FailedOk

th/SRPMS[OK]
th/x32[OK]
th/i686[OK]
th/x86_64[OK]

ac/SRPMS[OK]
ac/i386[OK]
ac/i586[OK]
ac/i686[OK]
ac/alpha[OK]
ac/amd64[OK]
ac/athlon[OK]
ac/ppc[OK]
ac/sparc[OK]
ac/sparc64[OK]

Advanced Search
main()
Powered by PLD Linux
(c) 2002-2017 PLD Team
$Revision: 1.37 $
Powered by BOFH.
Your IP: 54.234.255.29

gforth 0a801abf-4d75-42d0-97be-5b03a9579301

Status:Failed
Source URL:ftp://buildlogs.pld-linux.org/th/x32/FAIL/gforth,0a801abf-4d75-42d0-97be-5b03a9579301.bz2
text/plain URL:View!
full text:View!
rpm -qa of builder:View!
Date:2017/12/06 18:31:36
Runtime:0:00:14.931000

Toc:

  • error 1
  • prim:840: Error: incorrect register `%r8d' used with `q' suffix
  • error 2
  • prim:864: Error: incorrect register `%esi' used with `q' suffix
  • error 3
  • prim:897: Error: incorrect register `%esi' used with `q' suffix
  • error 4
  • prim:918: Error: incorrect register `%ecx' used with `q' suffix
  • error 5
  • prim:960: Error: incorrect register `%ecx' used with `q' suffix
  • error 6
  • prim:840: Error: incorrect register `%r8d' used with `q' suffix
  • error 7
  • prim:864: Error: incorrect register `%esi' used with `q' suffix
  • error 8
  • prim:897: Error: incorrect register `%esi' used with `q' suffix
  • error 9
  • prim:918: Error: incorrect register `%ecx' used with `q' suffix
  • error 10
  • prim:960: Error: incorrect register `%ecx' used with `q' suffix
  • error 11
  • error: Bad exit status from /tmp/B.Vg8Nhx/BUILD/tmp/rpm-tmp.98300 (%build)
  • error 12
  • RPM build errors:
  • error 13
  • error: No files produced.

Content:

checking for sys_siglist... yes
checking for getrusage... yes
checking for nanosleep... yes
checking for stack_t... yes
checking whether sys_siglist is declared... yes
checking for getopt_long... yes
checking for expm1... yes
checking for log1p... yes
checking for rint... yes
checking for ecvt... yes
checking sys/mman.h usability... yes
checking sys/mman.h presence... yes
checking for sys/mman.h... yes
checking fnmatch.h usability... yes
checking fnmatch.h presence... yes
checking for fnmatch.h... yes
checking alloca.h usability... yes
checking alloca.h presence... yes
checking for alloca.h... yes
checking wchar.h usability... yes
checking wchar.h presence... yes
checking for wchar.h... yes
checking for working POSIX fnmatch... yes
checking for mmap... yes
checking for sysconf... yes
checking for getpagesize... yes
checking for wcwidth... yes
checking for emacs... emacs
checking where .elc files should go... ${datadir}/emacs/site-lisp
configure: creating ./config.status
config.status: creating Makefile
config.status: creating Makedist
config.status: creating gforthmi
config.status: creating vmgen
config.status: creating machpc.fs
config.status: creating envos.fs
config.status: creating preforth
config.status: creating engine/Makefile
config.status: WARNING:  'engine/Makefile.in' seems to ignore the --datarootdir setting
config.status: creating engine/libcc.h
config.status: creating doc/version.texi
config.status: creating build-ec
config.status: creating engine/config.h
config.status: executing stamp-h commands
mkdir -p -- include/gforth/0.7.3
+ /usr/bin/make -Otarget -j9 -j1
if test -r version && test x'0.7.3' = x`cat version` ; then true ; else echo 0.7.3 > version ; fi
echo ": version-string s\" 0.7.3\" ;" > kernel/version.fs
cd . && autoheader
configure.in:225: warning: AC_LIBOBJ(../$arm_cacheflush): you should use literals
../../lib/autoconf/general.m4:2938: AC_LIBOBJ is expanded from...
configure.in:225: the top level
echo timestamp > ./stamp-h.in
./config.status
config.status: creating Makefile
config.status: creating Makedist
config.status: creating gforthmi
config.status: creating vmgen
config.status: creating machpc.fs
config.status: creating envos.fs
config.status: creating preforth
config.status: creating engine/Makefile
config.status: WARNING:  'engine/Makefile.in' seems to ignore the --datarootdir setting
config.status: creating engine/libcc.h
config.status: creating doc/version.texi
config.status: creating build-ec
config.status: creating engine/config.h
config.status: engine/config.h is unchanged
config.status: executing stamp-h commands
if test -z ""; then \
	for i in -ll-reg -ll; do /usr/bin/make optgforth OPT=$i && cp -p gforth${i} gforth && break; done; \
else \
	( cd engine && /usr/bin/make gforth ) && \
	cp -p engine/gforth gforth && \
	chcon -t unconfined_execmem_exec_t gforth; \
	true; \
	/usr/bin/make checkone check-nofast ENGINE=./engine/gforth; \
fi
make[1]: Entering directory '/tmp/B.Vg8Nhx/BUILD/gforth-0.7.3'
/usr/bin/make gforth-ll-reg OPT=-ll-reg OPTDEFINES="-DFORCE_LL -DFORCE_REG" OPTOBJECTS=
make[2]: Entering directory '/tmp/B.Vg8Nhx/BUILD/gforth-0.7.3'
if test -z "-ll-reg"; then \
	for i in -ll-reg -ll; do /usr/bin/make optgforth OPT=$i && cp -p gforth${i} gforth-ll-reg && break; done; \
else \
	( cd engine && /usr/bin/make gforth-ll-reg ) && \
	cp -p engine/gforth-ll-reg gforth-ll-reg && \
	chcon -t unconfined_execmem_exec_t gforth-ll-reg; \
	true; \
	/usr/bin/make checkone check-nofast ENGINE=./engine/gforth-ll-reg; \
fi
make[3]: Entering directory '/tmp/B.Vg8Nhx/BUILD/gforth-0.7.3/engine'
cd .. && CONFIG_FILES=stamp-h CONFIG_HEADERS=engine/config.h ./config.status
config.status: creating stamp-h
config.status: creating engine/config.h
config.status: engine/config.h is unchanged
config.status: executing stamp-h commands
echo timestamp > stamp-h
x86_64-pld-linux-gnux32-gcc  -I./../arch/amd64 -I. -Wall -O2 -fwrapv -pipe -Wformat -Werror=format-security -gdwarf-4 -fno-debug-types-section -fvar-tracking-assignments -g2 -Wp,-D_FORTIFY_SOURCE=2 -fstack-protector-strong --param=ssp-buffer-size=4 -fPIC -mtune=generic -march=x86-64 -gdwarf-4 -fno-debug-types-section -fvar-tracking-assignments -g2  -DHAVE_CONFIG_H -DFORCE_LL -DFORCE_REG -DDEFAULTPATH='".:/usr/libx32/gforth/site-forth:/usr/share/gforth/site-forth:/usr/libx32/gforth/0.7.3:/usr/share/gforth/0.7.3"'   -fno-gcse -fno-strict-aliasing -fno-crossjumping -fno-reorder-blocks -falign-labels=1 -falign-loops=1 -falign-jumps=1 -fno-defer-pop -fcaller-saves -fno-inline -fno-reorder-blocks -DGFORTH_DEBUGGING -o engine-ll-reg.o -c ./engine.c
prim: Assembler messages:
prim:840: Error: incorrect register `%r8d' used with `q' suffix
prim:864: Error: incorrect register `%esi' used with `q' suffix
prim:897: Error: incorrect register `%esi' used with `q' suffix
prim:918: Error: incorrect register `%ecx' used with `q' suffix
prim:960: Error: incorrect register `%ecx' used with `q' suffix
make[3]: *** [Makefile:169: engine-ll-reg.o] Error 1
make[3]: Leaving directory '/tmp/B.Vg8Nhx/BUILD/gforth-0.7.3/engine'
make[3]: Entering directory '/tmp/B.Vg8Nhx/BUILD/gforth-0.7.3'
./preforth -p ".:~+:." -e 's" mach16b.fs"' ./kernel/main.fs -e "save-cross kernl16b.fi- /usr/bin/gforth-0.7.3 bye"
You need to configure with a gforth in $PATH to build this part
make[3]: *** [Makefile:716: kernl16b.fi-] Error 1
make[3]: Leaving directory '/tmp/B.Vg8Nhx/BUILD/gforth-0.7.3'
make[2]: *** [Makefile:812: gforth-ll-reg] Error 2
make[2]: Leaving directory '/tmp/B.Vg8Nhx/BUILD/gforth-0.7.3'
make[1]: *** [Makefile:823: optgforth] Error 2
make[1]: Leaving directory '/tmp/B.Vg8Nhx/BUILD/gforth-0.7.3'
make[1]: Entering directory '/tmp/B.Vg8Nhx/BUILD/gforth-0.7.3'
/usr/bin/make gforth-ll OPT=-ll OPTDEFINES=-DFORCE_LL OPTOBJECTS=
make[2]: Entering directory '/tmp/B.Vg8Nhx/BUILD/gforth-0.7.3'
if test -z "-ll"; then \
	for i in -ll-reg -ll; do /usr/bin/make optgforth OPT=$i && cp -p gforth${i} gforth-ll && break; done; \
else \
	( cd engine && /usr/bin/make gforth-ll ) && \
	cp -p engine/gforth-ll gforth-ll && \
	chcon -t unconfined_execmem_exec_t gforth-ll; \
	true; \
	/usr/bin/make checkone check-nofast ENGINE=./engine/gforth-ll; \
fi
make[3]: Entering directory '/tmp/B.Vg8Nhx/BUILD/gforth-0.7.3/engine'
x86_64-pld-linux-gnux32-gcc  -I./../arch/amd64 -I. -Wall -O2 -fwrapv -pipe -Wformat -Werror=format-security -gdwarf-4 -fno-debug-types-section -fvar-tracking-assignments -g2 -Wp,-D_FORTIFY_SOURCE=2 -fstack-protector-strong --param=ssp-buffer-size=4 -fPIC -mtune=generic -march=x86-64 -gdwarf-4 -fno-debug-types-section -fvar-tracking-assignments -g2  -DHAVE_CONFIG_H -DFORCE_LL -DDEFAULTPATH='".:/usr/libx32/gforth/site-forth:/usr/share/gforth/site-forth:/usr/libx32/gforth/0.7.3:/usr/share/gforth/0.7.3"'   -fno-gcse -fno-strict-aliasing -fno-crossjumping -fno-reorder-blocks -falign-labels=1 -falign-loops=1 -falign-jumps=1 -fno-defer-pop -fcaller-saves -fno-inline -fno-reorder-blocks -DGFORTH_DEBUGGING -o engine-ll.o -c ./engine.c
prim: Assembler messages:
prim:840: Error: incorrect register `%r8d' used with `q' suffix
prim:864: Error: incorrect register `%esi' used with `q' suffix
prim:897: Error: incorrect register `%esi' used with `q' suffix
prim:918: Error: incorrect register `%ecx' used with `q' suffix
prim:960: Error: incorrect register `%ecx' used with `q' suffix
make[3]: *** [Makefile:169: engine-ll.o] Error 1
make[3]: Leaving directory '/tmp/B.Vg8Nhx/BUILD/gforth-0.7.3/engine'
make[3]: Entering directory '/tmp/B.Vg8Nhx/BUILD/gforth-0.7.3'
./preforth -p ".:~+:." -e 's" mach16b.fs"' ./kernel/main.fs -e "save-cross kernl16b.fi- /usr/bin/gforth-0.7.3 bye"
You need to configure with a gforth in $PATH to build this part
make[3]: *** [Makefile:716: kernl16b.fi-] Error 1
make[3]: Leaving directory '/tmp/B.Vg8Nhx/BUILD/gforth-0.7.3'
make[2]: *** [Makefile:812: gforth-ll] Error 2
make[2]: Leaving directory '/tmp/B.Vg8Nhx/BUILD/gforth-0.7.3'
make[1]: *** [Makefile:823: optgforth] Error 2
make[1]: Leaving directory '/tmp/B.Vg8Nhx/BUILD/gforth-0.7.3'
make: *** [Makefile:812: gforth] Error 2
error: Bad exit status from /tmp/B.Vg8Nhx/BUILD/tmp/rpm-tmp.98300 (%build)


RPM build errors:
    Bad exit status from /tmp/B.Vg8Nhx/BUILD/tmp/rpm-tmp.98300 (%build)
ended at: Wed Dec  6 18:31:35 2017, done in 0:00:14.931000
error: No files produced.
+ chmod -R u+rwX /tmp/B.Vg8Nhx/BUILD
+ rm -rf /tmp/B.Vg8Nhx/tmp /tmp/B.Vg8Nhx/BUILD
+ rm -rf /tmp/B.Vg8Nhx
Begin-PLD-Builder-Info
Build-Time: user:14.21s sys:1.24s real:19.38s (faults io:0 non-io:595708)

End-PLD-Builder-Info
[Back to list of logs] [View rpm -qa of builder]