FailedOk

th/SRPMS[OK]
th/x32[OK]
th/i686[OK]
th/x86_64[OK]

ac/SRPMS[OK]
ac/i386[OK]
ac/i586[OK]
ac/i686[OK]
ac/alpha[OK]
ac/amd64[OK]
ac/athlon[OK]
ac/ppc[OK]
ac/sparc[OK]
ac/sparc64[OK]

Advanced Search
main()
Powered by PLD Linux
(c) 2002-2017 PLD Team
$Revision: 1.37 $
Powered by Przewodniczacego Lepper-a.
Your IP: 54.92.201.232

gforth f3bcd8d8-491e-4b88-809e-7feb7557d0cd

Status:Failed
Source URL:ftp://buildlogs.pld-linux.org/th/x32/FAIL/gforth,f3bcd8d8-491e-4b88-809e-7feb7557d0cd.bz2
text/plain URL:View!
rpm -qa of builder:View!
Date:2017/12/05 18:11:17
Runtime:0:00:14.909207

Toc:

  • prep
  • Executing(%prep): /bin/sh -e /tmp/B.HhwJtT/BUILD/tmp/rpm-tmp.33967
  • build
  • Executing(%build): /bin/sh -e /tmp/B.HhwJtT/BUILD/tmp/rpm-tmp.33967
  • error 1
  • prim:840: Error: incorrect register `%r8d' used with `q' suffix
  • error 2
  • prim:864: Error: incorrect register `%esi' used with `q' suffix
  • error 3
  • prim:897: Error: incorrect register `%esi' used with `q' suffix
  • error 4
  • prim:918: Error: incorrect register `%ecx' used with `q' suffix
  • error 5
  • prim:960: Error: incorrect register `%ecx' used with `q' suffix
  • error 6
  • prim:840: Error: incorrect register `%r8d' used with `q' suffix
  • error 7
  • prim:864: Error: incorrect register `%esi' used with `q' suffix
  • error 8
  • prim:897: Error: incorrect register `%esi' used with `q' suffix
  • error 9
  • prim:918: Error: incorrect register `%ecx' used with `q' suffix
  • error 10
  • prim:960: Error: incorrect register `%ecx' used with `q' suffix
  • error 11
  • error: Bad exit status from /tmp/B.HhwJtT/BUILD/tmp/rpm-tmp.33967 (%build)
  • error 12
  • RPM build errors:
  • error 13
  • error: No files produced.

Content:

request from: qboosh
checking if we should skip the build
started at: Tue Dec  5 18:10:56 2017
fetching https://srcbuilder.pld-linux.org/th//srpms/f3bcd8d8-491e-4b88-809e-7feb7557d0cd/gforth-0.7.3-2.src.rpm
fetched 2538470 bytes, 1377.9 K/s
installing srpm: gforth-0.7.3-2.src.rpm
+ install -d /tmp/B.HhwJtT/BUILD /tmp/B.HhwJtT/RPMS
+ LC_ALL=en_US.UTF-8
+ rpm -qp --changelog gforth-0.7.3-2.src.rpm
* Tue Dec 05 2017 PLD Linux Team <feedback@pld-linux.org>
- For complete changelog see: http://git.pld-linux.org/?p=packages/gforth.git;a=log;h=master
+ rpm -Uhv --nodeps --define '_topdir /tmp/B.HhwJtT' --define '_specdir %{_topdir}' --define '_sourcedir %{_specdir}' --define '_rpmdir %{_topdir}/RPMS' --define '_builddir %{_topdir}/BUILD' gforth-0.7.3-2.src.rpm Preparing... ################################################## gforth ################################################## + rm -f gforth-0.7.3-2.src.rpm + install -m 700 -d /tmp/B.HhwJtT/BUILD/tmp + TMPDIR=/tmp/B.HhwJtT/BUILD/tmp + exec nice -n 0 rpmbuild -bp --short-circuit --nodeps --define '_topdir /tmp/B.HhwJtT' --define '_specdir %{_topdir}' --define '_sourcedir %{_specdir}' --define '_rpmdir %{_topdir}/RPMS' --define '_builddir %{_topdir}/BUILD' --target x32-pld-linux --define 'prep exit 0' /tmp/B.HhwJtT/gforth.spec Building target platforms: x32-pld-linux checking BuildConflict-ing packages no BuildConflicts found checking BR rpm: Building target platforms: x32-pld-linux no BR needed building RPM using: set -ex; : build-id: f3bcd8d8-491e-4b88-809e-7feb7557d0cd; TMPDIR=/tmp/B.HhwJtT/BUILD/tmp exec nice -n 0 rpmbuild -bb --define '_smp_mflags -j9' --define '_make_opts -Otarget' --define '_pld_builder 1' --define '_topdir /tmp/B.HhwJtT' --define '_specdir %{_topdir}' --define '_sourcedir %{_specdir}' --define '_rpmdir %{_topdir}/RPMS' --define '_builddir %{_topdir}/BUILD' --target x32-pld-linux /tmp/B.HhwJtT/gforth.spec + : build-id: f3bcd8d8-491e-4b88-809e-7feb7557d0cd + TMPDIR=/tmp/B.HhwJtT/BUILD/tmp + exec nice -n 0 rpmbuild -bb --define '_smp_mflags -j9' --define '_make_opts -Otarget' --define '_pld_builder 1' --define '_topdir /tmp/B.HhwJtT' --define '_specdir %{_topdir}' --define '_sourcedir %{_specdir}' --define '_rpmdir %{_topdir}/RPMS' --define '_builddir %{_topdir}/BUILD' --target x32-pld-linux /tmp/B.HhwJtT/gforth.spec Building target platforms: x32-pld-linux Executing(%prep): /bin/sh -e /tmp/B.HhwJtT/BUILD/tmp/rpm-tmp.33967 + umask 022 + cd /tmp/B.HhwJtT/BUILD + cd /tmp/B.HhwJtT/BUILD + rm -rf gforth-0.7.3 + /usr/bin/gzip -dc /tmp/B.HhwJtT/gforth-0.7.3.tar.gz + /bin/tar -xf - + STATUS=0 + '[' 0 -ne 0 ']' + cd gforth-0.7.3 + /bin/id -u + '[' 1000 '=' 0 ']' + /bin/id -u + '[' 1000 '=' 0 ']' + /bin/chmod -Rf a+rX,u+w,g-w,o-w . + echo 'Patch #0 (gforth-info.patch):' Patch #0 (gforth-info.patch): + '[' -f /tmp/B.HhwJtT/gforth-info.patch ']' + /bin/cat /tmp/B.HhwJtT/gforth-info.patch + /usr/bin/patch -s -p1 + echo 'Patch #1 (gforth-opt.patch):' Patch #1 (gforth-opt.patch): + '[' -f /tmp/B.HhwJtT/gforth-opt.patch ']' + /bin/cat /tmp/B.HhwJtT/gforth-opt.patch + /usr/bin/patch -s -p1 + /bin/rm '--interactive=never' doc/gforth.info doc/gforth.info-1 doc/gforth.info-2 doc/gforth.info-3 doc/gforth.info-4 doc/vmgen.info + exit 0 Executing(%build): /bin/sh -e /tmp/B.HhwJtT/BUILD/tmp/rpm-tmp.33967 HOME=/home/users/builder PATH=/home/users/builder/GNUstep/Tools:/usr/local/bin:/usr/bin:/bin TMPDIR=/tmp/B.HhwJtT/BUILD/tmp + umask 022 + cd /tmp/B.HhwJtT/BUILD + cd gforth-0.7.3 + aclocal aclocal: warning: autoconf input should be named 'configure.ac', not 'configure.in' configure.in:225: warning: AC_LIBOBJ(../$arm_cacheflush): you should use literals ../../lib/autoconf/general.m4:2938: AC_LIBOBJ is expanded from... configure.in:225: the top level + autoconf configure.in:225: warning: AC_LIBOBJ(../$arm_cacheflush): you should use literals ../../lib/autoconf/general.m4:2938: AC_LIBOBJ is expanded from... configure.in:225: the top level + ./configure 'LDFLAGS=-Wl,--as-needed -Wl,--no-copy-dt-needed-entries -Wl,-z,relro -Wl,-z,combreloc ' 'CFLAGS=-O2 -fwrapv -pipe -Wformat -Werror=format-security -gdwarf-4 -fno-debug-types-section -fvar-tracking-assignments -g2 -Wp,-D_FORTIFY_SOURCE=2 -fstack-protector-strong --param=ssp-buffer-size=4 -fPIC -mtune=generic -march=x86-64 -gdwarf-4 -fno-debug-types-section -fvar-tracking-assignments -g2 ' 'CXXFLAGS=-O2 -fwrapv -pipe -Wformat -Werror=format-security -gdwarf-4 -fno-debug-types-section -fvar-tracking-assignments -g2 -Wp,-D_FORTIFY_SOURCE=2 -fstack-protector-strong --param=ssp-buffer-size=4 -fPIC -mtune=generic -march=x86-64 -gdwarf-4 -fno-debug-types-section -fvar-tracking-assignments -g2 ' 'FFLAGS=-O2 -fwrapv -pipe -Wformat -Werror=format-security -gdwarf-4 -fno-debug-types-section -fvar-tracking-assignments -g2 -Wp,-D_FORTIFY_SOURCE=2 -fstack-protector-strong --param=ssp-buffer-size=4 -fPIC -mtune=generic -march=x86-64 -gdwarf-4 -fno-debug-types-section -fvar-tracking-assignments -g2 ' 'FCFLAGS=-O2 -fwrapv -pipe -Wformat -Werror=format-security -gdwarf-4 -fno-debug-types-section -fvar-tracking-assignments -g2 -Wp,-D_FORTIFY_SOURCE=2 -fstack-protector-strong --param=ssp-buffer-size=4 -fPIC -mtune=generic -march=x86-64 -gdwarf-4 -fno-debug-types-section -fvar-tracking-assignments -g2 ' 'CPPFLAGS=' 'CC=x86_64-pld-linux-gnux32-gcc' 'CXX=x86_64-pld-linux-gnux32-g++' '--host=x86_64-pld-linux-gnux32' '--build=x86_64-pld-linux-gnux32' '--prefix=/usr' '--exec-prefix=/usr' '--bindir=/usr/bin' '--sbindir=/usr/sbin' '--sysconfdir=/etc' '--datadir=/usr/share' '--includedir=/usr/include' '--libdir=/usr/libx32' '--libexecdir=/usr/libexec' '--localstatedir=/var' '--sharedstatedir=/var/lib' '--mandir=/usr/share/man' '--infodir=/usr/share/info' '--x-libraries=/usr/libx32' checking for x86_64-pld-linux-gnux32-gcc... x86_64-pld-linux-gnux32-gcc checking whether the C compiler works... yes checking for C compiler default output file name... a.out checking for suffix of executables... checking whether we are cross compiling... no checking for suffix of object files... o checking whether we are using the GNU C compiler... yes checking whether x86_64-pld-linux-gnux32-gcc accepts -g... yes checking for x86_64-pld-linux-gnux32-gcc option to accept ISO C89... none needed checking how to run the C preprocessor... x86_64-pld-linux-gnux32-gcc -E checking for grep that handles long lines and -e... /bin/grep checking for egrep... /bin/grep -E checking for ANSI C header files... yes checking for sys/types.h... yes checking for sys/stat.h... yes checking for stdlib.h... yes checking for string.h... yes checking for memory.h... yes checking for strings.h... yes checking for inttypes.h... yes checking for stdint.h... yes checking for unistd.h... yes checking minix/config.h usability... no checking minix/config.h presence... no checking for minix/config.h... no checking whether it is safe to define __EXTENSIONS__... yes checking for special C compiler options needed for large files... no checking for _FILE_OFFSET_BITS value needed for large files... no checking for x86_64-pld-linux-gnux32-gcc... (cached) x86_64-pld-linux-gnux32-gcc checking whether we are using the GNU C compiler... (cached) yes checking whether x86_64-pld-linux-gnux32-gcc accepts -g... (cached) yes checking for x86_64-pld-linux-gnux32-gcc option to accept ISO C89... (cached) none needed checking whether to use two dispatches per conditional branch... 1 checking make type... GNU Make checking whether the linker accepts -export-dynamic... yes checking build system type... x86_64-pld-linux-gnux32 checking host system type... x86_64-pld-linux-gnux32 Check for arch/amd64//gforth.ld (false) checking size of char *... 4 checking size of void *... 4 checking size of char... 1 checking size of short... 2 checking size of int... 4 checking size of long... 4 checking size of long long... 8 checking size of intptr_t... 4 checking size of int128_t... 0 checking size of uint128_t... 0 checking for a C type for cells... int checking for a C type for wydes... short checking for a C type for tetrabytes... int checking for a C type for double-cells... long long checking for a C type for unsigned double-cells... unsigned long long checking for off_t... yes checking size of off_t... 8 checking if x86_64-pld-linux-gnux32-gcc understands -fno-gcse... yes checking if x86_64-pld-linux-gnux32-gcc understands -fno-strict-aliasing... yes checking if x86_64-pld-linux-gnux32-gcc understands -fno-crossjumping... yes checking if x86_64-pld-linux-gnux32-gcc understands -fno-reorder-blocks... yes checking if x86_64-pld-linux-gnux32-gcc understands -falign-labels=1... yes checking if x86_64-pld-linux-gnux32-gcc understands -falign-loops=1... yes checking if x86_64-pld-linux-gnux32-gcc understands -falign-jumps=1... yes checking how to suppress 'unused variable' warnings... __attribute__((unused)) checking how to invoke m4... m4 -s checking for gforth... echo "You need to configure with a gforth in \$PATH to build this part" && false checking for ./arch/amd64/asm.fs... yes checking for ./arch/amd64/disasm.fs... yes checking for install-info... /sbin/install-info checking for chcon... chcon -t unconfined_execmem_exec_t checking whether byte ordering is bigendian... no checking if and how we can waste code space... .skip 16 checking if and how we can do comments in asm statements... "# " checking whether ln -s works... yes checking for a BSD-compatible install... /usr/bin/install -c checking for texi2dvi4a2ps... texi2dvi4a2ps checking for glibtool... no checking for libtool... libtool checking for asin in -lm... yes checking for lt_dlinit in -lltdl... yes checking ffi.h usability... no checking ffi.h presence... no checking for ffi.h... no checking ffi/ffi.h usability... no checking ffi/ffi.h presence... no checking for ffi/ffi.h... no checking for ffi_call in -lffi... yes checking for __builtin_avcall in -lavcall... yes checking for working memcmp... yes checking for memmove... yes checking for strtoul... yes checking for pow10... yes checking for strerror... yes checking for strsignal... yes checking for atanh... yes checking for _LARGEFILE_SOURCE value needed for large files... no checking for ftello... yes checking for dlopen... no checking for sys_siglist... yes checking for getrusage... yes checking for nanosleep... yes checking for stack_t... yes checking whether sys_siglist is declared... yes checking for getopt_long... yes checking for expm1... yes checking for log1p... yes checking for rint... yes checking for ecvt... yes checking sys/mman.h usability... yes checking sys/mman.h presence... yes checking for sys/mman.h... yes checking fnmatch.h usability... yes checking fnmatch.h presence... yes checking for fnmatch.h... yes checking alloca.h usability... yes checking alloca.h presence... yes checking for alloca.h... yes checking wchar.h usability... yes checking wchar.h presence... yes checking for wchar.h... yes checking for working POSIX fnmatch... yes checking for mmap... yes checking for sysconf... yes checking for getpagesize... yes checking for wcwidth... yes checking for emacs... emacs checking where .elc files should go... ${datadir}/emacs/site-lisp configure: creating ./config.status config.status: creating Makefile config.status: creating Makedist config.status: creating gforthmi config.status: creating vmgen config.status: creating machpc.fs config.status: creating envos.fs config.status: creating preforth config.status: creating engine/Makefile config.status: WARNING: 'engine/Makefile.in' seems to ignore the --datarootdir setting config.status: creating engine/libcc.h config.status: creating doc/version.texi config.status: creating build-ec config.status: creating engine/config.h config.status: executing stamp-h commands mkdir -p -- include/gforth/0.7.3 + /usr/bin/make -Otarget -j9 -j1 if test -r version && test x'0.7.3' = x`cat version` ; then true ; else echo 0.7.3 > version ; fi echo ": version-string s\" 0.7.3\" ;" > kernel/version.fs cd . && autoheader configure.in:225: warning: AC_LIBOBJ(../$arm_cacheflush): you should use literals ../../lib/autoconf/general.m4:2938: AC_LIBOBJ is expanded from... configure.in:225: the top level echo timestamp > ./stamp-h.in ./config.status config.status: creating Makefile config.status: creating Makedist config.status: creating gforthmi config.status: creating vmgen config.status: creating machpc.fs config.status: creating envos.fs config.status: creating preforth config.status: creating engine/Makefile config.status: WARNING: 'engine/Makefile.in' seems to ignore the --datarootdir setting config.status: creating engine/libcc.h config.status: creating doc/version.texi config.status: creating build-ec config.status: creating engine/config.h config.status: engine/config.h is unchanged config.status: executing stamp-h commands if test -z ""; then \ for i in -ll-reg -ll; do /usr/bin/make optgforth OPT=$i && cp -p gforth${i} gforth && break; done; \ else \ ( cd engine && /usr/bin/make gforth ) && \ cp -p engine/gforth gforth && \ chcon -t unconfined_execmem_exec_t gforth; \ true; \ /usr/bin/make checkone check-nofast ENGINE=./engine/gforth; \ fi make[1]: Entering directory '/tmp/B.HhwJtT/BUILD/gforth-0.7.3' /usr/bin/make gforth-ll-reg OPT=-ll-reg OPTDEFINES="-DFORCE_LL -DFORCE_REG" OPTOBJECTS= make[2]: Entering directory '/tmp/B.HhwJtT/BUILD/gforth-0.7.3' if test -z "-ll-reg"; then \ for i in -ll-reg -ll; do /usr/bin/make optgforth OPT=$i && cp -p gforth${i} gforth-ll-reg && break; done; \ else \ ( cd engine && /usr/bin/make gforth-ll-reg ) && \ cp -p engine/gforth-ll-reg gforth-ll-reg && \ chcon -t unconfined_execmem_exec_t gforth-ll-reg; \ true; \ /usr/bin/make checkone check-nofast ENGINE=./engine/gforth-ll-reg; \ fi make[3]: Entering directory '/tmp/B.HhwJtT/BUILD/gforth-0.7.3/engine' cd .. && CONFIG_FILES=stamp-h CONFIG_HEADERS=engine/config.h ./config.status config.status: creating stamp-h config.status: creating engine/config.h config.status: engine/config.h is unchanged config.status: executing stamp-h commands echo timestamp > stamp-h x86_64-pld-linux-gnux32-gcc -I./../arch/amd64 -I. -Wall -O2 -fwrapv -pipe -Wformat -Werror=format-security -gdwarf-4 -fno-debug-types-section -fvar-tracking-assignments -g2 -Wp,-D_FORTIFY_SOURCE=2 -fstack-protector-strong --param=ssp-buffer-size=4 -fPIC -mtune=generic -march=x86-64 -gdwarf-4 -fno-debug-types-section -fvar-tracking-assignments -g2 -DHAVE_CONFIG_H -DFORCE_LL -DFORCE_REG -DDEFAULTPATH='".:/usr/libx32/gforth/site-forth:/usr/share/gforth/site-forth:/usr/libx32/gforth/0.7.3:/usr/share/gforth/0.7.3"' -fno-gcse -fno-strict-aliasing -fno-crossjumping -fno-reorder-blocks -falign-labels=1 -falign-loops=1 -falign-jumps=1 -fno-defer-pop -fcaller-saves -fno-inline -fno-reorder-blocks -DGFORTH_DEBUGGING -o engine-ll-reg.o -c ./engine.c prim: Assembler messages: prim:840: Error: incorrect register `%r8d' used with `q' suffix prim:864: Error: incorrect register `%esi' used with `q' suffix prim:897: Error: incorrect register `%esi' used with `q' suffix prim:918: Error: incorrect register `%ecx' used with `q' suffix prim:960: Error: incorrect register `%ecx' used with `q' suffix make[3]: *** [Makefile:169: engine-ll-reg.o] Error 1 make[3]: Leaving directory '/tmp/B.HhwJtT/BUILD/gforth-0.7.3/engine' make[3]: Entering directory '/tmp/B.HhwJtT/BUILD/gforth-0.7.3' ./preforth -p ".:~+:." -e 's" mach16b.fs"' ./kernel/main.fs -e "save-cross kernl16b.fi- /usr/bin/gforth-0.7.3 bye" You need to configure with a gforth in $PATH to build this part make[3]: *** [Makefile:716: kernl16b.fi-] Error 1 make[3]: Leaving directory '/tmp/B.HhwJtT/BUILD/gforth-0.7.3' make[2]: *** [Makefile:812: gforth-ll-reg] Error 2 make[2]: Leaving directory '/tmp/B.HhwJtT/BUILD/gforth-0.7.3' make[1]: *** [Makefile:823: optgforth] Error 2 make[1]: Leaving directory '/tmp/B.HhwJtT/BUILD/gforth-0.7.3' make[1]: Entering directory '/tmp/B.HhwJtT/BUILD/gforth-0.7.3' /usr/bin/make gforth-ll OPT=-ll OPTDEFINES=-DFORCE_LL OPTOBJECTS= make[2]: Entering directory '/tmp/B.HhwJtT/BUILD/gforth-0.7.3' if test -z "-ll"; then \ for i in -ll-reg -ll; do /usr/bin/make optgforth OPT=$i && cp -p gforth${i} gforth-ll && break; done; \ else \ ( cd engine && /usr/bin/make gforth-ll ) && \ cp -p engine/gforth-ll gforth-ll && \ chcon -t unconfined_execmem_exec_t gforth-ll; \ true; \ /usr/bin/make checkone check-nofast ENGINE=./engine/gforth-ll; \ fi make[3]: Entering directory '/tmp/B.HhwJtT/BUILD/gforth-0.7.3/engine' x86_64-pld-linux-gnux32-gcc -I./../arch/amd64 -I. -Wall -O2 -fwrapv -pipe -Wformat -Werror=format-security -gdwarf-4 -fno-debug-types-section -fvar-tracking-assignments -g2 -Wp,-D_FORTIFY_SOURCE=2 -fstack-protector-strong --param=ssp-buffer-size=4 -fPIC -mtune=generic -march=x86-64 -gdwarf-4 -fno-debug-types-section -fvar-tracking-assignments -g2 -DHAVE_CONFIG_H -DFORCE_LL -DDEFAULTPATH='".:/usr/libx32/gforth/site-forth:/usr/share/gforth/site-forth:/usr/libx32/gforth/0.7.3:/usr/share/gforth/0.7.3"' -fno-gcse -fno-strict-aliasing -fno-crossjumping -fno-reorder-blocks -falign-labels=1 -falign-loops=1 -falign-jumps=1 -fno-defer-pop -fcaller-saves -fno-inline -fno-reorder-blocks -DGFORTH_DEBUGGING -o engine-ll.o -c ./engine.c prim: Assembler messages: prim:840: Error: incorrect register `%r8d' used with `q' suffix prim:864: Error: incorrect register `%esi' used with `q' suffix prim:897: Error: incorrect register `%esi' used with `q' suffix prim:918: Error: incorrect register `%ecx' used with `q' suffix prim:960: Error: incorrect register `%ecx' used with `q' suffix make[3]: *** [Makefile:169: engine-ll.o] Error 1 make[3]: Leaving directory '/tmp/B.HhwJtT/BUILD/gforth-0.7.3/engine' make[3]: Entering directory '/tmp/B.HhwJtT/BUILD/gforth-0.7.3' ./preforth -p ".:~+:." -e 's" mach16b.fs"' ./kernel/main.fs -e "save-cross kernl16b.fi- /usr/bin/gforth-0.7.3 bye" You need to configure with a gforth in $PATH to build this part make[3]: *** [Makefile:716: kernl16b.fi-] Error 1 make[3]: Leaving directory '/tmp/B.HhwJtT/BUILD/gforth-0.7.3' make[2]: *** [Makefile:812: gforth-ll] Error 2 make[2]: Leaving directory '/tmp/B.HhwJtT/BUILD/gforth-0.7.3' make[1]: *** [Makefile:823: optgforth] Error 2 make[1]: Leaving directory '/tmp/B.HhwJtT/BUILD/gforth-0.7.3' make: *** [Makefile:812: gforth] Error 2 error: Bad exit status from /tmp/B.HhwJtT/BUILD/tmp/rpm-tmp.33967 (%build) RPM build errors: Bad exit status from /tmp/B.HhwJtT/BUILD/tmp/rpm-tmp.33967 (%build) ended at: Tue Dec 5 18:11:16 2017, done in 0:00:14.909207 error: No files produced. + chmod -R u+rwX /tmp/B.HhwJtT/BUILD + rm -rf /tmp/B.HhwJtT/tmp /tmp/B.HhwJtT/BUILD + rm -rf /tmp/B.HhwJtT Begin-PLD-Builder-Info Build-Time: user:15.43s sys:1.28s real:20.82s (faults io:81 non-io:597176) End-PLD-Builder-Info
[Back to list of logs] [View rpm -qa of builder]