FailedOk

th/SRPMS[OK]
th/x32[OK]
th/i686[OK]
th/x86_64[OK]

ac/SRPMS[OK]
ac/i386[OK]
ac/i586[OK]
ac/i686[OK]
ac/alpha[OK]
ac/amd64[OK]
ac/athlon[OK]
ac/ppc[OK]
ac/sparc[OK]
ac/sparc64[OK]

Advanced Search
main()
Powered by PLD Linux
(c) 2002-2020 PLD Team
$Revision: 1.37 $
Powered by Ken.
Your IP: 35.153.39.7

grep 0c8af47b-2af1-456a-83da-df5cec82d563

Status:Failed
Source URL:https://buildlogs.pld-linux.org/pld/th/x32/FAIL/grep,0c8af47b-2af1-456a-83da-df5cec82d563.bz2
text/plain URL:View!
full text:View!
rpm -qa of builder:View!
Date:2020/11/17 18:06:51
Runtime:0:02:31.031829

Toc:

Content:

PASS: bre
PASS: c-locale
PASS: case-fold-backref
PASS: case-fold-backslash-w
PASS: case-fold-char-class
PASS: case-fold-char-range
PASS: case-fold-char-type
PASS: case-fold-titlecase
PASS: char-class-multibyte
PASS: char-class-multibyte2
PASS: context-0
PASS: count-newline
PASS: dfa-coverage
PASS: dfa-heap-overrun
PASS: dfa-infloop
PASS: dfa-invalid-utf8
PASS: dfaexec-multibyte
PASS: empty
PASS: empty-line
PASS: empty-line-mb
PASS: encoding-error
PASS: epipe
PASS: equiv-classes
PASS: ere
PASS: euc-mb
PASS: false-match-mb-non-utf8
PASS: fedora
PASS: fgrep-infloop
PASS: fgrep-longest
PASS: file
PASS: filename-lineno.pl
PASS: fmbtest
PASS: foad1
PASS: grep-dev-null
PASS: grep-dev-null-out
PASS: grep-dir
PASS: help-version
PASS: high-bit-range
PASS: in-eq-out-infloop
PASS: include-exclude
PASS: inconsistent-range
PASS: initial-tab
PASS: invalid-multibyte-infloop
PASS: khadafy
PASS: kwset-abuse
PASS: long-line-vs-2GiB-read
PASS: many-regex-performance
PASS: match-lines
PASS: max-count-overread
PASS: max-count-vs-context
PASS: mb-dot-newline
PASS: mb-non-UTF8-overrun
PASS: mb-non-UTF8-perf-Fw
PASS: mb-non-UTF8-performance
PASS: mb-non-UTF8-word-boundary
 warning: \s failed to match \x0a in the en_US.UTF-8 locale
 warning: \s failed to match \x85 in the en_US.UTF-8 locale
 warning: \s failed to match \xc2\xa0 in the en_US.UTF-8 locale
 warning: \S mistakenly matched \xc2\xa0 in the en_US.UTF-8 locale
 warning: \s failed to match \xe2\x80\x87 in the en_US.UTF-8 locale
 warning: \S mistakenly matched \xe2\x80\x87 in the en_US.UTF-8 locale
 warning: \s failed to match \xe2\x80\x8b in the en_US.UTF-8 locale
 warning: \S mistakenly matched \xe2\x80\x8b in the en_US.UTF-8 locale
 warning: \s failed to match \xe2\x80\xaf in the en_US.UTF-8 locale
 warning: \S mistakenly matched \xe2\x80\xaf in the en_US.UTF-8 locale
PASS: multibyte-white-space
PASS: multiple-begin-or-end-line
PASS: null-byte
PASS: options
PASS: pcre
PASS: pcre-abort
PASS: pcre-context
PASS: pcre-count
PASS: pcre-infloop
PASS: pcre-invalid-utf8-infloop
PASS: pcre-invalid-utf8-input
PASS: pcre-jitstack
PASS: pcre-o
PASS: pcre-utf8
PASS: pcre-w
PASS: pcre-wx-backref
PASS: pcre-z
PASS: posix-bracket
PASS: prefix-of-multibyte
PASS: proc
PASS: r-dot
PASS: repetition-overflow
PASS: reversed-range-endpoints
sjis-mb: skipped test: SJIS locale not found
SKIP: sjis-mb
PASS: skip-device
PASS: skip-read
PASS: spencer1
PASS: spencer1-locale
PASS: stack-overflow
PASS: status
PASS: surrogate-pair
PASS: symlink
triple-backref: expect malfunction on glibc systems due to https://sourceware.org/bugzilla/show_bug.cgi?id=11053
XFAIL: triple-backref
PASS: turkish-I
PASS: turkish-I-without-dot
PASS: turkish-eyes
PASS: two-chars
PASS: two-files
PASS: unibyte-binary
PASS: unibyte-bracket-expr
PASS: unibyte-negated-circumflex
PASS: utf8-bracket
PASS: warn-char-classes
PASS: word-delim-multibyte
PASS: word-multi-file
PASS: word-multibyte
PASS: write-error-msg
PASS: yesno
PASS: z-anchor-newline
============================================================================
Testsuite summary for GNU grep 3.6
============================================================================
# TOTAL: 115
# PASS:  113
# SKIP:  1
# XFAIL: 1
# FAIL:  0
# XPASS: 0
# ERROR: 0
============================================================================
make[4]: Leaving directory '/tmp/B.GWnnUo/BUILD/grep-3.6/tests'
make[3]: Leaving directory '/tmp/B.GWnnUo/BUILD/grep-3.6/tests'
fail=0;						\
        cd . && for i in backref backref-alt backref-multibyte-slow backref-word backslash-dot backslash-s-and-repetition-operators backslash-s-vs-invalid-multibyte big-hole big-match binary-file-matches bogus-wctob bre c-locale case-fold-backref case-fold-backslash-w case-fold-char-class case-fold-char-range case-fold-char-type case-fold-titlecase char-class-multibyte char-class-multibyte2 context-0 count-newline dfa-coverage dfa-heap-overrun dfa-infloop dfa-invalid-utf8 dfaexec-multibyte empty empty-line empty-line-mb encoding-error epipe equiv-classes ere euc-mb false-match-mb-non-utf8 fedora fgrep-infloop fgrep-longest file filename-lineno.pl fmbtest foad1 grep-dev-null grep-dev-null-out grep-dir help-version high-bit-range in-eq-out-infloop include-exclude inconsistent-range initial-tab invalid-multibyte-infloop khadafy kwset-abuse long-line-vs-2GiB-read many-regex-performance match-lines max-count-overread max-count-vs-context mb-dot-newline mb-non-UTF8-overrun mb-non-UTF8-perf-Fw mb-non-UTF8-performance mb-non-UTF8-word-boundary multibyte-white-space multiple-begin-or-end-line null-byte options pcre pcre-abort pcre-context pcre-count pcre-infloop pcre-invalid-utf8-infloop pcre-invalid-utf8-input pcre-jitstack pcre-o pcre-utf8 pcre-w pcre-wx-backref pcre-z posix-bracket prefix-of-multibyte proc r-dot repetition-overflow reversed-range-endpoints sjis-mb skip-device skip-read spencer1 spencer1-locale stack-overflow status surrogate-pair symlink triple-backref turkish-I turkish-I-without-dot turkish-eyes two-chars two-files unibyte-binary unibyte-bracket-expr unibyte-negated-circumflex utf8-bracket warn-char-classes word-delim-multibyte word-multi-file word-multibyte write-error-msg yesno z-anchor-newline; do				\
  test -x $i || { fail=1; echo $i >&2; };			\
done;								\
test $fail = 1							\
          && { echo the above test scripts are not executable >&2; exit 1; } \
          || :
make[2]: Leaving directory '/tmp/B.GWnnUo/BUILD/grep-3.6/tests'
Making check in gnulib-tests
make[2]: Entering directory '/tmp/B.GWnnUo/BUILD/grep-3.6/gnulib-tests'
/usr/bin/make  check-recursive
make[3]: Entering directory '/tmp/B.GWnnUo/BUILD/grep-3.6/gnulib-tests'
Making check in .
make[4]: Entering directory '/tmp/B.GWnnUo/BUILD/grep-3.6/gnulib-tests'
/usr/bin/make  test-accept test-alignof test-alloca-opt test-argmatch test-arpa_inet test-binary-io test-bind test-bitrotate test-btowc test-c-ctype test-c-stack test-c-strcasecmp test-c-strncasecmp test-chdir test-cloexec test-close test-connect test-ctype test-dfa-match-aux test-dirent test-dup test-dup2 test-environ test-errno test-exclude test-fchdir test-fcntl-h test-fcntl-safer test-fcntl test-fdopen test-fdopendir test-fgetc test-float test-fnmatch-h test-fnmatch test-fopen-gnu test-fopen test-fpending test-fputc test-fread test-fstat test-fstatat test-ftruncate test-fwrite test-getcwd-lgpl test-getdtablesize test-getopt-gnu test-getopt-posix test-getprogname test-gettimeofday test-hard-locale test-hash test-i-ring test-iconv-h test-iconv test-ignore-value test-inet_pton test-intprops test-inttostr test-inttypes test-ioctl test-isatty test-isblank test-iswblank test-iswdigit test-iswxdigit test-langinfo test-limits-h test-listen test-locale test-localeconv test-localename test-lseek test-lstat test-malloc-gnu test-malloca test-mbscasecmp test-mbsinit test-mbsrtowcs test-mbsstr1 test-mbsstr2 test-mbsstr3 test-memchr test-memchr2 test-memrchr test-nanosleep test-netinet_in test-nl_langinfo test-nl_langinfo-mt test-open test-openat-safer test-openat test-pathmax test-perror test-perror2 test-pipe test-pthread test-pthread-thread test-pthread_sigmask1 test-pthread_sigmask2 test-quotearg-simple test-raise test-rawmemchr test-read test-realloc-gnu test-regex test-sched test-select test-select-fd test-select-stdin test-setenv test-setlocale_null test-setlocale_null-mt-one test-setlocale_null-mt-all test-setlocale1 test-setlocale2 test-setsockopt test-sigaction test-signal-h test-sigprocmask test-sleep test-snprintf test-sockets test-stat test-stat-time test-stdalign test-stdbool test-stddef test-stdint test-stdio test-stdlib test-strerror test-strerror_r test-striconv test-string test-strnlen test-strstr test-strtoimax test-strtoll test-strtoull test-strtoumax test-symlink test-sys_ioctl test-sys_select test-sys_socket test-sys_stat test-sys_time test-sys_types test-sys_uio test-thread_self test-thread_create test-time test-dup-safer test-unistd test-u8-mbtoucr test-u8-uctomb test-uc_width test-uc_width2 test-unsetenv test-vasnprintf test-verify test-version-etc test-wchar test-wcrtomb test-wcrtomb-w32 test-wctype-h test-wcwidth test-xalloc-die test-xstrtoimax test-xstrtol test-xstrtoul libtests.a
make[5]: Entering directory '/tmp/B.GWnnUo/BUILD/grep-3.6/gnulib-tests'
depbase=`echo test-accept.o | sed 's|[^/]*$|.deps/&|;s|\.o$||'`;\
x86_64-pld-linux-gnux32-gcc -DHAVE_CONFIG_H -DEXEEXT=\"\" -I. -I..  -DIN_GREP_GNULIB_TESTS=1 -I. -I. -I.. -I./.. -I../lib -I./../lib   -O2 -fwrapv -pipe -Wformat -Werror=format-security -gdwarf-4 -fno-debug-types-section -fvar-tracking-assignments -g2 -Wp,-D_FORTIFY_SOURCE=2 -fstack-protector-strong --param=ssp-buffer-size=4 -Werror=trampolines -fPIC -mtune=generic -march=x86-64 -gdwarf-4 -fno-debug-types-section -fvar-tracking-assignments -g2  -MT test-accept.o -MD -MP -MF $depbase.Tpo -c -o test-accept.o test-accept.c &&\
mv -f $depbase.Tpo $depbase.Po
x86_64-pld-linux-gnux32-gcc  -O2 -fwrapv -pipe -Wformat -Werror=format-security -gdwarf-4 -fno-debug-types-section -fvar-tracking-assignments -g2 -Wp,-D_FORTIFY_SOURCE=2 -fstack-protector-strong --param=ssp-buffer-size=4 -Werror=trampolines -fPIC -mtune=generic -march=x86-64 -gdwarf-4 -fno-debug-types-section -fvar-tracking-assignments -g2   -Wl,--as-needed -Wl,--no-copy-dt-needed-entries -Wl,-z,relro -Wl,-z,combreloc  -o test-accept test-accept.o libtests.a ../lib/libgreputils.a libtests.a ../lib/libgreputils.a   
depbase=`echo test-alignof.o | sed 's|[^/]*$|.deps/&|;s|\.o$||'`;\
x86_64-pld-linux-gnux32-gcc -DHAVE_CONFIG_H -DEXEEXT=\"\" -I. -I..  -DIN_GREP_GNULIB_TESTS=1 -I. -I. -I.. -I./.. -I../lib -I./../lib   -O2 -fwrapv -pipe -Wformat -Werror=format-security -gdwarf-4 -fno-debug-types-section -fvar-tracking-assignments -g2 -Wp,-D_FORTIFY_SOURCE=2 -fstack-protector-strong --param=ssp-buffer-size=4 -Werror=trampolines -fPIC -mtune=generic -march=x86-64 -gdwarf-4 -fno-debug-types-section -fvar-tracking-assignments -g2  -MT test-alignof.o -MD -MP -MF $depbase.Tpo -c -o test-alignof.o test-alignof.c &&\
mv -f $depbase.Tpo $depbase.Po
x86_64-pld-linux-gnux32-gcc  -O2 -fwrapv -pipe -Wformat -Werror=format-security -gdwarf-4 -fno-debug-types-section -fvar-tracking-assignments -g2 -Wp,-D_FORTIFY_SOURCE=2 -fstack-protector-strong --param=ssp-buffer-size=4 -Werror=trampolines -fPIC -mtune=generic -march=x86-64 -gdwarf-4 -fno-debug-types-section -fvar-tracking-assignments -g2   -Wl,--as-needed -Wl,--no-copy-dt-needed-entries -Wl,-z,relro -Wl,-z,combreloc  -o test-alignof test-alignof.o libtests.a ../lib/libgreputils.a libtests.a ../lib/libgreputils.a  
depbase=`echo test-alloca-opt.o | sed 's|[^/]*$|.deps/&|;s|\.o$||'`;\
x86_64-pld-linux-gnux32-gcc -DHAVE_CONFIG_H -DEXEEXT=\"\" -I. -I..  -DIN_GREP_GNULIB_TESTS=1 -I. -I. -I.. -I./.. -I../lib -I./../lib   -O2 -fwrapv -pipe -Wformat -Werror=format-security -gdwarf-4 -fno-debug-types-section -fvar-tracking-assignments -g2 -Wp,-D_FORTIFY_SOURCE=2 -fstack-protector-strong --param=ssp-buffer-size=4 -Werror=trampolines -fPIC -mtune=generic -march=x86-64 -gdwarf-4 -fno-debug-types-section -fvar-tracking-assignments -g2  -MT test-alloca-opt.o -MD -MP -MF $depbase.Tpo -c -o test-alloca-opt.o test-alloca-opt.c &&\
mv -f $depbase.Tpo $depbase.Po
x86_64-pld-linux-gnux32-gcc  -O2 -fwrapv -pipe -Wformat -Werror=format-security -gdwarf-4 -fno-debug-types-section -fvar-tracking-assignments -g2 -Wp,-D_FORTIFY_SOURCE=2 -fstack-protector-strong --param=ssp-buffer-size=4 -Werror=trampolines -fPIC -mtune=generic -march=x86-64 -gdwarf-4 -fno-debug-types-section -fvar-tracking-assignments -g2   -Wl,--as-needed -Wl,--no-copy-dt-needed-entries -Wl,-z,relro -Wl,-z,combreloc  -o test-alloca-opt test-alloca-opt.o libtests.a ../lib/libgreputils.a libtests.a ../lib/libgreputils.a  
depbase=`echo test-argmatch.o | sed 's|[^/]*$|.deps/&|;s|\.o$||'`;\
x86_64-pld-linux-gnux32-gcc -DHAVE_CONFIG_H -DEXEEXT=\"\" -I. -I..  -DIN_GREP_GNULIB_TESTS=1 -I. -I. -I.. -I./.. -I../lib -I./../lib   -O2 -fwrapv -pipe -Wformat -Werror=format-security -gdwarf-4 -fno-debug-types-section -fvar-tracking-assignments -g2 -Wp,-D_FORTIFY_SOURCE=2 -fstack-protector-strong --param=ssp-buffer-size=4 -Werror=trampolines -fPIC -mtune=generic -march=x86-64 -gdwarf-4 -fno-debug-types-section -fvar-tracking-assignments -g2  -MT test-argmatch.o -MD -MP -MF $depbase.Tpo -c -o test-argmatch.o test-argmatch.c &&\
mv -f $depbase.Tpo $depbase.Po
x86_64-pld-linux-gnux32-gcc  -O2 -fwrapv -pipe -Wformat -Werror=format-security -gdwarf-4 -fno-debug-types-section -fvar-tracking-assignments -g2 -Wp,-D_FORTIFY_SOURCE=2 -fstack-protector-strong --param=ssp-buffer-size=4 -Werror=trampolines -fPIC -mtune=generic -march=x86-64 -gdwarf-4 -fno-debug-types-section -fvar-tracking-assignments -g2   -Wl,--as-needed -Wl,--no-copy-dt-needed-entries -Wl,-z,relro -Wl,-z,combreloc  -o test-argmatch test-argmatch.o libtests.a ../lib/libgreputils.a libtests.a ../lib/libgreputils.a    
depbase=`echo test-arpa_inet.o | sed 's|[^/]*$|.deps/&|;s|\.o$||'`;\
x86_64-pld-linux-gnux32-gcc -DHAVE_CONFIG_H -DEXEEXT=\"\" -I. -I..  -DIN_GREP_GNULIB_TESTS=1 -I. -I. -I.. -I./.. -I../lib -I./../lib   -O2 -fwrapv -pipe -Wformat -Werror=format-security -gdwarf-4 -fno-debug-types-section -fvar-tracking-assignments -g2 -Wp,-D_FORTIFY_SOURCE=2 -fstack-protector-strong --param=ssp-buffer-size=4 -Werror=trampolines -fPIC -mtune=generic -march=x86-64 -gdwarf-4 -fno-debug-types-section -fvar-tracking-assignments -g2  -MT test-arpa_inet.o -MD -MP -MF $depbase.Tpo -c -o test-arpa_inet.o test-arpa_inet.c &&\
mv -f $depbase.Tpo $depbase.Po
x86_64-pld-linux-gnux32-gcc  -O2 -fwrapv -pipe -Wformat -Werror=format-security -gdwarf-4 -fno-debug-types-section -fvar-tracking-assignments -g2 -Wp,-D_FORTIFY_SOURCE=2 -fstack-protector-strong --param=ssp-buffer-size=4 -Werror=trampolines -fPIC -mtune=generic -march=x86-64 -gdwarf-4 -fno-debug-types-section -fvar-tracking-assignments -g2   -Wl,--as-needed -Wl,--no-copy-dt-needed-entries -Wl,-z,relro -Wl,-z,combreloc  -o test-arpa_inet test-arpa_inet.o libtests.a ../lib/libgreputils.a libtests.a ../lib/libgreputils.a  
depbase=`echo test-binary-io.o | sed 's|[^/]*$|.deps/&|;s|\.o$||'`;\
x86_64-pld-linux-gnux32-gcc -DHAVE_CONFIG_H -DEXEEXT=\"\" -I. -I..  -DIN_GREP_GNULIB_TESTS=1 -I. -I. -I.. -I./.. -I../lib -I./../lib   -O2 -fwrapv -pipe -Wformat -Werror=format-security -gdwarf-4 -fno-debug-types-section -fvar-tracking-assignments -g2 -Wp,-D_FORTIFY_SOURCE=2 -fstack-protector-strong --param=ssp-buffer-size=4 -Werror=trampolines -fPIC -mtune=generic -march=x86-64 -gdwarf-4 -fno-debug-types-section -fvar-tracking-assignments -g2  -MT test-binary-io.o -MD -MP -MF $depbase.Tpo -c -o test-binary-io.o test-binary-io.c &&\
mv -f $depbase.Tpo $depbase.Po
x86_64-pld-linux-gnux32-gcc  -O2 -fwrapv -pipe -Wformat -Werror=format-security -gdwarf-4 -fno-debug-types-section -fvar-tracking-assignments -g2 -Wp,-D_FORTIFY_SOURCE=2 -fstack-protector-strong --param=ssp-buffer-size=4 -Werror=trampolines -fPIC -mtune=generic -march=x86-64 -gdwarf-4 -fno-debug-types-section -fvar-tracking-assignments -g2   -Wl,--as-needed -Wl,--no-copy-dt-needed-entries -Wl,-z,relro -Wl,-z,combreloc  -o test-binary-io test-binary-io.o libtests.a ../lib/libgreputils.a libtests.a ../lib/libgreputils.a  
depbase=`echo test-bind.o | sed 's|[^/]*$|.deps/&|;s|\.o$||'`;\
x86_64-pld-linux-gnux32-gcc -DHAVE_CONFIG_H -DEXEEXT=\"\" -I. -I..  -DIN_GREP_GNULIB_TESTS=1 -I. -I. -I.. -I./.. -I../lib -I./../lib   -O2 -fwrapv -pipe -Wformat -Werror=format-security -gdwarf-4 -fno-debug-types-section -fvar-tracking-assignments -g2 -Wp,-D_FORTIFY_SOURCE=2 -fstack-protector-strong --param=ssp-buffer-size=4 -Werror=trampolines -fPIC -mtune=generic -march=x86-64 -gdwarf-4 -fno-debug-types-section -fvar-tracking-assignments -g2  -MT test-bind.o -MD -MP -MF $depbase.Tpo -c -o test-bind.o test-bind.c &&\
mv -f $depbase.Tpo $depbase.Po
x86_64-pld-linux-gnux32-gcc  -O2 -fwrapv -pipe -Wformat -Werror=format-security -gdwarf-4 -fno-debug-types-section -fvar-tracking-assignments -g2 -Wp,-D_FORTIFY_SOURCE=2 -fstack-protector-strong --param=ssp-buffer-size=4 -Werror=trampolines -fPIC -mtune=generic -march=x86-64 -gdwarf-4 -fno-debug-types-section -fvar-tracking-assignments -g2   -Wl,--as-needed -Wl,--no-copy-dt-needed-entries -Wl,-z,relro -Wl,-z,combreloc  -o test-bind test-bind.o libtests.a ../lib/libgreputils.a libtests.a ../lib/libgreputils.a    
depbase=`echo test-bitrotate.o | sed 's|[^/]*$|.deps/&|;s|\.o$||'`;\
x86_64-pld-linux-gnux32-gcc -DHAVE_CONFIG_H -DEXEEXT=\"\" -I. -I..  -DIN_GREP_GNULIB_TESTS=1 -I. -I. -I.. -I./.. -I../lib -I./../lib   -O2 -fwrapv -pipe -Wformat -Werror=format-security -gdwarf-4 -fno-debug-types-section -fvar-tracking-assignments -g2 -Wp,-D_FORTIFY_SOURCE=2 -fstack-protector-strong --param=ssp-buffer-size=4 -Werror=trampolines -fPIC -mtune=generic -march=x86-64 -gdwarf-4 -fno-debug-types-section -fvar-tracking-assignments -g2  -MT test-bitrotate.o -MD -MP -MF $depbase.Tpo -c -o test-bitrotate.o test-bitrotate.c &&\
mv -f $depbase.Tpo $depbase.Po
x86_64-pld-linux-gnux32-gcc  -O2 -fwrapv -pipe -Wformat -Werror=format-security -gdwarf-4 -fno-debug-types-section -fvar-tracking-assignments -g2 -Wp,-D_FORTIFY_SOURCE=2 -fstack-protector-strong --param=ssp-buffer-size=4 -Werror=trampolines -fPIC -mtune=generic -march=x86-64 -gdwarf-4 -fno-debug-types-section -fvar-tracking-assignments -g2   -Wl,--as-needed -Wl,--no-copy-dt-needed-entries -Wl,-z,relro -Wl,-z,combreloc  -o test-bitrotate test-bitrotate.o libtests.a ../lib/libgreputils.a libtests.a ../lib/libgreputils.a  
depbase=`echo test-btowc.o | sed 's|[^/]*$|.deps/&|;s|\.o$||'`;\
x86_64-pld-linux-gnux32-gcc -DHAVE_CONFIG_H -DEXEEXT=\"\" -I. -I..  -DIN_GREP_GNULIB_TESTS=1 -I. -I. -I.. -I./.. -I../lib -I./../lib   -O2 -fwrapv -pipe -Wformat -Werror=format-security -gdwarf-4 -fno-debug-types-section -fvar-tracking-assignments -g2 -Wp,-D_FORTIFY_SOURCE=2 -fstack-protector-strong --param=ssp-buffer-size=4 -Werror=trampolines -fPIC -mtune=generic -march=x86-64 -gdwarf-4 -fno-debug-types-section -fvar-tracking-assignments -g2  -MT test-btowc.o -MD -MP -MF $depbase.Tpo -c -o test-btowc.o test-btowc.c &&\
mv -f $depbase.Tpo $depbase.Po
x86_64-pld-linux-gnux32-gcc  -O2 -fwrapv -pipe -Wformat -Werror=format-security -gdwarf-4 -fno-debug-types-section -fvar-tracking-assignments -g2 -Wp,-D_FORTIFY_SOURCE=2 -fstack-protector-strong --param=ssp-buffer-size=4 -Werror=trampolines -fPIC -mtune=generic -march=x86-64 -gdwarf-4 -fno-debug-types-section -fvar-tracking-assignments -g2   -Wl,--as-needed -Wl,--no-copy-dt-needed-entries -Wl,-z,relro -Wl,-z,combreloc  -o test-btowc test-btowc.o libtests.a ../lib/libgreputils.a libtests.a ../lib/libgreputils.a   
depbase=`echo test-c-ctype.o | sed 's|[^/]*$|.deps/&|;s|\.o$||'`;\
x86_64-pld-linux-gnux32-gcc -DHAVE_CONFIG_H -DEXEEXT=\"\" -I. -I..  -DIN_GREP_GNULIB_TESTS=1 -I. -I. -I.. -I./.. -I../lib -I./../lib   -O2 -fwrapv -pipe -Wformat -Werror=format-security -gdwarf-4 -fno-debug-types-section -fvar-tracking-assignments -g2 -Wp,-D_FORTIFY_SOURCE=2 -fstack-protector-strong --param=ssp-buffer-size=4 -Werror=trampolines -fPIC -mtune=generic -march=x86-64 -gdwarf-4 -fno-debug-types-section -fvar-tracking-assignments -g2  -MT test-c-ctype.o -MD -MP -MF $depbase.Tpo -c -o test-c-ctype.o test-c-ctype.c &&\
mv -f $depbase.Tpo $depbase.Po
x86_64-pld-linux-gnux32-gcc  -O2 -fwrapv -pipe -Wformat -Werror=format-security -gdwarf-4 -fno-debug-types-section -fvar-tracking-assignments -g2 -Wp,-D_FORTIFY_SOURCE=2 -fstack-protector-strong --param=ssp-buffer-size=4 -Werror=trampolines -fPIC -mtune=generic -march=x86-64 -gdwarf-4 -fno-debug-types-section -fvar-tracking-assignments -g2   -Wl,--as-needed -Wl,--no-copy-dt-needed-entries -Wl,-z,relro -Wl,-z,combreloc  -o test-c-ctype test-c-ctype.o libtests.a ../lib/libgreputils.a libtests.a ../lib/libgreputils.a   
depbase=`echo test-c-stack.o | sed 's|[^/]*$|.deps/&|;s|\.o$||'`;\
x86_64-pld-linux-gnux32-gcc -DHAVE_CONFIG_H -DEXEEXT=\"\" -I. -I..  -DIN_GREP_GNULIB_TESTS=1 -I. -I. -I.. -I./.. -I../lib -I./../lib   -O2 -fwrapv -pipe -Wformat -Werror=format-security -gdwarf-4 -fno-debug-types-section -fvar-tracking-assignments -g2 -Wp,-D_FORTIFY_SOURCE=2 -fstack-protector-strong --param=ssp-buffer-size=4 -Werror=trampolines -fPIC -mtune=generic -march=x86-64 -gdwarf-4 -fno-debug-types-section -fvar-tracking-assignments -g2  -MT test-c-stack.o -MD -MP -MF $depbase.Tpo -c -o test-c-stack.o test-c-stack.c &&\
mv -f $depbase.Tpo $depbase.Po
x86_64-pld-linux-gnux32-gcc  -O2 -fwrapv -pipe -Wformat -Werror=format-security -gdwarf-4 -fno-debug-types-section -fvar-tracking-assignments -g2 -Wp,-D_FORTIFY_SOURCE=2 -fstack-protector-strong --param=ssp-buffer-size=4 -Werror=trampolines -fPIC -mtune=generic -march=x86-64 -gdwarf-4 -fno-debug-types-section -fvar-tracking-assignments -g2   -Wl,--as-needed -Wl,--no-copy-dt-needed-entries -Wl,-z,relro -Wl,-z,combreloc  -o test-c-stack test-c-stack.o libtests.a ../lib/libgreputils.a libtests.a ../lib/libgreputils.a  -lsigsegv  
depbase=`echo test-c-strcasecmp.o | sed 's|[^/]*$|.deps/&|;s|\.o$||'`;\
x86_64-pld-linux-gnux32-gcc -DHAVE_CONFIG_H -DEXEEXT=\"\" -I. -I..  -DIN_GREP_GNULIB_TESTS=1 -I. -I. -I.. -I./.. -I../lib -I./../lib   -O2 -fwrapv -pipe -Wformat -Werror=format-security -gdwarf-4 -fno-debug-types-section -fvar-tracking-assignments -g2 -Wp,-D_FORTIFY_SOURCE=2 -fstack-protector-strong --param=ssp-buffer-size=4 -Werror=trampolines -fPIC -mtune=generic -march=x86-64 -gdwarf-4 -fno-debug-types-section -fvar-tracking-assignments -g2  -MT test-c-strcasecmp.o -MD -MP -MF $depbase.Tpo -c -o test-c-strcasecmp.o test-c-strcasecmp.c &&\
mv -f $depbase.Tpo $depbase.Po
x86_64-pld-linux-gnux32-gcc  -O2 -fwrapv -pipe -Wformat -Werror=format-security -gdwarf-4 -fno-debug-types-section -fvar-tracking-assignments -g2 -Wp,-D_FORTIFY_SOURCE=2 -fstack-protector-strong --param=ssp-buffer-size=4 -Werror=trampolines -fPIC -mtune=generic -march=x86-64 -gdwarf-4 -fno-debug-types-section -fvar-tracking-assignments -g2   -Wl,--as-needed -Wl,--no-copy-dt-needed-entries -Wl,-z,relro -Wl,-z,combreloc  -o test-c-strcasecmp test-c-strcasecmp.o libtests.a ../lib/libgreputils.a libtests.a ../lib/libgreputils.a   
depbase=`echo test-c-strncasecmp.o | sed 's|[^/]*$|.deps/&|;s|\.o$||'`;\
x86_64-pld-linux-gnux32-gcc -DHAVE_CONFIG_H -DEXEEXT=\"\" -I. -I..  -DIN_GREP_GNULIB_TESTS=1 -I. -I. -I.. -I./.. -I../lib -I./../lib   -O2 -fwrapv -pipe -Wformat -Werror=format-security -gdwarf-4 -fno-debug-types-section -fvar-tracking-assignments -g2 -Wp,-D_FORTIFY_SOURCE=2 -fstack-protector-strong --param=ssp-buffer-size=4 -Werror=trampolines -fPIC -mtune=generic -march=x86-64 -gdwarf-4 -fno-debug-types-section -fvar-tracking-assignments -g2  -MT test-c-strncasecmp.o -MD -MP -MF $depbase.Tpo -c -o test-c-strncasecmp.o test-c-strncasecmp.c &&\
mv -f $depbase.Tpo $depbase.Po
x86_64-pld-linux-gnux32-gcc  -O2 -fwrapv -pipe -Wformat -Werror=format-security -gdwarf-4 -fno-debug-types-section -fvar-tracking-assignments -g2 -Wp,-D_FORTIFY_SOURCE=2 -fstack-protector-strong --param=ssp-buffer-size=4 -Werror=trampolines -fPIC -mtune=generic -march=x86-64 -gdwarf-4 -fno-debug-types-section -fvar-tracking-assignments -g2   -Wl,--as-needed -Wl,--no-copy-dt-needed-entries -Wl,-z,relro -Wl,-z,combreloc  -o test-c-strncasecmp test-c-strncasecmp.o libtests.a ../lib/libgreputils.a libtests.a ../lib/libgreputils.a   
depbase=`echo test-chdir.o | sed 's|[^/]*$|.deps/&|;s|\.o$||'`;\
x86_64-pld-linux-gnux32-gcc -DHAVE_CONFIG_H -DEXEEXT=\"\" -I. -I..  -DIN_GREP_GNULIB_TESTS=1 -I. -I. -I.. -I./.. -I../lib -I./../lib   -O2 -fwrapv -pipe -Wformat -Werror=format-security -gdwarf-4 -fno-debug-types-section -fvar-tracking-assignments -g2 -Wp,-D_FORTIFY_SOURCE=2 -fstack-protector-strong --param=ssp-buffer-size=4 -Werror=trampolines -fPIC -mtune=generic -march=x86-64 -gdwarf-4 -fno-debug-types-section -fvar-tracking-assignments -g2  -MT test-chdir.o -MD -MP -MF $depbase.Tpo -c -o test-chdir.o test-chdir.c &&\
mv -f $depbase.Tpo $depbase.Po
x86_64-pld-linux-gnux32-gcc  -O2 -fwrapv -pipe -Wformat -Werror=format-security -gdwarf-4 -fno-debug-types-section -fvar-tracking-assignments -g2 -Wp,-D_FORTIFY_SOURCE=2 -fstack-protector-strong --param=ssp-buffer-size=4 -Werror=trampolines -fPIC -mtune=generic -march=x86-64 -gdwarf-4 -fno-debug-types-section -fvar-tracking-assignments -g2   -Wl,--as-needed -Wl,--no-copy-dt-needed-entries -Wl,-z,relro -Wl,-z,combreloc  -o test-chdir test-chdir.o libtests.a ../lib/libgreputils.a libtests.a ../lib/libgreputils.a  
depbase=`echo test-cloexec.o | sed 's|[^/]*$|.deps/&|;s|\.o$||'`;\
x86_64-pld-linux-gnux32-gcc -DHAVE_CONFIG_H -DEXEEXT=\"\" -I. -I..  -DIN_GREP_GNULIB_TESTS=1 -I. -I. -I.. -I./.. -I../lib -I./../lib   -O2 -fwrapv -pipe -Wformat -Werror=format-security -gdwarf-4 -fno-debug-types-section -fvar-tracking-assignments -g2 -Wp,-D_FORTIFY_SOURCE=2 -fstack-protector-strong --param=ssp-buffer-size=4 -Werror=trampolines -fPIC -mtune=generic -march=x86-64 -gdwarf-4 -fno-debug-types-section -fvar-tracking-assignments -g2  -MT test-cloexec.o -MD -MP -MF $depbase.Tpo -c -o test-cloexec.o test-cloexec.c &&\
mv -f $depbase.Tpo $depbase.Po
x86_64-pld-linux-gnux32-gcc  -O2 -fwrapv -pipe -Wformat -Werror=format-security -gdwarf-4 -fno-debug-types-section -fvar-tracking-assignments -g2 -Wp,-D_FORTIFY_SOURCE=2 -fstack-protector-strong --param=ssp-buffer-size=4 -Werror=trampolines -fPIC -mtune=generic -march=x86-64 -gdwarf-4 -fno-debug-types-section -fvar-tracking-assignments -g2   -Wl,--as-needed -Wl,--no-copy-dt-needed-entries -Wl,-z,relro -Wl,-z,combreloc  -o test-cloexec test-cloexec.o libtests.a ../lib/libgreputils.a libtests.a ../lib/libgreputils.a  
depbase=`echo test-close.o | sed 's|[^/]*$|.deps/&|;s|\.o$||'`;\
x86_64-pld-linux-gnux32-gcc -DHAVE_CONFIG_H -DEXEEXT=\"\" -I. -I..  -DIN_GREP_GNULIB_TESTS=1 -I. -I. -I.. -I./.. -I../lib -I./../lib   -O2 -fwrapv -pipe -Wformat -Werror=format-security -gdwarf-4 -fno-debug-types-section -fvar-tracking-assignments -g2 -Wp,-D_FORTIFY_SOURCE=2 -fstack-protector-strong --param=ssp-buffer-size=4 -Werror=trampolines -fPIC -mtune=generic -march=x86-64 -gdwarf-4 -fno-debug-types-section -fvar-tracking-assignments -g2  -MT test-close.o -MD -MP -MF $depbase.Tpo -c -o test-close.o test-close.c &&\
mv -f $depbase.Tpo $depbase.Po
x86_64-pld-linux-gnux32-gcc  -O2 -fwrapv -pipe -Wformat -Werror=format-security -gdwarf-4 -fno-debug-types-section -fvar-tracking-assignments -g2 -Wp,-D_FORTIFY_SOURCE=2 -fstack-protector-strong --param=ssp-buffer-size=4 -Werror=trampolines -fPIC -mtune=generic -march=x86-64 -gdwarf-4 -fno-debug-types-section -fvar-tracking-assignments -g2   -Wl,--as-needed -Wl,--no-copy-dt-needed-entries -Wl,-z,relro -Wl,-z,combreloc  -o test-close test-close.o libtests.a ../lib/libgreputils.a libtests.a ../lib/libgreputils.a  
depbase=`echo test-connect.o | sed 's|[^/]*$|.deps/&|;s|\.o$||'`;\
x86_64-pld-linux-gnux32-gcc -DHAVE_CONFIG_H -DEXEEXT=\"\" -I. -I..  -DIN_GREP_GNULIB_TESTS=1 -I. -I. -I.. -I./.. -I../lib -I./../lib   -O2 -fwrapv -pipe -Wformat -Werror=format-security -gdwarf-4 -fno-debug-types-section -fvar-tracking-assignments -g2 -Wp,-D_FORTIFY_SOURCE=2 -fstack-protector-strong --param=ssp-buffer-size=4 -Werror=trampolines -fPIC -mtune=generic -march=x86-64 -gdwarf-4 -fno-debug-types-section -fvar-tracking-assignments -g2  -MT test-connect.o -MD -MP -MF $depbase.Tpo -c -o test-connect.o test-connect.c &&\
mv -f $depbase.Tpo $depbase.Po
x86_64-pld-linux-gnux32-gcc  -O2 -fwrapv -pipe -Wformat -Werror=format-security -gdwarf-4 -fno-debug-types-section -fvar-tracking-assignments -g2 -Wp,-D_FORTIFY_SOURCE=2 -fstack-protector-strong --param=ssp-buffer-size=4 -Werror=trampolines -fPIC -mtune=generic -march=x86-64 -gdwarf-4 -fno-debug-types-section -fvar-tracking-assignments -g2   -Wl,--as-needed -Wl,--no-copy-dt-needed-entries -Wl,-z,relro -Wl,-z,combreloc  -o test-connect test-connect.o libtests.a ../lib/libgreputils.a libtests.a ../lib/libgreputils.a    
depbase=`echo test-ctype.o | sed 's|[^/]*$|.deps/&|;s|\.o$||'`;\
x86_64-pld-linux-gnux32-gcc -DHAVE_CONFIG_H -DEXEEXT=\"\" -I. -I..  -DIN_GREP_GNULIB_TESTS=1 -I. -I. -I.. -I./.. -I../lib -I./../lib   -O2 -fwrapv -pipe -Wformat -Werror=format-security -gdwarf-4 -fno-debug-types-section -fvar-tracking-assignments -g2 -Wp,-D_FORTIFY_SOURCE=2 -fstack-protector-strong --param=ssp-buffer-size=4 -Werror=trampolines -fPIC -mtune=generic -march=x86-64 -gdwarf-4 -fno-debug-types-section -fvar-tracking-assignments -g2  -MT test-ctype.o -MD -MP -MF $depbase.Tpo -c -o test-ctype.o test-ctype.c &&\
mv -f $depbase.Tpo $depbase.Po
x86_64-pld-linux-gnux32-gcc  -O2 -fwrapv -pipe -Wformat -Werror=format-security -gdwarf-4 -fno-debug-types-section -fvar-tracking-assignments -g2 -Wp,-D_FORTIFY_SOURCE=2 -fstack-protector-strong --param=ssp-buffer-size=4 -Werror=trampolines -fPIC -mtune=generic -march=x86-64 -gdwarf-4 -fno-debug-types-section -fvar-tracking-assignments -g2   -Wl,--as-needed -Wl,--no-copy-dt-needed-entries -Wl,-z,relro -Wl,-z,combreloc  -o test-ctype test-ctype.o libtests.a ../lib/libgreputils.a libtests.a ../lib/libgreputils.a  
depbase=`echo test-dfa-match-aux.o | sed 's|[^/]*$|.deps/&|;s|\.o$||'`;\
x86_64-pld-linux-gnux32-gcc -DHAVE_CONFIG_H -DEXEEXT=\"\" -I. -I..  -DIN_GREP_GNULIB_TESTS=1 -I. -I. -I.. -I./.. -I../lib -I./../lib   -O2 -fwrapv -pipe -Wformat -Werror=format-security -gdwarf-4 -fno-debug-types-section -fvar-tracking-assignments -g2 -Wp,-D_FORTIFY_SOURCE=2 -fstack-protector-strong --param=ssp-buffer-size=4 -Werror=trampolines -fPIC -mtune=generic -march=x86-64 -gdwarf-4 -fno-debug-types-section -fvar-tracking-assignments -g2  -MT test-dfa-match-aux.o -MD -MP -MF $depbase.Tpo -c -o test-dfa-match-aux.o test-dfa-match-aux.c &&\
mv -f $depbase.Tpo $depbase.Po
x86_64-pld-linux-gnux32-gcc  -O2 -fwrapv -pipe -Wformat -Werror=format-security -gdwarf-4 -fno-debug-types-section -fvar-tracking-assignments -g2 -Wp,-D_FORTIFY_SOURCE=2 -fstack-protector-strong --param=ssp-buffer-size=4 -Werror=trampolines -fPIC -mtune=generic -march=x86-64 -gdwarf-4 -fno-debug-types-section -fvar-tracking-assignments -g2   -Wl,--as-needed -Wl,--no-copy-dt-needed-entries -Wl,-z,relro -Wl,-z,combreloc  -o test-dfa-match-aux test-dfa-match-aux.o libtests.a ../lib/libgreputils.a libtests.a ../lib/libgreputils.a     
depbase=`echo test-dirent.o | sed 's|[^/]*$|.deps/&|;s|\.o$||'`;\
x86_64-pld-linux-gnux32-gcc -DHAVE_CONFIG_H -DEXEEXT=\"\" -I. -I..  -DIN_GREP_GNULIB_TESTS=1 -I. -I. -I.. -I./.. -I../lib -I./../lib   -O2 -fwrapv -pipe -Wformat -Werror=format-security -gdwarf-4 -fno-debug-types-section -fvar-tracking-assignments -g2 -Wp,-D_FORTIFY_SOURCE=2 -fstack-protector-strong --param=ssp-buffer-size=4 -Werror=trampolines -fPIC -mtune=generic -march=x86-64 -gdwarf-4 -fno-debug-types-section -fvar-tracking-assignments -g2  -MT test-dirent.o -MD -MP -MF $depbase.Tpo -c -o test-dirent.o test-dirent.c &&\
mv -f $depbase.Tpo $depbase.Po
x86_64-pld-linux-gnux32-gcc  -O2 -fwrapv -pipe -Wformat -Werror=format-security -gdwarf-4 -fno-debug-types-section -fvar-tracking-assignments -g2 -Wp,-D_FORTIFY_SOURCE=2 -fstack-protector-strong --param=ssp-buffer-size=4 -Werror=trampolines -fPIC -mtune=generic -march=x86-64 -gdwarf-4 -fno-debug-types-section -fvar-tracking-assignments -g2   -Wl,--as-needed -Wl,--no-copy-dt-needed-entries -Wl,-z,relro -Wl,-z,combreloc  -o test-dirent test-dirent.o libtests.a ../lib/libgreputils.a libtests.a ../lib/libgreputils.a  
depbase=`echo test-dup.o | sed 's|[^/]*$|.deps/&|;s|\.o$||'`;\
x86_64-pld-linux-gnux32-gcc -DHAVE_CONFIG_H -DEXEEXT=\"\" -I. -I..  -DIN_GREP_GNULIB_TESTS=1 -I. -I. -I.. -I./.. -I../lib -I./../lib   -O2 -fwrapv -pipe -Wformat -Werror=format-security -gdwarf-4 -fno-debug-types-section -fvar-tracking-assignments -g2 -Wp,-D_FORTIFY_SOURCE=2 -fstack-protector-strong --param=ssp-buffer-size=4 -Werror=trampolines -fPIC -mtune=generic -march=x86-64 -gdwarf-4 -fno-debug-types-section -fvar-tracking-assignments -g2  -MT test-dup.o -MD -MP -MF $depbase.Tpo -c -o test-dup.o test-dup.c &&\
mv -f $depbase.Tpo $depbase.Po
x86_64-pld-linux-gnux32-gcc  -O2 -fwrapv -pipe -Wformat -Werror=format-security -gdwarf-4 -fno-debug-types-section -fvar-tracking-assignments -g2 -Wp,-D_FORTIFY_SOURCE=2 -fstack-protector-strong --param=ssp-buffer-size=4 -Werror=trampolines -fPIC -mtune=generic -march=x86-64 -gdwarf-4 -fno-debug-types-section -fvar-tracking-assignments -g2   -Wl,--as-needed -Wl,--no-copy-dt-needed-entries -Wl,-z,relro -Wl,-z,combreloc  -o test-dup test-dup.o libtests.a ../lib/libgreputils.a libtests.a ../lib/libgreputils.a  
depbase=`echo test-dup2.o | sed 's|[^/]*$|.deps/&|;s|\.o$||'`;\
x86_64-pld-linux-gnux32-gcc -DHAVE_CONFIG_H -DEXEEXT=\"\" -I. -I..  -DIN_GREP_GNULIB_TESTS=1 -I. -I. -I.. -I./.. -I../lib -I./../lib   -O2 -fwrapv -pipe -Wformat -Werror=format-security -gdwarf-4 -fno-debug-types-section -fvar-tracking-assignments -g2 -Wp,-D_FORTIFY_SOURCE=2 -fstack-protector-strong --param=ssp-buffer-size=4 -Werror=trampolines -fPIC -mtune=generic -march=x86-64 -gdwarf-4 -fno-debug-types-section -fvar-tracking-assignments -g2  -MT test-dup2.o -MD -MP -MF $depbase.Tpo -c -o test-dup2.o test-dup2.c &&\
mv -f $depbase.Tpo $depbase.Po
x86_64-pld-linux-gnux32-gcc  -O2 -fwrapv -pipe -Wformat -Werror=format-security -gdwarf-4 -fno-debug-types-section -fvar-tracking-assignments -g2 -Wp,-D_FORTIFY_SOURCE=2 -fstack-protector-strong --param=ssp-buffer-size=4 -Werror=trampolines -fPIC -mtune=generic -march=x86-64 -gdwarf-4 -fno-debug-types-section -fvar-tracking-assignments -g2   -Wl,--as-needed -Wl,--no-copy-dt-needed-entries -Wl,-z,relro -Wl,-z,combreloc  -o test-dup2 test-dup2.o libtests.a ../lib/libgreputils.a libtests.a ../lib/libgreputils.a  
depbase=`echo test-environ.o | sed 's|[^/]*$|.deps/&|;s|\.o$||'`;\
x86_64-pld-linux-gnux32-gcc -DHAVE_CONFIG_H -DEXEEXT=\"\" -I. -I..  -DIN_GREP_GNULIB_TESTS=1 -I. -I. -I.. -I./.. -I../lib -I./../lib   -O2 -fwrapv -pipe -Wformat -Werror=format-security -gdwarf-4 -fno-debug-types-section -fvar-tracking-assignments -g2 -Wp,-D_FORTIFY_SOURCE=2 -fstack-protector-strong --param=ssp-buffer-size=4 -Werror=trampolines -fPIC -mtune=generic -march=x86-64 -gdwarf-4 -fno-debug-types-section -fvar-tracking-assignments -g2  -MT test-environ.o -MD -MP -MF $depbase.Tpo -c -o test-environ.o test-environ.c &&\
mv -f $depbase.Tpo $depbase.Po
x86_64-pld-linux-gnux32-gcc  -O2 -fwrapv -pipe -Wformat -Werror=format-security -gdwarf-4 -fno-debug-types-section -fvar-tracking-assignments -g2 -Wp,-D_FORTIFY_SOURCE=2 -fstack-protector-strong --param=ssp-buffer-size=4 -Werror=trampolines -fPIC -mtune=generic -march=x86-64 -gdwarf-4 -fno-debug-types-section -fvar-tracking-assignments -g2   -Wl,--as-needed -Wl,--no-copy-dt-needed-entries -Wl,-z,relro -Wl,-z,combreloc  -o test-environ test-environ.o libtests.a ../lib/libgreputils.a libtests.a ../lib/libgreputils.a  
depbase=`echo test-errno.o | sed 's|[^/]*$|.deps/&|;s|\.o$||'`;\
x86_64-pld-linux-gnux32-gcc -DHAVE_CONFIG_H -DEXEEXT=\"\" -I. -I..  -DIN_GREP_GNULIB_TESTS=1 -I. -I. -I.. -I./.. -I../lib -I./../lib   -O2 -fwrapv -pipe -Wformat -Werror=format-security -gdwarf-4 -fno-debug-types-section -fvar-tracking-assignments -g2 -Wp,-D_FORTIFY_SOURCE=2 -fstack-protector-strong --param=ssp-buffer-size=4 -Werror=trampolines -fPIC -mtune=generic -march=x86-64 -gdwarf-4 -fno-debug-types-section -fvar-tracking-assignments -g2  -MT test-errno.o -MD -MP -MF $depbase.Tpo -c -o test-errno.o test-errno.c &&\
mv -f $depbase.Tpo $depbase.Po
x86_64-pld-linux-gnux32-gcc  -O2 -fwrapv -pipe -Wformat -Werror=format-security -gdwarf-4 -fno-debug-types-section -fvar-tracking-assignments -g2 -Wp,-D_FORTIFY_SOURCE=2 -fstack-protector-strong --param=ssp-buffer-size=4 -Werror=trampolines -fPIC -mtune=generic -march=x86-64 -gdwarf-4 -fno-debug-types-section -fvar-tracking-assignments -g2   -Wl,--as-needed -Wl,--no-copy-dt-needed-entries -Wl,-z,relro -Wl,-z,combreloc  -o test-errno test-errno.o libtests.a ../lib/libgreputils.a libtests.a ../lib/libgreputils.a  
depbase=`echo test-exclude.o | sed 's|[^/]*$|.deps/&|;s|\.o$||'`;\
x86_64-pld-linux-gnux32-gcc -DHAVE_CONFIG_H -DEXEEXT=\"\" -I. -I..  -DIN_GREP_GNULIB_TESTS=1 -I. -I. -I.. -I./.. -I../lib -I./../lib   -O2 -fwrapv -pipe -Wformat -Werror=format-security -gdwarf-4 -fno-debug-types-section -fvar-tracking-assignments -g2 -Wp,-D_FORTIFY_SOURCE=2 -fstack-protector-strong --param=ssp-buffer-size=4 -Werror=trampolines -fPIC -mtune=generic -march=x86-64 -gdwarf-4 -fno-debug-types-section -fvar-tracking-assignments -g2  -MT test-exclude.o -MD -MP -MF $depbase.Tpo -c -o test-exclude.o test-exclude.c &&\
mv -f $depbase.Tpo $depbase.Po
x86_64-pld-linux-gnux32-gcc  -O2 -fwrapv -pipe -Wformat -Werror=format-security -gdwarf-4 -fno-debug-types-section -fvar-tracking-assignments -g2 -Wp,-D_FORTIFY_SOURCE=2 -fstack-protector-strong --param=ssp-buffer-size=4 -Werror=trampolines -fPIC -mtune=generic -march=x86-64 -gdwarf-4 -fno-debug-types-section -fvar-tracking-assignments -g2   -Wl,--as-needed -Wl,--no-copy-dt-needed-entries -Wl,-z,relro -Wl,-z,combreloc  -o test-exclude test-exclude.o libtests.a ../lib/libgreputils.a libtests.a ../lib/libgreputils.a     
depbase=`echo test-fchdir.o | sed 's|[^/]*$|.deps/&|;s|\.o$||'`;\
x86_64-pld-linux-gnux32-gcc -DHAVE_CONFIG_H -DEXEEXT=\"\" -I. -I..  -DIN_GREP_GNULIB_TESTS=1 -I. -I. -I.. -I./.. -I../lib -I./../lib   -O2 -fwrapv -pipe -Wformat -Werror=format-security -gdwarf-4 -fno-debug-types-section -fvar-tracking-assignments -g2 -Wp,-D_FORTIFY_SOURCE=2 -fstack-protector-strong --param=ssp-buffer-size=4 -Werror=trampolines -fPIC -mtune=generic -march=x86-64 -gdwarf-4 -fno-debug-types-section -fvar-tracking-assignments -g2  -MT test-fchdir.o -MD -MP -MF $depbase.Tpo -c -o test-fchdir.o test-fchdir.c &&\
mv -f $depbase.Tpo $depbase.Po
x86_64-pld-linux-gnux32-gcc  -O2 -fwrapv -pipe -Wformat -Werror=format-security -gdwarf-4 -fno-debug-types-section -fvar-tracking-assignments -g2 -Wp,-D_FORTIFY_SOURCE=2 -fstack-protector-strong --param=ssp-buffer-size=4 -Werror=trampolines -fPIC -mtune=generic -march=x86-64 -gdwarf-4 -fno-debug-types-section -fvar-tracking-assignments -g2   -Wl,--as-needed -Wl,--no-copy-dt-needed-entries -Wl,-z,relro -Wl,-z,combreloc  -o test-fchdir test-fchdir.o libtests.a ../lib/libgreputils.a libtests.a ../lib/libgreputils.a   
depbase=`echo test-fcntl-h.o | sed 's|[^/]*$|.deps/&|;s|\.o$||'`;\
x86_64-pld-linux-gnux32-gcc -DHAVE_CONFIG_H -DEXEEXT=\"\" -I. -I..  -DIN_GREP_GNULIB_TESTS=1 -I. -I. -I.. -I./.. -I../lib -I./../lib   -O2 -fwrapv -pipe -Wformat -Werror=format-security -gdwarf-4 -fno-debug-types-section -fvar-tracking-assignments -g2 -Wp,-D_FORTIFY_SOURCE=2 -fstack-protector-strong --param=ssp-buffer-size=4 -Werror=trampolines -fPIC -mtune=generic -march=x86-64 -gdwarf-4 -fno-debug-types-section -fvar-tracking-assignments -g2  -MT test-fcntl-h.o -MD -MP -MF $depbase.Tpo -c -o test-fcntl-h.o test-fcntl-h.c &&\
mv -f $depbase.Tpo $depbase.Po
x86_64-pld-linux-gnux32-gcc  -O2 -fwrapv -pipe -Wformat -Werror=format-security -gdwarf-4 -fno-debug-types-section -fvar-tracking-assignments -g2 -Wp,-D_FORTIFY_SOURCE=2 -fstack-protector-strong --param=ssp-buffer-size=4 -Werror=trampolines -fPIC -mtune=generic -march=x86-64 -gdwarf-4 -fno-debug-types-section -fvar-tracking-assignments -g2   -Wl,--as-needed -Wl,--no-copy-dt-needed-entries -Wl,-z,relro -Wl,-z,combreloc  -o test-fcntl-h test-fcntl-h.o libtests.a ../lib/libgreputils.a libtests.a ../lib/libgreputils.a  
depbase=`echo test-fcntl-safer.o | sed 's|[^/]*$|.deps/&|;s|\.o$||'`;\
x86_64-pld-linux-gnux32-gcc -DHAVE_CONFIG_H -DEXEEXT=\"\" -I. -I..  -DIN_GREP_GNULIB_TESTS=1 -I. -I. -I.. -I./.. -I../lib -I./../lib   -O2 -fwrapv -pipe -Wformat -Werror=format-security -gdwarf-4 -fno-debug-types-section -fvar-tracking-assignments -g2 -Wp,-D_FORTIFY_SOURCE=2 -fstack-protector-strong --param=ssp-buffer-size=4 -Werror=trampolines -fPIC -mtune=generic -march=x86-64 -gdwarf-4 -fno-debug-types-section -fvar-tracking-assignments -g2  -MT test-fcntl-safer.o -MD -MP -MF $depbase.Tpo -c -o test-fcntl-safer.o test-fcntl-safer.c &&\
mv -f $depbase.Tpo $depbase.Po
x86_64-pld-linux-gnux32-gcc  -O2 -fwrapv -pipe -Wformat -Werror=format-security -gdwarf-4 -fno-debug-types-section -fvar-tracking-assignments -g2 -Wp,-D_FORTIFY_SOURCE=2 -fstack-protector-strong --param=ssp-buffer-size=4 -Werror=trampolines -fPIC -mtune=generic -march=x86-64 -gdwarf-4 -fno-debug-types-section -fvar-tracking-assignments -g2   -Wl,--as-needed -Wl,--no-copy-dt-needed-entries -Wl,-z,relro -Wl,-z,combreloc  -o test-fcntl-safer test-fcntl-safer.o libtests.a ../lib/libgreputils.a libtests.a ../lib/libgreputils.a  
depbase=`echo test-fcntl.o | sed 's|[^/]*$|.deps/&|;s|\.o$||'`;\
x86_64-pld-linux-gnux32-gcc -DHAVE_CONFIG_H -DEXEEXT=\"\" -I. -I..  -DIN_GREP_GNULIB_TESTS=1 -I. -I. -I.. -I./.. -I../lib -I./../lib   -O2 -fwrapv -pipe -Wformat -Werror=format-security -gdwarf-4 -fno-debug-types-section -fvar-tracking-assignments -g2 -Wp,-D_FORTIFY_SOURCE=2 -fstack-protector-strong --param=ssp-buffer-size=4 -Werror=trampolines -fPIC -mtune=generic -march=x86-64 -gdwarf-4 -fno-debug-types-section -fvar-tracking-assignments -g2  -MT test-fcntl.o -MD -MP -MF $depbase.Tpo -c -o test-fcntl.o test-fcntl.c &&\
mv -f $depbase.Tpo $depbase.Po
x86_64-pld-linux-gnux32-gcc  -O2 -fwrapv -pipe -Wformat -Werror=format-security -gdwarf-4 -fno-debug-types-section -fvar-tracking-assignments -g2 -Wp,-D_FORTIFY_SOURCE=2 -fstack-protector-strong --param=ssp-buffer-size=4 -Werror=trampolines -fPIC -mtune=generic -march=x86-64 -gdwarf-4 -fno-debug-types-section -fvar-tracking-assignments -g2   -Wl,--as-needed -Wl,--no-copy-dt-needed-entries -Wl,-z,relro -Wl,-z,combreloc  -o test-fcntl test-fcntl.o libtests.a ../lib/libgreputils.a libtests.a ../lib/libgreputils.a  
depbase=`echo test-fdopen.o | sed 's|[^/]*$|.deps/&|;s|\.o$||'`;\
x86_64-pld-linux-gnux32-gcc -DHAVE_CONFIG_H -DEXEEXT=\"\" -I. -I..  -DIN_GREP_GNULIB_TESTS=1 -I. -I. -I.. -I./.. -I../lib -I./../lib   -O2 -fwrapv -pipe -Wformat -Werror=format-security -gdwarf-4 -fno-debug-types-section -fvar-tracking-assignments -g2 -Wp,-D_FORTIFY_SOURCE=2 -fstack-protector-strong --param=ssp-buffer-size=4 -Werror=trampolines -fPIC -mtune=generic -march=x86-64 -gdwarf-4 -fno-debug-types-section -fvar-tracking-assignments -g2  -MT test-fdopen.o -MD -MP -MF $depbase.Tpo -c -o test-fdopen.o test-fdopen.c &&\
mv -f $depbase.Tpo $depbase.Po
x86_64-pld-linux-gnux32-gcc  -O2 -fwrapv -pipe -Wformat -Werror=format-security -gdwarf-4 -fno-debug-types-section -fvar-tracking-assignments -g2 -Wp,-D_FORTIFY_SOURCE=2 -fstack-protector-strong --param=ssp-buffer-size=4 -Werror=trampolines -fPIC -mtune=generic -march=x86-64 -gdwarf-4 -fno-debug-types-section -fvar-tracking-assignments -g2   -Wl,--as-needed -Wl,--no-copy-dt-needed-entries -Wl,-z,relro -Wl,-z,combreloc  -o test-fdopen test-fdopen.o libtests.a ../lib/libgreputils.a libtests.a ../lib/libgreputils.a  
depbase=`echo test-fdopendir.o | sed 's|[^/]*$|.deps/&|;s|\.o$||'`;\
x86_64-pld-linux-gnux32-gcc -DHAVE_CONFIG_H -DEXEEXT=\"\" -I. -I..  -DIN_GREP_GNULIB_TESTS=1 -I. -I. -I.. -I./.. -I../lib -I./../lib   -O2 -fwrapv -pipe -Wformat -Werror=format-security -gdwarf-4 -fno-debug-types-section -fvar-tracking-assignments -g2 -Wp,-D_FORTIFY_SOURCE=2 -fstack-protector-strong --param=ssp-buffer-size=4 -Werror=trampolines -fPIC -mtune=generic -march=x86-64 -gdwarf-4 -fno-debug-types-section -fvar-tracking-assignments -g2  -MT test-fdopendir.o -MD -MP -MF $depbase.Tpo -c -o test-fdopendir.o test-fdopendir.c &&\
mv -f $depbase.Tpo $depbase.Po
x86_64-pld-linux-gnux32-gcc  -O2 -fwrapv -pipe -Wformat -Werror=format-security -gdwarf-4 -fno-debug-types-section -fvar-tracking-assignments -g2 -Wp,-D_FORTIFY_SOURCE=2 -fstack-protector-strong --param=ssp-buffer-size=4 -Werror=trampolines -fPIC -mtune=generic -march=x86-64 -gdwarf-4 -fno-debug-types-section -fvar-tracking-assignments -g2   -Wl,--as-needed -Wl,--no-copy-dt-needed-entries -Wl,-z,relro -Wl,-z,combreloc  -o test-fdopendir test-fdopendir.o libtests.a ../lib/libgreputils.a libtests.a ../lib/libgreputils.a   
depbase=`echo test-fgetc.o | sed 's|[^/]*$|.deps/&|;s|\.o$||'`;\
x86_64-pld-linux-gnux32-gcc -DHAVE_CONFIG_H -DEXEEXT=\"\" -I. -I..  -DIN_GREP_GNULIB_TESTS=1 -I. -I. -I.. -I./.. -I../lib -I./../lib   -O2 -fwrapv -pipe -Wformat -Werror=format-security -gdwarf-4 -fno-debug-types-section -fvar-tracking-assignments -g2 -Wp,-D_FORTIFY_SOURCE=2 -fstack-protector-strong --param=ssp-buffer-size=4 -Werror=trampolines -fPIC -mtune=generic -march=x86-64 -gdwarf-4 -fno-debug-types-section -fvar-tracking-assignments -g2  -MT test-fgetc.o -MD -MP -MF $depbase.Tpo -c -o test-fgetc.o test-fgetc.c &&\
mv -f $depbase.Tpo $depbase.Po
x86_64-pld-linux-gnux32-gcc  -O2 -fwrapv -pipe -Wformat -Werror=format-security -gdwarf-4 -fno-debug-types-section -fvar-tracking-assignments -g2 -Wp,-D_FORTIFY_SOURCE=2 -fstack-protector-strong --param=ssp-buffer-size=4 -Werror=trampolines -fPIC -mtune=generic -march=x86-64 -gdwarf-4 -fno-debug-types-section -fvar-tracking-assignments -g2   -Wl,--as-needed -Wl,--no-copy-dt-needed-entries -Wl,-z,relro -Wl,-z,combreloc  -o test-fgetc test-fgetc.o libtests.a ../lib/libgreputils.a libtests.a ../lib/libgreputils.a  
depbase=`echo test-float.o | sed 's|[^/]*$|.deps/&|;s|\.o$||'`;\
x86_64-pld-linux-gnux32-gcc -DHAVE_CONFIG_H -DEXEEXT=\"\" -I. -I..  -DIN_GREP_GNULIB_TESTS=1 -I. -I. -I.. -I./.. -I../lib -I./../lib   -O2 -fwrapv -pipe -Wformat -Werror=format-security -gdwarf-4 -fno-debug-types-section -fvar-tracking-assignments -g2 -Wp,-D_FORTIFY_SOURCE=2 -fstack-protector-strong --param=ssp-buffer-size=4 -Werror=trampolines -fPIC -mtune=generic -march=x86-64 -gdwarf-4 -fno-debug-types-section -fvar-tracking-assignments -g2  -MT test-float.o -MD -MP -MF $depbase.Tpo -c -o test-float.o test-float.c &&\
mv -f $depbase.Tpo $depbase.Po
x86_64-pld-linux-gnux32-gcc  -O2 -fwrapv -pipe -Wformat -Werror=format-security -gdwarf-4 -fno-debug-types-section -fvar-tracking-assignments -g2 -Wp,-D_FORTIFY_SOURCE=2 -fstack-protector-strong --param=ssp-buffer-size=4 -Werror=trampolines -fPIC -mtune=generic -march=x86-64 -gdwarf-4 -fno-debug-types-section -fvar-tracking-assignments -g2   -Wl,--as-needed -Wl,--no-copy-dt-needed-entries -Wl,-z,relro -Wl,-z,combreloc  -o test-float test-float.o libtests.a ../lib/libgreputils.a libtests.a ../lib/libgreputils.a  
depbase=`echo test-fnmatch-h.o | sed 's|[^/]*$|.deps/&|;s|\.o$||'`;\
x86_64-pld-linux-gnux32-gcc -DHAVE_CONFIG_H -DEXEEXT=\"\" -I. -I..  -DIN_GREP_GNULIB_TESTS=1 -I. -I. -I.. -I./.. -I../lib -I./../lib   -O2 -fwrapv -pipe -Wformat -Werror=format-security -gdwarf-4 -fno-debug-types-section -fvar-tracking-assignments -g2 -Wp,-D_FORTIFY_SOURCE=2 -fstack-protector-strong --param=ssp-buffer-size=4 -Werror=trampolines -fPIC -mtune=generic -march=x86-64 -gdwarf-4 -fno-debug-types-section -fvar-tracking-assignments -g2  -MT test-fnmatch-h.o -MD -MP -MF $depbase.Tpo -c -o test-fnmatch-h.o test-fnmatch-h.c &&\
mv -f $depbase.Tpo $depbase.Po
x86_64-pld-linux-gnux32-gcc  -O2 -fwrapv -pipe -Wformat -Werror=format-security -gdwarf-4 -fno-debug-types-section -fvar-tracking-assignments -g2 -Wp,-D_FORTIFY_SOURCE=2 -fstack-protector-strong --param=ssp-buffer-size=4 -Werror=trampolines -fPIC -mtune=generic -march=x86-64 -gdwarf-4 -fno-debug-types-section -fvar-tracking-assignments -g2   -Wl,--as-needed -Wl,--no-copy-dt-needed-entries -Wl,-z,relro -Wl,-z,combreloc  -o test-fnmatch-h test-fnmatch-h.o libtests.a ../lib/libgreputils.a libtests.a ../lib/libgreputils.a  
depbase=`echo test-fnmatch.o | sed 's|[^/]*$|.deps/&|;s|\.o$||'`;\
x86_64-pld-linux-gnux32-gcc -DHAVE_CONFIG_H -DEXEEXT=\"\" -I. -I..  -DIN_GREP_GNULIB_TESTS=1 -I. -I. -I.. -I./.. -I../lib -I./../lib   -O2 -fwrapv -pipe -Wformat -Werror=format-security -gdwarf-4 -fno-debug-types-section -fvar-tracking-assignments -g2 -Wp,-D_FORTIFY_SOURCE=2 -fstack-protector-strong --param=ssp-buffer-size=4 -Werror=trampolines -fPIC -mtune=generic -march=x86-64 -gdwarf-4 -fno-debug-types-section -fvar-tracking-assignments -g2  -MT test-fnmatch.o -MD -MP -MF $depbase.Tpo -c -o test-fnmatch.o test-fnmatch.c &&\
mv -f $depbase.Tpo $depbase.Po
x86_64-pld-linux-gnux32-gcc  -O2 -fwrapv -pipe -Wformat -Werror=format-security -gdwarf-4 -fno-debug-types-section -fvar-tracking-assignments -g2 -Wp,-D_FORTIFY_SOURCE=2 -fstack-protector-strong --param=ssp-buffer-size=4 -Werror=trampolines -fPIC -mtune=generic -march=x86-64 -gdwarf-4 -fno-debug-types-section -fvar-tracking-assignments -g2   -Wl,--as-needed -Wl,--no-copy-dt-needed-entries -Wl,-z,relro -Wl,-z,combreloc  -o test-fnmatch test-fnmatch.o libtests.a ../lib/libgreputils.a libtests.a ../lib/libgreputils.a   
depbase=`echo test-fopen-gnu.o | sed 's|[^/]*$|.deps/&|;s|\.o$||'`;\
x86_64-pld-linux-gnux32-gcc -DHAVE_CONFIG_H -DEXEEXT=\"\" -I. -I..  -DIN_GREP_GNULIB_TESTS=1 -I. -I. -I.. -I./.. -I../lib -I./../lib   -O2 -fwrapv -pipe -Wformat -Werror=format-security -gdwarf-4 -fno-debug-types-section -fvar-tracking-assignments -g2 -Wp,-D_FORTIFY_SOURCE=2 -fstack-protector-strong --param=ssp-buffer-size=4 -Werror=trampolines -fPIC -mtune=generic -march=x86-64 -gdwarf-4 -fno-debug-types-section -fvar-tracking-assignments -g2  -MT test-fopen-gnu.o -MD -MP -MF $depbase.Tpo -c -o test-fopen-gnu.o test-fopen-gnu.c &&\
mv -f $depbase.Tpo $depbase.Po
x86_64-pld-linux-gnux32-gcc  -O2 -fwrapv -pipe -Wformat -Werror=format-security -gdwarf-4 -fno-debug-types-section -fvar-tracking-assignments -g2 -Wp,-D_FORTIFY_SOURCE=2 -fstack-protector-strong --param=ssp-buffer-size=4 -Werror=trampolines -fPIC -mtune=generic -march=x86-64 -gdwarf-4 -fno-debug-types-section -fvar-tracking-assignments -g2   -Wl,--as-needed -Wl,--no-copy-dt-needed-entries -Wl,-z,relro -Wl,-z,combreloc  -o test-fopen-gnu test-fopen-gnu.o libtests.a ../lib/libgreputils.a libtests.a ../lib/libgreputils.a  
depbase=`echo test-fopen.o | sed 's|[^/]*$|.deps/&|;s|\.o$||'`;\
x86_64-pld-linux-gnux32-gcc -DHAVE_CONFIG_H -DEXEEXT=\"\" -I. -I..  -DIN_GREP_GNULIB_TESTS=1 -I. -I. -I.. -I./.. -I../lib -I./../lib   -O2 -fwrapv -pipe -Wformat -Werror=format-security -gdwarf-4 -fno-debug-types-section -fvar-tracking-assignments -g2 -Wp,-D_FORTIFY_SOURCE=2 -fstack-protector-strong --param=ssp-buffer-size=4 -Werror=trampolines -fPIC -mtune=generic -march=x86-64 -gdwarf-4 -fno-debug-types-section -fvar-tracking-assignments -g2  -MT test-fopen.o -MD -MP -MF $depbase.Tpo -c -o test-fopen.o test-fopen.c &&\
mv -f $depbase.Tpo $depbase.Po
x86_64-pld-linux-gnux32-gcc  -O2 -fwrapv -pipe -Wformat -Werror=format-security -gdwarf-4 -fno-debug-types-section -fvar-tracking-assignments -g2 -Wp,-D_FORTIFY_SOURCE=2 -fstack-protector-strong --param=ssp-buffer-size=4 -Werror=trampolines -fPIC -mtune=generic -march=x86-64 -gdwarf-4 -fno-debug-types-section -fvar-tracking-assignments -g2   -Wl,--as-needed -Wl,--no-copy-dt-needed-entries -Wl,-z,relro -Wl,-z,combreloc  -o test-fopen test-fopen.o libtests.a ../lib/libgreputils.a libtests.a ../lib/libgreputils.a  
depbase=`echo test-fpending.o | sed 's|[^/]*$|.deps/&|;s|\.o$||'`;\
x86_64-pld-linux-gnux32-gcc -DHAVE_CONFIG_H -DEXEEXT=\"\" -I. -I..  -DIN_GREP_GNULIB_TESTS=1 -I. -I. -I.. -I./.. -I../lib -I./../lib   -O2 -fwrapv -pipe -Wformat -Werror=format-security -gdwarf-4 -fno-debug-types-section -fvar-tracking-assignments -g2 -Wp,-D_FORTIFY_SOURCE=2 -fstack-protector-strong --param=ssp-buffer-size=4 -Werror=trampolines -fPIC -mtune=generic -march=x86-64 -gdwarf-4 -fno-debug-types-section -fvar-tracking-assignments -g2  -MT test-fpending.o -MD -MP -MF $depbase.Tpo -c -o test-fpending.o test-fpending.c &&\
mv -f $depbase.Tpo $depbase.Po
x86_64-pld-linux-gnux32-gcc  -O2 -fwrapv -pipe -Wformat -Werror=format-security -gdwarf-4 -fno-debug-types-section -fvar-tracking-assignments -g2 -Wp,-D_FORTIFY_SOURCE=2 -fstack-protector-strong --param=ssp-buffer-size=4 -Werror=trampolines -fPIC -mtune=generic -march=x86-64 -gdwarf-4 -fno-debug-types-section -fvar-tracking-assignments -g2   -Wl,--as-needed -Wl,--no-copy-dt-needed-entries -Wl,-z,relro -Wl,-z,combreloc  -o test-fpending test-fpending.o libtests.a ../lib/libgreputils.a libtests.a ../lib/libgreputils.a  
depbase=`echo test-fputc.o | sed 's|[^/]*$|.deps/&|;s|\.o$||'`;\
x86_64-pld-linux-gnux32-gcc -DHAVE_CONFIG_H -DEXEEXT=\"\" -I. -I..  -DIN_GREP_GNULIB_TESTS=1 -I. -I. -I.. -I./.. -I../lib -I./../lib   -O2 -fwrapv -pipe -Wformat -Werror=format-security -gdwarf-4 -fno-debug-types-section -fvar-tracking-assignments -g2 -Wp,-D_FORTIFY_SOURCE=2 -fstack-protector-strong --param=ssp-buffer-size=4 -Werror=trampolines -fPIC -mtune=generic -march=x86-64 -gdwarf-4 -fno-debug-types-section -fvar-tracking-assignments -g2  -MT test-fputc.o -MD -MP -MF $depbase.Tpo -c -o test-fputc.o test-fputc.c &&\
mv -f $depbase.Tpo $depbase.Po
x86_64-pld-linux-gnux32-gcc  -O2 -fwrapv -pipe -Wformat -Werror=format-security -gdwarf-4 -fno-debug-types-section -fvar-tracking-assignments -g2 -Wp,-D_FORTIFY_SOURCE=2 -fstack-protector-strong --param=ssp-buffer-size=4 -Werror=trampolines -fPIC -mtune=generic -march=x86-64 -gdwarf-4 -fno-debug-types-section -fvar-tracking-assignments -g2   -Wl,--as-needed -Wl,--no-copy-dt-needed-entries -Wl,-z,relro -Wl,-z,combreloc  -o test-fputc test-fputc.o libtests.a ../lib/libgreputils.a libtests.a ../lib/libgreputils.a  
depbase=`echo test-fread.o | sed 's|[^/]*$|.deps/&|;s|\.o$||'`;\
x86_64-pld-linux-gnux32-gcc -DHAVE_CONFIG_H -DEXEEXT=\"\" -I. -I..  -DIN_GREP_GNULIB_TESTS=1 -I. -I. -I.. -I./.. -I../lib -I./../lib   -O2 -fwrapv -pipe -Wformat -Werror=format-security -gdwarf-4 -fno-debug-types-section -fvar-tracking-assignments -g2 -Wp,-D_FORTIFY_SOURCE=2 -fstack-protector-strong --param=ssp-buffer-size=4 -Werror=trampolines -fPIC -mtune=generic -march=x86-64 -gdwarf-4 -fno-debug-types-section -fvar-tracking-assignments -g2  -MT test-fread.o -MD -MP -MF $depbase.Tpo -c -o test-fread.o test-fread.c &&\
mv -f $depbase.Tpo $depbase.Po
x86_64-pld-linux-gnux32-gcc  -O2 -fwrapv -pipe -Wformat -Werror=format-security -gdwarf-4 -fno-debug-types-section -fvar-tracking-assignments -g2 -Wp,-D_FORTIFY_SOURCE=2 -fstack-protector-strong --param=ssp-buffer-size=4 -Werror=trampolines -fPIC -mtune=generic -march=x86-64 -gdwarf-4 -fno-debug-types-section -fvar-tracking-assignments -g2   -Wl,--as-needed -Wl,--no-copy-dt-needed-entries -Wl,-z,relro -Wl,-z,combreloc  -o test-fread test-fread.o libtests.a ../lib/libgreputils.a libtests.a ../lib/libgreputils.a  
depbase=`echo test-fstat.o | sed 's|[^/]*$|.deps/&|;s|\.o$||'`;\
x86_64-pld-linux-gnux32-gcc -DHAVE_CONFIG_H -DEXEEXT=\"\" -I. -I..  -DIN_GREP_GNULIB_TESTS=1 -I. -I. -I.. -I./.. -I../lib -I./../lib   -O2 -fwrapv -pipe -Wformat -Werror=format-security -gdwarf-4 -fno-debug-types-section -fvar-tracking-assignments -g2 -Wp,-D_FORTIFY_SOURCE=2 -fstack-protector-strong --param=ssp-buffer-size=4 -Werror=trampolines -fPIC -mtune=generic -march=x86-64 -gdwarf-4 -fno-debug-types-section -fvar-tracking-assignments -g2  -MT test-fstat.o -MD -MP -MF $depbase.Tpo -c -o test-fstat.o test-fstat.c &&\
mv -f $depbase.Tpo $depbase.Po
x86_64-pld-linux-gnux32-gcc  -O2 -fwrapv -pipe -Wformat -Werror=format-security -gdwarf-4 -fno-debug-types-section -fvar-tracking-assignments -g2 -Wp,-D_FORTIFY_SOURCE=2 -fstack-protector-strong --param=ssp-buffer-size=4 -Werror=trampolines -fPIC -mtune=generic -march=x86-64 -gdwarf-4 -fno-debug-types-section -fvar-tracking-assignments -g2   -Wl,--as-needed -Wl,--no-copy-dt-needed-entries -Wl,-z,relro -Wl,-z,combreloc  -o test-fstat test-fstat.o libtests.a ../lib/libgreputils.a libtests.a ../lib/libgreputils.a  
depbase=`echo test-fstatat.o | sed 's|[^/]*$|.deps/&|;s|\.o$||'`;\
x86_64-pld-linux-gnux32-gcc -DHAVE_CONFIG_H -DEXEEXT=\"\" -I. -I..  -DIN_GREP_GNULIB_TESTS=1 -I. -I. -I.. -I./.. -I../lib -I./../lib   -O2 -fwrapv -pipe -Wformat -Werror=format-security -gdwarf-4 -fno-debug-types-section -fvar-tracking-assignments -g2 -Wp,-D_FORTIFY_SOURCE=2 -fstack-protector-strong --param=ssp-buffer-size=4 -Werror=trampolines -fPIC -mtune=generic -march=x86-64 -gdwarf-4 -fno-debug-types-section -fvar-tracking-assignments -g2  -MT test-fstatat.o -MD -MP -MF $depbase.Tpo -c -o test-fstatat.o test-fstatat.c &&\
mv -f $depbase.Tpo $depbase.Po
x86_64-pld-linux-gnux32-gcc  -O2 -fwrapv -pipe -Wformat -Werror=format-security -gdwarf-4 -fno-debug-types-section -fvar-tracking-assignments -g2 -Wp,-D_FORTIFY_SOURCE=2 -fstack-protector-strong --param=ssp-buffer-size=4 -Werror=trampolines -fPIC -mtune=generic -march=x86-64 -gdwarf-4 -fno-debug-types-section -fvar-tracking-assignments -g2   -Wl,--as-needed -Wl,--no-copy-dt-needed-entries -Wl,-z,relro -Wl,-z,combreloc  -o test-fstatat test-fstatat.o libtests.a ../lib/libgreputils.a libtests.a ../lib/libgreputils.a   
depbase=`echo test-ftruncate.o | sed 's|[^/]*$|.deps/&|;s|\.o$||'`;\
x86_64-pld-linux-gnux32-gcc -DHAVE_CONFIG_H -DEXEEXT=\"\" -I. -I..  -DIN_GREP_GNULIB_TESTS=1 -I. -I. -I.. -I./.. -I../lib -I./../lib   -O2 -fwrapv -pipe -Wformat -Werror=format-security -gdwarf-4 -fno-debug-types-section -fvar-tracking-assignments -g2 -Wp,-D_FORTIFY_SOURCE=2 -fstack-protector-strong --param=ssp-buffer-size=4 -Werror=trampolines -fPIC -mtune=generic -march=x86-64 -gdwarf-4 -fno-debug-types-section -fvar-tracking-assignments -g2  -MT test-ftruncate.o -MD -MP -MF $depbase.Tpo -c -o test-ftruncate.o test-ftruncate.c &&\
mv -f $depbase.Tpo $depbase.Po
x86_64-pld-linux-gnux32-gcc  -O2 -fwrapv -pipe -Wformat -Werror=format-security -gdwarf-4 -fno-debug-types-section -fvar-tracking-assignments -g2 -Wp,-D_FORTIFY_SOURCE=2 -fstack-protector-strong --param=ssp-buffer-size=4 -Werror=trampolines -fPIC -mtune=generic -march=x86-64 -gdwarf-4 -fno-debug-types-section -fvar-tracking-assignments -g2   -Wl,--as-needed -Wl,--no-copy-dt-needed-entries -Wl,-z,relro -Wl,-z,combreloc  -o test-ftruncate test-ftruncate.o libtests.a ../lib/libgreputils.a libtests.a ../lib/libgreputils.a  
depbase=`echo test-fwrite.o | sed 's|[^/]*$|.deps/&|;s|\.o$||'`;\
x86_64-pld-linux-gnux32-gcc -DHAVE_CONFIG_H -DEXEEXT=\"\" -I. -I..  -DIN_GREP_GNULIB_TESTS=1 -I. -I. -I.. -I./.. -I../lib -I./../lib   -O2 -fwrapv -pipe -Wformat -Werror=format-security -gdwarf-4 -fno-debug-types-section -fvar-tracking-assignments -g2 -Wp,-D_FORTIFY_SOURCE=2 -fstack-protector-strong --param=ssp-buffer-size=4 -Werror=trampolines -fPIC -mtune=generic -march=x86-64 -gdwarf-4 -fno-debug-types-section -fvar-tracking-assignments -g2  -MT test-fwrite.o -MD -MP -MF $depbase.Tpo -c -o test-fwrite.o test-fwrite.c &&\
mv -f $depbase.Tpo $depbase.Po
x86_64-pld-linux-gnux32-gcc  -O2 -fwrapv -pipe -Wformat -Werror=format-security -gdwarf-4 -fno-debug-types-section -fvar-tracking-assignments -g2 -Wp,-D_FORTIFY_SOURCE=2 -fstack-protector-strong --param=ssp-buffer-size=4 -Werror=trampolines -fPIC -mtune=generic -march=x86-64 -gdwarf-4 -fno-debug-types-section -fvar-tracking-assignments -g2   -Wl,--as-needed -Wl,--no-copy-dt-needed-entries -Wl,-z,relro -Wl,-z,combreloc  -o test-fwrite test-fwrite.o libtests.a ../lib/libgreputils.a libtests.a ../lib/libgreputils.a  
depbase=`echo test-getcwd-lgpl.o | sed 's|[^/]*$|.deps/&|;s|\.o$||'`;\
x86_64-pld-linux-gnux32-gcc -DHAVE_CONFIG_H -DEXEEXT=\"\" -I. -I..  -DIN_GREP_GNULIB_TESTS=1 -I. -I. -I.. -I./.. -I../lib -I./../lib   -O2 -fwrapv -pipe -Wformat -Werror=format-security -gdwarf-4 -fno-debug-types-section -fvar-tracking-assignments -g2 -Wp,-D_FORTIFY_SOURCE=2 -fstack-protector-strong --param=ssp-buffer-size=4 -Werror=trampolines -fPIC -mtune=generic -march=x86-64 -gdwarf-4 -fno-debug-types-section -fvar-tracking-assignments -g2  -MT test-getcwd-lgpl.o -MD -MP -MF $depbase.Tpo -c -o test-getcwd-lgpl.o test-getcwd-lgpl.c &&\
mv -f $depbase.Tpo $depbase.Po
x86_64-pld-linux-gnux32-gcc  -O2 -fwrapv -pipe -Wformat -Werror=format-security -gdwarf-4 -fno-debug-types-section -fvar-tracking-assignments -g2 -Wp,-D_FORTIFY_SOURCE=2 -fstack-protector-strong --param=ssp-buffer-size=4 -Werror=trampolines -fPIC -mtune=generic -march=x86-64 -gdwarf-4 -fno-debug-types-section -fvar-tracking-assignments -g2   -Wl,--as-needed -Wl,--no-copy-dt-needed-entries -Wl,-z,relro -Wl,-z,combreloc  -o test-getcwd-lgpl test-getcwd-lgpl.o libtests.a ../lib/libgreputils.a libtests.a ../lib/libgreputils.a   
depbase=`echo test-getdtablesize.o | sed 's|[^/]*$|.deps/&|;s|\.o$||'`;\
x86_64-pld-linux-gnux32-gcc -DHAVE_CONFIG_H -DEXEEXT=\"\" -I. -I..  -DIN_GREP_GNULIB_TESTS=1 -I. -I. -I.. -I./.. -I../lib -I./../lib   -O2 -fwrapv -pipe -Wformat -Werror=format-security -gdwarf-4 -fno-debug-types-section -fvar-tracking-assignments -g2 -Wp,-D_FORTIFY_SOURCE=2 -fstack-protector-strong --param=ssp-buffer-size=4 -Werror=trampolines -fPIC -mtune=generic -march=x86-64 -gdwarf-4 -fno-debug-types-section -fvar-tracking-assignments -g2  -MT test-getdtablesize.o -MD -MP -MF $depbase.Tpo -c -o test-getdtablesize.o test-getdtablesize.c &&\
mv -f $depbase.Tpo $depbase.Po
x86_64-pld-linux-gnux32-gcc  -O2 -fwrapv -pipe -Wformat -Werror=format-security -gdwarf-4 -fno-debug-types-section -fvar-tracking-assignments -g2 -Wp,-D_FORTIFY_SOURCE=2 -fstack-protector-strong --param=ssp-buffer-size=4 -Werror=trampolines -fPIC -mtune=generic -march=x86-64 -gdwarf-4 -fno-debug-types-section -fvar-tracking-assignments -g2   -Wl,--as-needed -Wl,--no-copy-dt-needed-entries -Wl,-z,relro -Wl,-z,combreloc  -o test-getdtablesize test-getdtablesize.o libtests.a ../lib/libgreputils.a libtests.a ../lib/libgreputils.a  
depbase=`echo test-getopt-gnu.o | sed 's|[^/]*$|.deps/&|;s|\.o$||'`;\
x86_64-pld-linux-gnux32-gcc -DHAVE_CONFIG_H -DEXEEXT=\"\" -I. -I..  -DIN_GREP_GNULIB_TESTS=1 -I. -I. -I.. -I./.. -I../lib -I./../lib   -O2 -fwrapv -pipe -Wformat -Werror=format-security -gdwarf-4 -fno-debug-types-section -fvar-tracking-assignments -g2 -Wp,-D_FORTIFY_SOURCE=2 -fstack-protector-strong --param=ssp-buffer-size=4 -Werror=trampolines -fPIC -mtune=generic -march=x86-64 -gdwarf-4 -fno-debug-types-section -fvar-tracking-assignments -g2  -MT test-getopt-gnu.o -MD -MP -MF $depbase.Tpo -c -o test-getopt-gnu.o test-getopt-gnu.c &&\
mv -f $depbase.Tpo $depbase.Po
x86_64-pld-linux-gnux32-gcc  -O2 -fwrapv -pipe -Wformat -Werror=format-security -gdwarf-4 -fno-debug-types-section -fvar-tracking-assignments -g2 -Wp,-D_FORTIFY_SOURCE=2 -fstack-protector-strong --param=ssp-buffer-size=4 -Werror=trampolines -fPIC -mtune=generic -march=x86-64 -gdwarf-4 -fno-debug-types-section -fvar-tracking-assignments -g2   -Wl,--as-needed -Wl,--no-copy-dt-needed-entries -Wl,-z,relro -Wl,-z,combreloc  -o test-getopt-gnu test-getopt-gnu.o libtests.a ../lib/libgreputils.a libtests.a ../lib/libgreputils.a   
depbase=`echo test-getopt-posix.o | sed 's|[^/]*$|.deps/&|;s|\.o$||'`;\
x86_64-pld-linux-gnux32-gcc -DHAVE_CONFIG_H -DEXEEXT=\"\" -I. -I..  -DIN_GREP_GNULIB_TESTS=1 -I. -I. -I.. -I./.. -I../lib -I./../lib   -O2 -fwrapv -pipe -Wformat -Werror=format-security -gdwarf-4 -fno-debug-types-section -fvar-tracking-assignments -g2 -Wp,-D_FORTIFY_SOURCE=2 -fstack-protector-strong --param=ssp-buffer-size=4 -Werror=trampolines -fPIC -mtune=generic -march=x86-64 -gdwarf-4 -fno-debug-types-section -fvar-tracking-assignments -g2  -MT test-getopt-posix.o -MD -MP -MF $depbase.Tpo -c -o test-getopt-posix.o test-getopt-posix.c &&\
mv -f $depbase.Tpo $depbase.Po
x86_64-pld-linux-gnux32-gcc  -O2 -fwrapv -pipe -Wformat -Werror=format-security -gdwarf-4 -fno-debug-types-section -fvar-tracking-assignments -g2 -Wp,-D_FORTIFY_SOURCE=2 -fstack-protector-strong --param=ssp-buffer-size=4 -Werror=trampolines -fPIC -mtune=generic -march=x86-64 -gdwarf-4 -fno-debug-types-section -fvar-tracking-assignments -g2   -Wl,--as-needed -Wl,--no-copy-dt-needed-entries -Wl,-z,relro -Wl,-z,combreloc  -o test-getopt-posix test-getopt-posix.o libtests.a ../lib/libgreputils.a libtests.a ../lib/libgreputils.a   
depbase=`echo test-getprogname.o | sed 's|[^/]*$|.deps/&|;s|\.o$||'`;\
x86_64-pld-linux-gnux32-gcc -DHAVE_CONFIG_H -DEXEEXT=\"\" -I. -I..  -DIN_GREP_GNULIB_TESTS=1 -I. -I. -I.. -I./.. -I../lib -I./../lib   -O2 -fwrapv -pipe -Wformat -Werror=format-security -gdwarf-4 -fno-debug-types-section -fvar-tracking-assignments -g2 -Wp,-D_FORTIFY_SOURCE=2 -fstack-protector-strong --param=ssp-buffer-size=4 -Werror=trampolines -fPIC -mtune=generic -march=x86-64 -gdwarf-4 -fno-debug-types-section -fvar-tracking-assignments -g2  -MT test-getprogname.o -MD -MP -MF $depbase.Tpo -c -o test-getprogname.o test-getprogname.c &&\
mv -f $depbase.Tpo $depbase.Po
x86_64-pld-linux-gnux32-gcc  -O2 -fwrapv -pipe -Wformat -Werror=format-security -gdwarf-4 -fno-debug-types-section -fvar-tracking-assignments -g2 -Wp,-D_FORTIFY_SOURCE=2 -fstack-protector-strong --param=ssp-buffer-size=4 -Werror=trampolines -fPIC -mtune=generic -march=x86-64 -gdwarf-4 -fno-debug-types-section -fvar-tracking-assignments -g2   -Wl,--as-needed -Wl,--no-copy-dt-needed-entries -Wl,-z,relro -Wl,-z,combreloc  -o test-getprogname test-getprogname.o libtests.a ../lib/libgreputils.a libtests.a ../lib/libgreputils.a  
depbase=`echo test-gettimeofday.o | sed 's|[^/]*$|.deps/&|;s|\.o$||'`;\
x86_64-pld-linux-gnux32-gcc -DHAVE_CONFIG_H -DEXEEXT=\"\" -I. -I..  -DIN_GREP_GNULIB_TESTS=1 -I. -I. -I.. -I./.. -I../lib -I./../lib   -O2 -fwrapv -pipe -Wformat -Werror=format-security -gdwarf-4 -fno-debug-types-section -fvar-tracking-assignments -g2 -Wp,-D_FORTIFY_SOURCE=2 -fstack-protector-strong --param=ssp-buffer-size=4 -Werror=trampolines -fPIC -mtune=generic -march=x86-64 -gdwarf-4 -fno-debug-types-section -fvar-tracking-assignments -g2  -MT test-gettimeofday.o -MD -MP -MF $depbase.Tpo -c -o test-gettimeofday.o test-gettimeofday.c &&\
mv -f $depbase.Tpo $depbase.Po
x86_64-pld-linux-gnux32-gcc  -O2 -fwrapv -pipe -Wformat -Werror=format-security -gdwarf-4 -fno-debug-types-section -fvar-tracking-assignments -g2 -Wp,-D_FORTIFY_SOURCE=2 -fstack-protector-strong --param=ssp-buffer-size=4 -Werror=trampolines -fPIC -mtune=generic -march=x86-64 -gdwarf-4 -fno-debug-types-section -fvar-tracking-assignments -g2   -Wl,--as-needed -Wl,--no-copy-dt-needed-entries -Wl,-z,relro -Wl,-z,combreloc  -o test-gettimeofday test-gettimeofday.o libtests.a ../lib/libgreputils.a libtests.a ../lib/libgreputils.a  
depbase=`echo test-hard-locale.o | sed 's|[^/]*$|.deps/&|;s|\.o$||'`;\
x86_64-pld-linux-gnux32-gcc -DHAVE_CONFIG_H -DEXEEXT=\"\" -I. -I..  -DIN_GREP_GNULIB_TESTS=1 -I. -I. -I.. -I./.. -I../lib -I./../lib   -O2 -fwrapv -pipe -Wformat -Werror=format-security -gdwarf-4 -fno-debug-types-section -fvar-tracking-assignments -g2 -Wp,-D_FORTIFY_SOURCE=2 -fstack-protector-strong --param=ssp-buffer-size=4 -Werror=trampolines -fPIC -mtune=generic -march=x86-64 -gdwarf-4 -fno-debug-types-section -fvar-tracking-assignments -g2  -MT test-hard-locale.o -MD -MP -MF $depbase.Tpo -c -o test-hard-locale.o test-hard-locale.c &&\
mv -f $depbase.Tpo $depbase.Po
x86_64-pld-linux-gnux32-gcc  -O2 -fwrapv -pipe -Wformat -Werror=format-security -gdwarf-4 -fno-debug-types-section -fvar-tracking-assignments -g2 -Wp,-D_FORTIFY_SOURCE=2 -fstack-protector-strong --param=ssp-buffer-size=4 -Werror=trampolines -fPIC -mtune=generic -march=x86-64 -gdwarf-4 -fno-debug-types-section -fvar-tracking-assignments -g2   -Wl,--as-needed -Wl,--no-copy-dt-needed-entries -Wl,-z,relro -Wl,-z,combreloc  -o test-hard-locale test-hard-locale.o libtests.a ../lib/libgreputils.a libtests.a ../lib/libgreputils.a    
depbase=`echo test-hash.o | sed 's|[^/]*$|.deps/&|;s|\.o$||'`;\
x86_64-pld-linux-gnux32-gcc -DHAVE_CONFIG_H -DEXEEXT=\"\" -I. -I..  -DIN_GREP_GNULIB_TESTS=1 -I. -I. -I.. -I./.. -I../lib -I./../lib   -O2 -fwrapv -pipe -Wformat -Werror=format-security -gdwarf-4 -fno-debug-types-section -fvar-tracking-assignments -g2 -Wp,-D_FORTIFY_SOURCE=2 -fstack-protector-strong --param=ssp-buffer-size=4 -Werror=trampolines -fPIC -mtune=generic -march=x86-64 -gdwarf-4 -fno-debug-types-section -fvar-tracking-assignments -g2  -MT test-hash.o -MD -MP -MF $depbase.Tpo -c -o test-hash.o test-hash.c &&\
mv -f $depbase.Tpo $depbase.Po
x86_64-pld-linux-gnux32-gcc  -O2 -fwrapv -pipe -Wformat -Werror=format-security -gdwarf-4 -fno-debug-types-section -fvar-tracking-assignments -g2 -Wp,-D_FORTIFY_SOURCE=2 -fstack-protector-strong --param=ssp-buffer-size=4 -Werror=trampolines -fPIC -mtune=generic -march=x86-64 -gdwarf-4 -fno-debug-types-section -fvar-tracking-assignments -g2   -Wl,--as-needed -Wl,--no-copy-dt-needed-entries -Wl,-z,relro -Wl,-z,combreloc  -o test-hash test-hash.o libtests.a ../lib/libgreputils.a libtests.a ../lib/libgreputils.a  
depbase=`echo test-i-ring.o | sed 's|[^/]*$|.deps/&|;s|\.o$||'`;\
x86_64-pld-linux-gnux32-gcc -DHAVE_CONFIG_H -DEXEEXT=\"\" -I. -I..  -DIN_GREP_GNULIB_TESTS=1 -I. -I. -I.. -I./.. -I../lib -I./../lib   -O2 -fwrapv -pipe -Wformat -Werror=format-security -gdwarf-4 -fno-debug-types-section -fvar-tracking-assignments -g2 -Wp,-D_FORTIFY_SOURCE=2 -fstack-protector-strong --param=ssp-buffer-size=4 -Werror=trampolines -fPIC -mtune=generic -march=x86-64 -gdwarf-4 -fno-debug-types-section -fvar-tracking-assignments -g2  -MT test-i-ring.o -MD -MP -MF $depbase.Tpo -c -o test-i-ring.o test-i-ring.c &&\
mv -f $depbase.Tpo $depbase.Po
x86_64-pld-linux-gnux32-gcc  -O2 -fwrapv -pipe -Wformat -Werror=format-security -gdwarf-4 -fno-debug-types-section -fvar-tracking-assignments -g2 -Wp,-D_FORTIFY_SOURCE=2 -fstack-protector-strong --param=ssp-buffer-size=4 -Werror=trampolines -fPIC -mtune=generic -march=x86-64 -gdwarf-4 -fno-debug-types-section -fvar-tracking-assignments -g2   -Wl,--as-needed -Wl,--no-copy-dt-needed-entries -Wl,-z,relro -Wl,-z,combreloc  -o test-i-ring test-i-ring.o libtests.a ../lib/libgreputils.a libtests.a ../lib/libgreputils.a  
depbase=`echo test-iconv-h.o | sed 's|[^/]*$|.deps/&|;s|\.o$||'`;\
x86_64-pld-linux-gnux32-gcc -DHAVE_CONFIG_H -DEXEEXT=\"\" -I. -I..  -DIN_GREP_GNULIB_TESTS=1 -I. -I. -I.. -I./.. -I../lib -I./../lib   -O2 -fwrapv -pipe -Wformat -Werror=format-security -gdwarf-4 -fno-debug-types-section -fvar-tracking-assignments -g2 -Wp,-D_FORTIFY_SOURCE=2 -fstack-protector-strong --param=ssp-buffer-size=4 -Werror=trampolines -fPIC -mtune=generic -march=x86-64 -gdwarf-4 -fno-debug-types-section -fvar-tracking-assignments -g2  -MT test-iconv-h.o -MD -MP -MF $depbase.Tpo -c -o test-iconv-h.o test-iconv-h.c &&\
mv -f $depbase.Tpo $depbase.Po
x86_64-pld-linux-gnux32-gcc  -O2 -fwrapv -pipe -Wformat -Werror=format-security -gdwarf-4 -fno-debug-types-section -fvar-tracking-assignments -g2 -Wp,-D_FORTIFY_SOURCE=2 -fstack-protector-strong --param=ssp-buffer-size=4 -Werror=trampolines -fPIC -mtune=generic -march=x86-64 -gdwarf-4 -fno-debug-types-section -fvar-tracking-assignments -g2   -Wl,--as-needed -Wl,--no-copy-dt-needed-entries -Wl,-z,relro -Wl,-z,combreloc  -o test-iconv-h test-iconv-h.o libtests.a ../lib/libgreputils.a libtests.a ../lib/libgreputils.a  
depbase=`echo test-iconv.o | sed 's|[^/]*$|.deps/&|;s|\.o$||'`;\
x86_64-pld-linux-gnux32-gcc -DHAVE_CONFIG_H -DEXEEXT=\"\" -I. -I..  -DIN_GREP_GNULIB_TESTS=1 -I. -I. -I.. -I./.. -I../lib -I./../lib   -O2 -fwrapv -pipe -Wformat -Werror=format-security -gdwarf-4 -fno-debug-types-section -fvar-tracking-assignments -g2 -Wp,-D_FORTIFY_SOURCE=2 -fstack-protector-strong --param=ssp-buffer-size=4 -Werror=trampolines -fPIC -mtune=generic -march=x86-64 -gdwarf-4 -fno-debug-types-section -fvar-tracking-assignments -g2  -MT test-iconv.o -MD -MP -MF $depbase.Tpo -c -o test-iconv.o test-iconv.c &&\
mv -f $depbase.Tpo $depbase.Po
x86_64-pld-linux-gnux32-gcc  -O2 -fwrapv -pipe -Wformat -Werror=format-security -gdwarf-4 -fno-debug-types-section -fvar-tracking-assignments -g2 -Wp,-D_FORTIFY_SOURCE=2 -fstack-protector-strong --param=ssp-buffer-size=4 -Werror=trampolines -fPIC -mtune=generic -march=x86-64 -gdwarf-4 -fno-debug-types-section -fvar-tracking-assignments -g2   -Wl,--as-needed -Wl,--no-copy-dt-needed-entries -Wl,-z,relro -Wl,-z,combreloc  -o test-iconv test-iconv.o libtests.a ../lib/libgreputils.a libtests.a ../lib/libgreputils.a   
depbase=`echo test-ignore-value.o | sed 's|[^/]*$|.deps/&|;s|\.o$||'`;\
x86_64-pld-linux-gnux32-gcc -DHAVE_CONFIG_H -DEXEEXT=\"\" -I. -I..  -DIN_GREP_GNULIB_TESTS=1 -I. -I. -I.. -I./.. -I../lib -I./../lib   -O2 -fwrapv -pipe -Wformat -Werror=format-security -gdwarf-4 -fno-debug-types-section -fvar-tracking-assignments -g2 -Wp,-D_FORTIFY_SOURCE=2 -fstack-protector-strong --param=ssp-buffer-size=4 -Werror=trampolines -fPIC -mtune=generic -march=x86-64 -gdwarf-4 -fno-debug-types-section -fvar-tracking-assignments -g2  -MT test-ignore-value.o -MD -MP -MF $depbase.Tpo -c -o test-ignore-value.o test-ignore-value.c &&\
mv -f $depbase.Tpo $depbase.Po
x86_64-pld-linux-gnux32-gcc  -O2 -fwrapv -pipe -Wformat -Werror=format-security -gdwarf-4 -fno-debug-types-section -fvar-tracking-assignments -g2 -Wp,-D_FORTIFY_SOURCE=2 -fstack-protector-strong --param=ssp-buffer-size=4 -Werror=trampolines -fPIC -mtune=generic -march=x86-64 -gdwarf-4 -fno-debug-types-section -fvar-tracking-assignments -g2   -Wl,--as-needed -Wl,--no-copy-dt-needed-entries -Wl,-z,relro -Wl,-z,combreloc  -o test-ignore-value test-ignore-value.o libtests.a ../lib/libgreputils.a libtests.a ../lib/libgreputils.a  
depbase=`echo test-inet_pton.o | sed 's|[^/]*$|.deps/&|;s|\.o$||'`;\
x86_64-pld-linux-gnux32-gcc -DHAVE_CONFIG_H -DEXEEXT=\"\" -I. -I..  -DIN_GREP_GNULIB_TESTS=1 -I. -I. -I.. -I./.. -I../lib -I./../lib   -O2 -fwrapv -pipe -Wformat -Werror=format-security -gdwarf-4 -fno-debug-types-section -fvar-tracking-assignments -g2 -Wp,-D_FORTIFY_SOURCE=2 -fstack-protector-strong --param=ssp-buffer-size=4 -Werror=trampolines -fPIC -mtune=generic -march=x86-64 -gdwarf-4 -fno-debug-types-section -fvar-tracking-assignments -g2  -MT test-inet_pton.o -MD -MP -MF $depbase.Tpo -c -o test-inet_pton.o test-inet_pton.c &&\
mv -f $depbase.Tpo $depbase.Po
x86_64-pld-linux-gnux32-gcc  -O2 -fwrapv -pipe -Wformat -Werror=format-security -gdwarf-4 -fno-debug-types-section -fvar-tracking-assignments -g2 -Wp,-D_FORTIFY_SOURCE=2 -fstack-protector-strong --param=ssp-buffer-size=4 -Werror=trampolines -fPIC -mtune=generic -march=x86-64 -gdwarf-4 -fno-debug-types-section -fvar-tracking-assignments -g2   -Wl,--as-needed -Wl,--no-copy-dt-needed-entries -Wl,-z,relro -Wl,-z,combreloc  -o test-inet_pton test-inet_pton.o libtests.a ../lib/libgreputils.a libtests.a ../lib/libgreputils.a   
depbase=`echo test-intprops.o | sed 's|[^/]*$|.deps/&|;s|\.o$||'`;\
x86_64-pld-linux-gnux32-gcc -DHAVE_CONFIG_H -DEXEEXT=\"\" -I. -I..  -DIN_GREP_GNULIB_TESTS=1 -I. -I. -I.. -I./.. -I../lib -I./../lib   -O2 -fwrapv -pipe -Wformat -Werror=format-security -gdwarf-4 -fno-debug-types-section -fvar-tracking-assignments -g2 -Wp,-D_FORTIFY_SOURCE=2 -fstack-protector-strong --param=ssp-buffer-size=4 -Werror=trampolines -fPIC -mtune=generic -march=x86-64 -gdwarf-4 -fno-debug-types-section -fvar-tracking-assignments -g2  -MT test-intprops.o -MD -MP -MF $depbase.Tpo -c -o test-intprops.o test-intprops.c &&\
mv -f $depbase.Tpo $depbase.Po
x86_64-pld-linux-gnux32-gcc  -O2 -fwrapv -pipe -Wformat -Werror=format-security -gdwarf-4 -fno-debug-types-section -fvar-tracking-assignments -g2 -Wp,-D_FORTIFY_SOURCE=2 -fstack-protector-strong --param=ssp-buffer-size=4 -Werror=trampolines -fPIC -mtune=generic -march=x86-64 -gdwarf-4 -fno-debug-types-section -fvar-tracking-assignments -g2   -Wl,--as-needed -Wl,--no-copy-dt-needed-entries -Wl,-z,relro -Wl,-z,combreloc  -o test-intprops test-intprops.o libtests.a ../lib/libgreputils.a libtests.a ../lib/libgreputils.a  
depbase=`echo test-inttostr.o | sed 's|[^/]*$|.deps/&|;s|\.o$||'`;\
x86_64-pld-linux-gnux32-gcc -DHAVE_CONFIG_H -DEXEEXT=\"\" -I. -I..  -DIN_GREP_GNULIB_TESTS=1 -I. -I. -I.. -I./.. -I../lib -I./../lib   -O2 -fwrapv -pipe -Wformat -Werror=format-security -gdwarf-4 -fno-debug-types-section -fvar-tracking-assignments -g2 -Wp,-D_FORTIFY_SOURCE=2 -fstack-protector-strong --param=ssp-buffer-size=4 -Werror=trampolines -fPIC -mtune=generic -march=x86-64 -gdwarf-4 -fno-debug-types-section -fvar-tracking-assignments -g2  -MT test-inttostr.o -MD -MP -MF $depbase.Tpo -c -o test-inttostr.o test-inttostr.c &&\
mv -f $depbase.Tpo $depbase.Po
x86_64-pld-linux-gnux32-gcc  -O2 -fwrapv -pipe -Wformat -Werror=format-security -gdwarf-4 -fno-debug-types-section -fvar-tracking-assignments -g2 -Wp,-D_FORTIFY_SOURCE=2 -fstack-protector-strong --param=ssp-buffer-size=4 -Werror=trampolines -fPIC -mtune=generic -march=x86-64 -gdwarf-4 -fno-debug-types-section -fvar-tracking-assignments -g2   -Wl,--as-needed -Wl,--no-copy-dt-needed-entries -Wl,-z,relro -Wl,-z,combreloc  -o test-inttostr test-inttostr.o libtests.a ../lib/libgreputils.a libtests.a ../lib/libgreputils.a  
depbase=`echo test-inttypes.o | sed 's|[^/]*$|.deps/&|;s|\.o$||'`;\
x86_64-pld-linux-gnux32-gcc -DHAVE_CONFIG_H -DEXEEXT=\"\" -I. -I..  -DIN_GREP_GNULIB_TESTS=1 -I. -I. -I.. -I./.. -I../lib -I./../lib   -O2 -fwrapv -pipe -Wformat -Werror=format-security -gdwarf-4 -fno-debug-types-section -fvar-tracking-assignments -g2 -Wp,-D_FORTIFY_SOURCE=2 -fstack-protector-strong --param=ssp-buffer-size=4 -Werror=trampolines -fPIC -mtune=generic -march=x86-64 -gdwarf-4 -fno-debug-types-section -fvar-tracking-assignments -g2  -MT test-inttypes.o -MD -MP -MF $depbase.Tpo -c -o test-inttypes.o test-inttypes.c &&\
mv -f $depbase.Tpo $depbase.Po
x86_64-pld-linux-gnux32-gcc  -O2 -fwrapv -pipe -Wformat -Werror=format-security -gdwarf-4 -fno-debug-types-section -fvar-tracking-assignments -g2 -Wp,-D_FORTIFY_SOURCE=2 -fstack-protector-strong --param=ssp-buffer-size=4 -Werror=trampolines -fPIC -mtune=generic -march=x86-64 -gdwarf-4 -fno-debug-types-section -fvar-tracking-assignments -g2   -Wl,--as-needed -Wl,--no-copy-dt-needed-entries -Wl,-z,relro -Wl,-z,combreloc  -o test-inttypes test-inttypes.o libtests.a ../lib/libgreputils.a libtests.a ../lib/libgreputils.a  
depbase=`echo test-ioctl.o | sed 's|[^/]*$|.deps/&|;s|\.o$||'`;\
x86_64-pld-linux-gnux32-gcc -DHAVE_CONFIG_H -DEXEEXT=\"\" -I. -I..  -DIN_GREP_GNULIB_TESTS=1 -I. -I. -I.. -I./.. -I../lib -I./../lib   -O2 -fwrapv -pipe -Wformat -Werror=format-security -gdwarf-4 -fno-debug-types-section -fvar-tracking-assignments -g2 -Wp,-D_FORTIFY_SOURCE=2 -fstack-protector-strong --param=ssp-buffer-size=4 -Werror=trampolines -fPIC -mtune=generic -march=x86-64 -gdwarf-4 -fno-debug-types-section -fvar-tracking-assignments -g2  -MT test-ioctl.o -MD -MP -MF $depbase.Tpo -c -o test-ioctl.o test-ioctl.c &&\
mv -f $depbase.Tpo $depbase.Po
x86_64-pld-linux-gnux32-gcc  -O2 -fwrapv -pipe -Wformat -Werror=format-security -gdwarf-4 -fno-debug-types-section -fvar-tracking-assignments -g2 -Wp,-D_FORTIFY_SOURCE=2 -fstack-protector-strong --param=ssp-buffer-size=4 -Werror=trampolines -fPIC -mtune=generic -march=x86-64 -gdwarf-4 -fno-debug-types-section -fvar-tracking-assignments -g2   -Wl,--as-needed -Wl,--no-copy-dt-needed-entries -Wl,-z,relro -Wl,-z,combreloc  -o test-ioctl test-ioctl.o libtests.a ../lib/libgreputils.a libtests.a ../lib/libgreputils.a  
depbase=`echo test-isatty.o | sed 's|[^/]*$|.deps/&|;s|\.o$||'`;\
x86_64-pld-linux-gnux32-gcc -DHAVE_CONFIG_H -DEXEEXT=\"\" -I. -I..  -DIN_GREP_GNULIB_TESTS=1 -I. -I. -I.. -I./.. -I../lib -I./../lib   -O2 -fwrapv -pipe -Wformat -Werror=format-security -gdwarf-4 -fno-debug-types-section -fvar-tracking-assignments -g2 -Wp,-D_FORTIFY_SOURCE=2 -fstack-protector-strong --param=ssp-buffer-size=4 -Werror=trampolines -fPIC -mtune=generic -march=x86-64 -gdwarf-4 -fno-debug-types-section -fvar-tracking-assignments -g2  -MT test-isatty.o -MD -MP -MF $depbase.Tpo -c -o test-isatty.o test-isatty.c &&\
mv -f $depbase.Tpo $depbase.Po
x86_64-pld-linux-gnux32-gcc  -O2 -fwrapv -pipe -Wformat -Werror=format-security -gdwarf-4 -fno-debug-types-section -fvar-tracking-assignments -g2 -Wp,-D_FORTIFY_SOURCE=2 -fstack-protector-strong --param=ssp-buffer-size=4 -Werror=trampolines -fPIC -mtune=generic -march=x86-64 -gdwarf-4 -fno-debug-types-section -fvar-tracking-assignments -g2   -Wl,--as-needed -Wl,--no-copy-dt-needed-entries -Wl,-z,relro -Wl,-z,combreloc  -o test-isatty test-isatty.o libtests.a ../lib/libgreputils.a libtests.a ../lib/libgreputils.a  
depbase=`echo test-isblank.o | sed 's|[^/]*$|.deps/&|;s|\.o$||'`;\
x86_64-pld-linux-gnux32-gcc -DHAVE_CONFIG_H -DEXEEXT=\"\" -I. -I..  -DIN_GREP_GNULIB_TESTS=1 -I. -I. -I.. -I./.. -I../lib -I./../lib   -O2 -fwrapv -pipe -Wformat -Werror=format-security -gdwarf-4 -fno-debug-types-section -fvar-tracking-assignments -g2 -Wp,-D_FORTIFY_SOURCE=2 -fstack-protector-strong --param=ssp-buffer-size=4 -Werror=trampolines -fPIC -mtune=generic -march=x86-64 -gdwarf-4 -fno-debug-types-section -fvar-tracking-assignments -g2  -MT test-isblank.o -MD -MP -MF $depbase.Tpo -c -o test-isblank.o test-isblank.c &&\
mv -f $depbase.Tpo $depbase.Po
x86_64-pld-linux-gnux32-gcc  -O2 -fwrapv -pipe -Wformat -Werror=format-security -gdwarf-4 -fno-debug-types-section -fvar-tracking-assignments -g2 -Wp,-D_FORTIFY_SOURCE=2 -fstack-protector-strong --param=ssp-buffer-size=4 -Werror=trampolines -fPIC -mtune=generic -march=x86-64 -gdwarf-4 -fno-debug-types-section -fvar-tracking-assignments -g2   -Wl,--as-needed -Wl,--no-copy-dt-needed-entries -Wl,-z,relro -Wl,-z,combreloc  -o test-isblank test-isblank.o libtests.a ../lib/libgreputils.a libtests.a ../lib/libgreputils.a  
depbase=`echo test-iswblank.o | sed 's|[^/]*$|.deps/&|;s|\.o$||'`;\
x86_64-pld-linux-gnux32-gcc -DHAVE_CONFIG_H -DEXEEXT=\"\" -I. -I..  -DIN_GREP_GNULIB_TESTS=1 -I. -I. -I.. -I./.. -I../lib -I./../lib   -O2 -fwrapv -pipe -Wformat -Werror=format-security -gdwarf-4 -fno-debug-types-section -fvar-tracking-assignments -g2 -Wp,-D_FORTIFY_SOURCE=2 -fstack-protector-strong --param=ssp-buffer-size=4 -Werror=trampolines -fPIC -mtune=generic -march=x86-64 -gdwarf-4 -fno-debug-types-section -fvar-tracking-assignments -g2  -MT test-iswblank.o -MD -MP -MF $depbase.Tpo -c -o test-iswblank.o test-iswblank.c &&\
mv -f $depbase.Tpo $depbase.Po
x86_64-pld-linux-gnux32-gcc  -O2 -fwrapv -pipe -Wformat -Werror=format-security -gdwarf-4 -fno-debug-types-section -fvar-tracking-assignments -g2 -Wp,-D_FORTIFY_SOURCE=2 -fstack-protector-strong --param=ssp-buffer-size=4 -Werror=trampolines -fPIC -mtune=generic -march=x86-64 -gdwarf-4 -fno-debug-types-section -fvar-tracking-assignments -g2   -Wl,--as-needed -Wl,--no-copy-dt-needed-entries -Wl,-z,relro -Wl,-z,combreloc  -o test-iswblank test-iswblank.o libtests.a ../lib/libgreputils.a libtests.a ../lib/libgreputils.a  
depbase=`echo test-iswdigit.o | sed 's|[^/]*$|.deps/&|;s|\.o$||'`;\
x86_64-pld-linux-gnux32-gcc -DHAVE_CONFIG_H -DEXEEXT=\"\" -I. -I..  -DIN_GREP_GNULIB_TESTS=1 -I. -I. -I.. -I./.. -I../lib -I./../lib   -O2 -fwrapv -pipe -Wformat -Werror=format-security -gdwarf-4 -fno-debug-types-section -fvar-tracking-assignments -g2 -Wp,-D_FORTIFY_SOURCE=2 -fstack-protector-strong --param=ssp-buffer-size=4 -Werror=trampolines -fPIC -mtune=generic -march=x86-64 -gdwarf-4 -fno-debug-types-section -fvar-tracking-assignments -g2  -MT test-iswdigit.o -MD -MP -MF $depbase.Tpo -c -o test-iswdigit.o test-iswdigit.c &&\
mv -f $depbase.Tpo $depbase.Po
x86_64-pld-linux-gnux32-gcc  -O2 -fwrapv -pipe -Wformat -Werror=format-security -gdwarf-4 -fno-debug-types-section -fvar-tracking-assignments -g2 -Wp,-D_FORTIFY_SOURCE=2 -fstack-protector-strong --param=ssp-buffer-size=4 -Werror=trampolines -fPIC -mtune=generic -march=x86-64 -gdwarf-4 -fno-debug-types-section -fvar-tracking-assignments -g2   -Wl,--as-needed -Wl,--no-copy-dt-needed-entries -Wl,-z,relro -Wl,-z,combreloc  -o test-iswdigit test-iswdigit.o libtests.a ../lib/libgreputils.a libtests.a ../lib/libgreputils.a    
depbase=`echo test-iswxdigit.o | sed 's|[^/]*$|.deps/&|;s|\.o$||'`;\
x86_64-pld-linux-gnux32-gcc -DHAVE_CONFIG_H -DEXEEXT=\"\" -I. -I..  -DIN_GREP_GNULIB_TESTS=1 -I. -I. -I.. -I./.. -I../lib -I./../lib   -O2 -fwrapv -pipe -Wformat -Werror=format-security -gdwarf-4 -fno-debug-types-section -fvar-tracking-assignments -g2 -Wp,-D_FORTIFY_SOURCE=2 -fstack-protector-strong --param=ssp-buffer-size=4 -Werror=trampolines -fPIC -mtune=generic -march=x86-64 -gdwarf-4 -fno-debug-types-section -fvar-tracking-assignments -g2  -MT test-iswxdigit.o -MD -MP -MF $depbase.Tpo -c -o test-iswxdigit.o test-iswxdigit.c &&\
mv -f $depbase.Tpo $depbase.Po
x86_64-pld-linux-gnux32-gcc  -O2 -fwrapv -pipe -Wformat -Werror=format-security -gdwarf-4 -fno-debug-types-section -fvar-tracking-assignments -g2 -Wp,-D_FORTIFY_SOURCE=2 -fstack-protector-strong --param=ssp-buffer-size=4 -Werror=trampolines -fPIC -mtune=generic -march=x86-64 -gdwarf-4 -fno-debug-types-section -fvar-tracking-assignments -g2   -Wl,--as-needed -Wl,--no-copy-dt-needed-entries -Wl,-z,relro -Wl,-z,combreloc  -o test-iswxdigit test-iswxdigit.o libtests.a ../lib/libgreputils.a libtests.a ../lib/libgreputils.a    
depbase=`echo test-langinfo.o | sed 's|[^/]*$|.deps/&|;s|\.o$||'`;\
x86_64-pld-linux-gnux32-gcc -DHAVE_CONFIG_H -DEXEEXT=\"\" -I. -I..  -DIN_GREP_GNULIB_TESTS=1 -I. -I. -I.. -I./.. -I../lib -I./../lib   -O2 -fwrapv -pipe -Wformat -Werror=format-security -gdwarf-4 -fno-debug-types-section -fvar-tracking-assignments -g2 -Wp,-D_FORTIFY_SOURCE=2 -fstack-protector-strong --param=ssp-buffer-size=4 -Werror=trampolines -fPIC -mtune=generic -march=x86-64 -gdwarf-4 -fno-debug-types-section -fvar-tracking-assignments -g2  -MT test-langinfo.o -MD -MP -MF $depbase.Tpo -c -o test-langinfo.o test-langinfo.c &&\
mv -f $depbase.Tpo $depbase.Po
x86_64-pld-linux-gnux32-gcc  -O2 -fwrapv -pipe -Wformat -Werror=format-security -gdwarf-4 -fno-debug-types-section -fvar-tracking-assignments -g2 -Wp,-D_FORTIFY_SOURCE=2 -fstack-protector-strong --param=ssp-buffer-size=4 -Werror=trampolines -fPIC -mtune=generic -march=x86-64 -gdwarf-4 -fno-debug-types-section -fvar-tracking-assignments -g2   -Wl,--as-needed -Wl,--no-copy-dt-needed-entries -Wl,-z,relro -Wl,-z,combreloc  -o test-langinfo test-langinfo.o libtests.a ../lib/libgreputils.a libtests.a ../lib/libgreputils.a  
depbase=`echo test-limits-h.o | sed 's|[^/]*$|.deps/&|;s|\.o$||'`;\
x86_64-pld-linux-gnux32-gcc -DHAVE_CONFIG_H -DEXEEXT=\"\" -I. -I..  -DIN_GREP_GNULIB_TESTS=1 -I. -I. -I.. -I./.. -I../lib -I./../lib   -O2 -fwrapv -pipe -Wformat -Werror=format-security -gdwarf-4 -fno-debug-types-section -fvar-tracking-assignments -g2 -Wp,-D_FORTIFY_SOURCE=2 -fstack-protector-strong --param=ssp-buffer-size=4 -Werror=trampolines -fPIC -mtune=generic -march=x86-64 -gdwarf-4 -fno-debug-types-section -fvar-tracking-assignments -g2  -MT test-limits-h.o -MD -MP -MF $depbase.Tpo -c -o test-limits-h.o test-limits-h.c &&\
mv -f $depbase.Tpo $depbase.Po
x86_64-pld-linux-gnux32-gcc  -O2 -fwrapv -pipe -Wformat -Werror=format-security -gdwarf-4 -fno-debug-types-section -fvar-tracking-assignments -g2 -Wp,-D_FORTIFY_SOURCE=2 -fstack-protector-strong --param=ssp-buffer-size=4 -Werror=trampolines -fPIC -mtune=generic -march=x86-64 -gdwarf-4 -fno-debug-types-section -fvar-tracking-assignments -g2   -Wl,--as-needed -Wl,--no-copy-dt-needed-entries -Wl,-z,relro -Wl,-z,combreloc  -o test-limits-h test-limits-h.o libtests.a ../lib/libgreputils.a libtests.a ../lib/libgreputils.a  
depbase=`echo test-listen.o | sed 's|[^/]*$|.deps/&|;s|\.o$||'`;\
x86_64-pld-linux-gnux32-gcc -DHAVE_CONFIG_H -DEXEEXT=\"\" -I. -I..  -DIN_GREP_GNULIB_TESTS=1 -I. -I. -I.. -I./.. -I../lib -I./../lib   -O2 -fwrapv -pipe -Wformat -Werror=format-security -gdwarf-4 -fno-debug-types-section -fvar-tracking-assignments -g2 -Wp,-D_FORTIFY_SOURCE=2 -fstack-protector-strong --param=ssp-buffer-size=4 -Werror=trampolines -fPIC -mtune=generic -march=x86-64 -gdwarf-4 -fno-debug-types-section -fvar-tracking-assignments -g2  -MT test-listen.o -MD -MP -MF $depbase.Tpo -c -o test-listen.o test-listen.c &&\
mv -f $depbase.Tpo $depbase.Po
x86_64-pld-linux-gnux32-gcc  -O2 -fwrapv -pipe -Wformat -Werror=format-security -gdwarf-4 -fno-debug-types-section -fvar-tracking-assignments -g2 -Wp,-D_FORTIFY_SOURCE=2 -fstack-protector-strong --param=ssp-buffer-size=4 -Werror=trampolines -fPIC -mtune=generic -march=x86-64 -gdwarf-4 -fno-debug-types-section -fvar-tracking-assignments -g2   -Wl,--as-needed -Wl,--no-copy-dt-needed-entries -Wl,-z,relro -Wl,-z,combreloc  -o test-listen test-listen.o libtests.a ../lib/libgreputils.a libtests.a ../lib/libgreputils.a   
depbase=`echo test-locale.o | sed 's|[^/]*$|.deps/&|;s|\.o$||'`;\
x86_64-pld-linux-gnux32-gcc -DHAVE_CONFIG_H -DEXEEXT=\"\" -I. -I..  -DIN_GREP_GNULIB_TESTS=1 -I. -I. -I.. -I./.. -I../lib -I./../lib   -O2 -fwrapv -pipe -Wformat -Werror=format-security -gdwarf-4 -fno-debug-types-section -fvar-tracking-assignments -g2 -Wp,-D_FORTIFY_SOURCE=2 -fstack-protector-strong --param=ssp-buffer-size=4 -Werror=trampolines -fPIC -mtune=generic -march=x86-64 -gdwarf-4 -fno-debug-types-section -fvar-tracking-assignments -g2  -MT test-locale.o -MD -MP -MF $depbase.Tpo -c -o test-locale.o test-locale.c &&\
mv -f $depbase.Tpo $depbase.Po
x86_64-pld-linux-gnux32-gcc  -O2 -fwrapv -pipe -Wformat -Werror=format-security -gdwarf-4 -fno-debug-types-section -fvar-tracking-assignments -g2 -Wp,-D_FORTIFY_SOURCE=2 -fstack-protector-strong --param=ssp-buffer-size=4 -Werror=trampolines -fPIC -mtune=generic -march=x86-64 -gdwarf-4 -fno-debug-types-section -fvar-tracking-assignments -g2   -Wl,--as-needed -Wl,--no-copy-dt-needed-entries -Wl,-z,relro -Wl,-z,combreloc  -o test-locale test-locale.o libtests.a ../lib/libgreputils.a libtests.a ../lib/libgreputils.a  
depbase=`echo test-localeconv.o | sed 's|[^/]*$|.deps/&|;s|\.o$||'`;\
x86_64-pld-linux-gnux32-gcc -DHAVE_CONFIG_H -DEXEEXT=\"\" -I. -I..  -DIN_GREP_GNULIB_TESTS=1 -I. -I. -I.. -I./.. -I../lib -I./../lib   -O2 -fwrapv -pipe -Wformat -Werror=format-security -gdwarf-4 -fno-debug-types-section -fvar-tracking-assignments -g2 -Wp,-D_FORTIFY_SOURCE=2 -fstack-protector-strong --param=ssp-buffer-size=4 -Werror=trampolines -fPIC -mtune=generic -march=x86-64 -gdwarf-4 -fno-debug-types-section -fvar-tracking-assignments -g2  -MT test-localeconv.o -MD -MP -MF $depbase.Tpo -c -o test-localeconv.o test-localeconv.c &&\
mv -f $depbase.Tpo $depbase.Po
x86_64-pld-linux-gnux32-gcc  -O2 -fwrapv -pipe -Wformat -Werror=format-security -gdwarf-4 -fno-debug-types-section -fvar-tracking-assignments -g2 -Wp,-D_FORTIFY_SOURCE=2 -fstack-protector-strong --param=ssp-buffer-size=4 -Werror=trampolines -fPIC -mtune=generic -march=x86-64 -gdwarf-4 -fno-debug-types-section -fvar-tracking-assignments -g2   -Wl,--as-needed -Wl,--no-copy-dt-needed-entries -Wl,-z,relro -Wl,-z,combreloc  -o test-localeconv test-localeconv.o libtests.a ../lib/libgreputils.a libtests.a ../lib/libgreputils.a  
depbase=`echo test-localename.o | sed 's|[^/]*$|.deps/&|;s|\.o$||'`;\
x86_64-pld-linux-gnux32-gcc -DHAVE_CONFIG_H -DEXEEXT=\"\" -I. -I..  -DIN_GREP_GNULIB_TESTS=1 -I. -I. -I.. -I./.. -I../lib -I./../lib   -O2 -fwrapv -pipe -Wformat -Werror=format-security -gdwarf-4 -fno-debug-types-section -fvar-tracking-assignments -g2 -Wp,-D_FORTIFY_SOURCE=2 -fstack-protector-strong --param=ssp-buffer-size=4 -Werror=trampolines -fPIC -mtune=generic -march=x86-64 -gdwarf-4 -fno-debug-types-section -fvar-tracking-assignments -g2  -MT test-localename.o -MD -MP -MF $depbase.Tpo -c -o test-localename.o test-localename.c &&\
mv -f $depbase.Tpo $depbase.Po
x86_64-pld-linux-gnux32-gcc  -O2 -fwrapv -pipe -Wformat -Werror=format-security -gdwarf-4 -fno-debug-types-section -fvar-tracking-assignments -g2 -Wp,-D_FORTIFY_SOURCE=2 -fstack-protector-strong --param=ssp-buffer-size=4 -Werror=trampolines -fPIC -mtune=generic -march=x86-64 -gdwarf-4 -fno-debug-types-section -fvar-tracking-assignments -g2   -Wl,--as-needed -Wl,--no-copy-dt-needed-entries -Wl,-z,relro -Wl,-z,combreloc  -o test-localename test-localename.o libtests.a ../lib/libgreputils.a libtests.a ../lib/libgreputils.a     
depbase=`echo test-lseek.o | sed 's|[^/]*$|.deps/&|;s|\.o$||'`;\
x86_64-pld-linux-gnux32-gcc -DHAVE_CONFIG_H -DEXEEXT=\"\" -I. -I..  -DIN_GREP_GNULIB_TESTS=1 -I. -I. -I.. -I./.. -I../lib -I./../lib   -O2 -fwrapv -pipe -Wformat -Werror=format-security -gdwarf-4 -fno-debug-types-section -fvar-tracking-assignments -g2 -Wp,-D_FORTIFY_SOURCE=2 -fstack-protector-strong --param=ssp-buffer-size=4 -Werror=trampolines -fPIC -mtune=generic -march=x86-64 -gdwarf-4 -fno-debug-types-section -fvar-tracking-assignments -g2  -MT test-lseek.o -MD -MP -MF $depbase.Tpo -c -o test-lseek.o test-lseek.c &&\
mv -f $depbase.Tpo $depbase.Po
x86_64-pld-linux-gnux32-gcc  -O2 -fwrapv -pipe -Wformat -Werror=format-security -gdwarf-4 -fno-debug-types-section -fvar-tracking-assignments -g2 -Wp,-D_FORTIFY_SOURCE=2 -fstack-protector-strong --param=ssp-buffer-size=4 -Werror=trampolines -fPIC -mtune=generic -march=x86-64 -gdwarf-4 -fno-debug-types-section -fvar-tracking-assignments -g2   -Wl,--as-needed -Wl,--no-copy-dt-needed-entries -Wl,-z,relro -Wl,-z,combreloc  -o test-lseek test-lseek.o libtests.a ../lib/libgreputils.a libtests.a ../lib/libgreputils.a  
depbase=`echo test-lstat.o | sed 's|[^/]*$|.deps/&|;s|\.o$||'`;\
x86_64-pld-linux-gnux32-gcc -DHAVE_CONFIG_H -DEXEEXT=\"\" -I. -I..  -DIN_GREP_GNULIB_TESTS=1 -I. -I. -I.. -I./.. -I../lib -I./../lib   -O2 -fwrapv -pipe -Wformat -Werror=format-security -gdwarf-4 -fno-debug-types-section -fvar-tracking-assignments -g2 -Wp,-D_FORTIFY_SOURCE=2 -fstack-protector-strong --param=ssp-buffer-size=4 -Werror=trampolines -fPIC -mtune=generic -march=x86-64 -gdwarf-4 -fno-debug-types-section -fvar-tracking-assignments -g2  -MT test-lstat.o -MD -MP -MF $depbase.Tpo -c -o test-lstat.o test-lstat.c &&\
mv -f $depbase.Tpo $depbase.Po
x86_64-pld-linux-gnux32-gcc  -O2 -fwrapv -pipe -Wformat -Werror=format-security -gdwarf-4 -fno-debug-types-section -fvar-tracking-assignments -g2 -Wp,-D_FORTIFY_SOURCE=2 -fstack-protector-strong --param=ssp-buffer-size=4 -Werror=trampolines -fPIC -mtune=generic -march=x86-64 -gdwarf-4 -fno-debug-types-section -fvar-tracking-assignments -g2   -Wl,--as-needed -Wl,--no-copy-dt-needed-entries -Wl,-z,relro -Wl,-z,combreloc  -o test-lstat test-lstat.o libtests.a ../lib/libgreputils.a libtests.a ../lib/libgreputils.a  
depbase=`echo test-malloc-gnu.o | sed 's|[^/]*$|.deps/&|;s|\.o$||'`;\
x86_64-pld-linux-gnux32-gcc -DHAVE_CONFIG_H -DEXEEXT=\"\" -I. -I..  -DIN_GREP_GNULIB_TESTS=1 -I. -I. -I.. -I./.. -I../lib -I./../lib   -O2 -fwrapv -pipe -Wformat -Werror=format-security -gdwarf-4 -fno-debug-types-section -fvar-tracking-assignments -g2 -Wp,-D_FORTIFY_SOURCE=2 -fstack-protector-strong --param=ssp-buffer-size=4 -Werror=trampolines -fPIC -mtune=generic -march=x86-64 -gdwarf-4 -fno-debug-types-section -fvar-tracking-assignments -g2  -MT test-malloc-gnu.o -MD -MP -MF $depbase.Tpo -c -o test-malloc-gnu.o test-malloc-gnu.c &&\
mv -f $depbase.Tpo $depbase.Po
x86_64-pld-linux-gnux32-gcc  -O2 -fwrapv -pipe -Wformat -Werror=format-security -gdwarf-4 -fno-debug-types-section -fvar-tracking-assignments -g2 -Wp,-D_FORTIFY_SOURCE=2 -fstack-protector-strong --param=ssp-buffer-size=4 -Werror=trampolines -fPIC -mtune=generic -march=x86-64 -gdwarf-4 -fno-debug-types-section -fvar-tracking-assignments -g2   -Wl,--as-needed -Wl,--no-copy-dt-needed-entries -Wl,-z,relro -Wl,-z,combreloc  -o test-malloc-gnu test-malloc-gnu.o libtests.a ../lib/libgreputils.a libtests.a ../lib/libgreputils.a  
depbase=`echo test-malloca.o | sed 's|[^/]*$|.deps/&|;s|\.o$||'`;\
x86_64-pld-linux-gnux32-gcc -DHAVE_CONFIG_H -DEXEEXT=\"\" -I. -I..  -DIN_GREP_GNULIB_TESTS=1 -I. -I. -I.. -I./.. -I../lib -I./../lib   -O2 -fwrapv -pipe -Wformat -Werror=format-security -gdwarf-4 -fno-debug-types-section -fvar-tracking-assignments -g2 -Wp,-D_FORTIFY_SOURCE=2 -fstack-protector-strong --param=ssp-buffer-size=4 -Werror=trampolines -fPIC -mtune=generic -march=x86-64 -gdwarf-4 -fno-debug-types-section -fvar-tracking-assignments -g2  -MT test-malloca.o -MD -MP -MF $depbase.Tpo -c -o test-malloca.o test-malloca.c &&\
mv -f $depbase.Tpo $depbase.Po
x86_64-pld-linux-gnux32-gcc  -O2 -fwrapv -pipe -Wformat -Werror=format-security -gdwarf-4 -fno-debug-types-section -fvar-tracking-assignments -g2 -Wp,-D_FORTIFY_SOURCE=2 -fstack-protector-strong --param=ssp-buffer-size=4 -Werror=trampolines -fPIC -mtune=generic -march=x86-64 -gdwarf-4 -fno-debug-types-section -fvar-tracking-assignments -g2   -Wl,--as-needed -Wl,--no-copy-dt-needed-entries -Wl,-z,relro -Wl,-z,combreloc  -o test-malloca test-malloca.o libtests.a ../lib/libgreputils.a libtests.a ../lib/libgreputils.a  
depbase=`echo test-mbscasecmp.o | sed 's|[^/]*$|.deps/&|;s|\.o$||'`;\
x86_64-pld-linux-gnux32-gcc -DHAVE_CONFIG_H -DEXEEXT=\"\" -I. -I..  -DIN_GREP_GNULIB_TESTS=1 -I. -I. -I.. -I./.. -I../lib -I./../lib   -O2 -fwrapv -pipe -Wformat -Werror=format-security -gdwarf-4 -fno-debug-types-section -fvar-tracking-assignments -g2 -Wp,-D_FORTIFY_SOURCE=2 -fstack-protector-strong --param=ssp-buffer-size=4 -Werror=trampolines -fPIC -mtune=generic -march=x86-64 -gdwarf-4 -fno-debug-types-section -fvar-tracking-assignments -g2  -MT test-mbscasecmp.o -MD -MP -MF $depbase.Tpo -c -o test-mbscasecmp.o test-mbscasecmp.c &&\
mv -f $depbase.Tpo $depbase.Po
x86_64-pld-linux-gnux32-gcc  -O2 -fwrapv -pipe -Wformat -Werror=format-security -gdwarf-4 -fno-debug-types-section -fvar-tracking-assignments -g2 -Wp,-D_FORTIFY_SOURCE=2 -fstack-protector-strong --param=ssp-buffer-size=4 -Werror=trampolines -fPIC -mtune=generic -march=x86-64 -gdwarf-4 -fno-debug-types-section -fvar-tracking-assignments -g2   -Wl,--as-needed -Wl,--no-copy-dt-needed-entries -Wl,-z,relro -Wl,-z,combreloc  -o test-mbscasecmp test-mbscasecmp.o libtests.a ../lib/libgreputils.a libtests.a ../lib/libgreputils.a    
depbase=`echo test-mbsinit.o | sed 's|[^/]*$|.deps/&|;s|\.o$||'`;\
x86_64-pld-linux-gnux32-gcc -DHAVE_CONFIG_H -DEXEEXT=\"\" -I. -I..  -DIN_GREP_GNULIB_TESTS=1 -I. -I. -I.. -I./.. -I../lib -I./../lib   -O2 -fwrapv -pipe -Wformat -Werror=format-security -gdwarf-4 -fno-debug-types-section -fvar-tracking-assignments -g2 -Wp,-D_FORTIFY_SOURCE=2 -fstack-protector-strong --param=ssp-buffer-size=4 -Werror=trampolines -fPIC -mtune=generic -march=x86-64 -gdwarf-4 -fno-debug-types-section -fvar-tracking-assignments -g2  -MT test-mbsinit.o -MD -MP -MF $depbase.Tpo -c -o test-mbsinit.o test-mbsinit.c &&\
mv -f $depbase.Tpo $depbase.Po
x86_64-pld-linux-gnux32-gcc  -O2 -fwrapv -pipe -Wformat -Werror=format-security -gdwarf-4 -fno-debug-types-section -fvar-tracking-assignments -g2 -Wp,-D_FORTIFY_SOURCE=2 -fstack-protector-strong --param=ssp-buffer-size=4 -Werror=trampolines -fPIC -mtune=generic -march=x86-64 -gdwarf-4 -fno-debug-types-section -fvar-tracking-assignments -g2   -Wl,--as-needed -Wl,--no-copy-dt-needed-entries -Wl,-z,relro -Wl,-z,combreloc  -o test-mbsinit test-mbsinit.o libtests.a ../lib/libgreputils.a libtests.a ../lib/libgreputils.a    
depbase=`echo test-mbsrtowcs.o | sed 's|[^/]*$|.deps/&|;s|\.o$||'`;\
x86_64-pld-linux-gnux32-gcc -DHAVE_CONFIG_H -DEXEEXT=\"\" -I. -I..  -DIN_GREP_GNULIB_TESTS=1 -I. -I. -I.. -I./.. -I../lib -I./../lib   -O2 -fwrapv -pipe -Wformat -Werror=format-security -gdwarf-4 -fno-debug-types-section -fvar-tracking-assignments -g2 -Wp,-D_FORTIFY_SOURCE=2 -fstack-protector-strong --param=ssp-buffer-size=4 -Werror=trampolines -fPIC -mtune=generic -march=x86-64 -gdwarf-4 -fno-debug-types-section -fvar-tracking-assignments -g2  -MT test-mbsrtowcs.o -MD -MP -MF $depbase.Tpo -c -o test-mbsrtowcs.o test-mbsrtowcs.c &&\
mv -f $depbase.Tpo $depbase.Po
x86_64-pld-linux-gnux32-gcc  -O2 -fwrapv -pipe -Wformat -Werror=format-security -gdwarf-4 -fno-debug-types-section -fvar-tracking-assignments -g2 -Wp,-D_FORTIFY_SOURCE=2 -fstack-protector-strong --param=ssp-buffer-size=4 -Werror=trampolines -fPIC -mtune=generic -march=x86-64 -gdwarf-4 -fno-debug-types-section -fvar-tracking-assignments -g2   -Wl,--as-needed -Wl,--no-copy-dt-needed-entries -Wl,-z,relro -Wl,-z,combreloc  -o test-mbsrtowcs test-mbsrtowcs.o libtests.a ../lib/libgreputils.a libtests.a ../lib/libgreputils.a    
depbase=`echo test-mbsstr1.o | sed 's|[^/]*$|.deps/&|;s|\.o$||'`;\
x86_64-pld-linux-gnux32-gcc -DHAVE_CONFIG_H -DEXEEXT=\"\" -I. -I..  -DIN_GREP_GNULIB_TESTS=1 -I. -I. -I.. -I./.. -I../lib -I./../lib   -O2 -fwrapv -pipe -Wformat -Werror=format-security -gdwarf-4 -fno-debug-types-section -fvar-tracking-assignments -g2 -Wp,-D_FORTIFY_SOURCE=2 -fstack-protector-strong --param=ssp-buffer-size=4 -Werror=trampolines -fPIC -mtune=generic -march=x86-64 -gdwarf-4 -fno-debug-types-section -fvar-tracking-assignments -g2  -MT test-mbsstr1.o -MD -MP -MF $depbase.Tpo -c -o test-mbsstr1.o test-mbsstr1.c &&\
mv -f $depbase.Tpo $depbase.Po
x86_64-pld-linux-gnux32-gcc  -O2 -fwrapv -pipe -Wformat -Werror=format-security -gdwarf-4 -fno-debug-types-section -fvar-tracking-assignments -g2 -Wp,-D_FORTIFY_SOURCE=2 -fstack-protector-strong --param=ssp-buffer-size=4 -Werror=trampolines -fPIC -mtune=generic -march=x86-64 -gdwarf-4 -fno-debug-types-section -fvar-tracking-assignments -g2   -Wl,--as-needed -Wl,--no-copy-dt-needed-entries -Wl,-z,relro -Wl,-z,combreloc  -o test-mbsstr1 test-mbsstr1.o libtests.a ../lib/libgreputils.a libtests.a ../lib/libgreputils.a   
depbase=`echo test-mbsstr2.o | sed 's|[^/]*$|.deps/&|;s|\.o$||'`;\
x86_64-pld-linux-gnux32-gcc -DHAVE_CONFIG_H -DEXEEXT=\"\" -I. -I..  -DIN_GREP_GNULIB_TESTS=1 -I. -I. -I.. -I./.. -I../lib -I./../lib   -O2 -fwrapv -pipe -Wformat -Werror=format-security -gdwarf-4 -fno-debug-types-section -fvar-tracking-assignments -g2 -Wp,-D_FORTIFY_SOURCE=2 -fstack-protector-strong --param=ssp-buffer-size=4 -Werror=trampolines -fPIC -mtune=generic -march=x86-64 -gdwarf-4 -fno-debug-types-section -fvar-tracking-assignments -g2  -MT test-mbsstr2.o -MD -MP -MF $depbase.Tpo -c -o test-mbsstr2.o test-mbsstr2.c &&\
mv -f $depbase.Tpo $depbase.Po
x86_64-pld-linux-gnux32-gcc  -O2 -fwrapv -pipe -Wformat -Werror=format-security -gdwarf-4 -fno-debug-types-section -fvar-tracking-assignments -g2 -Wp,-D_FORTIFY_SOURCE=2 -fstack-protector-strong --param=ssp-buffer-size=4 -Werror=trampolines -fPIC -mtune=generic -march=x86-64 -gdwarf-4 -fno-debug-types-section -fvar-tracking-assignments -g2   -Wl,--as-needed -Wl,--no-copy-dt-needed-entries -Wl,-z,relro -Wl,-z,combreloc  -o test-mbsstr2 test-mbsstr2.o libtests.a ../lib/libgreputils.a libtests.a ../lib/libgreputils.a    
depbase=`echo test-mbsstr3.o | sed 's|[^/]*$|.deps/&|;s|\.o$||'`;\
x86_64-pld-linux-gnux32-gcc -DHAVE_CONFIG_H -DEXEEXT=\"\" -I. -I..  -DIN_GREP_GNULIB_TESTS=1 -I. -I. -I.. -I./.. -I../lib -I./../lib   -O2 -fwrapv -pipe -Wformat -Werror=format-security -gdwarf-4 -fno-debug-types-section -fvar-tracking-assignments -g2 -Wp,-D_FORTIFY_SOURCE=2 -fstack-protector-strong --param=ssp-buffer-size=4 -Werror=trampolines -fPIC -mtune=generic -march=x86-64 -gdwarf-4 -fno-debug-types-section -fvar-tracking-assignments -g2  -MT test-mbsstr3.o -MD -MP -MF $depbase.Tpo -c -o test-mbsstr3.o test-mbsstr3.c &&\
mv -f $depbase.Tpo $depbase.Po
x86_64-pld-linux-gnux32-gcc  -O2 -fwrapv -pipe -Wformat -Werror=format-security -gdwarf-4 -fno-debug-types-section -fvar-tracking-assignments -g2 -Wp,-D_FORTIFY_SOURCE=2 -fstack-protector-strong --param=ssp-buffer-size=4 -Werror=trampolines -fPIC -mtune=generic -march=x86-64 -gdwarf-4 -fno-debug-types-section -fvar-tracking-assignments -g2   -Wl,--as-needed -Wl,--no-copy-dt-needed-entries -Wl,-z,relro -Wl,-z,combreloc  -o test-mbsstr3 test-mbsstr3.o libtests.a ../lib/libgreputils.a libtests.a ../lib/libgreputils.a    
depbase=`echo test-memchr.o | sed 's|[^/]*$|.deps/&|;s|\.o$||'`;\
x86_64-pld-linux-gnux32-gcc -DHAVE_CONFIG_H -DEXEEXT=\"\" -I. -I..  -DIN_GREP_GNULIB_TESTS=1 -I. -I. -I.. -I./.. -I../lib -I./../lib   -O2 -fwrapv -pipe -Wformat -Werror=format-security -gdwarf-4 -fno-debug-types-section -fvar-tracking-assignments -g2 -Wp,-D_FORTIFY_SOURCE=2 -fstack-protector-strong --param=ssp-buffer-size=4 -Werror=trampolines -fPIC -mtune=generic -march=x86-64 -gdwarf-4 -fno-debug-types-section -fvar-tracking-assignments -g2  -MT test-memchr.o -MD -MP -MF $depbase.Tpo -c -o test-memchr.o test-memchr.c &&\
mv -f $depbase.Tpo $depbase.Po
x86_64-pld-linux-gnux32-gcc  -O2 -fwrapv -pipe -Wformat -Werror=format-security -gdwarf-4 -fno-debug-types-section -fvar-tracking-assignments -g2 -Wp,-D_FORTIFY_SOURCE=2 -fstack-protector-strong --param=ssp-buffer-size=4 -Werror=trampolines -fPIC -mtune=generic -march=x86-64 -gdwarf-4 -fno-debug-types-section -fvar-tracking-assignments -g2   -Wl,--as-needed -Wl,--no-copy-dt-needed-entries -Wl,-z,relro -Wl,-z,combreloc  -o test-memchr test-memchr.o libtests.a ../lib/libgreputils.a libtests.a ../lib/libgreputils.a  
depbase=`echo test-memchr2.o | sed 's|[^/]*$|.deps/&|;s|\.o$||'`;\
x86_64-pld-linux-gnux32-gcc -DHAVE_CONFIG_H -DEXEEXT=\"\" -I. -I..  -DIN_GREP_GNULIB_TESTS=1 -I. -I. -I.. -I./.. -I../lib -I./../lib   -O2 -fwrapv -pipe -Wformat -Werror=format-security -gdwarf-4 -fno-debug-types-section -fvar-tracking-assignments -g2 -Wp,-D_FORTIFY_SOURCE=2 -fstack-protector-strong --param=ssp-buffer-size=4 -Werror=trampolines -fPIC -mtune=generic -march=x86-64 -gdwarf-4 -fno-debug-types-section -fvar-tracking-assignments -g2  -MT test-memchr2.o -MD -MP -MF $depbase.Tpo -c -o test-memchr2.o test-memchr2.c &&\
mv -f $depbase.Tpo $depbase.Po
x86_64-pld-linux-gnux32-gcc  -O2 -fwrapv -pipe -Wformat -Werror=format-security -gdwarf-4 -fno-debug-types-section -fvar-tracking-assignments -g2 -Wp,-D_FORTIFY_SOURCE=2 -fstack-protector-strong --param=ssp-buffer-size=4 -Werror=trampolines -fPIC -mtune=generic -march=x86-64 -gdwarf-4 -fno-debug-types-section -fvar-tracking-assignments -g2   -Wl,--as-needed -Wl,--no-copy-dt-needed-entries -Wl,-z,relro -Wl,-z,combreloc  -o test-memchr2 test-memchr2.o libtests.a ../lib/libgreputils.a libtests.a ../lib/libgreputils.a  
depbase=`echo test-memrchr.o | sed 's|[^/]*$|.deps/&|;s|\.o$||'`;\
x86_64-pld-linux-gnux32-gcc -DHAVE_CONFIG_H -DEXEEXT=\"\" -I. -I..  -DIN_GREP_GNULIB_TESTS=1 -I. -I. -I.. -I./.. -I../lib -I./../lib   -O2 -fwrapv -pipe -Wformat -Werror=format-security -gdwarf-4 -fno-debug-types-section -fvar-tracking-assignments -g2 -Wp,-D_FORTIFY_SOURCE=2 -fstack-protector-strong --param=ssp-buffer-size=4 -Werror=trampolines -fPIC -mtune=generic -march=x86-64 -gdwarf-4 -fno-debug-types-section -fvar-tracking-assignments -g2  -MT test-memrchr.o -MD -MP -MF $depbase.Tpo -c -o test-memrchr.o test-memrchr.c &&\
mv -f $depbase.Tpo $depbase.Po
x86_64-pld-linux-gnux32-gcc  -O2 -fwrapv -pipe -Wformat -Werror=format-security -gdwarf-4 -fno-debug-types-section -fvar-tracking-assignments -g2 -Wp,-D_FORTIFY_SOURCE=2 -fstack-protector-strong --param=ssp-buffer-size=4 -Werror=trampolines -fPIC -mtune=generic -march=x86-64 -gdwarf-4 -fno-debug-types-section -fvar-tracking-assignments -g2   -Wl,--as-needed -Wl,--no-copy-dt-needed-entries -Wl,-z,relro -Wl,-z,combreloc  -o test-memrchr test-memrchr.o libtests.a ../lib/libgreputils.a libtests.a ../lib/libgreputils.a  
depbase=`echo test-nanosleep.o | sed 's|[^/]*$|.deps/&|;s|\.o$||'`;\
x86_64-pld-linux-gnux32-gcc -DHAVE_CONFIG_H -DEXEEXT=\"\" -I. -I..  -DIN_GREP_GNULIB_TESTS=1 -I. -I. -I.. -I./.. -I../lib -I./../lib   -O2 -fwrapv -pipe -Wformat -Werror=format-security -gdwarf-4 -fno-debug-types-section -fvar-tracking-assignments -g2 -Wp,-D_FORTIFY_SOURCE=2 -fstack-protector-strong --param=ssp-buffer-size=4 -Werror=trampolines -fPIC -mtune=generic -march=x86-64 -gdwarf-4 -fno-debug-types-section -fvar-tracking-assignments -g2  -MT test-nanosleep.o -MD -MP -MF $depbase.Tpo -c -o test-nanosleep.o test-nanosleep.c &&\
mv -f $depbase.Tpo $depbase.Po
x86_64-pld-linux-gnux32-gcc  -O2 -fwrapv -pipe -Wformat -Werror=format-security -gdwarf-4 -fno-debug-types-section -fvar-tracking-assignments -g2 -Wp,-D_FORTIFY_SOURCE=2 -fstack-protector-strong --param=ssp-buffer-size=4 -Werror=trampolines -fPIC -mtune=generic -march=x86-64 -gdwarf-4 -fno-debug-types-section -fvar-tracking-assignments -g2   -Wl,--as-needed -Wl,--no-copy-dt-needed-entries -Wl,-z,relro -Wl,-z,combreloc  -o test-nanosleep test-nanosleep.o libtests.a ../lib/libgreputils.a libtests.a ../lib/libgreputils.a   
depbase=`echo test-netinet_in.o | sed 's|[^/]*$|.deps/&|;s|\.o$||'`;\
x86_64-pld-linux-gnux32-gcc -DHAVE_CONFIG_H -DEXEEXT=\"\" -I. -I..  -DIN_GREP_GNULIB_TESTS=1 -I. -I. -I.. -I./.. -I../lib -I./../lib   -O2 -fwrapv -pipe -Wformat -Werror=format-security -gdwarf-4 -fno-debug-types-section -fvar-tracking-assignments -g2 -Wp,-D_FORTIFY_SOURCE=2 -fstack-protector-strong --param=ssp-buffer-size=4 -Werror=trampolines -fPIC -mtune=generic -march=x86-64 -gdwarf-4 -fno-debug-types-section -fvar-tracking-assignments -g2  -MT test-netinet_in.o -MD -MP -MF $depbase.Tpo -c -o test-netinet_in.o test-netinet_in.c &&\
mv -f $depbase.Tpo $depbase.Po
x86_64-pld-linux-gnux32-gcc  -O2 -fwrapv -pipe -Wformat -Werror=format-security -gdwarf-4 -fno-debug-types-section -fvar-tracking-assignments -g2 -Wp,-D_FORTIFY_SOURCE=2 -fstack-protector-strong --param=ssp-buffer-size=4 -Werror=trampolines -fPIC -mtune=generic -march=x86-64 -gdwarf-4 -fno-debug-types-section -fvar-tracking-assignments -g2   -Wl,--as-needed -Wl,--no-copy-dt-needed-entries -Wl,-z,relro -Wl,-z,combreloc  -o test-netinet_in test-netinet_in.o libtests.a ../lib/libgreputils.a libtests.a ../lib/libgreputils.a  
depbase=`echo test-nl_langinfo.o | sed 's|[^/]*$|.deps/&|;s|\.o$||'`;\
x86_64-pld-linux-gnux32-gcc -DHAVE_CONFIG_H -DEXEEXT=\"\" -I. -I..  -DIN_GREP_GNULIB_TESTS=1 -I. -I. -I.. -I./.. -I../lib -I./../lib   -O2 -fwrapv -pipe -Wformat -Werror=format-security -gdwarf-4 -fno-debug-types-section -fvar-tracking-assignments -g2 -Wp,-D_FORTIFY_SOURCE=2 -fstack-protector-strong --param=ssp-buffer-size=4 -Werror=trampolines -fPIC -mtune=generic -march=x86-64 -gdwarf-4 -fno-debug-types-section -fvar-tracking-assignments -g2  -MT test-nl_langinfo.o -MD -MP -MF $depbase.Tpo -c -o test-nl_langinfo.o test-nl_langinfo.c &&\
mv -f $depbase.Tpo $depbase.Po
x86_64-pld-linux-gnux32-gcc  -O2 -fwrapv -pipe -Wformat -Werror=format-security -gdwarf-4 -fno-debug-types-section -fvar-tracking-assignments -g2 -Wp,-D_FORTIFY_SOURCE=2 -fstack-protector-strong --param=ssp-buffer-size=4 -Werror=trampolines -fPIC -mtune=generic -march=x86-64 -gdwarf-4 -fno-debug-types-section -fvar-tracking-assignments -g2   -Wl,--as-needed -Wl,--no-copy-dt-needed-entries -Wl,-z,relro -Wl,-z,combreloc  -o test-nl_langinfo test-nl_langinfo.o libtests.a ../lib/libgreputils.a libtests.a ../lib/libgreputils.a   
depbase=`echo test-nl_langinfo-mt.o | sed 's|[^/]*$|.deps/&|;s|\.o$||'`;\
x86_64-pld-linux-gnux32-gcc -DHAVE_CONFIG_H -DEXEEXT=\"\" -I. -I..  -DIN_GREP_GNULIB_TESTS=1 -I. -I. -I.. -I./.. -I../lib -I./../lib   -O2 -fwrapv -pipe -Wformat -Werror=format-security -gdwarf-4 -fno-debug-types-section -fvar-tracking-assignments -g2 -Wp,-D_FORTIFY_SOURCE=2 -fstack-protector-strong --param=ssp-buffer-size=4 -Werror=trampolines -fPIC -mtune=generic -march=x86-64 -gdwarf-4 -fno-debug-types-section -fvar-tracking-assignments -g2  -MT test-nl_langinfo-mt.o -MD -MP -MF $depbase.Tpo -c -o test-nl_langinfo-mt.o test-nl_langinfo-mt.c &&\
mv -f $depbase.Tpo $depbase.Po
x86_64-pld-linux-gnux32-gcc  -O2 -fwrapv -pipe -Wformat -Werror=format-security -gdwarf-4 -fno-debug-types-section -fvar-tracking-assignments -g2 -Wp,-D_FORTIFY_SOURCE=2 -fstack-protector-strong --param=ssp-buffer-size=4 -Werror=trampolines -fPIC -mtune=generic -march=x86-64 -gdwarf-4 -fno-debug-types-section -fvar-tracking-assignments -g2   -Wl,--as-needed -Wl,--no-copy-dt-needed-entries -Wl,-z,relro -Wl,-z,combreloc  -o test-nl_langinfo-mt test-nl_langinfo-mt.o libtests.a ../lib/libgreputils.a libtests.a ../lib/libgreputils.a   -pthread  
depbase=`echo test-open.o | sed 's|[^/]*$|.deps/&|;s|\.o$||'`;\
x86_64-pld-linux-gnux32-gcc -DHAVE_CONFIG_H -DEXEEXT=\"\" -I. -I..  -DIN_GREP_GNULIB_TESTS=1 -I. -I. -I.. -I./.. -I../lib -I./../lib   -O2 -fwrapv -pipe -Wformat -Werror=format-security -gdwarf-4 -fno-debug-types-section -fvar-tracking-assignments -g2 -Wp,-D_FORTIFY_SOURCE=2 -fstack-protector-strong --param=ssp-buffer-size=4 -Werror=trampolines -fPIC -mtune=generic -march=x86-64 -gdwarf-4 -fno-debug-types-section -fvar-tracking-assignments -g2  -MT test-open.o -MD -MP -MF $depbase.Tpo -c -o test-open.o test-open.c &&\
mv -f $depbase.Tpo $depbase.Po
x86_64-pld-linux-gnux32-gcc  -O2 -fwrapv -pipe -Wformat -Werror=format-security -gdwarf-4 -fno-debug-types-section -fvar-tracking-assignments -g2 -Wp,-D_FORTIFY_SOURCE=2 -fstack-protector-strong --param=ssp-buffer-size=4 -Werror=trampolines -fPIC -mtune=generic -march=x86-64 -gdwarf-4 -fno-debug-types-section -fvar-tracking-assignments -g2   -Wl,--as-needed -Wl,--no-copy-dt-needed-entries -Wl,-z,relro -Wl,-z,combreloc  -o test-open test-open.o libtests.a ../lib/libgreputils.a libtests.a ../lib/libgreputils.a  
depbase=`echo test-openat-safer.o | sed 's|[^/]*$|.deps/&|;s|\.o$||'`;\
x86_64-pld-linux-gnux32-gcc -DHAVE_CONFIG_H -DEXEEXT=\"\" -I. -I..  -DIN_GREP_GNULIB_TESTS=1 -I. -I. -I.. -I./.. -I../lib -I./../lib   -O2 -fwrapv -pipe -Wformat -Werror=format-security -gdwarf-4 -fno-debug-types-section -fvar-tracking-assignments -g2 -Wp,-D_FORTIFY_SOURCE=2 -fstack-protector-strong --param=ssp-buffer-size=4 -Werror=trampolines -fPIC -mtune=generic -march=x86-64 -gdwarf-4 -fno-debug-types-section -fvar-tracking-assignments -g2  -MT test-openat-safer.o -MD -MP -MF $depbase.Tpo -c -o test-openat-safer.o test-openat-safer.c &&\
mv -f $depbase.Tpo $depbase.Po
x86_64-pld-linux-gnux32-gcc  -O2 -fwrapv -pipe -Wformat -Werror=format-security -gdwarf-4 -fno-debug-types-section -fvar-tracking-assignments -g2 -Wp,-D_FORTIFY_SOURCE=2 -fstack-protector-strong --param=ssp-buffer-size=4 -Werror=trampolines -fPIC -mtune=generic -march=x86-64 -gdwarf-4 -fno-debug-types-section -fvar-tracking-assignments -g2   -Wl,--as-needed -Wl,--no-copy-dt-needed-entries -Wl,-z,relro -Wl,-z,combreloc  -o test-openat-safer test-openat-safer.o libtests.a ../lib/libgreputils.a libtests.a ../lib/libgreputils.a   
depbase=`echo test-openat.o | sed 's|[^/]*$|.deps/&|;s|\.o$||'`;\
x86_64-pld-linux-gnux32-gcc -DHAVE_CONFIG_H -DEXEEXT=\"\" -I. -I..  -DIN_GREP_GNULIB_TESTS=1 -I. -I. -I.. -I./.. -I../lib -I./../lib   -O2 -fwrapv -pipe -Wformat -Werror=format-security -gdwarf-4 -fno-debug-types-section -fvar-tracking-assignments -g2 -Wp,-D_FORTIFY_SOURCE=2 -fstack-protector-strong --param=ssp-buffer-size=4 -Werror=trampolines -fPIC -mtune=generic -march=x86-64 -gdwarf-4 -fno-debug-types-section -fvar-tracking-assignments -g2  -MT test-openat.o -MD -MP -MF $depbase.Tpo -c -o test-openat.o test-openat.c &&\
mv -f $depbase.Tpo $depbase.Po
x86_64-pld-linux-gnux32-gcc  -O2 -fwrapv -pipe -Wformat -Werror=format-security -gdwarf-4 -fno-debug-types-section -fvar-tracking-assignments -g2 -Wp,-D_FORTIFY_SOURCE=2 -fstack-protector-strong --param=ssp-buffer-size=4 -Werror=trampolines -fPIC -mtune=generic -march=x86-64 -gdwarf-4 -fno-debug-types-section -fvar-tracking-assignments -g2   -Wl,--as-needed -Wl,--no-copy-dt-needed-entries -Wl,-z,relro -Wl,-z,combreloc  -o test-openat test-openat.o libtests.a ../lib/libgreputils.a libtests.a ../lib/libgreputils.a   
depbase=`echo test-pathmax.o | sed 's|[^/]*$|.deps/&|;s|\.o$||'`;\
x86_64-pld-linux-gnux32-gcc -DHAVE_CONFIG_H -DEXEEXT=\"\" -I. -I..  -DIN_GREP_GNULIB_TESTS=1 -I. -I. -I.. -I./.. -I../lib -I./../lib   -O2 -fwrapv -pipe -Wformat -Werror=format-security -gdwarf-4 -fno-debug-types-section -fvar-tracking-assignments -g2 -Wp,-D_FORTIFY_SOURCE=2 -fstack-protector-strong --param=ssp-buffer-size=4 -Werror=trampolines -fPIC -mtune=generic -march=x86-64 -gdwarf-4 -fno-debug-types-section -fvar-tracking-assignments -g2  -MT test-pathmax.o -MD -MP -MF $depbase.Tpo -c -o test-pathmax.o test-pathmax.c &&\
mv -f $depbase.Tpo $depbase.Po
x86_64-pld-linux-gnux32-gcc  -O2 -fwrapv -pipe -Wformat -Werror=format-security -gdwarf-4 -fno-debug-types-section -fvar-tracking-assignments -g2 -Wp,-D_FORTIFY_SOURCE=2 -fstack-protector-strong --param=ssp-buffer-size=4 -Werror=trampolines -fPIC -mtune=generic -march=x86-64 -gdwarf-4 -fno-debug-types-section -fvar-tracking-assignments -g2   -Wl,--as-needed -Wl,--no-copy-dt-needed-entries -Wl,-z,relro -Wl,-z,combreloc  -o test-pathmax test-pathmax.o libtests.a ../lib/libgreputils.a libtests.a ../lib/libgreputils.a  
depbase=`echo test-perror.o | sed 's|[^/]*$|.deps/&|;s|\.o$||'`;\
x86_64-pld-linux-gnux32-gcc -DHAVE_CONFIG_H -DEXEEXT=\"\" -I. -I..  -DIN_GREP_GNULIB_TESTS=1 -I. -I. -I.. -I./.. -I../lib -I./../lib   -O2 -fwrapv -pipe -Wformat -Werror=format-security -gdwarf-4 -fno-debug-types-section -fvar-tracking-assignments -g2 -Wp,-D_FORTIFY_SOURCE=2 -fstack-protector-strong --param=ssp-buffer-size=4 -Werror=trampolines -fPIC -mtune=generic -march=x86-64 -gdwarf-4 -fno-debug-types-section -fvar-tracking-assignments -g2  -MT test-perror.o -MD -MP -MF $depbase.Tpo -c -o test-perror.o test-perror.c &&\
mv -f $depbase.Tpo $depbase.Po
x86_64-pld-linux-gnux32-gcc  -O2 -fwrapv -pipe -Wformat -Werror=format-security -gdwarf-4 -fno-debug-types-section -fvar-tracking-assignments -g2 -Wp,-D_FORTIFY_SOURCE=2 -fstack-protector-strong --param=ssp-buffer-size=4 -Werror=trampolines -fPIC -mtune=generic -march=x86-64 -gdwarf-4 -fno-debug-types-section -fvar-tracking-assignments -g2   -Wl,--as-needed -Wl,--no-copy-dt-needed-entries -Wl,-z,relro -Wl,-z,combreloc  -o test-perror test-perror.o libtests.a ../lib/libgreputils.a libtests.a ../lib/libgreputils.a  
depbase=`echo test-perror2.o | sed 's|[^/]*$|.deps/&|;s|\.o$||'`;\
x86_64-pld-linux-gnux32-gcc -DHAVE_CONFIG_H -DEXEEXT=\"\" -I. -I..  -DIN_GREP_GNULIB_TESTS=1 -I. -I. -I.. -I./.. -I../lib -I./../lib   -O2 -fwrapv -pipe -Wformat -Werror=format-security -gdwarf-4 -fno-debug-types-section -fvar-tracking-assignments -g2 -Wp,-D_FORTIFY_SOURCE=2 -fstack-protector-strong --param=ssp-buffer-size=4 -Werror=trampolines -fPIC -mtune=generic -march=x86-64 -gdwarf-4 -fno-debug-types-section -fvar-tracking-assignments -g2  -MT test-perror2.o -MD -MP -MF $depbase.Tpo -c -o test-perror2.o test-perror2.c &&\
mv -f $depbase.Tpo $depbase.Po
x86_64-pld-linux-gnux32-gcc  -O2 -fwrapv -pipe -Wformat -Werror=format-security -gdwarf-4 -fno-debug-types-section -fvar-tracking-assignments -g2 -Wp,-D_FORTIFY_SOURCE=2 -fstack-protector-strong --param=ssp-buffer-size=4 -Werror=trampolines -fPIC -mtune=generic -march=x86-64 -gdwarf-4 -fno-debug-types-section -fvar-tracking-assignments -g2   -Wl,--as-needed -Wl,--no-copy-dt-needed-entries -Wl,-z,relro -Wl,-z,combreloc  -o test-perror2 test-perror2.o libtests.a ../lib/libgreputils.a libtests.a ../lib/libgreputils.a  
depbase=`echo test-pipe.o | sed 's|[^/]*$|.deps/&|;s|\.o$||'`;\
x86_64-pld-linux-gnux32-gcc -DHAVE_CONFIG_H -DEXEEXT=\"\" -I. -I..  -DIN_GREP_GNULIB_TESTS=1 -I. -I. -I.. -I./.. -I../lib -I./../lib   -O2 -fwrapv -pipe -Wformat -Werror=format-security -gdwarf-4 -fno-debug-types-section -fvar-tracking-assignments -g2 -Wp,-D_FORTIFY_SOURCE=2 -fstack-protector-strong --param=ssp-buffer-size=4 -Werror=trampolines -fPIC -mtune=generic -march=x86-64 -gdwarf-4 -fno-debug-types-section -fvar-tracking-assignments -g2  -MT test-pipe.o -MD -MP -MF $depbase.Tpo -c -o test-pipe.o test-pipe.c &&\
mv -f $depbase.Tpo $depbase.Po
x86_64-pld-linux-gnux32-gcc  -O2 -fwrapv -pipe -Wformat -Werror=format-security -gdwarf-4 -fno-debug-types-section -fvar-tracking-assignments -g2 -Wp,-D_FORTIFY_SOURCE=2 -fstack-protector-strong --param=ssp-buffer-size=4 -Werror=trampolines -fPIC -mtune=generic -march=x86-64 -gdwarf-4 -fno-debug-types-section -fvar-tracking-assignments -g2   -Wl,--as-needed -Wl,--no-copy-dt-needed-entries -Wl,-z,relro -Wl,-z,combreloc  -o test-pipe test-pipe.o libtests.a ../lib/libgreputils.a libtests.a ../lib/libgreputils.a  
depbase=`echo test-pthread.o | sed 's|[^/]*$|.deps/&|;s|\.o$||'`;\
x86_64-pld-linux-gnux32-gcc -DHAVE_CONFIG_H -DEXEEXT=\"\" -I. -I..  -DIN_GREP_GNULIB_TESTS=1 -I. -I. -I.. -I./.. -I../lib -I./../lib   -O2 -fwrapv -pipe -Wformat -Werror=format-security -gdwarf-4 -fno-debug-types-section -fvar-tracking-assignments -g2 -Wp,-D_FORTIFY_SOURCE=2 -fstack-protector-strong --param=ssp-buffer-size=4 -Werror=trampolines -fPIC -mtune=generic -march=x86-64 -gdwarf-4 -fno-debug-types-section -fvar-tracking-assignments -g2  -MT test-pthread.o -MD -MP -MF $depbase.Tpo -c -o test-pthread.o test-pthread.c &&\
mv -f $depbase.Tpo $depbase.Po
x86_64-pld-linux-gnux32-gcc  -O2 -fwrapv -pipe -Wformat -Werror=format-security -gdwarf-4 -fno-debug-types-section -fvar-tracking-assignments -g2 -Wp,-D_FORTIFY_SOURCE=2 -fstack-protector-strong --param=ssp-buffer-size=4 -Werror=trampolines -fPIC -mtune=generic -march=x86-64 -gdwarf-4 -fno-debug-types-section -fvar-tracking-assignments -g2   -Wl,--as-needed -Wl,--no-copy-dt-needed-entries -Wl,-z,relro -Wl,-z,combreloc  -o test-pthread test-pthread.o libtests.a ../lib/libgreputils.a libtests.a ../lib/libgreputils.a  
depbase=`echo test-pthread-thread.o | sed 's|[^/]*$|.deps/&|;s|\.o$||'`;\
x86_64-pld-linux-gnux32-gcc -DHAVE_CONFIG_H -DEXEEXT=\"\" -I. -I..  -DIN_GREP_GNULIB_TESTS=1 -I. -I. -I.. -I./.. -I../lib -I./../lib   -O2 -fwrapv -pipe -Wformat -Werror=format-security -gdwarf-4 -fno-debug-types-section -fvar-tracking-assignments -g2 -Wp,-D_FORTIFY_SOURCE=2 -fstack-protector-strong --param=ssp-buffer-size=4 -Werror=trampolines -fPIC -mtune=generic -march=x86-64 -gdwarf-4 -fno-debug-types-section -fvar-tracking-assignments -g2  -MT test-pthread-thread.o -MD -MP -MF $depbase.Tpo -c -o test-pthread-thread.o test-pthread-thread.c &&\
mv -f $depbase.Tpo $depbase.Po
x86_64-pld-linux-gnux32-gcc  -O2 -fwrapv -pipe -Wformat -Werror=format-security -gdwarf-4 -fno-debug-types-section -fvar-tracking-assignments -g2 -Wp,-D_FORTIFY_SOURCE=2 -fstack-protector-strong --param=ssp-buffer-size=4 -Werror=trampolines -fPIC -mtune=generic -march=x86-64 -gdwarf-4 -fno-debug-types-section -fvar-tracking-assignments -g2   -Wl,--as-needed -Wl,--no-copy-dt-needed-entries -Wl,-z,relro -Wl,-z,combreloc  -o test-pthread-thread test-pthread-thread.o libtests.a ../lib/libgreputils.a libtests.a ../lib/libgreputils.a  -pthread 
depbase=`echo test-pthread_sigmask1.o | sed 's|[^/]*$|.deps/&|;s|\.o$||'`;\
x86_64-pld-linux-gnux32-gcc -DHAVE_CONFIG_H -DEXEEXT=\"\" -I. -I..  -DIN_GREP_GNULIB_TESTS=1 -I. -I. -I.. -I./.. -I../lib -I./../lib   -O2 -fwrapv -pipe -Wformat -Werror=format-security -gdwarf-4 -fno-debug-types-section -fvar-tracking-assignments -g2 -Wp,-D_FORTIFY_SOURCE=2 -fstack-protector-strong --param=ssp-buffer-size=4 -Werror=trampolines -fPIC -mtune=generic -march=x86-64 -gdwarf-4 -fno-debug-types-section -fvar-tracking-assignments -g2  -MT test-pthread_sigmask1.o -MD -MP -MF $depbase.Tpo -c -o test-pthread_sigmask1.o test-pthread_sigmask1.c &&\
mv -f $depbase.Tpo $depbase.Po
x86_64-pld-linux-gnux32-gcc  -O2 -fwrapv -pipe -Wformat -Werror=format-security -gdwarf-4 -fno-debug-types-section -fvar-tracking-assignments -g2 -Wp,-D_FORTIFY_SOURCE=2 -fstack-protector-strong --param=ssp-buffer-size=4 -Werror=trampolines -fPIC -mtune=generic -march=x86-64 -gdwarf-4 -fno-debug-types-section -fvar-tracking-assignments -g2   -Wl,--as-needed -Wl,--no-copy-dt-needed-entries -Wl,-z,relro -Wl,-z,combreloc  -o test-pthread_sigmask1 test-pthread_sigmask1.o libtests.a ../lib/libgreputils.a libtests.a ../lib/libgreputils.a   
depbase=`echo test-pthread_sigmask2.o | sed 's|[^/]*$|.deps/&|;s|\.o$||'`;\
x86_64-pld-linux-gnux32-gcc -DHAVE_CONFIG_H -DEXEEXT=\"\" -I. -I..  -DIN_GREP_GNULIB_TESTS=1 -I. -I. -I.. -I./.. -I../lib -I./../lib   -O2 -fwrapv -pipe -Wformat -Werror=format-security -gdwarf-4 -fno-debug-types-section -fvar-tracking-assignments -g2 -Wp,-D_FORTIFY_SOURCE=2 -fstack-protector-strong --param=ssp-buffer-size=4 -Werror=trampolines -fPIC -mtune=generic -march=x86-64 -gdwarf-4 -fno-debug-types-section -fvar-tracking-assignments -g2  -MT test-pthread_sigmask2.o -MD -MP -MF $depbase.Tpo -c -o test-pthread_sigmask2.o test-pthread_sigmask2.c &&\
mv -f $depbase.Tpo $depbase.Po
x86_64-pld-linux-gnux32-gcc  -O2 -fwrapv -pipe -Wformat -Werror=format-security -gdwarf-4 -fno-debug-types-section -fvar-tracking-assignments -g2 -Wp,-D_FORTIFY_SOURCE=2 -fstack-protector-strong --param=ssp-buffer-size=4 -Werror=trampolines -fPIC -mtune=generic -march=x86-64 -gdwarf-4 -fno-debug-types-section -fvar-tracking-assignments -g2   -Wl,--as-needed -Wl,--no-copy-dt-needed-entries -Wl,-z,relro -Wl,-z,combreloc  -o test-pthread_sigmask2 test-pthread_sigmask2.o libtests.a ../lib/libgreputils.a libtests.a ../lib/libgreputils.a   -pthread 
depbase=`echo test-quotearg-simple.o | sed 's|[^/]*$|.deps/&|;s|\.o$||'`;\
x86_64-pld-linux-gnux32-gcc -DHAVE_CONFIG_H -DEXEEXT=\"\" -I. -I..  -DIN_GREP_GNULIB_TESTS=1 -I. -I. -I.. -I./.. -I../lib -I./../lib   -O2 -fwrapv -pipe -Wformat -Werror=format-security -gdwarf-4 -fno-debug-types-section -fvar-tracking-assignments -g2 -Wp,-D_FORTIFY_SOURCE=2 -fstack-protector-strong --param=ssp-buffer-size=4 -Werror=trampolines -fPIC -mtune=generic -march=x86-64 -gdwarf-4 -fno-debug-types-section -fvar-tracking-assignments -g2  -MT test-quotearg-simple.o -MD -MP -MF $depbase.Tpo -c -o test-quotearg-simple.o test-quotearg-simple.c &&\
mv -f $depbase.Tpo $depbase.Po
x86_64-pld-linux-gnux32-gcc  -O2 -fwrapv -pipe -Wformat -Werror=format-security -gdwarf-4 -fno-debug-types-section -fvar-tracking-assignments -g2 -Wp,-D_FORTIFY_SOURCE=2 -fstack-protector-strong --param=ssp-buffer-size=4 -Werror=trampolines -fPIC -mtune=generic -march=x86-64 -gdwarf-4 -fno-debug-types-section -fvar-tracking-assignments -g2   -Wl,--as-needed -Wl,--no-copy-dt-needed-entries -Wl,-z,relro -Wl,-z,combreloc  -o test-quotearg-simple test-quotearg-simple.o libtests.a ../lib/libgreputils.a libtests.a ../lib/libgreputils.a    
depbase=`echo test-raise.o | sed 's|[^/]*$|.deps/&|;s|\.o$||'`;\
x86_64-pld-linux-gnux32-gcc -DHAVE_CONFIG_H -DEXEEXT=\"\" -I. -I..  -DIN_GREP_GNULIB_TESTS=1 -I. -I. -I.. -I./.. -I../lib -I./../lib   -O2 -fwrapv -pipe -Wformat -Werror=format-security -gdwarf-4 -fno-debug-types-section -fvar-tracking-assignments -g2 -Wp,-D_FORTIFY_SOURCE=2 -fstack-protector-strong --param=ssp-buffer-size=4 -Werror=trampolines -fPIC -mtune=generic -march=x86-64 -gdwarf-4 -fno-debug-types-section -fvar-tracking-assignments -g2  -MT test-raise.o -MD -MP -MF $depbase.Tpo -c -o test-raise.o test-raise.c &&\
mv -f $depbase.Tpo $depbase.Po
x86_64-pld-linux-gnux32-gcc  -O2 -fwrapv -pipe -Wformat -Werror=format-security -gdwarf-4 -fno-debug-types-section -fvar-tracking-assignments -g2 -Wp,-D_FORTIFY_SOURCE=2 -fstack-protector-strong --param=ssp-buffer-size=4 -Werror=trampolines -fPIC -mtune=generic -march=x86-64 -gdwarf-4 -fno-debug-types-section -fvar-tracking-assignments -g2   -Wl,--as-needed -Wl,--no-copy-dt-needed-entries -Wl,-z,relro -Wl,-z,combreloc  -o test-raise test-raise.o libtests.a ../lib/libgreputils.a libtests.a ../lib/libgreputils.a  
depbase=`echo test-rawmemchr.o | sed 's|[^/]*$|.deps/&|;s|\.o$||'`;\
x86_64-pld-linux-gnux32-gcc -DHAVE_CONFIG_H -DEXEEXT=\"\" -I. -I..  -DIN_GREP_GNULIB_TESTS=1 -I. -I. -I.. -I./.. -I../lib -I./../lib   -O2 -fwrapv -pipe -Wformat -Werror=format-security -gdwarf-4 -fno-debug-types-section -fvar-tracking-assignments -g2 -Wp,-D_FORTIFY_SOURCE=2 -fstack-protector-strong --param=ssp-buffer-size=4 -Werror=trampolines -fPIC -mtune=generic -march=x86-64 -gdwarf-4 -fno-debug-types-section -fvar-tracking-assignments -g2  -MT test-rawmemchr.o -MD -MP -MF $depbase.Tpo -c -o test-rawmemchr.o test-rawmemchr.c &&\
mv -f $depbase.Tpo $depbase.Po
x86_64-pld-linux-gnux32-gcc  -O2 -fwrapv -pipe -Wformat -Werror=format-security -gdwarf-4 -fno-debug-types-section -fvar-tracking-assignments -g2 -Wp,-D_FORTIFY_SOURCE=2 -fstack-protector-strong --param=ssp-buffer-size=4 -Werror=trampolines -fPIC -mtune=generic -march=x86-64 -gdwarf-4 -fno-debug-types-section -fvar-tracking-assignments -g2   -Wl,--as-needed -Wl,--no-copy-dt-needed-entries -Wl,-z,relro -Wl,-z,combreloc  -o test-rawmemchr test-rawmemchr.o libtests.a ../lib/libgreputils.a libtests.a ../lib/libgreputils.a  
depbase=`echo test-read.o | sed 's|[^/]*$|.deps/&|;s|\.o$||'`;\
x86_64-pld-linux-gnux32-gcc -DHAVE_CONFIG_H -DEXEEXT=\"\" -I. -I..  -DIN_GREP_GNULIB_TESTS=1 -I. -I. -I.. -I./.. -I../lib -I./../lib   -O2 -fwrapv -pipe -Wformat -Werror=format-security -gdwarf-4 -fno-debug-types-section -fvar-tracking-assignments -g2 -Wp,-D_FORTIFY_SOURCE=2 -fstack-protector-strong --param=ssp-buffer-size=4 -Werror=trampolines -fPIC -mtune=generic -march=x86-64 -gdwarf-4 -fno-debug-types-section -fvar-tracking-assignments -g2  -MT test-read.o -MD -MP -MF $depbase.Tpo -c -o test-read.o test-read.c &&\
mv -f $depbase.Tpo $depbase.Po
x86_64-pld-linux-gnux32-gcc  -O2 -fwrapv -pipe -Wformat -Werror=format-security -gdwarf-4 -fno-debug-types-section -fvar-tracking-assignments -g2 -Wp,-D_FORTIFY_SOURCE=2 -fstack-protector-strong --param=ssp-buffer-size=4 -Werror=trampolines -fPIC -mtune=generic -march=x86-64 -gdwarf-4 -fno-debug-types-section -fvar-tracking-assignments -g2   -Wl,--as-needed -Wl,--no-copy-dt-needed-entries -Wl,-z,relro -Wl,-z,combreloc  -o test-read test-read.o libtests.a ../lib/libgreputils.a libtests.a ../lib/libgreputils.a  
depbase=`echo test-realloc-gnu.o | sed 's|[^/]*$|.deps/&|;s|\.o$||'`;\
x86_64-pld-linux-gnux32-gcc -DHAVE_CONFIG_H -DEXEEXT=\"\" -I. -I..  -DIN_GREP_GNULIB_TESTS=1 -I. -I. -I.. -I./.. -I../lib -I./../lib   -O2 -fwrapv -pipe -Wformat -Werror=format-security -gdwarf-4 -fno-debug-types-section -fvar-tracking-assignments -g2 -Wp,-D_FORTIFY_SOURCE=2 -fstack-protector-strong --param=ssp-buffer-size=4 -Werror=trampolines -fPIC -mtune=generic -march=x86-64 -gdwarf-4 -fno-debug-types-section -fvar-tracking-assignments -g2  -MT test-realloc-gnu.o -MD -MP -MF $depbase.Tpo -c -o test-realloc-gnu.o test-realloc-gnu.c &&\
mv -f $depbase.Tpo $depbase.Po
x86_64-pld-linux-gnux32-gcc  -O2 -fwrapv -pipe -Wformat -Werror=format-security -gdwarf-4 -fno-debug-types-section -fvar-tracking-assignments -g2 -Wp,-D_FORTIFY_SOURCE=2 -fstack-protector-strong --param=ssp-buffer-size=4 -Werror=trampolines -fPIC -mtune=generic -march=x86-64 -gdwarf-4 -fno-debug-types-section -fvar-tracking-assignments -g2   -Wl,--as-needed -Wl,--no-copy-dt-needed-entries -Wl,-z,relro -Wl,-z,combreloc  -o test-realloc-gnu test-realloc-gnu.o libtests.a ../lib/libgreputils.a libtests.a ../lib/libgreputils.a  
depbase=`echo test-regex.o | sed 's|[^/]*$|.deps/&|;s|\.o$||'`;\
x86_64-pld-linux-gnux32-gcc -DHAVE_CONFIG_H -DEXEEXT=\"\" -I. -I..  -DIN_GREP_GNULIB_TESTS=1 -I. -I. -I.. -I./.. -I../lib -I./../lib   -O2 -fwrapv -pipe -Wformat -Werror=format-security -gdwarf-4 -fno-debug-types-section -fvar-tracking-assignments -g2 -Wp,-D_FORTIFY_SOURCE=2 -fstack-protector-strong --param=ssp-buffer-size=4 -Werror=trampolines -fPIC -mtune=generic -march=x86-64 -gdwarf-4 -fno-debug-types-section -fvar-tracking-assignments -g2  -MT test-regex.o -MD -MP -MF $depbase.Tpo -c -o test-regex.o test-regex.c &&\
mv -f $depbase.Tpo $depbase.Po
x86_64-pld-linux-gnux32-gcc  -O2 -fwrapv -pipe -Wformat -Werror=format-security -gdwarf-4 -fno-debug-types-section -fvar-tracking-assignments -g2 -Wp,-D_FORTIFY_SOURCE=2 -fstack-protector-strong --param=ssp-buffer-size=4 -Werror=trampolines -fPIC -mtune=generic -march=x86-64 -gdwarf-4 -fno-debug-types-section -fvar-tracking-assignments -g2   -Wl,--as-needed -Wl,--no-copy-dt-needed-entries -Wl,-z,relro -Wl,-z,combreloc  -o test-regex test-regex.o libtests.a ../lib/libgreputils.a libtests.a ../lib/libgreputils.a      
depbase=`echo test-sched.o | sed 's|[^/]*$|.deps/&|;s|\.o$||'`;\
x86_64-pld-linux-gnux32-gcc -DHAVE_CONFIG_H -DEXEEXT=\"\" -I. -I..  -DIN_GREP_GNULIB_TESTS=1 -I. -I. -I.. -I./.. -I../lib -I./../lib   -O2 -fwrapv -pipe -Wformat -Werror=format-security -gdwarf-4 -fno-debug-types-section -fvar-tracking-assignments -g2 -Wp,-D_FORTIFY_SOURCE=2 -fstack-protector-strong --param=ssp-buffer-size=4 -Werror=trampolines -fPIC -mtune=generic -march=x86-64 -gdwarf-4 -fno-debug-types-section -fvar-tracking-assignments -g2  -MT test-sched.o -MD -MP -MF $depbase.Tpo -c -o test-sched.o test-sched.c &&\
mv -f $depbase.Tpo $depbase.Po
x86_64-pld-linux-gnux32-gcc  -O2 -fwrapv -pipe -Wformat -Werror=format-security -gdwarf-4 -fno-debug-types-section -fvar-tracking-assignments -g2 -Wp,-D_FORTIFY_SOURCE=2 -fstack-protector-strong --param=ssp-buffer-size=4 -Werror=trampolines -fPIC -mtune=generic -march=x86-64 -gdwarf-4 -fno-debug-types-section -fvar-tracking-assignments -g2   -Wl,--as-needed -Wl,--no-copy-dt-needed-entries -Wl,-z,relro -Wl,-z,combreloc  -o test-sched test-sched.o libtests.a ../lib/libgreputils.a libtests.a ../lib/libgreputils.a  
depbase=`echo test-select.o | sed 's|[^/]*$|.deps/&|;s|\.o$||'`;\
x86_64-pld-linux-gnux32-gcc -DHAVE_CONFIG_H -DEXEEXT=\"\" -I. -I..  -DIN_GREP_GNULIB_TESTS=1 -I. -I. -I.. -I./.. -I../lib -I./../lib   -O2 -fwrapv -pipe -Wformat -Werror=format-security -gdwarf-4 -fno-debug-types-section -fvar-tracking-assignments -g2 -Wp,-D_FORTIFY_SOURCE=2 -fstack-protector-strong --param=ssp-buffer-size=4 -Werror=trampolines -fPIC -mtune=generic -march=x86-64 -gdwarf-4 -fno-debug-types-section -fvar-tracking-assignments -g2  -MT test-select.o -MD -MP -MF $depbase.Tpo -c -o test-select.o test-select.c &&\
mv -f $depbase.Tpo $depbase.Po
x86_64-pld-linux-gnux32-gcc  -O2 -fwrapv -pipe -Wformat -Werror=format-security -gdwarf-4 -fno-debug-types-section -fvar-tracking-assignments -g2 -Wp,-D_FORTIFY_SOURCE=2 -fstack-protector-strong --param=ssp-buffer-size=4 -Werror=trampolines -fPIC -mtune=generic -march=x86-64 -gdwarf-4 -fno-debug-types-section -fvar-tracking-assignments -g2   -Wl,--as-needed -Wl,--no-copy-dt-needed-entries -Wl,-z,relro -Wl,-z,combreloc  -o test-select test-select.o libtests.a ../lib/libgreputils.a libtests.a ../lib/libgreputils.a     
depbase=`echo test-select-fd.o | sed 's|[^/]*$|.deps/&|;s|\.o$||'`;\
x86_64-pld-linux-gnux32-gcc -DHAVE_CONFIG_H -DEXEEXT=\"\" -I. -I..  -DIN_GREP_GNULIB_TESTS=1 -I. -I. -I.. -I./.. -I../lib -I./../lib   -O2 -fwrapv -pipe -Wformat -Werror=format-security -gdwarf-4 -fno-debug-types-section -fvar-tracking-assignments -g2 -Wp,-D_FORTIFY_SOURCE=2 -fstack-protector-strong --param=ssp-buffer-size=4 -Werror=trampolines -fPIC -mtune=generic -march=x86-64 -gdwarf-4 -fno-debug-types-section -fvar-tracking-assignments -g2  -MT test-select-fd.o -MD -MP -MF $depbase.Tpo -c -o test-select-fd.o test-select-fd.c &&\
mv -f $depbase.Tpo $depbase.Po
x86_64-pld-linux-gnux32-gcc  -O2 -fwrapv -pipe -Wformat -Werror=format-security -gdwarf-4 -fno-debug-types-section -fvar-tracking-assignments -g2 -Wp,-D_FORTIFY_SOURCE=2 -fstack-protector-strong --param=ssp-buffer-size=4 -Werror=trampolines -fPIC -mtune=generic -march=x86-64 -gdwarf-4 -fno-debug-types-section -fvar-tracking-assignments -g2   -Wl,--as-needed -Wl,--no-copy-dt-needed-entries -Wl,-z,relro -Wl,-z,combreloc  -o test-select-fd test-select-fd.o libtests.a ../lib/libgreputils.a libtests.a ../lib/libgreputils.a   
depbase=`echo test-select-stdin.o | sed 's|[^/]*$|.deps/&|;s|\.o$||'`;\
x86_64-pld-linux-gnux32-gcc -DHAVE_CONFIG_H -DEXEEXT=\"\" -I. -I..  -DIN_GREP_GNULIB_TESTS=1 -I. -I. -I.. -I./.. -I../lib -I./../lib   -O2 -fwrapv -pipe -Wformat -Werror=format-security -gdwarf-4 -fno-debug-types-section -fvar-tracking-assignments -g2 -Wp,-D_FORTIFY_SOURCE=2 -fstack-protector-strong --param=ssp-buffer-size=4 -Werror=trampolines -fPIC -mtune=generic -march=x86-64 -gdwarf-4 -fno-debug-types-section -fvar-tracking-assignments -g2  -MT test-select-stdin.o -MD -MP -MF $depbase.Tpo -c -o test-select-stdin.o test-select-stdin.c &&\
mv -f $depbase.Tpo $depbase.Po
x86_64-pld-linux-gnux32-gcc  -O2 -fwrapv -pipe -Wformat -Werror=format-security -gdwarf-4 -fno-debug-types-section -fvar-tracking-assignments -g2 -Wp,-D_FORTIFY_SOURCE=2 -fstack-protector-strong --param=ssp-buffer-size=4 -Werror=trampolines -fPIC -mtune=generic -march=x86-64 -gdwarf-4 -fno-debug-types-section -fvar-tracking-assignments -g2   -Wl,--as-needed -Wl,--no-copy-dt-needed-entries -Wl,-z,relro -Wl,-z,combreloc  -o test-select-stdin test-select-stdin.o libtests.a ../lib/libgreputils.a libtests.a ../lib/libgreputils.a   
depbase=`echo test-setenv.o | sed 's|[^/]*$|.deps/&|;s|\.o$||'`;\
x86_64-pld-linux-gnux32-gcc -DHAVE_CONFIG_H -DEXEEXT=\"\" -I. -I..  -DIN_GREP_GNULIB_TESTS=1 -I. -I. -I.. -I./.. -I../lib -I./../lib   -O2 -fwrapv -pipe -Wformat -Werror=format-security -gdwarf-4 -fno-debug-types-section -fvar-tracking-assignments -g2 -Wp,-D_FORTIFY_SOURCE=2 -fstack-protector-strong --param=ssp-buffer-size=4 -Werror=trampolines -fPIC -mtune=generic -march=x86-64 -gdwarf-4 -fno-debug-types-section -fvar-tracking-assignments -g2  -MT test-setenv.o -MD -MP -MF $depbase.Tpo -c -o test-setenv.o test-setenv.c &&\
mv -f $depbase.Tpo $depbase.Po
x86_64-pld-linux-gnux32-gcc  -O2 -fwrapv -pipe -Wformat -Werror=format-security -gdwarf-4 -fno-debug-types-section -fvar-tracking-assignments -g2 -Wp,-D_FORTIFY_SOURCE=2 -fstack-protector-strong --param=ssp-buffer-size=4 -Werror=trampolines -fPIC -mtune=generic -march=x86-64 -gdwarf-4 -fno-debug-types-section -fvar-tracking-assignments -g2   -Wl,--as-needed -Wl,--no-copy-dt-needed-entries -Wl,-z,relro -Wl,-z,combreloc  -o test-setenv test-setenv.o libtests.a ../lib/libgreputils.a libtests.a ../lib/libgreputils.a  
depbase=`echo test-setlocale_null.o | sed 's|[^/]*$|.deps/&|;s|\.o$||'`;\
x86_64-pld-linux-gnux32-gcc -DHAVE_CONFIG_H -DEXEEXT=\"\" -I. -I..  -DIN_GREP_GNULIB_TESTS=1 -I. -I. -I.. -I./.. -I../lib -I./../lib   -O2 -fwrapv -pipe -Wformat -Werror=format-security -gdwarf-4 -fno-debug-types-section -fvar-tracking-assignments -g2 -Wp,-D_FORTIFY_SOURCE=2 -fstack-protector-strong --param=ssp-buffer-size=4 -Werror=trampolines -fPIC -mtune=generic -march=x86-64 -gdwarf-4 -fno-debug-types-section -fvar-tracking-assignments -g2  -MT test-setlocale_null.o -MD -MP -MF $depbase.Tpo -c -o test-setlocale_null.o test-setlocale_null.c &&\
mv -f $depbase.Tpo $depbase.Po
x86_64-pld-linux-gnux32-gcc  -O2 -fwrapv -pipe -Wformat -Werror=format-security -gdwarf-4 -fno-debug-types-section -fvar-tracking-assignments -g2 -Wp,-D_FORTIFY_SOURCE=2 -fstack-protector-strong --param=ssp-buffer-size=4 -Werror=trampolines -fPIC -mtune=generic -march=x86-64 -gdwarf-4 -fno-debug-types-section -fvar-tracking-assignments -g2   -Wl,--as-needed -Wl,--no-copy-dt-needed-entries -Wl,-z,relro -Wl,-z,combreloc  -o test-setlocale_null test-setlocale_null.o libtests.a ../lib/libgreputils.a libtests.a ../lib/libgreputils.a   
depbase=`echo test-setlocale_null-mt-one.o | sed 's|[^/]*$|.deps/&|;s|\.o$||'`;\
x86_64-pld-linux-gnux32-gcc -DHAVE_CONFIG_H -DEXEEXT=\"\" -I. -I..  -DIN_GREP_GNULIB_TESTS=1 -I. -I. -I.. -I./.. -I../lib -I./../lib   -O2 -fwrapv -pipe -Wformat -Werror=format-security -gdwarf-4 -fno-debug-types-section -fvar-tracking-assignments -g2 -Wp,-D_FORTIFY_SOURCE=2 -fstack-protector-strong --param=ssp-buffer-size=4 -Werror=trampolines -fPIC -mtune=generic -march=x86-64 -gdwarf-4 -fno-debug-types-section -fvar-tracking-assignments -g2  -MT test-setlocale_null-mt-one.o -MD -MP -MF $depbase.Tpo -c -o test-setlocale_null-mt-one.o test-setlocale_null-mt-one.c &&\
mv -f $depbase.Tpo $depbase.Po
x86_64-pld-linux-gnux32-gcc  -O2 -fwrapv -pipe -Wformat -Werror=format-security -gdwarf-4 -fno-debug-types-section -fvar-tracking-assignments -g2 -Wp,-D_FORTIFY_SOURCE=2 -fstack-protector-strong --param=ssp-buffer-size=4 -Werror=trampolines -fPIC -mtune=generic -march=x86-64 -gdwarf-4 -fno-debug-types-section -fvar-tracking-assignments -g2   -Wl,--as-needed -Wl,--no-copy-dt-needed-entries -Wl,-z,relro -Wl,-z,combreloc  -o test-setlocale_null-mt-one test-setlocale_null-mt-one.o libtests.a ../lib/libgreputils.a libtests.a ../lib/libgreputils.a   -pthread  
depbase=`echo test-setlocale_null-mt-all.o | sed 's|[^/]*$|.deps/&|;s|\.o$||'`;\
x86_64-pld-linux-gnux32-gcc -DHAVE_CONFIG_H -DEXEEXT=\"\" -I. -I..  -DIN_GREP_GNULIB_TESTS=1 -I. -I. -I.. -I./.. -I../lib -I./../lib   -O2 -fwrapv -pipe -Wformat -Werror=format-security -gdwarf-4 -fno-debug-types-section -fvar-tracking-assignments -g2 -Wp,-D_FORTIFY_SOURCE=2 -fstack-protector-strong --param=ssp-buffer-size=4 -Werror=trampolines -fPIC -mtune=generic -march=x86-64 -gdwarf-4 -fno-debug-types-section -fvar-tracking-assignments -g2  -MT test-setlocale_null-mt-all.o -MD -MP -MF $depbase.Tpo -c -o test-setlocale_null-mt-all.o test-setlocale_null-mt-all.c &&\
mv -f $depbase.Tpo $depbase.Po
x86_64-pld-linux-gnux32-gcc  -O2 -fwrapv -pipe -Wformat -Werror=format-security -gdwarf-4 -fno-debug-types-section -fvar-tracking-assignments -g2 -Wp,-D_FORTIFY_SOURCE=2 -fstack-protector-strong --param=ssp-buffer-size=4 -Werror=trampolines -fPIC -mtune=generic -march=x86-64 -gdwarf-4 -fno-debug-types-section -fvar-tracking-assignments -g2   -Wl,--as-needed -Wl,--no-copy-dt-needed-entries -Wl,-z,relro -Wl,-z,combreloc  -o test-setlocale_null-mt-all test-setlocale_null-mt-all.o libtests.a ../lib/libgreputils.a libtests.a ../lib/libgreputils.a   -pthread  
depbase=`echo test-setlocale1.o | sed 's|[^/]*$|.deps/&|;s|\.o$||'`;\
x86_64-pld-linux-gnux32-gcc -DHAVE_CONFIG_H -DEXEEXT=\"\" -I. -I..  -DIN_GREP_GNULIB_TESTS=1 -I. -I. -I.. -I./.. -I../lib -I./../lib   -O2 -fwrapv -pipe -Wformat -Werror=format-security -gdwarf-4 -fno-debug-types-section -fvar-tracking-assignments -g2 -Wp,-D_FORTIFY_SOURCE=2 -fstack-protector-strong --param=ssp-buffer-size=4 -Werror=trampolines -fPIC -mtune=generic -march=x86-64 -gdwarf-4 -fno-debug-types-section -fvar-tracking-assignments -g2  -MT test-setlocale1.o -MD -MP -MF $depbase.Tpo -c -o test-setlocale1.o test-setlocale1.c &&\
mv -f $depbase.Tpo $depbase.Po
x86_64-pld-linux-gnux32-gcc  -O2 -fwrapv -pipe -Wformat -Werror=format-security -gdwarf-4 -fno-debug-types-section -fvar-tracking-assignments -g2 -Wp,-D_FORTIFY_SOURCE=2 -fstack-protector-strong --param=ssp-buffer-size=4 -Werror=trampolines -fPIC -mtune=generic -march=x86-64 -gdwarf-4 -fno-debug-types-section -fvar-tracking-assignments -g2   -Wl,--as-needed -Wl,--no-copy-dt-needed-entries -Wl,-z,relro -Wl,-z,combreloc  -o test-setlocale1 test-setlocale1.o libtests.a ../lib/libgreputils.a libtests.a ../lib/libgreputils.a   
depbase=`echo test-setlocale2.o | sed 's|[^/]*$|.deps/&|;s|\.o$||'`;\
x86_64-pld-linux-gnux32-gcc -DHAVE_CONFIG_H -DEXEEXT=\"\" -I. -I..  -DIN_GREP_GNULIB_TESTS=1 -I. -I. -I.. -I./.. -I../lib -I./../lib   -O2 -fwrapv -pipe -Wformat -Werror=format-security -gdwarf-4 -fno-debug-types-section -fvar-tracking-assignments -g2 -Wp,-D_FORTIFY_SOURCE=2 -fstack-protector-strong --param=ssp-buffer-size=4 -Werror=trampolines -fPIC -mtune=generic -march=x86-64 -gdwarf-4 -fno-debug-types-section -fvar-tracking-assignments -g2  -MT test-setlocale2.o -MD -MP -MF $depbase.Tpo -c -o test-setlocale2.o test-setlocale2.c &&\
mv -f $depbase.Tpo $depbase.Po
x86_64-pld-linux-gnux32-gcc  -O2 -fwrapv -pipe -Wformat -Werror=format-security -gdwarf-4 -fno-debug-types-section -fvar-tracking-assignments -g2 -Wp,-D_FORTIFY_SOURCE=2 -fstack-protector-strong --param=ssp-buffer-size=4 -Werror=trampolines -fPIC -mtune=generic -march=x86-64 -gdwarf-4 -fno-debug-types-section -fvar-tracking-assignments -g2   -Wl,--as-needed -Wl,--no-copy-dt-needed-entries -Wl,-z,relro -Wl,-z,combreloc  -o test-setlocale2 test-setlocale2.o libtests.a ../lib/libgreputils.a libtests.a ../lib/libgreputils.a   
depbase=`echo test-setsockopt.o | sed 's|[^/]*$|.deps/&|;s|\.o$||'`;\
x86_64-pld-linux-gnux32-gcc -DHAVE_CONFIG_H -DEXEEXT=\"\" -I. -I..  -DIN_GREP_GNULIB_TESTS=1 -I. -I. -I.. -I./.. -I../lib -I./../lib   -O2 -fwrapv -pipe -Wformat -Werror=format-security -gdwarf-4 -fno-debug-types-section -fvar-tracking-assignments -g2 -Wp,-D_FORTIFY_SOURCE=2 -fstack-protector-strong --param=ssp-buffer-size=4 -Werror=trampolines -fPIC -mtune=generic -march=x86-64 -gdwarf-4 -fno-debug-types-section -fvar-tracking-assignments -g2  -MT test-setsockopt.o -MD -MP -MF $depbase.Tpo -c -o test-setsockopt.o test-setsockopt.c &&\
mv -f $depbase.Tpo $depbase.Po
x86_64-pld-linux-gnux32-gcc  -O2 -fwrapv -pipe -Wformat -Werror=format-security -gdwarf-4 -fno-debug-types-section -fvar-tracking-assignments -g2 -Wp,-D_FORTIFY_SOURCE=2 -fstack-protector-strong --param=ssp-buffer-size=4 -Werror=trampolines -fPIC -mtune=generic -march=x86-64 -gdwarf-4 -fno-debug-types-section -fvar-tracking-assignments -g2   -Wl,--as-needed -Wl,--no-copy-dt-needed-entries -Wl,-z,relro -Wl,-z,combreloc  -o test-setsockopt test-setsockopt.o libtests.a ../lib/libgreputils.a libtests.a ../lib/libgreputils.a   
depbase=`echo test-sigaction.o | sed 's|[^/]*$|.deps/&|;s|\.o$||'`;\
x86_64-pld-linux-gnux32-gcc -DHAVE_CONFIG_H -DEXEEXT=\"\" -I. -I..  -DIN_GREP_GNULIB_TESTS=1 -I. -I. -I.. -I./.. -I../lib -I./../lib   -O2 -fwrapv -pipe -Wformat -Werror=format-security -gdwarf-4 -fno-debug-types-section -fvar-tracking-assignments -g2 -Wp,-D_FORTIFY_SOURCE=2 -fstack-protector-strong --param=ssp-buffer-size=4 -Werror=trampolines -fPIC -mtune=generic -march=x86-64 -gdwarf-4 -fno-debug-types-section -fvar-tracking-assignments -g2  -MT test-sigaction.o -MD -MP -MF $depbase.Tpo -c -o test-sigaction.o test-sigaction.c &&\
mv -f $depbase.Tpo $depbase.Po
x86_64-pld-linux-gnux32-gcc  -O2 -fwrapv -pipe -Wformat -Werror=format-security -gdwarf-4 -fno-debug-types-section -fvar-tracking-assignments -g2 -Wp,-D_FORTIFY_SOURCE=2 -fstack-protector-strong --param=ssp-buffer-size=4 -Werror=trampolines -fPIC -mtune=generic -march=x86-64 -gdwarf-4 -fno-debug-types-section -fvar-tracking-assignments -g2   -Wl,--as-needed -Wl,--no-copy-dt-needed-entries -Wl,-z,relro -Wl,-z,combreloc  -o test-sigaction test-sigaction.o libtests.a ../lib/libgreputils.a libtests.a ../lib/libgreputils.a  
depbase=`echo test-signal-h.o | sed 's|[^/]*$|.deps/&|;s|\.o$||'`;\
x86_64-pld-linux-gnux32-gcc -DHAVE_CONFIG_H -DEXEEXT=\"\" -I. -I..  -DIN_GREP_GNULIB_TESTS=1 -I. -I. -I.. -I./.. -I../lib -I./../lib   -O2 -fwrapv -pipe -Wformat -Werror=format-security -gdwarf-4 -fno-debug-types-section -fvar-tracking-assignments -g2 -Wp,-D_FORTIFY_SOURCE=2 -fstack-protector-strong --param=ssp-buffer-size=4 -Werror=trampolines -fPIC -mtune=generic -march=x86-64 -gdwarf-4 -fno-debug-types-section -fvar-tracking-assignments -g2  -MT test-signal-h.o -MD -MP -MF $depbase.Tpo -c -o test-signal-h.o test-signal-h.c &&\
mv -f $depbase.Tpo $depbase.Po
x86_64-pld-linux-gnux32-gcc  -O2 -fwrapv -pipe -Wformat -Werror=format-security -gdwarf-4 -fno-debug-types-section -fvar-tracking-assignments -g2 -Wp,-D_FORTIFY_SOURCE=2 -fstack-protector-strong --param=ssp-buffer-size=4 -Werror=trampolines -fPIC -mtune=generic -march=x86-64 -gdwarf-4 -fno-debug-types-section -fvar-tracking-assignments -g2   -Wl,--as-needed -Wl,--no-copy-dt-needed-entries -Wl,-z,relro -Wl,-z,combreloc  -o test-signal-h test-signal-h.o libtests.a ../lib/libgreputils.a libtests.a ../lib/libgreputils.a  
depbase=`echo test-sigprocmask.o | sed 's|[^/]*$|.deps/&|;s|\.o$||'`;\
x86_64-pld-linux-gnux32-gcc -DHAVE_CONFIG_H -DEXEEXT=\"\" -I. -I..  -DIN_GREP_GNULIB_TESTS=1 -I. -I. -I.. -I./.. -I../lib -I./../lib   -O2 -fwrapv -pipe -Wformat -Werror=format-security -gdwarf-4 -fno-debug-types-section -fvar-tracking-assignments -g2 -Wp,-D_FORTIFY_SOURCE=2 -fstack-protector-strong --param=ssp-buffer-size=4 -Werror=trampolines -fPIC -mtune=generic -march=x86-64 -gdwarf-4 -fno-debug-types-section -fvar-tracking-assignments -g2  -MT test-sigprocmask.o -MD -MP -MF $depbase.Tpo -c -o test-sigprocmask.o test-sigprocmask.c &&\
mv -f $depbase.Tpo $depbase.Po
x86_64-pld-linux-gnux32-gcc  -O2 -fwrapv -pipe -Wformat -Werror=format-security -gdwarf-4 -fno-debug-types-section -fvar-tracking-assignments -g2 -Wp,-D_FORTIFY_SOURCE=2 -fstack-protector-strong --param=ssp-buffer-size=4 -Werror=trampolines -fPIC -mtune=generic -march=x86-64 -gdwarf-4 -fno-debug-types-section -fvar-tracking-assignments -g2   -Wl,--as-needed -Wl,--no-copy-dt-needed-entries -Wl,-z,relro -Wl,-z,combreloc  -o test-sigprocmask test-sigprocmask.o libtests.a ../lib/libgreputils.a libtests.a ../lib/libgreputils.a  
depbase=`echo test-sleep.o | sed 's|[^/]*$|.deps/&|;s|\.o$||'`;\
x86_64-pld-linux-gnux32-gcc -DHAVE_CONFIG_H -DEXEEXT=\"\" -I. -I..  -DIN_GREP_GNULIB_TESTS=1 -I. -I. -I.. -I./.. -I../lib -I./../lib   -O2 -fwrapv -pipe -Wformat -Werror=format-security -gdwarf-4 -fno-debug-types-section -fvar-tracking-assignments -g2 -Wp,-D_FORTIFY_SOURCE=2 -fstack-protector-strong --param=ssp-buffer-size=4 -Werror=trampolines -fPIC -mtune=generic -march=x86-64 -gdwarf-4 -fno-debug-types-section -fvar-tracking-assignments -g2  -MT test-sleep.o -MD -MP -MF $depbase.Tpo -c -o test-sleep.o test-sleep.c &&\
mv -f $depbase.Tpo $depbase.Po
x86_64-pld-linux-gnux32-gcc  -O2 -fwrapv -pipe -Wformat -Werror=format-security -gdwarf-4 -fno-debug-types-section -fvar-tracking-assignments -g2 -Wp,-D_FORTIFY_SOURCE=2 -fstack-protector-strong --param=ssp-buffer-size=4 -Werror=trampolines -fPIC -mtune=generic -march=x86-64 -gdwarf-4 -fno-debug-types-section -fvar-tracking-assignments -g2   -Wl,--as-needed -Wl,--no-copy-dt-needed-entries -Wl,-z,relro -Wl,-z,combreloc  -o test-sleep test-sleep.o libtests.a ../lib/libgreputils.a libtests.a ../lib/libgreputils.a  
depbase=`echo test-snprintf.o | sed 's|[^/]*$|.deps/&|;s|\.o$||'`;\
x86_64-pld-linux-gnux32-gcc -DHAVE_CONFIG_H -DEXEEXT=\"\" -I. -I..  -DIN_GREP_GNULIB_TESTS=1 -I. -I. -I.. -I./.. -I../lib -I./../lib   -O2 -fwrapv -pipe -Wformat -Werror=format-security -gdwarf-4 -fno-debug-types-section -fvar-tracking-assignments -g2 -Wp,-D_FORTIFY_SOURCE=2 -fstack-protector-strong --param=ssp-buffer-size=4 -Werror=trampolines -fPIC -mtune=generic -march=x86-64 -gdwarf-4 -fno-debug-types-section -fvar-tracking-assignments -g2  -MT test-snprintf.o -MD -MP -MF $depbase.Tpo -c -o test-snprintf.o test-snprintf.c &&\
mv -f $depbase.Tpo $depbase.Po
x86_64-pld-linux-gnux32-gcc  -O2 -fwrapv -pipe -Wformat -Werror=format-security -gdwarf-4 -fno-debug-types-section -fvar-tracking-assignments -g2 -Wp,-D_FORTIFY_SOURCE=2 -fstack-protector-strong --param=ssp-buffer-size=4 -Werror=trampolines -fPIC -mtune=generic -march=x86-64 -gdwarf-4 -fno-debug-types-section -fvar-tracking-assignments -g2   -Wl,--as-needed -Wl,--no-copy-dt-needed-entries -Wl,-z,relro -Wl,-z,combreloc  -o test-snprintf test-snprintf.o libtests.a ../lib/libgreputils.a libtests.a ../lib/libgreputils.a  
depbase=`echo test-sockets.o | sed 's|[^/]*$|.deps/&|;s|\.o$||'`;\
x86_64-pld-linux-gnux32-gcc -DHAVE_CONFIG_H -DEXEEXT=\"\" -I. -I..  -DIN_GREP_GNULIB_TESTS=1 -I. -I. -I.. -I./.. -I../lib -I./../lib   -O2 -fwrapv -pipe -Wformat -Werror=format-security -gdwarf-4 -fno-debug-types-section -fvar-tracking-assignments -g2 -Wp,-D_FORTIFY_SOURCE=2 -fstack-protector-strong --param=ssp-buffer-size=4 -Werror=trampolines -fPIC -mtune=generic -march=x86-64 -gdwarf-4 -fno-debug-types-section -fvar-tracking-assignments -g2  -MT test-sockets.o -MD -MP -MF $depbase.Tpo -c -o test-sockets.o test-sockets.c &&\
mv -f $depbase.Tpo $depbase.Po
x86_64-pld-linux-gnux32-gcc  -O2 -fwrapv -pipe -Wformat -Werror=format-security -gdwarf-4 -fno-debug-types-section -fvar-tracking-assignments -g2 -Wp,-D_FORTIFY_SOURCE=2 -fstack-protector-strong --param=ssp-buffer-size=4 -Werror=trampolines -fPIC -mtune=generic -march=x86-64 -gdwarf-4 -fno-debug-types-section -fvar-tracking-assignments -g2   -Wl,--as-needed -Wl,--no-copy-dt-needed-entries -Wl,-z,relro -Wl,-z,combreloc  -o test-sockets test-sockets.o libtests.a ../lib/libgreputils.a libtests.a ../lib/libgreputils.a   
depbase=`echo test-stat.o | sed 's|[^/]*$|.deps/&|;s|\.o$||'`;\
x86_64-pld-linux-gnux32-gcc -DHAVE_CONFIG_H -DEXEEXT=\"\" -I. -I..  -DIN_GREP_GNULIB_TESTS=1 -I. -I. -I.. -I./.. -I../lib -I./../lib   -O2 -fwrapv -pipe -Wformat -Werror=format-security -gdwarf-4 -fno-debug-types-section -fvar-tracking-assignments -g2 -Wp,-D_FORTIFY_SOURCE=2 -fstack-protector-strong --param=ssp-buffer-size=4 -Werror=trampolines -fPIC -mtune=generic -march=x86-64 -gdwarf-4 -fno-debug-types-section -fvar-tracking-assignments -g2  -MT test-stat.o -MD -MP -MF $depbase.Tpo -c -o test-stat.o test-stat.c &&\
mv -f $depbase.Tpo $depbase.Po
x86_64-pld-linux-gnux32-gcc  -O2 -fwrapv -pipe -Wformat -Werror=format-security -gdwarf-4 -fno-debug-types-section -fvar-tracking-assignments -g2 -Wp,-D_FORTIFY_SOURCE=2 -fstack-protector-strong --param=ssp-buffer-size=4 -Werror=trampolines -fPIC -mtune=generic -march=x86-64 -gdwarf-4 -fno-debug-types-section -fvar-tracking-assignments -g2   -Wl,--as-needed -Wl,--no-copy-dt-needed-entries -Wl,-z,relro -Wl,-z,combreloc  -o test-stat test-stat.o libtests.a ../lib/libgreputils.a libtests.a ../lib/libgreputils.a   
depbase=`echo test-stat-time.o | sed 's|[^/]*$|.deps/&|;s|\.o$||'`;\
x86_64-pld-linux-gnux32-gcc -DHAVE_CONFIG_H -DEXEEXT=\"\" -I. -I..  -DIN_GREP_GNULIB_TESTS=1 -I. -I. -I.. -I./.. -I../lib -I./../lib   -O2 -fwrapv -pipe -Wformat -Werror=format-security -gdwarf-4 -fno-debug-types-section -fvar-tracking-assignments -g2 -Wp,-D_FORTIFY_SOURCE=2 -fstack-protector-strong --param=ssp-buffer-size=4 -Werror=trampolines -fPIC -mtune=generic -march=x86-64 -gdwarf-4 -fno-debug-types-section -fvar-tracking-assignments -g2  -MT test-stat-time.o -MD -MP -MF $depbase.Tpo -c -o test-stat-time.o test-stat-time.c &&\
mv -f $depbase.Tpo $depbase.Po
x86_64-pld-linux-gnux32-gcc  -O2 -fwrapv -pipe -Wformat -Werror=format-security -gdwarf-4 -fno-debug-types-section -fvar-tracking-assignments -g2 -Wp,-D_FORTIFY_SOURCE=2 -fstack-protector-strong --param=ssp-buffer-size=4 -Werror=trampolines -fPIC -mtune=generic -march=x86-64 -gdwarf-4 -fno-debug-types-section -fvar-tracking-assignments -g2   -Wl,--as-needed -Wl,--no-copy-dt-needed-entries -Wl,-z,relro -Wl,-z,combreloc  -o test-stat-time test-stat-time.o libtests.a ../lib/libgreputils.a libtests.a ../lib/libgreputils.a   
depbase=`echo test-stdalign.o | sed 's|[^/]*$|.deps/&|;s|\.o$||'`;\
x86_64-pld-linux-gnux32-gcc -DHAVE_CONFIG_H -DEXEEXT=\"\" -I. -I..  -DIN_GREP_GNULIB_TESTS=1 -I. -I. -I.. -I./.. -I../lib -I./../lib   -O2 -fwrapv -pipe -Wformat -Werror=format-security -gdwarf-4 -fno-debug-types-section -fvar-tracking-assignments -g2 -Wp,-D_FORTIFY_SOURCE=2 -fstack-protector-strong --param=ssp-buffer-size=4 -Werror=trampolines -fPIC -mtune=generic -march=x86-64 -gdwarf-4 -fno-debug-types-section -fvar-tracking-assignments -g2  -MT test-stdalign.o -MD -MP -MF $depbase.Tpo -c -o test-stdalign.o test-stdalign.c &&\
mv -f $depbase.Tpo $depbase.Po
x86_64-pld-linux-gnux32-gcc  -O2 -fwrapv -pipe -Wformat -Werror=format-security -gdwarf-4 -fno-debug-types-section -fvar-tracking-assignments -g2 -Wp,-D_FORTIFY_SOURCE=2 -fstack-protector-strong --param=ssp-buffer-size=4 -Werror=trampolines -fPIC -mtune=generic -march=x86-64 -gdwarf-4 -fno-debug-types-section -fvar-tracking-assignments -g2   -Wl,--as-needed -Wl,--no-copy-dt-needed-entries -Wl,-z,relro -Wl,-z,combreloc  -o test-stdalign test-stdalign.o libtests.a ../lib/libgreputils.a libtests.a ../lib/libgreputils.a  
depbase=`echo test-stdbool.o | sed 's|[^/]*$|.deps/&|;s|\.o$||'`;\
x86_64-pld-linux-gnux32-gcc -DHAVE_CONFIG_H -DEXEEXT=\"\" -I. -I..  -DIN_GREP_GNULIB_TESTS=1 -I. -I. -I.. -I./.. -I../lib -I./../lib   -O2 -fwrapv -pipe -Wformat -Werror=format-security -gdwarf-4 -fno-debug-types-section -fvar-tracking-assignments -g2 -Wp,-D_FORTIFY_SOURCE=2 -fstack-protector-strong --param=ssp-buffer-size=4 -Werror=trampolines -fPIC -mtune=generic -march=x86-64 -gdwarf-4 -fno-debug-types-section -fvar-tracking-assignments -g2  -MT test-stdbool.o -MD -MP -MF $depbase.Tpo -c -o test-stdbool.o test-stdbool.c &&\
mv -f $depbase.Tpo $depbase.Po
x86_64-pld-linux-gnux32-gcc  -O2 -fwrapv -pipe -Wformat -Werror=format-security -gdwarf-4 -fno-debug-types-section -fvar-tracking-assignments -g2 -Wp,-D_FORTIFY_SOURCE=2 -fstack-protector-strong --param=ssp-buffer-size=4 -Werror=trampolines -fPIC -mtune=generic -march=x86-64 -gdwarf-4 -fno-debug-types-section -fvar-tracking-assignments -g2   -Wl,--as-needed -Wl,--no-copy-dt-needed-entries -Wl,-z,relro -Wl,-z,combreloc  -o test-stdbool test-stdbool.o libtests.a ../lib/libgreputils.a libtests.a ../lib/libgreputils.a  
depbase=`echo test-stddef.o | sed 's|[^/]*$|.deps/&|;s|\.o$||'`;\
x86_64-pld-linux-gnux32-gcc -DHAVE_CONFIG_H -DEXEEXT=\"\" -I. -I..  -DIN_GREP_GNULIB_TESTS=1 -I. -I. -I.. -I./.. -I../lib -I./../lib   -O2 -fwrapv -pipe -Wformat -Werror=format-security -gdwarf-4 -fno-debug-types-section -fvar-tracking-assignments -g2 -Wp,-D_FORTIFY_SOURCE=2 -fstack-protector-strong --param=ssp-buffer-size=4 -Werror=trampolines -fPIC -mtune=generic -march=x86-64 -gdwarf-4 -fno-debug-types-section -fvar-tracking-assignments -g2  -MT test-stddef.o -MD -MP -MF $depbase.Tpo -c -o test-stddef.o test-stddef.c &&\
mv -f $depbase.Tpo $depbase.Po
x86_64-pld-linux-gnux32-gcc  -O2 -fwrapv -pipe -Wformat -Werror=format-security -gdwarf-4 -fno-debug-types-section -fvar-tracking-assignments -g2 -Wp,-D_FORTIFY_SOURCE=2 -fstack-protector-strong --param=ssp-buffer-size=4 -Werror=trampolines -fPIC -mtune=generic -march=x86-64 -gdwarf-4 -fno-debug-types-section -fvar-tracking-assignments -g2   -Wl,--as-needed -Wl,--no-copy-dt-needed-entries -Wl,-z,relro -Wl,-z,combreloc  -o test-stddef test-stddef.o libtests.a ../lib/libgreputils.a libtests.a ../lib/libgreputils.a  
depbase=`echo test-stdint.o | sed 's|[^/]*$|.deps/&|;s|\.o$||'`;\
x86_64-pld-linux-gnux32-gcc -DHAVE_CONFIG_H -DEXEEXT=\"\" -I. -I..  -DIN_GREP_GNULIB_TESTS=1 -I. -I. -I.. -I./.. -I../lib -I./../lib   -O2 -fwrapv -pipe -Wformat -Werror=format-security -gdwarf-4 -fno-debug-types-section -fvar-tracking-assignments -g2 -Wp,-D_FORTIFY_SOURCE=2 -fstack-protector-strong --param=ssp-buffer-size=4 -Werror=trampolines -fPIC -mtune=generic -march=x86-64 -gdwarf-4 -fno-debug-types-section -fvar-tracking-assignments -g2  -MT test-stdint.o -MD -MP -MF $depbase.Tpo -c -o test-stdint.o test-stdint.c &&\
mv -f $depbase.Tpo $depbase.Po
x86_64-pld-linux-gnux32-gcc  -O2 -fwrapv -pipe -Wformat -Werror=format-security -gdwarf-4 -fno-debug-types-section -fvar-tracking-assignments -g2 -Wp,-D_FORTIFY_SOURCE=2 -fstack-protector-strong --param=ssp-buffer-size=4 -Werror=trampolines -fPIC -mtune=generic -march=x86-64 -gdwarf-4 -fno-debug-types-section -fvar-tracking-assignments -g2   -Wl,--as-needed -Wl,--no-copy-dt-needed-entries -Wl,-z,relro -Wl,-z,combreloc  -o test-stdint test-stdint.o libtests.a ../lib/libgreputils.a libtests.a ../lib/libgreputils.a  
depbase=`echo test-stdio.o | sed 's|[^/]*$|.deps/&|;s|\.o$||'`;\
x86_64-pld-linux-gnux32-gcc -DHAVE_CONFIG_H -DEXEEXT=\"\" -I. -I..  -DIN_GREP_GNULIB_TESTS=1 -I. -I. -I.. -I./.. -I../lib -I./../lib   -O2 -fwrapv -pipe -Wformat -Werror=format-security -gdwarf-4 -fno-debug-types-section -fvar-tracking-assignments -g2 -Wp,-D_FORTIFY_SOURCE=2 -fstack-protector-strong --param=ssp-buffer-size=4 -Werror=trampolines -fPIC -mtune=generic -march=x86-64 -gdwarf-4 -fno-debug-types-section -fvar-tracking-assignments -g2  -MT test-stdio.o -MD -MP -MF $depbase.Tpo -c -o test-stdio.o test-stdio.c &&\
mv -f $depbase.Tpo $depbase.Po
x86_64-pld-linux-gnux32-gcc  -O2 -fwrapv -pipe -Wformat -Werror=format-security -gdwarf-4 -fno-debug-types-section -fvar-tracking-assignments -g2 -Wp,-D_FORTIFY_SOURCE=2 -fstack-protector-strong --param=ssp-buffer-size=4 -Werror=trampolines -fPIC -mtune=generic -march=x86-64 -gdwarf-4 -fno-debug-types-section -fvar-tracking-assignments -g2   -Wl,--as-needed -Wl,--no-copy-dt-needed-entries -Wl,-z,relro -Wl,-z,combreloc  -o test-stdio test-stdio.o libtests.a ../lib/libgreputils.a libtests.a ../lib/libgreputils.a  
depbase=`echo test-stdlib.o | sed 's|[^/]*$|.deps/&|;s|\.o$||'`;\
x86_64-pld-linux-gnux32-gcc -DHAVE_CONFIG_H -DEXEEXT=\"\" -I. -I..  -DIN_GREP_GNULIB_TESTS=1 -I. -I. -I.. -I./.. -I../lib -I./../lib   -O2 -fwrapv -pipe -Wformat -Werror=format-security -gdwarf-4 -fno-debug-types-section -fvar-tracking-assignments -g2 -Wp,-D_FORTIFY_SOURCE=2 -fstack-protector-strong --param=ssp-buffer-size=4 -Werror=trampolines -fPIC -mtune=generic -march=x86-64 -gdwarf-4 -fno-debug-types-section -fvar-tracking-assignments -g2  -MT test-stdlib.o -MD -MP -MF $depbase.Tpo -c -o test-stdlib.o test-stdlib.c &&\
mv -f $depbase.Tpo $depbase.Po
x86_64-pld-linux-gnux32-gcc  -O2 -fwrapv -pipe -Wformat -Werror=format-security -gdwarf-4 -fno-debug-types-section -fvar-tracking-assignments -g2 -Wp,-D_FORTIFY_SOURCE=2 -fstack-protector-strong --param=ssp-buffer-size=4 -Werror=trampolines -fPIC -mtune=generic -march=x86-64 -gdwarf-4 -fno-debug-types-section -fvar-tracking-assignments -g2   -Wl,--as-needed -Wl,--no-copy-dt-needed-entries -Wl,-z,relro -Wl,-z,combreloc  -o test-stdlib test-stdlib.o libtests.a ../lib/libgreputils.a libtests.a ../lib/libgreputils.a  
depbase=`echo test-strerror.o | sed 's|[^/]*$|.deps/&|;s|\.o$||'`;\
x86_64-pld-linux-gnux32-gcc -DHAVE_CONFIG_H -DEXEEXT=\"\" -I. -I..  -DIN_GREP_GNULIB_TESTS=1 -I. -I. -I.. -I./.. -I../lib -I./../lib   -O2 -fwrapv -pipe -Wformat -Werror=format-security -gdwarf-4 -fno-debug-types-section -fvar-tracking-assignments -g2 -Wp,-D_FORTIFY_SOURCE=2 -fstack-protector-strong --param=ssp-buffer-size=4 -Werror=trampolines -fPIC -mtune=generic -march=x86-64 -gdwarf-4 -fno-debug-types-section -fvar-tracking-assignments -g2  -MT test-strerror.o -MD -MP -MF $depbase.Tpo -c -o test-strerror.o test-strerror.c &&\
mv -f $depbase.Tpo $depbase.Po
x86_64-pld-linux-gnux32-gcc  -O2 -fwrapv -pipe -Wformat -Werror=format-security -gdwarf-4 -fno-debug-types-section -fvar-tracking-assignments -g2 -Wp,-D_FORTIFY_SOURCE=2 -fstack-protector-strong --param=ssp-buffer-size=4 -Werror=trampolines -fPIC -mtune=generic -march=x86-64 -gdwarf-4 -fno-debug-types-section -fvar-tracking-assignments -g2   -Wl,--as-needed -Wl,--no-copy-dt-needed-entries -Wl,-z,relro -Wl,-z,combreloc  -o test-strerror test-strerror.o libtests.a ../lib/libgreputils.a libtests.a ../lib/libgreputils.a  
depbase=`echo test-strerror_r.o | sed 's|[^/]*$|.deps/&|;s|\.o$||'`;\
x86_64-pld-linux-gnux32-gcc -DHAVE_CONFIG_H -DEXEEXT=\"\" -I. -I..  -DIN_GREP_GNULIB_TESTS=1 -I. -I. -I.. -I./.. -I../lib -I./../lib   -O2 -fwrapv -pipe -Wformat -Werror=format-security -gdwarf-4 -fno-debug-types-section -fvar-tracking-assignments -g2 -Wp,-D_FORTIFY_SOURCE=2 -fstack-protector-strong --param=ssp-buffer-size=4 -Werror=trampolines -fPIC -mtune=generic -march=x86-64 -gdwarf-4 -fno-debug-types-section -fvar-tracking-assignments -g2  -MT test-strerror_r.o -MD -MP -MF $depbase.Tpo -c -o test-strerror_r.o test-strerror_r.c &&\
mv -f $depbase.Tpo $depbase.Po
x86_64-pld-linux-gnux32-gcc  -O2 -fwrapv -pipe -Wformat -Werror=format-security -gdwarf-4 -fno-debug-types-section -fvar-tracking-assignments -g2 -Wp,-D_FORTIFY_SOURCE=2 -fstack-protector-strong --param=ssp-buffer-size=4 -Werror=trampolines -fPIC -mtune=generic -march=x86-64 -gdwarf-4 -fno-debug-types-section -fvar-tracking-assignments -g2   -Wl,--as-needed -Wl,--no-copy-dt-needed-entries -Wl,-z,relro -Wl,-z,combreloc  -o test-strerror_r test-strerror_r.o libtests.a ../lib/libgreputils.a libtests.a ../lib/libgreputils.a  
depbase=`echo test-striconv.o | sed 's|[^/]*$|.deps/&|;s|\.o$||'`;\
x86_64-pld-linux-gnux32-gcc -DHAVE_CONFIG_H -DEXEEXT=\"\" -I. -I..  -DIN_GREP_GNULIB_TESTS=1 -I. -I. -I.. -I./.. -I../lib -I./../lib   -O2 -fwrapv -pipe -Wformat -Werror=format-security -gdwarf-4 -fno-debug-types-section -fvar-tracking-assignments -g2 -Wp,-D_FORTIFY_SOURCE=2 -fstack-protector-strong --param=ssp-buffer-size=4 -Werror=trampolines -fPIC -mtune=generic -march=x86-64 -gdwarf-4 -fno-debug-types-section -fvar-tracking-assignments -g2  -MT test-striconv.o -MD -MP -MF $depbase.Tpo -c -o test-striconv.o test-striconv.c &&\
mv -f $depbase.Tpo $depbase.Po
x86_64-pld-linux-gnux32-gcc  -O2 -fwrapv -pipe -Wformat -Werror=format-security -gdwarf-4 -fno-debug-types-section -fvar-tracking-assignments -g2 -Wp,-D_FORTIFY_SOURCE=2 -fstack-protector-strong --param=ssp-buffer-size=4 -Werror=trampolines -fPIC -mtune=generic -march=x86-64 -gdwarf-4 -fno-debug-types-section -fvar-tracking-assignments -g2   -Wl,--as-needed -Wl,--no-copy-dt-needed-entries -Wl,-z,relro -Wl,-z,combreloc  -o test-striconv test-striconv.o libtests.a ../lib/libgreputils.a libtests.a ../lib/libgreputils.a   
depbase=`echo test-string.o | sed 's|[^/]*$|.deps/&|;s|\.o$||'`;\
x86_64-pld-linux-gnux32-gcc -DHAVE_CONFIG_H -DEXEEXT=\"\" -I. -I..  -DIN_GREP_GNULIB_TESTS=1 -I. -I. -I.. -I./.. -I../lib -I./../lib   -O2 -fwrapv -pipe -Wformat -Werror=format-security -gdwarf-4 -fno-debug-types-section -fvar-tracking-assignments -g2 -Wp,-D_FORTIFY_SOURCE=2 -fstack-protector-strong --param=ssp-buffer-size=4 -Werror=trampolines -fPIC -mtune=generic -march=x86-64 -gdwarf-4 -fno-debug-types-section -fvar-tracking-assignments -g2  -MT test-string.o -MD -MP -MF $depbase.Tpo -c -o test-string.o test-string.c &&\
mv -f $depbase.Tpo $depbase.Po
x86_64-pld-linux-gnux32-gcc  -O2 -fwrapv -pipe -Wformat -Werror=format-security -gdwarf-4 -fno-debug-types-section -fvar-tracking-assignments -g2 -Wp,-D_FORTIFY_SOURCE=2 -fstack-protector-strong --param=ssp-buffer-size=4 -Werror=trampolines -fPIC -mtune=generic -march=x86-64 -gdwarf-4 -fno-debug-types-section -fvar-tracking-assignments -g2   -Wl,--as-needed -Wl,--no-copy-dt-needed-entries -Wl,-z,relro -Wl,-z,combreloc  -o test-string test-string.o libtests.a ../lib/libgreputils.a libtests.a ../lib/libgreputils.a  
depbase=`echo test-strnlen.o | sed 's|[^/]*$|.deps/&|;s|\.o$||'`;\
x86_64-pld-linux-gnux32-gcc -DHAVE_CONFIG_H -DEXEEXT=\"\" -I. -I..  -DIN_GREP_GNULIB_TESTS=1 -I. -I. -I.. -I./.. -I../lib -I./../lib   -O2 -fwrapv -pipe -Wformat -Werror=format-security -gdwarf-4 -fno-debug-types-section -fvar-tracking-assignments -g2 -Wp,-D_FORTIFY_SOURCE=2 -fstack-protector-strong --param=ssp-buffer-size=4 -Werror=trampolines -fPIC -mtune=generic -march=x86-64 -gdwarf-4 -fno-debug-types-section -fvar-tracking-assignments -g2  -MT test-strnlen.o -MD -MP -MF $depbase.Tpo -c -o test-strnlen.o test-strnlen.c &&\
mv -f $depbase.Tpo $depbase.Po
x86_64-pld-linux-gnux32-gcc  -O2 -fwrapv -pipe -Wformat -Werror=format-security -gdwarf-4 -fno-debug-types-section -fvar-tracking-assignments -g2 -Wp,-D_FORTIFY_SOURCE=2 -fstack-protector-strong --param=ssp-buffer-size=4 -Werror=trampolines -fPIC -mtune=generic -march=x86-64 -gdwarf-4 -fno-debug-types-section -fvar-tracking-assignments -g2   -Wl,--as-needed -Wl,--no-copy-dt-needed-entries -Wl,-z,relro -Wl,-z,combreloc  -o test-strnlen test-strnlen.o libtests.a ../lib/libgreputils.a libtests.a ../lib/libgreputils.a  
depbase=`echo test-strstr.o | sed 's|[^/]*$|.deps/&|;s|\.o$||'`;\
x86_64-pld-linux-gnux32-gcc -DHAVE_CONFIG_H -DEXEEXT=\"\" -I. -I..  -DIN_GREP_GNULIB_TESTS=1 -I. -I. -I.. -I./.. -I../lib -I./../lib   -O2 -fwrapv -pipe -Wformat -Werror=format-security -gdwarf-4 -fno-debug-types-section -fvar-tracking-assignments -g2 -Wp,-D_FORTIFY_SOURCE=2 -fstack-protector-strong --param=ssp-buffer-size=4 -Werror=trampolines -fPIC -mtune=generic -march=x86-64 -gdwarf-4 -fno-debug-types-section -fvar-tracking-assignments -g2  -MT test-strstr.o -MD -MP -MF $depbase.Tpo -c -o test-strstr.o test-strstr.c &&\
mv -f $depbase.Tpo $depbase.Po
x86_64-pld-linux-gnux32-gcc  -O2 -fwrapv -pipe -Wformat -Werror=format-security -gdwarf-4 -fno-debug-types-section -fvar-tracking-assignments -g2 -Wp,-D_FORTIFY_SOURCE=2 -fstack-protector-strong --param=ssp-buffer-size=4 -Werror=trampolines -fPIC -mtune=generic -march=x86-64 -gdwarf-4 -fno-debug-types-section -fvar-tracking-assignments -g2   -Wl,--as-needed -Wl,--no-copy-dt-needed-entries -Wl,-z,relro -Wl,-z,combreloc  -o test-strstr test-strstr.o libtests.a ../lib/libgreputils.a libtests.a ../lib/libgreputils.a  
depbase=`echo test-strtoimax.o | sed 's|[^/]*$|.deps/&|;s|\.o$||'`;\
x86_64-pld-linux-gnux32-gcc -DHAVE_CONFIG_H -DEXEEXT=\"\" -I. -I..  -DIN_GREP_GNULIB_TESTS=1 -I. -I. -I.. -I./.. -I../lib -I./../lib   -O2 -fwrapv -pipe -Wformat -Werror=format-security -gdwarf-4 -fno-debug-types-section -fvar-tracking-assignments -g2 -Wp,-D_FORTIFY_SOURCE=2 -fstack-protector-strong --param=ssp-buffer-size=4 -Werror=trampolines -fPIC -mtune=generic -march=x86-64 -gdwarf-4 -fno-debug-types-section -fvar-tracking-assignments -g2  -MT test-strtoimax.o -MD -MP -MF $depbase.Tpo -c -o test-strtoimax.o test-strtoimax.c &&\
mv -f $depbase.Tpo $depbase.Po
x86_64-pld-linux-gnux32-gcc  -O2 -fwrapv -pipe -Wformat -Werror=format-security -gdwarf-4 -fno-debug-types-section -fvar-tracking-assignments -g2 -Wp,-D_FORTIFY_SOURCE=2 -fstack-protector-strong --param=ssp-buffer-size=4 -Werror=trampolines -fPIC -mtune=generic -march=x86-64 -gdwarf-4 -fno-debug-types-section -fvar-tracking-assignments -g2   -Wl,--as-needed -Wl,--no-copy-dt-needed-entries -Wl,-z,relro -Wl,-z,combreloc  -o test-strtoimax test-strtoimax.o libtests.a ../lib/libgreputils.a libtests.a ../lib/libgreputils.a  
depbase=`echo test-strtoll.o | sed 's|[^/]*$|.deps/&|;s|\.o$||'`;\
x86_64-pld-linux-gnux32-gcc -DHAVE_CONFIG_H -DEXEEXT=\"\" -I. -I..  -DIN_GREP_GNULIB_TESTS=1 -I. -I. -I.. -I./.. -I../lib -I./../lib   -O2 -fwrapv -pipe -Wformat -Werror=format-security -gdwarf-4 -fno-debug-types-section -fvar-tracking-assignments -g2 -Wp,-D_FORTIFY_SOURCE=2 -fstack-protector-strong --param=ssp-buffer-size=4 -Werror=trampolines -fPIC -mtune=generic -march=x86-64 -gdwarf-4 -fno-debug-types-section -fvar-tracking-assignments -g2  -MT test-strtoll.o -MD -MP -MF $depbase.Tpo -c -o test-strtoll.o test-strtoll.c &&\
mv -f $depbase.Tpo $depbase.Po
x86_64-pld-linux-gnux32-gcc  -O2 -fwrapv -pipe -Wformat -Werror=format-security -gdwarf-4 -fno-debug-types-section -fvar-tracking-assignments -g2 -Wp,-D_FORTIFY_SOURCE=2 -fstack-protector-strong --param=ssp-buffer-size=4 -Werror=trampolines -fPIC -mtune=generic -march=x86-64 -gdwarf-4 -fno-debug-types-section -fvar-tracking-assignments -g2   -Wl,--as-needed -Wl,--no-copy-dt-needed-entries -Wl,-z,relro -Wl,-z,combreloc  -o test-strtoll test-strtoll.o libtests.a ../lib/libgreputils.a libtests.a ../lib/libgreputils.a  
depbase=`echo test-strtoull.o | sed 's|[^/]*$|.deps/&|;s|\.o$||'`;\
x86_64-pld-linux-gnux32-gcc -DHAVE_CONFIG_H -DEXEEXT=\"\" -I. -I..  -DIN_GREP_GNULIB_TESTS=1 -I. -I. -I.. -I./.. -I../lib -I./../lib   -O2 -fwrapv -pipe -Wformat -Werror=format-security -gdwarf-4 -fno-debug-types-section -fvar-tracking-assignments -g2 -Wp,-D_FORTIFY_SOURCE=2 -fstack-protector-strong --param=ssp-buffer-size=4 -Werror=trampolines -fPIC -mtune=generic -march=x86-64 -gdwarf-4 -fno-debug-types-section -fvar-tracking-assignments -g2  -MT test-strtoull.o -MD -MP -MF $depbase.Tpo -c -o test-strtoull.o test-strtoull.c &&\
mv -f $depbase.Tpo $depbase.Po
x86_64-pld-linux-gnux32-gcc  -O2 -fwrapv -pipe -Wformat -Werror=format-security -gdwarf-4 -fno-debug-types-section -fvar-tracking-assignments -g2 -Wp,-D_FORTIFY_SOURCE=2 -fstack-protector-strong --param=ssp-buffer-size=4 -Werror=trampolines -fPIC -mtune=generic -march=x86-64 -gdwarf-4 -fno-debug-types-section -fvar-tracking-assignments -g2   -Wl,--as-needed -Wl,--no-copy-dt-needed-entries -Wl,-z,relro -Wl,-z,combreloc  -o test-strtoull test-strtoull.o libtests.a ../lib/libgreputils.a libtests.a ../lib/libgreputils.a  
depbase=`echo test-strtoumax.o | sed 's|[^/]*$|.deps/&|;s|\.o$||'`;\
x86_64-pld-linux-gnux32-gcc -DHAVE_CONFIG_H -DEXEEXT=\"\" -I. -I..  -DIN_GREP_GNULIB_TESTS=1 -I. -I. -I.. -I./.. -I../lib -I./../lib   -O2 -fwrapv -pipe -Wformat -Werror=format-security -gdwarf-4 -fno-debug-types-section -fvar-tracking-assignments -g2 -Wp,-D_FORTIFY_SOURCE=2 -fstack-protector-strong --param=ssp-buffer-size=4 -Werror=trampolines -fPIC -mtune=generic -march=x86-64 -gdwarf-4 -fno-debug-types-section -fvar-tracking-assignments -g2  -MT test-strtoumax.o -MD -MP -MF $depbase.Tpo -c -o test-strtoumax.o test-strtoumax.c &&\
mv -f $depbase.Tpo $depbase.Po
x86_64-pld-linux-gnux32-gcc  -O2 -fwrapv -pipe -Wformat -Werror=format-security -gdwarf-4 -fno-debug-types-section -fvar-tracking-assignments -g2 -Wp,-D_FORTIFY_SOURCE=2 -fstack-protector-strong --param=ssp-buffer-size=4 -Werror=trampolines -fPIC -mtune=generic -march=x86-64 -gdwarf-4 -fno-debug-types-section -fvar-tracking-assignments -g2   -Wl,--as-needed -Wl,--no-copy-dt-needed-entries -Wl,-z,relro -Wl,-z,combreloc  -o test-strtoumax test-strtoumax.o libtests.a ../lib/libgreputils.a libtests.a ../lib/libgreputils.a  
depbase=`echo test-symlink.o | sed 's|[^/]*$|.deps/&|;s|\.o$||'`;\
x86_64-pld-linux-gnux32-gcc -DHAVE_CONFIG_H -DEXEEXT=\"\" -I. -I..  -DIN_GREP_GNULIB_TESTS=1 -I. -I. -I.. -I./.. -I../lib -I./../lib   -O2 -fwrapv -pipe -Wformat -Werror=format-security -gdwarf-4 -fno-debug-types-section -fvar-tracking-assignments -g2 -Wp,-D_FORTIFY_SOURCE=2 -fstack-protector-strong --param=ssp-buffer-size=4 -Werror=trampolines -fPIC -mtune=generic -march=x86-64 -gdwarf-4 -fno-debug-types-section -fvar-tracking-assignments -g2  -MT test-symlink.o -MD -MP -MF $depbase.Tpo -c -o test-symlink.o test-symlink.c &&\
mv -f $depbase.Tpo $depbase.Po
x86_64-pld-linux-gnux32-gcc  -O2 -fwrapv -pipe -Wformat -Werror=format-security -gdwarf-4 -fno-debug-types-section -fvar-tracking-assignments -g2 -Wp,-D_FORTIFY_SOURCE=2 -fstack-protector-strong --param=ssp-buffer-size=4 -Werror=trampolines -fPIC -mtune=generic -march=x86-64 -gdwarf-4 -fno-debug-types-section -fvar-tracking-assignments -g2   -Wl,--as-needed -Wl,--no-copy-dt-needed-entries -Wl,-z,relro -Wl,-z,combreloc  -o test-symlink test-symlink.o libtests.a ../lib/libgreputils.a libtests.a ../lib/libgreputils.a  
depbase=`echo test-sys_ioctl.o | sed 's|[^/]*$|.deps/&|;s|\.o$||'`;\
x86_64-pld-linux-gnux32-gcc -DHAVE_CONFIG_H -DEXEEXT=\"\" -I. -I..  -DIN_GREP_GNULIB_TESTS=1 -I. -I. -I.. -I./.. -I../lib -I./../lib   -O2 -fwrapv -pipe -Wformat -Werror=format-security -gdwarf-4 -fno-debug-types-section -fvar-tracking-assignments -g2 -Wp,-D_FORTIFY_SOURCE=2 -fstack-protector-strong --param=ssp-buffer-size=4 -Werror=trampolines -fPIC -mtune=generic -march=x86-64 -gdwarf-4 -fno-debug-types-section -fvar-tracking-assignments -g2  -MT test-sys_ioctl.o -MD -MP -MF $depbase.Tpo -c -o test-sys_ioctl.o test-sys_ioctl.c &&\
mv -f $depbase.Tpo $depbase.Po
x86_64-pld-linux-gnux32-gcc  -O2 -fwrapv -pipe -Wformat -Werror=format-security -gdwarf-4 -fno-debug-types-section -fvar-tracking-assignments -g2 -Wp,-D_FORTIFY_SOURCE=2 -fstack-protector-strong --param=ssp-buffer-size=4 -Werror=trampolines -fPIC -mtune=generic -march=x86-64 -gdwarf-4 -fno-debug-types-section -fvar-tracking-assignments -g2   -Wl,--as-needed -Wl,--no-copy-dt-needed-entries -Wl,-z,relro -Wl,-z,combreloc  -o test-sys_ioctl test-sys_ioctl.o libtests.a ../lib/libgreputils.a libtests.a ../lib/libgreputils.a  
depbase=`echo test-sys_select.o | sed 's|[^/]*$|.deps/&|;s|\.o$||'`;\
x86_64-pld-linux-gnux32-gcc -DHAVE_CONFIG_H -DEXEEXT=\"\" -I. -I..  -DIN_GREP_GNULIB_TESTS=1 -I. -I. -I.. -I./.. -I../lib -I./../lib   -O2 -fwrapv -pipe -Wformat -Werror=format-security -gdwarf-4 -fno-debug-types-section -fvar-tracking-assignments -g2 -Wp,-D_FORTIFY_SOURCE=2 -fstack-protector-strong --param=ssp-buffer-size=4 -Werror=trampolines -fPIC -mtune=generic -march=x86-64 -gdwarf-4 -fno-debug-types-section -fvar-tracking-assignments -g2  -MT test-sys_select.o -MD -MP -MF $depbase.Tpo -c -o test-sys_select.o test-sys_select.c &&\
mv -f $depbase.Tpo $depbase.Po
x86_64-pld-linux-gnux32-gcc  -O2 -fwrapv -pipe -Wformat -Werror=format-security -gdwarf-4 -fno-debug-types-section -fvar-tracking-assignments -g2 -Wp,-D_FORTIFY_SOURCE=2 -fstack-protector-strong --param=ssp-buffer-size=4 -Werror=trampolines -fPIC -mtune=generic -march=x86-64 -gdwarf-4 -fno-debug-types-section -fvar-tracking-assignments -g2   -Wl,--as-needed -Wl,--no-copy-dt-needed-entries -Wl,-z,relro -Wl,-z,combreloc  -o test-sys_select test-sys_select.o libtests.a ../lib/libgreputils.a libtests.a ../lib/libgreputils.a  
depbase=`echo test-sys_socket.o | sed 's|[^/]*$|.deps/&|;s|\.o$||'`;\
x86_64-pld-linux-gnux32-gcc -DHAVE_CONFIG_H -DEXEEXT=\"\" -I. -I..  -DIN_GREP_GNULIB_TESTS=1 -I. -I. -I.. -I./.. -I../lib -I./../lib   -O2 -fwrapv -pipe -Wformat -Werror=format-security -gdwarf-4 -fno-debug-types-section -fvar-tracking-assignments -g2 -Wp,-D_FORTIFY_SOURCE=2 -fstack-protector-strong --param=ssp-buffer-size=4 -Werror=trampolines -fPIC -mtune=generic -march=x86-64 -gdwarf-4 -fno-debug-types-section -fvar-tracking-assignments -g2  -MT test-sys_socket.o -MD -MP -MF $depbase.Tpo -c -o test-sys_socket.o test-sys_socket.c &&\
mv -f $depbase.Tpo $depbase.Po
x86_64-pld-linux-gnux32-gcc  -O2 -fwrapv -pipe -Wformat -Werror=format-security -gdwarf-4 -fno-debug-types-section -fvar-tracking-assignments -g2 -Wp,-D_FORTIFY_SOURCE=2 -fstack-protector-strong --param=ssp-buffer-size=4 -Werror=trampolines -fPIC -mtune=generic -march=x86-64 -gdwarf-4 -fno-debug-types-section -fvar-tracking-assignments -g2   -Wl,--as-needed -Wl,--no-copy-dt-needed-entries -Wl,-z,relro -Wl,-z,combreloc  -o test-sys_socket test-sys_socket.o libtests.a ../lib/libgreputils.a libtests.a ../lib/libgreputils.a  
depbase=`echo test-sys_stat.o | sed 's|[^/]*$|.deps/&|;s|\.o$||'`;\
x86_64-pld-linux-gnux32-gcc -DHAVE_CONFIG_H -DEXEEXT=\"\" -I. -I..  -DIN_GREP_GNULIB_TESTS=1 -I. -I. -I.. -I./.. -I../lib -I./../lib   -O2 -fwrapv -pipe -Wformat -Werror=format-security -gdwarf-4 -fno-debug-types-section -fvar-tracking-assignments -g2 -Wp,-D_FORTIFY_SOURCE=2 -fstack-protector-strong --param=ssp-buffer-size=4 -Werror=trampolines -fPIC -mtune=generic -march=x86-64 -gdwarf-4 -fno-debug-types-section -fvar-tracking-assignments -g2  -MT test-sys_stat.o -MD -MP -MF $depbase.Tpo -c -o test-sys_stat.o test-sys_stat.c &&\
mv -f $depbase.Tpo $depbase.Po
x86_64-pld-linux-gnux32-gcc  -O2 -fwrapv -pipe -Wformat -Werror=format-security -gdwarf-4 -fno-debug-types-section -fvar-tracking-assignments -g2 -Wp,-D_FORTIFY_SOURCE=2 -fstack-protector-strong --param=ssp-buffer-size=4 -Werror=trampolines -fPIC -mtune=generic -march=x86-64 -gdwarf-4 -fno-debug-types-section -fvar-tracking-assignments -g2   -Wl,--as-needed -Wl,--no-copy-dt-needed-entries -Wl,-z,relro -Wl,-z,combreloc  -o test-sys_stat test-sys_stat.o libtests.a ../lib/libgreputils.a libtests.a ../lib/libgreputils.a  
depbase=`echo test-sys_time.o | sed 's|[^/]*$|.deps/&|;s|\.o$||'`;\
x86_64-pld-linux-gnux32-gcc -DHAVE_CONFIG_H -DEXEEXT=\"\" -I. -I..  -DIN_GREP_GNULIB_TESTS=1 -I. -I. -I.. -I./.. -I../lib -I./../lib   -O2 -fwrapv -pipe -Wformat -Werror=format-security -gdwarf-4 -fno-debug-types-section -fvar-tracking-assignments -g2 -Wp,-D_FORTIFY_SOURCE=2 -fstack-protector-strong --param=ssp-buffer-size=4 -Werror=trampolines -fPIC -mtune=generic -march=x86-64 -gdwarf-4 -fno-debug-types-section -fvar-tracking-assignments -g2  -MT test-sys_time.o -MD -MP -MF $depbase.Tpo -c -o test-sys_time.o test-sys_time.c &&\
mv -f $depbase.Tpo $depbase.Po
x86_64-pld-linux-gnux32-gcc  -O2 -fwrapv -pipe -Wformat -Werror=format-security -gdwarf-4 -fno-debug-types-section -fvar-tracking-assignments -g2 -Wp,-D_FORTIFY_SOURCE=2 -fstack-protector-strong --param=ssp-buffer-size=4 -Werror=trampolines -fPIC -mtune=generic -march=x86-64 -gdwarf-4 -fno-debug-types-section -fvar-tracking-assignments -g2   -Wl,--as-needed -Wl,--no-copy-dt-needed-entries -Wl,-z,relro -Wl,-z,combreloc  -o test-sys_time test-sys_time.o libtests.a ../lib/libgreputils.a libtests.a ../lib/libgreputils.a  
depbase=`echo test-sys_types.o | sed 's|[^/]*$|.deps/&|;s|\.o$||'`;\
x86_64-pld-linux-gnux32-gcc -DHAVE_CONFIG_H -DEXEEXT=\"\" -I. -I..  -DIN_GREP_GNULIB_TESTS=1 -I. -I. -I.. -I./.. -I../lib -I./../lib   -O2 -fwrapv -pipe -Wformat -Werror=format-security -gdwarf-4 -fno-debug-types-section -fvar-tracking-assignments -g2 -Wp,-D_FORTIFY_SOURCE=2 -fstack-protector-strong --param=ssp-buffer-size=4 -Werror=trampolines -fPIC -mtune=generic -march=x86-64 -gdwarf-4 -fno-debug-types-section -fvar-tracking-assignments -g2  -MT test-sys_types.o -MD -MP -MF $depbase.Tpo -c -o test-sys_types.o test-sys_types.c &&\
mv -f $depbase.Tpo $depbase.Po
x86_64-pld-linux-gnux32-gcc  -O2 -fwrapv -pipe -Wformat -Werror=format-security -gdwarf-4 -fno-debug-types-section -fvar-tracking-assignments -g2 -Wp,-D_FORTIFY_SOURCE=2 -fstack-protector-strong --param=ssp-buffer-size=4 -Werror=trampolines -fPIC -mtune=generic -march=x86-64 -gdwarf-4 -fno-debug-types-section -fvar-tracking-assignments -g2   -Wl,--as-needed -Wl,--no-copy-dt-needed-entries -Wl,-z,relro -Wl,-z,combreloc  -o test-sys_types test-sys_types.o libtests.a ../lib/libgreputils.a libtests.a ../lib/libgreputils.a  
depbase=`echo test-sys_uio.o | sed 's|[^/]*$|.deps/&|;s|\.o$||'`;\
x86_64-pld-linux-gnux32-gcc -DHAVE_CONFIG_H -DEXEEXT=\"\" -I. -I..  -DIN_GREP_GNULIB_TESTS=1 -I. -I. -I.. -I./.. -I../lib -I./../lib   -O2 -fwrapv -pipe -Wformat -Werror=format-security -gdwarf-4 -fno-debug-types-section -fvar-tracking-assignments -g2 -Wp,-D_FORTIFY_SOURCE=2 -fstack-protector-strong --param=ssp-buffer-size=4 -Werror=trampolines -fPIC -mtune=generic -march=x86-64 -gdwarf-4 -fno-debug-types-section -fvar-tracking-assignments -g2  -MT test-sys_uio.o -MD -MP -MF $depbase.Tpo -c -o test-sys_uio.o test-sys_uio.c &&\
mv -f $depbase.Tpo $depbase.Po
x86_64-pld-linux-gnux32-gcc  -O2 -fwrapv -pipe -Wformat -Werror=format-security -gdwarf-4 -fno-debug-types-section -fvar-tracking-assignments -g2 -Wp,-D_FORTIFY_SOURCE=2 -fstack-protector-strong --param=ssp-buffer-size=4 -Werror=trampolines -fPIC -mtune=generic -march=x86-64 -gdwarf-4 -fno-debug-types-section -fvar-tracking-assignments -g2   -Wl,--as-needed -Wl,--no-copy-dt-needed-entries -Wl,-z,relro -Wl,-z,combreloc  -o test-sys_uio test-sys_uio.o libtests.a ../lib/libgreputils.a libtests.a ../lib/libgreputils.a  
depbase=`echo test-thread_self.o | sed 's|[^/]*$|.deps/&|;s|\.o$||'`;\
x86_64-pld-linux-gnux32-gcc -DHAVE_CONFIG_H -DEXEEXT=\"\" -I. -I..  -DIN_GREP_GNULIB_TESTS=1 -I. -I. -I.. -I./.. -I../lib -I./../lib   -O2 -fwrapv -pipe -Wformat -Werror=format-security -gdwarf-4 -fno-debug-types-section -fvar-tracking-assignments -g2 -Wp,-D_FORTIFY_SOURCE=2 -fstack-protector-strong --param=ssp-buffer-size=4 -Werror=trampolines -fPIC -mtune=generic -march=x86-64 -gdwarf-4 -fno-debug-types-section -fvar-tracking-assignments -g2  -MT test-thread_self.o -MD -MP -MF $depbase.Tpo -c -o test-thread_self.o test-thread_self.c &&\
mv -f $depbase.Tpo $depbase.Po
x86_64-pld-linux-gnux32-gcc  -O2 -fwrapv -pipe -Wformat -Werror=format-security -gdwarf-4 -fno-debug-types-section -fvar-tracking-assignments -g2 -Wp,-D_FORTIFY_SOURCE=2 -fstack-protector-strong --param=ssp-buffer-size=4 -Werror=trampolines -fPIC -mtune=generic -march=x86-64 -gdwarf-4 -fno-debug-types-section -fvar-tracking-assignments -g2   -Wl,--as-needed -Wl,--no-copy-dt-needed-entries -Wl,-z,relro -Wl,-z,combreloc  -o test-thread_self test-thread_self.o libtests.a ../lib/libgreputils.a libtests.a ../lib/libgreputils.a   
depbase=`echo test-thread_create.o | sed 's|[^/]*$|.deps/&|;s|\.o$||'`;\
x86_64-pld-linux-gnux32-gcc -DHAVE_CONFIG_H -DEXEEXT=\"\" -I. -I..  -DIN_GREP_GNULIB_TESTS=1 -I. -I. -I.. -I./.. -I../lib -I./../lib   -O2 -fwrapv -pipe -Wformat -Werror=format-security -gdwarf-4 -fno-debug-types-section -fvar-tracking-assignments -g2 -Wp,-D_FORTIFY_SOURCE=2 -fstack-protector-strong --param=ssp-buffer-size=4 -Werror=trampolines -fPIC -mtune=generic -march=x86-64 -gdwarf-4 -fno-debug-types-section -fvar-tracking-assignments -g2  -MT test-thread_create.o -MD -MP -MF $depbase.Tpo -c -o test-thread_create.o test-thread_create.c &&\
mv -f $depbase.Tpo $depbase.Po
x86_64-pld-linux-gnux32-gcc  -O2 -fwrapv -pipe -Wformat -Werror=format-security -gdwarf-4 -fno-debug-types-section -fvar-tracking-assignments -g2 -Wp,-D_FORTIFY_SOURCE=2 -fstack-protector-strong --param=ssp-buffer-size=4 -Werror=trampolines -fPIC -mtune=generic -march=x86-64 -gdwarf-4 -fno-debug-types-section -fvar-tracking-assignments -g2   -Wl,--as-needed -Wl,--no-copy-dt-needed-entries -Wl,-z,relro -Wl,-z,combreloc  -o test-thread_create test-thread_create.o libtests.a ../lib/libgreputils.a libtests.a ../lib/libgreputils.a  -pthread 
depbase=`echo test-time.o | sed 's|[^/]*$|.deps/&|;s|\.o$||'`;\
x86_64-pld-linux-gnux32-gcc -DHAVE_CONFIG_H -DEXEEXT=\"\" -I. -I..  -DIN_GREP_GNULIB_TESTS=1 -I. -I. -I.. -I./.. -I../lib -I./../lib   -O2 -fwrapv -pipe -Wformat -Werror=format-security -gdwarf-4 -fno-debug-types-section -fvar-tracking-assignments -g2 -Wp,-D_FORTIFY_SOURCE=2 -fstack-protector-strong --param=ssp-buffer-size=4 -Werror=trampolines -fPIC -mtune=generic -march=x86-64 -gdwarf-4 -fno-debug-types-section -fvar-tracking-assignments -g2  -MT test-time.o -MD -MP -MF $depbase.Tpo -c -o test-time.o test-time.c &&\
mv -f $depbase.Tpo $depbase.Po
x86_64-pld-linux-gnux32-gcc  -O2 -fwrapv -pipe -Wformat -Werror=format-security -gdwarf-4 -fno-debug-types-section -fvar-tracking-assignments -g2 -Wp,-D_FORTIFY_SOURCE=2 -fstack-protector-strong --param=ssp-buffer-size=4 -Werror=trampolines -fPIC -mtune=generic -march=x86-64 -gdwarf-4 -fno-debug-types-section -fvar-tracking-assignments -g2   -Wl,--as-needed -Wl,--no-copy-dt-needed-entries -Wl,-z,relro -Wl,-z,combreloc  -o test-time test-time.o libtests.a ../lib/libgreputils.a libtests.a ../lib/libgreputils.a  
depbase=`echo test-dup-safer.o | sed 's|[^/]*$|.deps/&|;s|\.o$||'`;\
x86_64-pld-linux-gnux32-gcc -DHAVE_CONFIG_H -DEXEEXT=\"\" -I. -I..  -DIN_GREP_GNULIB_TESTS=1 -I. -I. -I.. -I./.. -I../lib -I./../lib   -O2 -fwrapv -pipe -Wformat -Werror=format-security -gdwarf-4 -fno-debug-types-section -fvar-tracking-assignments -g2 -Wp,-D_FORTIFY_SOURCE=2 -fstack-protector-strong --param=ssp-buffer-size=4 -Werror=trampolines -fPIC -mtune=generic -march=x86-64 -gdwarf-4 -fno-debug-types-section -fvar-tracking-assignments -g2  -MT test-dup-safer.o -MD -MP -MF $depbase.Tpo -c -o test-dup-safer.o test-dup-safer.c &&\
mv -f $depbase.Tpo $depbase.Po
x86_64-pld-linux-gnux32-gcc  -O2 -fwrapv -pipe -Wformat -Werror=format-security -gdwarf-4 -fno-debug-types-section -fvar-tracking-assignments -g2 -Wp,-D_FORTIFY_SOURCE=2 -fstack-protector-strong --param=ssp-buffer-size=4 -Werror=trampolines -fPIC -mtune=generic -march=x86-64 -gdwarf-4 -fno-debug-types-section -fvar-tracking-assignments -g2   -Wl,--as-needed -Wl,--no-copy-dt-needed-entries -Wl,-z,relro -Wl,-z,combreloc  -o test-dup-safer test-dup-safer.o libtests.a ../lib/libgreputils.a libtests.a ../lib/libgreputils.a  
depbase=`echo test-unistd.o | sed 's|[^/]*$|.deps/&|;s|\.o$||'`;\
x86_64-pld-linux-gnux32-gcc -DHAVE_CONFIG_H -DEXEEXT=\"\" -I. -I..  -DIN_GREP_GNULIB_TESTS=1 -I. -I. -I.. -I./.. -I../lib -I./../lib   -O2 -fwrapv -pipe -Wformat -Werror=format-security -gdwarf-4 -fno-debug-types-section -fvar-tracking-assignments -g2 -Wp,-D_FORTIFY_SOURCE=2 -fstack-protector-strong --param=ssp-buffer-size=4 -Werror=trampolines -fPIC -mtune=generic -march=x86-64 -gdwarf-4 -fno-debug-types-section -fvar-tracking-assignments -g2  -MT test-unistd.o -MD -MP -MF $depbase.Tpo -c -o test-unistd.o test-unistd.c &&\
mv -f $depbase.Tpo $depbase.Po
x86_64-pld-linux-gnux32-gcc  -O2 -fwrapv -pipe -Wformat -Werror=format-security -gdwarf-4 -fno-debug-types-section -fvar-tracking-assignments -g2 -Wp,-D_FORTIFY_SOURCE=2 -fstack-protector-strong --param=ssp-buffer-size=4 -Werror=trampolines -fPIC -mtune=generic -march=x86-64 -gdwarf-4 -fno-debug-types-section -fvar-tracking-assignments -g2   -Wl,--as-needed -Wl,--no-copy-dt-needed-entries -Wl,-z,relro -Wl,-z,combreloc  -o test-unistd test-unistd.o libtests.a ../lib/libgreputils.a libtests.a ../lib/libgreputils.a  
depbase=`echo unistr/test-u8-mbtoucr.o | sed 's|[^/]*$|.deps/&|;s|\.o$||'`;\
x86_64-pld-linux-gnux32-gcc -DHAVE_CONFIG_H -DEXEEXT=\"\" -I. -I..  -DIN_GREP_GNULIB_TESTS=1 -I. -I. -I.. -I./.. -I../lib -I./../lib   -O2 -fwrapv -pipe -Wformat -Werror=format-security -gdwarf-4 -fno-debug-types-section -fvar-tracking-assignments -g2 -Wp,-D_FORTIFY_SOURCE=2 -fstack-protector-strong --param=ssp-buffer-size=4 -Werror=trampolines -fPIC -mtune=generic -march=x86-64 -gdwarf-4 -fno-debug-types-section -fvar-tracking-assignments -g2  -MT unistr/test-u8-mbtoucr.o -MD -MP -MF $depbase.Tpo -c -o unistr/test-u8-mbtoucr.o unistr/test-u8-mbtoucr.c &&\
mv -f $depbase.Tpo $depbase.Po
x86_64-pld-linux-gnux32-gcc  -O2 -fwrapv -pipe -Wformat -Werror=format-security -gdwarf-4 -fno-debug-types-section -fvar-tracking-assignments -g2 -Wp,-D_FORTIFY_SOURCE=2 -fstack-protector-strong --param=ssp-buffer-size=4 -Werror=trampolines -fPIC -mtune=generic -march=x86-64 -gdwarf-4 -fno-debug-types-section -fvar-tracking-assignments -g2   -Wl,--as-needed -Wl,--no-copy-dt-needed-entries -Wl,-z,relro -Wl,-z,combreloc  -o test-u8-mbtoucr unistr/test-u8-mbtoucr.o libtests.a ../lib/libgreputils.a libtests.a ../lib/libgreputils.a   
depbase=`echo unistr/test-u8-uctomb.o | sed 's|[^/]*$|.deps/&|;s|\.o$||'`;\
x86_64-pld-linux-gnux32-gcc -DHAVE_CONFIG_H -DEXEEXT=\"\" -I. -I..  -DIN_GREP_GNULIB_TESTS=1 -I. -I. -I.. -I./.. -I../lib -I./../lib   -O2 -fwrapv -pipe -Wformat -Werror=format-security -gdwarf-4 -fno-debug-types-section -fvar-tracking-assignments -g2 -Wp,-D_FORTIFY_SOURCE=2 -fstack-protector-strong --param=ssp-buffer-size=4 -Werror=trampolines -fPIC -mtune=generic -march=x86-64 -gdwarf-4 -fno-debug-types-section -fvar-tracking-assignments -g2  -MT unistr/test-u8-uctomb.o -MD -MP -MF $depbase.Tpo -c -o unistr/test-u8-uctomb.o unistr/test-u8-uctomb.c &&\
mv -f $depbase.Tpo $depbase.Po
x86_64-pld-linux-gnux32-gcc  -O2 -fwrapv -pipe -Wformat -Werror=format-security -gdwarf-4 -fno-debug-types-section -fvar-tracking-assignments -g2 -Wp,-D_FORTIFY_SOURCE=2 -fstack-protector-strong --param=ssp-buffer-size=4 -Werror=trampolines -fPIC -mtune=generic -march=x86-64 -gdwarf-4 -fno-debug-types-section -fvar-tracking-assignments -g2   -Wl,--as-needed -Wl,--no-copy-dt-needed-entries -Wl,-z,relro -Wl,-z,combreloc  -o test-u8-uctomb unistr/test-u8-uctomb.o libtests.a ../lib/libgreputils.a libtests.a ../lib/libgreputils.a   
depbase=`echo uniwidth/test-uc_width.o | sed 's|[^/]*$|.deps/&|;s|\.o$||'`;\
x86_64-pld-linux-gnux32-gcc -DHAVE_CONFIG_H -DEXEEXT=\"\" -I. -I..  -DIN_GREP_GNULIB_TESTS=1 -I. -I. -I.. -I./.. -I../lib -I./../lib   -O2 -fwrapv -pipe -Wformat -Werror=format-security -gdwarf-4 -fno-debug-types-section -fvar-tracking-assignments -g2 -Wp,-D_FORTIFY_SOURCE=2 -fstack-protector-strong --param=ssp-buffer-size=4 -Werror=trampolines -fPIC -mtune=generic -march=x86-64 -gdwarf-4 -fno-debug-types-section -fvar-tracking-assignments -g2  -MT uniwidth/test-uc_width.o -MD -MP -MF $depbase.Tpo -c -o uniwidth/test-uc_width.o uniwidth/test-uc_width.c &&\
mv -f $depbase.Tpo $depbase.Po
x86_64-pld-linux-gnux32-gcc  -O2 -fwrapv -pipe -Wformat -Werror=format-security -gdwarf-4 -fno-debug-types-section -fvar-tracking-assignments -g2 -Wp,-D_FORTIFY_SOURCE=2 -fstack-protector-strong --param=ssp-buffer-size=4 -Werror=trampolines -fPIC -mtune=generic -march=x86-64 -gdwarf-4 -fno-debug-types-section -fvar-tracking-assignments -g2   -Wl,--as-needed -Wl,--no-copy-dt-needed-entries -Wl,-z,relro -Wl,-z,combreloc  -o test-uc_width uniwidth/test-uc_width.o libtests.a ../lib/libgreputils.a libtests.a ../lib/libgreputils.a   
depbase=`echo uniwidth/test-uc_width2.o | sed 's|[^/]*$|.deps/&|;s|\.o$||'`;\
x86_64-pld-linux-gnux32-gcc -DHAVE_CONFIG_H -DEXEEXT=\"\" -I. -I..  -DIN_GREP_GNULIB_TESTS=1 -I. -I. -I.. -I./.. -I../lib -I./../lib   -O2 -fwrapv -pipe -Wformat -Werror=format-security -gdwarf-4 -fno-debug-types-section -fvar-tracking-assignments -g2 -Wp,-D_FORTIFY_SOURCE=2 -fstack-protector-strong --param=ssp-buffer-size=4 -Werror=trampolines -fPIC -mtune=generic -march=x86-64 -gdwarf-4 -fno-debug-types-section -fvar-tracking-assignments -g2  -MT uniwidth/test-uc_width2.o -MD -MP -MF $depbase.Tpo -c -o uniwidth/test-uc_width2.o uniwidth/test-uc_width2.c &&\
mv -f $depbase.Tpo $depbase.Po
x86_64-pld-linux-gnux32-gcc  -O2 -fwrapv -pipe -Wformat -Werror=format-security -gdwarf-4 -fno-debug-types-section -fvar-tracking-assignments -g2 -Wp,-D_FORTIFY_SOURCE=2 -fstack-protector-strong --param=ssp-buffer-size=4 -Werror=trampolines -fPIC -mtune=generic -march=x86-64 -gdwarf-4 -fno-debug-types-section -fvar-tracking-assignments -g2   -Wl,--as-needed -Wl,--no-copy-dt-needed-entries -Wl,-z,relro -Wl,-z,combreloc  -o test-uc_width2 uniwidth/test-uc_width2.o libtests.a ../lib/libgreputils.a libtests.a ../lib/libgreputils.a   
depbase=`echo test-unsetenv.o | sed 's|[^/]*$|.deps/&|;s|\.o$||'`;\
x86_64-pld-linux-gnux32-gcc -DHAVE_CONFIG_H -DEXEEXT=\"\" -I. -I..  -DIN_GREP_GNULIB_TESTS=1 -I. -I. -I.. -I./.. -I../lib -I./../lib   -O2 -fwrapv -pipe -Wformat -Werror=format-security -gdwarf-4 -fno-debug-types-section -fvar-tracking-assignments -g2 -Wp,-D_FORTIFY_SOURCE=2 -fstack-protector-strong --param=ssp-buffer-size=4 -Werror=trampolines -fPIC -mtune=generic -march=x86-64 -gdwarf-4 -fno-debug-types-section -fvar-tracking-assignments -g2  -MT test-unsetenv.o -MD -MP -MF $depbase.Tpo -c -o test-unsetenv.o test-unsetenv.c &&\
mv -f $depbase.Tpo $depbase.Po
x86_64-pld-linux-gnux32-gcc  -O2 -fwrapv -pipe -Wformat -Werror=format-security -gdwarf-4 -fno-debug-types-section -fvar-tracking-assignments -g2 -Wp,-D_FORTIFY_SOURCE=2 -fstack-protector-strong --param=ssp-buffer-size=4 -Werror=trampolines -fPIC -mtune=generic -march=x86-64 -gdwarf-4 -fno-debug-types-section -fvar-tracking-assignments -g2   -Wl,--as-needed -Wl,--no-copy-dt-needed-entries -Wl,-z,relro -Wl,-z,combreloc  -o test-unsetenv test-unsetenv.o libtests.a ../lib/libgreputils.a libtests.a ../lib/libgreputils.a  
depbase=`echo test-vasnprintf.o | sed 's|[^/]*$|.deps/&|;s|\.o$||'`;\
x86_64-pld-linux-gnux32-gcc -DHAVE_CONFIG_H -DEXEEXT=\"\" -I. -I..  -DIN_GREP_GNULIB_TESTS=1 -I. -I. -I.. -I./.. -I../lib -I./../lib   -O2 -fwrapv -pipe -Wformat -Werror=format-security -gdwarf-4 -fno-debug-types-section -fvar-tracking-assignments -g2 -Wp,-D_FORTIFY_SOURCE=2 -fstack-protector-strong --param=ssp-buffer-size=4 -Werror=trampolines -fPIC -mtune=generic -march=x86-64 -gdwarf-4 -fno-debug-types-section -fvar-tracking-assignments -g2  -MT test-vasnprintf.o -MD -MP -MF $depbase.Tpo -c -o test-vasnprintf.o test-vasnprintf.c &&\
mv -f $depbase.Tpo $depbase.Po
x86_64-pld-linux-gnux32-gcc  -O2 -fwrapv -pipe -Wformat -Werror=format-security -gdwarf-4 -fno-debug-types-section -fvar-tracking-assignments -g2 -Wp,-D_FORTIFY_SOURCE=2 -fstack-protector-strong --param=ssp-buffer-size=4 -Werror=trampolines -fPIC -mtune=generic -march=x86-64 -gdwarf-4 -fno-debug-types-section -fvar-tracking-assignments -g2   -Wl,--as-needed -Wl,--no-copy-dt-needed-entries -Wl,-z,relro -Wl,-z,combreloc  -o test-vasnprintf test-vasnprintf.o libtests.a ../lib/libgreputils.a libtests.a ../lib/libgreputils.a  
depbase=`echo test-verify.o | sed 's|[^/]*$|.deps/&|;s|\.o$||'`;\
x86_64-pld-linux-gnux32-gcc -DHAVE_CONFIG_H -DEXEEXT=\"\" -I. -I..  -DIN_GREP_GNULIB_TESTS=1 -I. -I. -I.. -I./.. -I../lib -I./../lib   -O2 -fwrapv -pipe -Wformat -Werror=format-security -gdwarf-4 -fno-debug-types-section -fvar-tracking-assignments -g2 -Wp,-D_FORTIFY_SOURCE=2 -fstack-protector-strong --param=ssp-buffer-size=4 -Werror=trampolines -fPIC -mtune=generic -march=x86-64 -gdwarf-4 -fno-debug-types-section -fvar-tracking-assignments -g2  -MT test-verify.o -MD -MP -MF $depbase.Tpo -c -o test-verify.o test-verify.c &&\
mv -f $depbase.Tpo $depbase.Po
x86_64-pld-linux-gnux32-gcc  -O2 -fwrapv -pipe -Wformat -Werror=format-security -gdwarf-4 -fno-debug-types-section -fvar-tracking-assignments -g2 -Wp,-D_FORTIFY_SOURCE=2 -fstack-protector-strong --param=ssp-buffer-size=4 -Werror=trampolines -fPIC -mtune=generic -march=x86-64 -gdwarf-4 -fno-debug-types-section -fvar-tracking-assignments -g2   -Wl,--as-needed -Wl,--no-copy-dt-needed-entries -Wl,-z,relro -Wl,-z,combreloc  -o test-verify test-verify.o libtests.a ../lib/libgreputils.a libtests.a ../lib/libgreputils.a  
depbase=`echo test-version-etc.o | sed 's|[^/]*$|.deps/&|;s|\.o$||'`;\
x86_64-pld-linux-gnux32-gcc -DHAVE_CONFIG_H -DEXEEXT=\"\" -I. -I..  -DIN_GREP_GNULIB_TESTS=1 -I. -I. -I.. -I./.. -I../lib -I./../lib   -O2 -fwrapv -pipe -Wformat -Werror=format-security -gdwarf-4 -fno-debug-types-section -fvar-tracking-assignments -g2 -Wp,-D_FORTIFY_SOURCE=2 -fstack-protector-strong --param=ssp-buffer-size=4 -Werror=trampolines -fPIC -mtune=generic -march=x86-64 -gdwarf-4 -fno-debug-types-section -fvar-tracking-assignments -g2  -MT test-version-etc.o -MD -MP -MF $depbase.Tpo -c -o test-version-etc.o test-version-etc.c &&\
mv -f $depbase.Tpo $depbase.Po
x86_64-pld-linux-gnux32-gcc  -O2 -fwrapv -pipe -Wformat -Werror=format-security -gdwarf-4 -fno-debug-types-section -fvar-tracking-assignments -g2 -Wp,-D_FORTIFY_SOURCE=2 -fstack-protector-strong --param=ssp-buffer-size=4 -Werror=trampolines -fPIC -mtune=generic -march=x86-64 -gdwarf-4 -fno-debug-types-section -fvar-tracking-assignments -g2   -Wl,--as-needed -Wl,--no-copy-dt-needed-entries -Wl,-z,relro -Wl,-z,combreloc  -o test-version-etc test-version-etc.o libtests.a ../lib/libgreputils.a libtests.a ../lib/libgreputils.a   
depbase=`echo test-wchar.o | sed 's|[^/]*$|.deps/&|;s|\.o$||'`;\
x86_64-pld-linux-gnux32-gcc -DHAVE_CONFIG_H -DEXEEXT=\"\" -I. -I..  -DIN_GREP_GNULIB_TESTS=1 -I. -I. -I.. -I./.. -I../lib -I./../lib   -O2 -fwrapv -pipe -Wformat -Werror=format-security -gdwarf-4 -fno-debug-types-section -fvar-tracking-assignments -g2 -Wp,-D_FORTIFY_SOURCE=2 -fstack-protector-strong --param=ssp-buffer-size=4 -Werror=trampolines -fPIC -mtune=generic -march=x86-64 -gdwarf-4 -fno-debug-types-section -fvar-tracking-assignments -g2  -MT test-wchar.o -MD -MP -MF $depbase.Tpo -c -o test-wchar.o test-wchar.c &&\
mv -f $depbase.Tpo $depbase.Po
x86_64-pld-linux-gnux32-gcc  -O2 -fwrapv -pipe -Wformat -Werror=format-security -gdwarf-4 -fno-debug-types-section -fvar-tracking-assignments -g2 -Wp,-D_FORTIFY_SOURCE=2 -fstack-protector-strong --param=ssp-buffer-size=4 -Werror=trampolines -fPIC -mtune=generic -march=x86-64 -gdwarf-4 -fno-debug-types-section -fvar-tracking-assignments -g2   -Wl,--as-needed -Wl,--no-copy-dt-needed-entries -Wl,-z,relro -Wl,-z,combreloc  -o test-wchar test-wchar.o libtests.a ../lib/libgreputils.a libtests.a ../lib/libgreputils.a  
depbase=`echo test-wcrtomb.o | sed 's|[^/]*$|.deps/&|;s|\.o$||'`;\
x86_64-pld-linux-gnux32-gcc -DHAVE_CONFIG_H -DEXEEXT=\"\" -I. -I..  -DIN_GREP_GNULIB_TESTS=1 -I. -I. -I.. -I./.. -I../lib -I./../lib   -O2 -fwrapv -pipe -Wformat -Werror=format-security -gdwarf-4 -fno-debug-types-section -fvar-tracking-assignments -g2 -Wp,-D_FORTIFY_SOURCE=2 -fstack-protector-strong --param=ssp-buffer-size=4 -Werror=trampolines -fPIC -mtune=generic -march=x86-64 -gdwarf-4 -fno-debug-types-section -fvar-tracking-assignments -g2  -MT test-wcrtomb.o -MD -MP -MF $depbase.Tpo -c -o test-wcrtomb.o test-wcrtomb.c &&\
mv -f $depbase.Tpo $depbase.Po
x86_64-pld-linux-gnux32-gcc  -O2 -fwrapv -pipe -Wformat -Werror=format-security -gdwarf-4 -fno-debug-types-section -fvar-tracking-assignments -g2 -Wp,-D_FORTIFY_SOURCE=2 -fstack-protector-strong --param=ssp-buffer-size=4 -Werror=trampolines -fPIC -mtune=generic -march=x86-64 -gdwarf-4 -fno-debug-types-section -fvar-tracking-assignments -g2   -Wl,--as-needed -Wl,--no-copy-dt-needed-entries -Wl,-z,relro -Wl,-z,combreloc  -o test-wcrtomb test-wcrtomb.o libtests.a ../lib/libgreputils.a libtests.a ../lib/libgreputils.a   
depbase=`echo test-wcrtomb-w32.o | sed 's|[^/]*$|.deps/&|;s|\.o$||'`;\
x86_64-pld-linux-gnux32-gcc -DHAVE_CONFIG_H -DEXEEXT=\"\" -I. -I..  -DIN_GREP_GNULIB_TESTS=1 -I. -I. -I.. -I./.. -I../lib -I./../lib   -O2 -fwrapv -pipe -Wformat -Werror=format-security -gdwarf-4 -fno-debug-types-section -fvar-tracking-assignments -g2 -Wp,-D_FORTIFY_SOURCE=2 -fstack-protector-strong --param=ssp-buffer-size=4 -Werror=trampolines -fPIC -mtune=generic -march=x86-64 -gdwarf-4 -fno-debug-types-section -fvar-tracking-assignments -g2  -MT test-wcrtomb-w32.o -MD -MP -MF $depbase.Tpo -c -o test-wcrtomb-w32.o test-wcrtomb-w32.c &&\
mv -f $depbase.Tpo $depbase.Po
x86_64-pld-linux-gnux32-gcc  -O2 -fwrapv -pipe -Wformat -Werror=format-security -gdwarf-4 -fno-debug-types-section -fvar-tracking-assignments -g2 -Wp,-D_FORTIFY_SOURCE=2 -fstack-protector-strong --param=ssp-buffer-size=4 -Werror=trampolines -fPIC -mtune=generic -march=x86-64 -gdwarf-4 -fno-debug-types-section -fvar-tracking-assignments -g2   -Wl,--as-needed -Wl,--no-copy-dt-needed-entries -Wl,-z,relro -Wl,-z,combreloc  -o test-wcrtomb-w32 test-wcrtomb-w32.o libtests.a ../lib/libgreputils.a libtests.a ../lib/libgreputils.a  
depbase=`echo test-wctype-h.o | sed 's|[^/]*$|.deps/&|;s|\.o$||'`;\
x86_64-pld-linux-gnux32-gcc -DHAVE_CONFIG_H -DEXEEXT=\"\" -I. -I..  -DIN_GREP_GNULIB_TESTS=1 -I. -I. -I.. -I./.. -I../lib -I./../lib   -O2 -fwrapv -pipe -Wformat -Werror=format-security -gdwarf-4 -fno-debug-types-section -fvar-tracking-assignments -g2 -Wp,-D_FORTIFY_SOURCE=2 -fstack-protector-strong --param=ssp-buffer-size=4 -Werror=trampolines -fPIC -mtune=generic -march=x86-64 -gdwarf-4 -fno-debug-types-section -fvar-tracking-assignments -g2  -MT test-wctype-h.o -MD -MP -MF $depbase.Tpo -c -o test-wctype-h.o test-wctype-h.c &&\
mv -f $depbase.Tpo $depbase.Po
x86_64-pld-linux-gnux32-gcc  -O2 -fwrapv -pipe -Wformat -Werror=format-security -gdwarf-4 -fno-debug-types-section -fvar-tracking-assignments -g2 -Wp,-D_FORTIFY_SOURCE=2 -fstack-protector-strong --param=ssp-buffer-size=4 -Werror=trampolines -fPIC -mtune=generic -march=x86-64 -gdwarf-4 -fno-debug-types-section -fvar-tracking-assignments -g2   -Wl,--as-needed -Wl,--no-copy-dt-needed-entries -Wl,-z,relro -Wl,-z,combreloc  -o test-wctype-h test-wctype-h.o libtests.a ../lib/libgreputils.a libtests.a ../lib/libgreputils.a  
depbase=`echo test-wcwidth.o | sed 's|[^/]*$|.deps/&|;s|\.o$||'`;\
x86_64-pld-linux-gnux32-gcc -DHAVE_CONFIG_H -DEXEEXT=\"\" -I. -I..  -DIN_GREP_GNULIB_TESTS=1 -I. -I. -I.. -I./.. -I../lib -I./../lib   -O2 -fwrapv -pipe -Wformat -Werror=format-security -gdwarf-4 -fno-debug-types-section -fvar-tracking-assignments -g2 -Wp,-D_FORTIFY_SOURCE=2 -fstack-protector-strong --param=ssp-buffer-size=4 -Werror=trampolines -fPIC -mtune=generic -march=x86-64 -gdwarf-4 -fno-debug-types-section -fvar-tracking-assignments -g2  -MT test-wcwidth.o -MD -MP -MF $depbase.Tpo -c -o test-wcwidth.o test-wcwidth.c &&\
mv -f $depbase.Tpo $depbase.Po
x86_64-pld-linux-gnux32-gcc  -O2 -fwrapv -pipe -Wformat -Werror=format-security -gdwarf-4 -fno-debug-types-section -fvar-tracking-assignments -g2 -Wp,-D_FORTIFY_SOURCE=2 -fstack-protector-strong --param=ssp-buffer-size=4 -Werror=trampolines -fPIC -mtune=generic -march=x86-64 -gdwarf-4 -fno-debug-types-section -fvar-tracking-assignments -g2   -Wl,--as-needed -Wl,--no-copy-dt-needed-entries -Wl,-z,relro -Wl,-z,combreloc  -o test-wcwidth test-wcwidth.o libtests.a ../lib/libgreputils.a libtests.a ../lib/libgreputils.a    
depbase=`echo test-xalloc-die.o | sed 's|[^/]*$|.deps/&|;s|\.o$||'`;\
x86_64-pld-linux-gnux32-gcc -DHAVE_CONFIG_H -DEXEEXT=\"\" -I. -I..  -DIN_GREP_GNULIB_TESTS=1 -I. -I. -I.. -I./.. -I../lib -I./../lib   -O2 -fwrapv -pipe -Wformat -Werror=format-security -gdwarf-4 -fno-debug-types-section -fvar-tracking-assignments -g2 -Wp,-D_FORTIFY_SOURCE=2 -fstack-protector-strong --param=ssp-buffer-size=4 -Werror=trampolines -fPIC -mtune=generic -march=x86-64 -gdwarf-4 -fno-debug-types-section -fvar-tracking-assignments -g2  -MT test-xalloc-die.o -MD -MP -MF $depbase.Tpo -c -o test-xalloc-die.o test-xalloc-die.c &&\
mv -f $depbase.Tpo $depbase.Po
x86_64-pld-linux-gnux32-gcc  -O2 -fwrapv -pipe -Wformat -Werror=format-security -gdwarf-4 -fno-debug-types-section -fvar-tracking-assignments -g2 -Wp,-D_FORTIFY_SOURCE=2 -fstack-protector-strong --param=ssp-buffer-size=4 -Werror=trampolines -fPIC -mtune=generic -march=x86-64 -gdwarf-4 -fno-debug-types-section -fvar-tracking-assignments -g2   -Wl,--as-needed -Wl,--no-copy-dt-needed-entries -Wl,-z,relro -Wl,-z,combreloc  -o test-xalloc-die test-xalloc-die.o libtests.a ../lib/libgreputils.a libtests.a ../lib/libgreputils.a   
depbase=`echo test-xstrtoimax.o | sed 's|[^/]*$|.deps/&|;s|\.o$||'`;\
x86_64-pld-linux-gnux32-gcc -DHAVE_CONFIG_H -DEXEEXT=\"\" -I. -I..  -DIN_GREP_GNULIB_TESTS=1 -I. -I. -I.. -I./.. -I../lib -I./../lib   -O2 -fwrapv -pipe -Wformat -Werror=format-security -gdwarf-4 -fno-debug-types-section -fvar-tracking-assignments -g2 -Wp,-D_FORTIFY_SOURCE=2 -fstack-protector-strong --param=ssp-buffer-size=4 -Werror=trampolines -fPIC -mtune=generic -march=x86-64 -gdwarf-4 -fno-debug-types-section -fvar-tracking-assignments -g2  -MT test-xstrtoimax.o -MD -MP -MF $depbase.Tpo -c -o test-xstrtoimax.o test-xstrtoimax.c &&\
mv -f $depbase.Tpo $depbase.Po
x86_64-pld-linux-gnux32-gcc  -O2 -fwrapv -pipe -Wformat -Werror=format-security -gdwarf-4 -fno-debug-types-section -fvar-tracking-assignments -g2 -Wp,-D_FORTIFY_SOURCE=2 -fstack-protector-strong --param=ssp-buffer-size=4 -Werror=trampolines -fPIC -mtune=generic -march=x86-64 -gdwarf-4 -fno-debug-types-section -fvar-tracking-assignments -g2   -Wl,--as-needed -Wl,--no-copy-dt-needed-entries -Wl,-z,relro -Wl,-z,combreloc  -o test-xstrtoimax test-xstrtoimax.o libtests.a ../lib/libgreputils.a libtests.a ../lib/libgreputils.a   
depbase=`echo test-xstrtol.o | sed 's|[^/]*$|.deps/&|;s|\.o$||'`;\
x86_64-pld-linux-gnux32-gcc -DHAVE_CONFIG_H -DEXEEXT=\"\" -I. -I..  -DIN_GREP_GNULIB_TESTS=1 -I. -I. -I.. -I./.. -I../lib -I./../lib   -O2 -fwrapv -pipe -Wformat -Werror=format-security -gdwarf-4 -fno-debug-types-section -fvar-tracking-assignments -g2 -Wp,-D_FORTIFY_SOURCE=2 -fstack-protector-strong --param=ssp-buffer-size=4 -Werror=trampolines -fPIC -mtune=generic -march=x86-64 -gdwarf-4 -fno-debug-types-section -fvar-tracking-assignments -g2  -MT test-xstrtol.o -MD -MP -MF $depbase.Tpo -c -o test-xstrtol.o test-xstrtol.c &&\
mv -f $depbase.Tpo $depbase.Po
x86_64-pld-linux-gnux32-gcc  -O2 -fwrapv -pipe -Wformat -Werror=format-security -gdwarf-4 -fno-debug-types-section -fvar-tracking-assignments -g2 -Wp,-D_FORTIFY_SOURCE=2 -fstack-protector-strong --param=ssp-buffer-size=4 -Werror=trampolines -fPIC -mtune=generic -march=x86-64 -gdwarf-4 -fno-debug-types-section -fvar-tracking-assignments -g2   -Wl,--as-needed -Wl,--no-copy-dt-needed-entries -Wl,-z,relro -Wl,-z,combreloc  -o test-xstrtol test-xstrtol.o libtests.a ../lib/libgreputils.a libtests.a ../lib/libgreputils.a   
depbase=`echo test-xstrtoul.o | sed 's|[^/]*$|.deps/&|;s|\.o$||'`;\
x86_64-pld-linux-gnux32-gcc -DHAVE_CONFIG_H -DEXEEXT=\"\" -I. -I..  -DIN_GREP_GNULIB_TESTS=1 -I. -I. -I.. -I./.. -I../lib -I./../lib   -O2 -fwrapv -pipe -Wformat -Werror=format-security -gdwarf-4 -fno-debug-types-section -fvar-tracking-assignments -g2 -Wp,-D_FORTIFY_SOURCE=2 -fstack-protector-strong --param=ssp-buffer-size=4 -Werror=trampolines -fPIC -mtune=generic -march=x86-64 -gdwarf-4 -fno-debug-types-section -fvar-tracking-assignments -g2  -MT test-xstrtoul.o -MD -MP -MF $depbase.Tpo -c -o test-xstrtoul.o test-xstrtoul.c &&\
mv -f $depbase.Tpo $depbase.Po
x86_64-pld-linux-gnux32-gcc  -O2 -fwrapv -pipe -Wformat -Werror=format-security -gdwarf-4 -fno-debug-types-section -fvar-tracking-assignments -g2 -Wp,-D_FORTIFY_SOURCE=2 -fstack-protector-strong --param=ssp-buffer-size=4 -Werror=trampolines -fPIC -mtune=generic -march=x86-64 -gdwarf-4 -fno-debug-types-section -fvar-tracking-assignments -g2   -Wl,--as-needed -Wl,--no-copy-dt-needed-entries -Wl,-z,relro -Wl,-z,combreloc  -o test-xstrtoul test-xstrtoul.o libtests.a ../lib/libgreputils.a libtests.a ../lib/libgreputils.a   
make[5]: 'libtests.a' is up to date.
make[5]: Leaving directory '/tmp/B.GWnnUo/BUILD/grep-3.6/gnulib-tests'
/usr/bin/make  check-TESTS
make[5]: Entering directory '/tmp/B.GWnnUo/BUILD/grep-3.6/gnulib-tests'
make[6]: Entering directory '/tmp/B.GWnnUo/BUILD/grep-3.6/gnulib-tests'
PASS: test-accept
PASS: test-alignof
PASS: test-alloca-opt
PASS: test-argmatch
PASS: test-arpa_inet
PASS: test-binary-io.sh
PASS: test-bind
PASS: test-bitrotate
PASS: test-btowc1.sh
PASS: test-btowc2.sh
PASS: test-c-ctype
PASS: test-c-stack.sh
PASS: test-c-stack2.sh
PASS: test-c-strcase.sh
PASS: test-chdir
PASS: test-cloexec
PASS: test-close
PASS: test-connect
PASS: test-ctype
PASS: test-dfa-invalid-char-class.sh
FAIL: test-dfa-invalid-merge.sh
PASS: test-dfa-match.sh
PASS: test-dirent
PASS: test-dup
PASS: test-dup2
PASS: test-environ
PASS: test-errno
PASS: test-exclude1.sh
PASS: test-exclude2.sh
PASS: test-exclude3.sh
PASS: test-exclude4.sh
PASS: test-exclude5.sh
PASS: test-exclude6.sh
PASS: test-exclude7.sh
PASS: test-exclude8.sh
PASS: test-fchdir
PASS: test-fcntl-h
PASS: test-fcntl-safer
PASS: test-fcntl
PASS: test-fdopen
PASS: test-fdopendir
PASS: test-fgetc
PASS: test-float
PASS: test-fnmatch-h
PASS: test-fnmatch
PASS: test-fopen-gnu
PASS: test-fopen
PASS: test-fpending.sh
PASS: test-fputc
PASS: test-fread
PASS: test-fstat
PASS: test-fstatat
PASS: test-ftruncate.sh
PASS: test-fwrite
PASS: test-getcwd-lgpl
PASS: test-getdtablesize
PASS: test-getopt-gnu
PASS: test-getopt-posix
PASS: test-getprogname
PASS: test-gettimeofday
PASS: test-hard-locale
PASS: test-hash
PASS: test-i-ring
PASS: test-iconv-h
PASS: test-iconv
PASS: test-ignore-value
PASS: test-inet_pton
PASS: test-intprops
PASS: test-inttostr
PASS: test-inttypes
PASS: test-ioctl
PASS: test-isatty
PASS: test-isblank
PASS: test-iswblank
PASS: test-iswdigit.sh
PASS: test-iswxdigit.sh
PASS: test-langinfo
PASS: test-limits-h
PASS: test-listen
PASS: test-locale
PASS: test-localeconv
PASS: test-localename
PASS: test-lseek.sh
PASS: test-lstat
PASS: test-malloc-gnu
PASS: test-malloca
PASS: test-mbscasecmp.sh
PASS: test-mbsinit.sh
PASS: test-mbsrtowcs1.sh
PASS: test-mbsrtowcs2.sh
PASS: test-mbsrtowcs3.sh
PASS: test-mbsrtowcs4.sh
PASS: test-mbsstr1
PASS: test-mbsstr2.sh
PASS: test-mbsstr3.sh
PASS: test-memchr
PASS: test-memchr2
PASS: test-memrchr
PASS: test-nanosleep
PASS: test-netinet_in
PASS: test-nl_langinfo.sh
PASS: test-nl_langinfo-mt
PASS: test-open
PASS: test-openat-safer
PASS: test-openat
PASS: test-pathmax
PASS: test-perror.sh
PASS: test-perror2
PASS: test-pipe
PASS: test-pthread
PASS: test-pthread-thread
PASS: test-pthread_sigmask1
PASS: test-pthread_sigmask2
PASS: test-quotearg-simple
PASS: test-raise
PASS: test-rawmemchr
PASS: test-read
PASS: test-realloc-gnu
PASS: test-regex
PASS: test-sched
PASS: test-select
PASS: test-select-in.sh
PASS: test-select-out.sh
PASS: test-setenv
PASS: test-setlocale_null
PASS: test-setlocale_null-mt-one
PASS: test-setlocale_null-mt-all
PASS: test-setlocale1.sh
PASS: test-setlocale2.sh
PASS: test-setsockopt
PASS: test-sigaction
PASS: test-signal-h
PASS: test-sigprocmask
PASS: test-sleep
PASS: test-snprintf
PASS: test-sockets
PASS: test-stat
PASS: test-stat-time
PASS: test-stdalign
PASS: test-stdbool
PASS: test-stddef
PASS: test-stdint
PASS: test-stdio
PASS: test-stdlib
PASS: test-strerror
PASS: test-strerror_r
PASS: test-striconv
PASS: test-string
PASS: test-strnlen
PASS: test-strstr
PASS: test-strtoimax
PASS: test-strtoll
PASS: test-strtoull
PASS: test-strtoumax
PASS: test-symlink
PASS: test-sys_ioctl
PASS: test-sys_select
PASS: test-sys_socket
PASS: test-sys_stat
PASS: test-sys_time
PASS: test-sys_types
PASS: test-sys_uio
PASS: test-init.sh
PASS: test-thread_self
PASS: test-thread_create
PASS: test-time
PASS: test-dup-safer
PASS: test-unistd
PASS: test-u8-mbtoucr
PASS: test-u8-uctomb
PASS: test-uc_width
PASS: uniwidth/test-uc_width2.sh
PASS: test-unsetenv
PASS: test-vasnprintf
PASS: test-vc-list-files-git.sh
PASS: test-vc-list-files-cvs.sh
PASS: test-verify
PASS: test-verify.sh
PASS: test-version-etc.sh
PASS: test-wchar
PASS: test-wcrtomb.sh
SKIP: test-wcrtomb-w32-1.sh
SKIP: test-wcrtomb-w32-2.sh
SKIP: test-wcrtomb-w32-3.sh
SKIP: test-wcrtomb-w32-4.sh
SKIP: test-wcrtomb-w32-5.sh
SKIP: test-wcrtomb-w32-6.sh
SKIP: test-wcrtomb-w32-7.sh
PASS: test-wctype-h
PASS: test-wcwidth
PASS: test-xalloc-die.sh
PASS: test-xstrtoimax.sh
PASS: test-xstrtol.sh
===============================================
   GNU grep 3.6: gnulib-tests/test-suite.log
===============================================

# TOTAL: 193
# PASS:  185
# SKIP:  7
# XFAIL: 0
# FAIL:  1
# XPASS: 0
# ERROR: 0

.. contents:: :depth: 2

FAIL: test-dfa-invalid-merge.sh
===============================

+ initial_cwd_=/tmp/B.GWnnUo/BUILD/grep-3.6/gnulib-tests 
+ testdir_prefix_
+ printf gt
+ pfx_=gt 
+ mktempd_ /tmp/B.GWnnUo/BUILD/grep-3.6/gnulib-tests gt-test-dfa-invalid-merge.sh.XXXX
+ destdir_=/tmp/B.GWnnUo/BUILD/grep-3.6/gnulib-tests 
+ template_=gt-test-dfa-invalid-merge.sh.XXXX 
+ MAX_TRIES_=4 
+ destdir_slash_=/tmp/B.GWnnUo/BUILD/grep-3.6/gnulib-tests/ 
+ unset TMPDIR
+ 2>/dev/null 
+ mktemp -d -t -p /tmp/B.GWnnUo/BUILD/grep-3.6/gnulib-tests gt-test-dfa-invalid-merge.sh.XXXX
+ d=/tmp/B.GWnnUo/BUILD/grep-3.6/gnulib-tests/gt-test-dfa-invalid-merge.sh.RgLn 
+ :
+ test -d /tmp/B.GWnnUo/BUILD/grep-3.6/gnulib-tests/gt-test-dfa-invalid-merge.sh.RgLn
+ 2>/dev/null 
+ ls -dgo /tmp/B.GWnnUo/BUILD/grep-3.6/gnulib-tests/gt-test-dfa-invalid-merge.sh.RgLn
+ perms='drwx------ 2 6 Nov 17 18:06 /tmp/B.GWnnUo/BUILD/grep-3.6/gnulib-tests/gt-test-dfa-invalid-merge.sh.RgLn' 
+ :
+ echo /tmp/B.GWnnUo/BUILD/grep-3.6/gnulib-tests/gt-test-dfa-invalid-merge.sh.RgLn
+ return
+ test_dir_=/tmp/B.GWnnUo/BUILD/grep-3.6/gnulib-tests/gt-test-dfa-invalid-merge.sh.RgLn 
+ cd /tmp/B.GWnnUo/BUILD/grep-3.6/gnulib-tests/gt-test-dfa-invalid-merge.sh.RgLn
+ srcdir=../. 
+ builddir=.. 
+ export srcdir builddir
+ gl_init_sh_nl_=$'\n' 
+ IFS=$' \t\n' 
+ expr 1 + 128
+ eval 'trap '\''Exit 129'\'' 1'
+ trap 'Exit 129' 1
+ expr 2 + 128
+ eval 'trap '\''Exit 130'\'' 2'
+ trap 'Exit 130' 2
+ expr 3 + 128
+ eval 'trap '\''Exit 131'\'' 3'
+ trap 'Exit 131' 3
+ expr 13 + 128
+ eval 'trap '\''Exit 141'\'' 13'
+ trap 'Exit 141' 13
+ expr 15 + 128
+ eval 'trap '\''Exit 143'\'' 15'
+ trap 'Exit 143' 15
diff -u /dev/null out
--- /dev/null	1970-01-01
+++ out	1970-01-01
++ 2>/dev/null 
++ return 0

SKIP: test-wcrtomb-w32-1.sh
===========================

Skipping test: not a native Windows system

SKIP: test-wcrtomb-w32-2.sh
===========================

Skipping test: not a native Windows system

SKIP: test-wcrtomb-w32-3.sh
===========================

Skipping test: not a native Windows system

SKIP: test-wcrtomb-w32-4.sh
===========================

Skipping test: not a native Windows system

SKIP: test-wcrtomb-w32-5.sh
===========================

Skipping test: not a native Windows system

SKIP: test-wcrtomb-w32-6.sh
===========================

Skipping test: not a native Windows system

SKIP: test-wcrtomb-w32-7.sh
===========================

Skipping test: not a native Windows system

============================================================================
Testsuite summary for GNU grep 3.6
============================================================================
# TOTAL: 193
# PASS:  185
# SKIP:  7
# XFAIL: 0
# FAIL:  1
# XPASS: 0
# ERROR: 0
============================================================================
See gnulib-tests/test-suite.log
Please report to bug-grep@gnu.org
============================================================================
make[6]: *** [Makefile:4345: test-suite.log] Error 1
make[6]: Leaving directory '/tmp/B.GWnnUo/BUILD/grep-3.6/gnulib-tests'
make[5]: *** [Makefile:4453: check-TESTS] Error 2
make[5]: Leaving directory '/tmp/B.GWnnUo/BUILD/grep-3.6/gnulib-tests'
make[4]: *** [Makefile:5896: check-am] Error 2
make[4]: Leaving directory '/tmp/B.GWnnUo/BUILD/grep-3.6/gnulib-tests'
make[3]: *** [Makefile:4237: check-recursive] Error 1
make[3]: Leaving directory '/tmp/B.GWnnUo/BUILD/grep-3.6/gnulib-tests'
make[2]: *** [Makefile:5898: check] Error 2
make[2]: Leaving directory '/tmp/B.GWnnUo/BUILD/grep-3.6/gnulib-tests'
make[1]: *** [Makefile:1614: check-recursive] Error 1
make[1]: Leaving directory '/tmp/B.GWnnUo/BUILD/grep-3.6'
make: *** [Makefile:2040: check-expensive] Error 2
error: Bad exit status from /tmp/B.GWnnUo/BUILD/tmp/rpm-tmp.39481 (%build)


RPM build errors:
    Bad exit status from /tmp/B.GWnnUo/BUILD/tmp/rpm-tmp.39481 (%build)
ended at: Tue Nov 17 18:06:51 2020, done in 0:02:31.031829
error: No files produced.
+ chmod -R u+rwX /tmp/B.GWnnUo/BUILD
+ rm -rf /tmp/B.GWnnUo/tmp /tmp/B.GWnnUo/BUILD
+ rm -rf /tmp/B.GWnnUo
Begin-PLD-Builder-Info
Build-Time: user:143.58s sys:31.35s real:154.98s (faults io:247 non-io:6145679)

End-PLD-Builder-Info
[Back to list of logs] [View rpm -qa of builder]