FailedOk

th/SRPMS[OK]
th/x32[OK]
th/i686[OK]
th/x86_64[OK]

ac/SRPMS[OK]
ac/i386[OK]
ac/i586[OK]
ac/i686[OK]
ac/alpha[OK]
ac/amd64[OK]
ac/athlon[OK]
ac/ppc[OK]
ac/sparc[OK]
ac/sparc64[OK]

Advanced Search
main()
Powered by PLD Linux
(c) 2002-2020 PLD Team
$Revision: 1.37 $
Powered by Neo.
Your IP: 34.234.207.100

hiredis 28eff6ce-9485-4f29-8bf7-d9f88d2118a2

Status:Failed
Source URL:https://buildlogs.pld-linux.org/pld/th/x32/FAIL/hiredis,28eff6ce-9485-4f29-8bf7-d9f88d2118a2.bz2
text/plain URL:View!
full text:View!
rpm -qa of builder:View!
Date:2020/10/13 06:24:20
Runtime:0:00:01.501710

Toc:

  • error 1
  • x86_64-pld-linux-gnux32-gcc: error: libhiredis.so: No such file or directory
  • error 2
  • error: Bad exit status from /tmp/B.XLGGGD/BUILD/tmp/rpm-tmp.92344 (%build)
  • error 3
  • RPM build errors:
  • error 4
  • error: No files produced.

Content:

checking if we should skip the build
started at: Tue Oct 13 06:24:16 2020
killing old processes on a builder
sending signal 9 to pid -1
Killed
cleaning up /tmp
fetching https://srcbuilder.pld-linux.org/th//srpms/28eff6ce-9485-4f29-8bf7-d9f88d2118a2/hiredis-1.0.0-1.src.rpm
fetched 108560 bytes, 280.3 K/s
installing srpm: hiredis-1.0.0-1.src.rpm
+ install -d /tmp/B.XLGGGD/BUILD /tmp/B.XLGGGD/RPMS
+ LC_ALL=en_US.UTF-8
+ rpm -qp --changelog hiredis-1.0.0-1.src.rpm
* Tue Oct 13 2020 PLD Linux Team <feedback@pld-linux.org>
- For complete changelog see: http://git.pld-linux.org/?p=packages/hiredis.git;a=log;h=master
* Sat Sep 05 2020 Jakub Bogusz <qboosh@pld-linux.org> 1e34b0d
- separated -tools (currently hiredis-test), as it requires -ssl library if built with ssl * Sat Sep 05 2020 Jakub Bogusz <qboosh@pld-linux.org> 711e634
- updated to 1.0.0 (note: new soname) - updated link patch; switched to upstream soname - package ssl library * Wed Apr 29 2020 Jakub Bogusz <qboosh@pld-linux.org> ad10e8d
- updated to 0.14.1 (CVE-2020-7105) + rpm -Uhv --nodeps --define '_topdir /tmp/B.XLGGGD' --define '_specdir %{_topdir}' --define '_sourcedir %{_specdir}' --define '_rpmdir %{_topdir}/RPMS' --define '_builddir %{_topdir}/BUILD' hiredis-1.0.0-1.src.rpm Preparing... ################################################## hiredis ################################################## + rm -f hiredis-1.0.0-1.src.rpm + install -m 700 -d /tmp/B.XLGGGD/BUILD/tmp + TMPDIR=/tmp/B.XLGGGD/BUILD/tmp + exec nice -n 0 rpmbuild -bp --short-circuit --nodeps --define '_topdir /tmp/B.XLGGGD' --define '_specdir %{_topdir}' --define '_sourcedir %{_specdir}' --define '_rpmdir %{_topdir}/RPMS' --define '_builddir %{_topdir}/BUILD' --target x32-pld-linux --define 'prep exit 0' /tmp/B.XLGGGD/hiredis.spec Building target platforms: x32-pld-linux checking BuildConflict-ing packages no BuildConflicts found checking BR rpm: Building target platforms: x32-pld-linux no BR needed building RPM using: set -ex; : build-id: 28eff6ce-9485-4f29-8bf7-d9f88d2118a2; TMPDIR=/tmp/B.XLGGGD/BUILD/tmp exec nice -n 0 rpmbuild -bb --define '_smp_mflags -j9' --define '_make_opts -Otarget' --define '_pld_builder 1' --define '_topdir /tmp/B.XLGGGD' --define '_specdir %{_topdir}' --define '_sourcedir %{_specdir}' --define '_rpmdir %{_topdir}/RPMS' --define '_builddir %{_topdir}/BUILD' --target x32-pld-linux /tmp/B.XLGGGD/hiredis.spec + : build-id: 28eff6ce-9485-4f29-8bf7-d9f88d2118a2 + TMPDIR=/tmp/B.XLGGGD/BUILD/tmp + exec nice -n 0 rpmbuild -bb --define '_smp_mflags -j9' --define '_make_opts -Otarget' --define '_pld_builder 1' --define '_topdir /tmp/B.XLGGGD' --define '_specdir %{_topdir}' --define '_sourcedir %{_specdir}' --define '_rpmdir %{_topdir}/RPMS' --define '_builddir %{_topdir}/BUILD' --target x32-pld-linux /tmp/B.XLGGGD/hiredis.spec Building target platforms: x32-pld-linux Executing(%prep): /bin/sh -e /tmp/B.XLGGGD/BUILD/tmp/rpm-tmp.92344 + umask 022 + cd /tmp/B.XLGGGD/BUILD + cd /tmp/B.XLGGGD/BUILD + rm -rf hiredis-1.0.0 + /bin/gzip -dc /tmp/B.XLGGGD/hiredis-1.0.0.tar.gz + /bin/tar -xf - + STATUS=0 + '[' 0 -ne 0 ']' + cd hiredis-1.0.0 + /bin/id -u + '[' 1000 '=' 0 ']' + /bin/id -u + '[' 1000 '=' 0 ']' + /bin/chmod -Rf a+rX,u+w,g-w,o-w . + echo 'Patch #0 (link.patch):' Patch #0 (link.patch): + '[' -f /tmp/B.XLGGGD/link.patch ']' + /bin/cat /tmp/B.XLGGGD/link.patch + /usr/bin/patch -s -p1 + exit 0 Executing(%build): /bin/sh -e /tmp/B.XLGGGD/BUILD/tmp/rpm-tmp.92344 HOME=/home/users/builder PATH=/home/users/builder/GNUstep/Tools:/bin:/usr/bin:/usr/local/bin TMPDIR=/tmp/B.XLGGGD/BUILD/tmp + umask 022 + cd /tmp/B.XLGGGD/BUILD + cd hiredis-1.0.0 + /usr/bin/make -Otarget -j9 'CC=x86_64-pld-linux-gnux32-gcc' 'DEBUG=' 'LDFLAGS=-Wl,--as-needed -Wl,--no-copy-dt-needed-entries -Wl,-z,relro -Wl,-z,combreloc ' 'OPTIMIZATION=-O2 -fwrapv -pipe -Wformat -Werror=format-security -gdwarf-4 -fno-debug-types-section -fvar-tracking-assignments -g2 -Wp,-D_FORTIFY_SOURCE=2 -fstack-protector-strong --param=ssp-buffer-size=4 -Werror=trampolines -fPIC -mtune=generic -march=x86-64 -gdwarf-4 -fno-debug-types-section -fvar-tracking-assignments -g2 ' 'PREFIX=/usr' 'LIBRARY_PATH=libx32' 'USE_SSL=1' x86_64-pld-linux-gnux32-gcc -std=c99 -pedantic -c -O2 -fwrapv -pipe -Wformat -Werror=format-security -gdwarf-4 -fno-debug-types-section -fvar-tracking-assignments -g2 -Wp,-D_FORTIFY_SOURCE=2 -fstack-protector-strong --param=ssp-buffer-size=4 -Werror=trampolines -fPIC -mtune=generic -march=x86-64 -gdwarf-4 -fno-debug-types-section -fvar-tracking-assignments -g2 -fPIC -DHIREDIS_TEST_SSL -Wall -W -Wstrict-prototypes -Wwrite-strings -Wno-missing-field-initializers -g -ggdb alloc.c x86_64-pld-linux-gnux32-gcc -std=c99 -pedantic -c -O2 -fwrapv -pipe -Wformat -Werror=format-security -gdwarf-4 -fno-debug-types-section -fvar-tracking-assignments -g2 -Wp,-D_FORTIFY_SOURCE=2 -fstack-protector-strong --param=ssp-buffer-size=4 -Werror=trampolines -fPIC -mtune=generic -march=x86-64 -gdwarf-4 -fno-debug-types-section -fvar-tracking-assignments -g2 -fPIC -DHIREDIS_TEST_SSL -Wall -W -Wstrict-prototypes -Wwrite-strings -Wno-missing-field-initializers -g -ggdb sockcompat.c Generating hiredis.pc for pkgconfig... Generating hiredis_ssl.pc for pkgconfig... x86_64-pld-linux-gnux32-gcc -std=c99 -pedantic -c -O2 -fwrapv -pipe -Wformat -Werror=format-security -gdwarf-4 -fno-debug-types-section -fvar-tracking-assignments -g2 -Wp,-D_FORTIFY_SOURCE=2 -fstack-protector-strong --param=ssp-buffer-size=4 -Werror=trampolines -fPIC -mtune=generic -march=x86-64 -gdwarf-4 -fno-debug-types-section -fvar-tracking-assignments -g2 -fPIC -DHIREDIS_TEST_SSL -Wall -W -Wstrict-prototypes -Wwrite-strings -Wno-missing-field-initializers -g -ggdb net.c x86_64-pld-linux-gnux32-gcc -std=c99 -pedantic -c -O2 -fwrapv -pipe -Wformat -Werror=format-security -gdwarf-4 -fno-debug-types-section -fvar-tracking-assignments -g2 -Wp,-D_FORTIFY_SOURCE=2 -fstack-protector-strong --param=ssp-buffer-size=4 -Werror=trampolines -fPIC -mtune=generic -march=x86-64 -gdwarf-4 -fno-debug-types-section -fvar-tracking-assignments -g2 -fPIC -DHIREDIS_TEST_SSL -Wall -W -Wstrict-prototypes -Wwrite-strings -Wno-missing-field-initializers -g -ggdb ssl.c x86_64-pld-linux-gnux32-gcc -shared -Wl,-soname,libhiredis_ssl.so.1.0.0 -o libhiredis_ssl.so ssl.o libhiredis.so -Wl,--as-needed -Wl,--no-copy-dt-needed-entries -Wl,-z,relro -Wl,-z,combreloc -Wl,--as-needed -Wl,--no-copy-dt-needed-entries -Wl,-z,relro -Wl,-z,combreloc -lssl -lcrypto x86_64-pld-linux-gnux32-gcc: error: libhiredis.so: No such file or directory make: *** [Makefile:130: libhiredis_ssl.so] Error 1 make: *** Waiting for unfinished jobs.... ar rcs libhiredis_ssl.a ssl.o x86_64-pld-linux-gnux32-gcc -std=c99 -pedantic -c -O2 -fwrapv -pipe -Wformat -Werror=format-security -gdwarf-4 -fno-debug-types-section -fvar-tracking-assignments -g2 -Wp,-D_FORTIFY_SOURCE=2 -fstack-protector-strong --param=ssp-buffer-size=4 -Werror=trampolines -fPIC -mtune=generic -march=x86-64 -gdwarf-4 -fno-debug-types-section -fvar-tracking-assignments -g2 -fPIC -DHIREDIS_TEST_SSL -Wall -W -Wstrict-prototypes -Wwrite-strings -Wno-missing-field-initializers -g -ggdb read.c x86_64-pld-linux-gnux32-gcc -std=c99 -pedantic -c -O2 -fwrapv -pipe -Wformat -Werror=format-security -gdwarf-4 -fno-debug-types-section -fvar-tracking-assignments -g2 -Wp,-D_FORTIFY_SOURCE=2 -fstack-protector-strong --param=ssp-buffer-size=4 -Werror=trampolines -fPIC -mtune=generic -march=x86-64 -gdwarf-4 -fno-debug-types-section -fvar-tracking-assignments -g2 -fPIC -DHIREDIS_TEST_SSL -Wall -W -Wstrict-prototypes -Wwrite-strings -Wno-missing-field-initializers -g -ggdb async.c x86_64-pld-linux-gnux32-gcc -std=c99 -pedantic -c -O2 -fwrapv -pipe -Wformat -Werror=format-security -gdwarf-4 -fno-debug-types-section -fvar-tracking-assignments -g2 -Wp,-D_FORTIFY_SOURCE=2 -fstack-protector-strong --param=ssp-buffer-size=4 -Werror=trampolines -fPIC -mtune=generic -march=x86-64 -gdwarf-4 -fno-debug-types-section -fvar-tracking-assignments -g2 -fPIC -DHIREDIS_TEST_SSL -Wall -W -Wstrict-prototypes -Wwrite-strings -Wno-missing-field-initializers -g -ggdb hiredis.c x86_64-pld-linux-gnux32-gcc -std=c99 -pedantic -c -O2 -fwrapv -pipe -Wformat -Werror=format-security -gdwarf-4 -fno-debug-types-section -fvar-tracking-assignments -g2 -Wp,-D_FORTIFY_SOURCE=2 -fstack-protector-strong --param=ssp-buffer-size=4 -Werror=trampolines -fPIC -mtune=generic -march=x86-64 -gdwarf-4 -fno-debug-types-section -fvar-tracking-assignments -g2 -fPIC -DHIREDIS_TEST_SSL -Wall -W -Wstrict-prototypes -Wwrite-strings -Wno-missing-field-initializers -g -ggdb sds.c x86_64-pld-linux-gnux32-gcc -std=c99 -pedantic -c -O2 -fwrapv -pipe -Wformat -Werror=format-security -gdwarf-4 -fno-debug-types-section -fvar-tracking-assignments -g2 -Wp,-D_FORTIFY_SOURCE=2 -fstack-protector-strong --param=ssp-buffer-size=4 -Werror=trampolines -fPIC -mtune=generic -march=x86-64 -gdwarf-4 -fno-debug-types-section -fvar-tracking-assignments -g2 -fPIC -DHIREDIS_TEST_SSL -Wall -W -Wstrict-prototypes -Wwrite-strings -Wno-missing-field-initializers -g -ggdb test.c error: Bad exit status from /tmp/B.XLGGGD/BUILD/tmp/rpm-tmp.92344 (%build) RPM build errors: Bad exit status from /tmp/B.XLGGGD/BUILD/tmp/rpm-tmp.92344 (%build) ended at: Tue Oct 13 06:24:19 2020, done in 0:00:01.501710 error: No files produced. + chmod -R u+rwX /tmp/B.XLGGGD/BUILD + rm -rf /tmp/B.XLGGGD/tmp /tmp/B.XLGGGD/BUILD + rm -rf /tmp/B.XLGGGD Begin-PLD-Builder-Info Build-Time: user:5.01s sys:0.41s real:4.00s (faults io:0 non-io:140530) End-PLD-Builder-Info
[Back to list of logs] [View rpm -qa of builder]