FailedOk

th/SRPMS[OK]
th/x32[OK]
th/i686[OK]
th/x86_64[OK]

ac/SRPMS[OK]
ac/i386[OK]
ac/i586[OK]
ac/i686[OK]
ac/alpha[OK]
ac/amd64[OK]
ac/athlon[OK]
ac/ppc[OK]
ac/sparc[OK]
ac/sparc64[OK]

Advanced Search
main()
Powered by PLD Linux
(c) 2002-2020 PLD Team
$Revision: 1.37 $
Powered by PDP-7.
Your IP: 35.172.233.215

hwsd aa820974-fad8-4d8a-8a9b-43cf6de769a4

Status:Failed
Source URL:https://buildlogs.pld-linux.org/pld/th/x32/FAIL/hwsd,aa820974-fad8-4d8a-8a9b-43cf6de769a4.bz2
text/plain URL:View!
rpm -qa of builder:View!
Date:2020/07/31 22:36:34
Runtime:0:00:09.174141

Toc:

  • error 1
  • rpm: error: Failed build dependencies:
  • error 2
  • rpm: error: Failed build dependencies:
  • prep
  • Executing(%prep): /bin/sh -e /tmp/B.S8s1z3/BUILD/tmp/rpm-tmp.64458
  • build
  • Executing(%build): /bin/sh -e /tmp/B.S8s1z3/BUILD/tmp/rpm-tmp.64458
  • error 3
  • /usr/include/bits/string_fortified.h:106:34: error: 'char* __builtin_strncpy(char*, const char*, unsigned int)' specified bound 4 equals destination size [-Werror=stringop-truncation]
  • error 4
  • make[2]: *** [hwsd/CMakeFiles/hwsd.dir/build.make:138: hwsd/CMakeFiles/hwsd.dir/gpuInfo.cpp.o] Error 1
  • error 5
  • make[1]: *** [CMakeFiles/Makefile2:1271: hwsd/CMakeFiles/hwsd.dir/all] Error 2
  • error 6
  • error: Bad exit status from /tmp/B.S8s1z3/BUILD/tmp/rpm-tmp.64458 (%build)
  • error 7
  • RPM build errors:
  • error 8
  • error: No files produced.

Content:

request from: qboosh
checking if we should skip the build
started at: Fri Jul 31 22:36:06 2020
killing old processes on a builder
sending signal 9 to pid -1
Killed
cleaning up /tmp
fetching https://srcbuilder.pld-linux.org/th//srpms/aa820974-fad8-4d8a-8a9b-43cf6de769a4/hwsd-2.0.1-2.src.rpm
fetched 58580 bytes, 224.4 K/s
installing srpm: hwsd-2.0.1-2.src.rpm
+ install -d /tmp/B.S8s1z3/BUILD /tmp/B.S8s1z3/RPMS
+ LC_ALL=en_US.UTF-8
+ rpm -qp --changelog hwsd-2.0.1-2.src.rpm
* Fri Jul 31 2020 PLD Linux Team <feedback@pld-linux.org>
- For complete changelog see: http://git.pld-linux.org/?p=packages/hwsd.git;a=log;h=master
* Wed Oct 09 2019 Adam Gołębiowski <adamg@pld-linux.org> bafa3cc
- release 2, rebuild against boost-1.71 + rpm -Uhv --nodeps --define '_topdir /tmp/B.S8s1z3' --define '_specdir %{_topdir}' --define '_sourcedir %{_specdir}' --define '_rpmdir %{_topdir}/RPMS' --define '_builddir %{_topdir}/BUILD' hwsd-2.0.1-2.src.rpm Preparing... ################################################## hwsd ################################################## + rm -f hwsd-2.0.1-2.src.rpm + install -m 700 -d /tmp/B.S8s1z3/BUILD/tmp + TMPDIR=/tmp/B.S8s1z3/BUILD/tmp + exec nice -n 0 rpmbuild -bp --short-circuit --nodeps --define '_topdir /tmp/B.S8s1z3' --define '_specdir %{_topdir}' --define '_sourcedir %{_specdir}' --define '_rpmdir %{_topdir}/RPMS' --define '_builddir %{_topdir}/BUILD' --target x32-pld-linux --define 'prep exit 0' /tmp/B.S8s1z3/hwsd.spec Building target platforms: x32-pld-linux checking BuildConflict-ing packages no BuildConflicts found checking BR rpm: error: Failed build dependencies: rpm: Lunchbox-devel >= 1.10 is needed by hwsd-2.0.1-2.src rpm: Building target platforms: x32-pld-linux updating poldek cache... ready is up to date th is up to date th is up to date th-ready is up to date th-ready is up to date Retrieving diff::packages.ndir.2020.07.31-18.12.07.gz......................................done Loading [pndir]th-test... Applying packages.ndir.2020.07.31-18.12.07.gz... Retrieving diff::packages.ndir.2020.07.31-19.36.02.gz......................................done Applying packages.ndir.2020.07.31-19.36.02.gz... Writing /root/.cache/poldek/[...]/packages.ndir.gz... Retrieving th-test::packages.ndir.diff.toc.gz..............................................done Loading [pndir]th-test... Applying packages.ndir.2020.07.31-18.35.02.gz... Retrieving diff::packages.ndir.2020.07.31-19.04.01.gz......................................done Applying packages.ndir.2020.07.31-19.04.01.gz... Retrieving diff::packages.ndir.2020.07.31-19.36.02.gz......................................done Applying packages.ndir.2020.07.31-19.36.02.gz... Retrieving diff::packages.ndir.2020.07.31-19.46.01.gz......................................done Applying packages.ndir.2020.07.31-19.46.01.gz... Retrieving diff::packages.ndir.2020.07.31-19.51.01.gz......................................done Applying packages.ndir.2020.07.31-19.51.01.gz... Retrieving diff::packages.ndir.2020.07.31-20.31.02.gz......................................done Applying packages.ndir.2020.07.31-20.31.02.gz... Writing /root/.cache/poldek/[...]/packages.ndir.gz... checking conflicting packages in BRed packages poldek: Loading [pndir]ready... poldek: Loading [pndir]th-test... poldek: Loading [pndir]th-test... poldek: Loading [pndir]th-ready... poldek: Loading [pndir]th-ready... poldek: Loading [pndir]th... poldek: Loading [pndir]th... poldek: 28075 packages read poldek: Removed 2414 duplicate packages from available set poldek: Processing dependencies... poldek: Lunchbox-devel-1.17.0-3.x32 marks Lunchbox-1.17.0-3.x32 (cap /usr/share/Lunchbox) poldek: There are 2 packages to install (1 marked by dependencies): poldek: A Lunchbox-1.17.0-3.x32 Lunchbox-devel-1.17.0-3.x32 poldek: This operation will use 585.8KB of disk space. poldek: Need to get 158.6KB of archives. poldek: Executing pm-command.sh --upgrade -vh --test --root / --define _check_dirname_deps 1... poldek: Preparing... ################################################## no conflicts found checking BR rpm: error: Failed build dependencies: rpm: Lunchbox-devel >= 1.10 is needed by hwsd-2.0.1-2.src rpm: Building target platforms: x32-pld-linux installing BR: Lunchbox\-devel + poldek --noask --caplookup -Q -v '--ignore=hhvm-*' '--ignore=php4-*' '--ignore=php52-*' '--ignore=php54-*' '--ignore=php55-*' '--ignore=php56-*' '--ignore=php70-*' '--ignore=php71-*' '--ignore=php72-*' '--ignore=php73-*' '--ignore=php74-*' --upgrade Lunchbox-devel Loading [pndir]ready... Loading [pndir]th-test... Loading [pndir]th-test... Loading [pndir]th-ready... Loading [pndir]th-ready... Loading [pndir]th... Loading [pndir]th... 28075 packages read Removed 2414 duplicate packages from available set Processing dependencies... Lunchbox-devel-1.17.0-3.x32 marks Lunchbox-1.17.0-3.x32 (cap /usr/share/Lunchbox) There are 2 packages to install (1 marked by dependencies): A Lunchbox-1.17.0-3.x32 Lunchbox-devel-1.17.0-3.x32 This operation will use 585.8KB of disk space. Need to get 158.6KB of archives. Executing pm-command.sh --upgrade -vh --root / --define _check_dirname_deps 1... Preparing... ################################################## Lunchbox ################################################## Lunchbox-devel ################################################## building RPM using: set -ex; : build-id: aa820974-fad8-4d8a-8a9b-43cf6de769a4; TMPDIR=/tmp/B.S8s1z3/BUILD/tmp exec nice -n 0 rpmbuild -bb --define '_smp_mflags -j9' --define '_make_opts -Otarget' --define '_pld_builder 1' --define '_topdir /tmp/B.S8s1z3' --define '_specdir %{_topdir}' --define '_sourcedir %{_specdir}' --define '_rpmdir %{_topdir}/RPMS' --define '_builddir %{_topdir}/BUILD' --target x32-pld-linux /tmp/B.S8s1z3/hwsd.spec + : build-id: aa820974-fad8-4d8a-8a9b-43cf6de769a4 + TMPDIR=/tmp/B.S8s1z3/BUILD/tmp + exec nice -n 0 rpmbuild -bb --define '_smp_mflags -j9' --define '_make_opts -Otarget' --define '_pld_builder 1' --define '_topdir /tmp/B.S8s1z3' --define '_specdir %{_topdir}' --define '_sourcedir %{_specdir}' --define '_rpmdir %{_topdir}/RPMS' --define '_builddir %{_topdir}/BUILD' --target x32-pld-linux /tmp/B.S8s1z3/hwsd.spec Building target platforms: x32-pld-linux Executing(%prep): /bin/sh -e /tmp/B.S8s1z3/BUILD/tmp/rpm-tmp.64458 + umask 022 + cd /tmp/B.S8s1z3/BUILD + cd /tmp/B.S8s1z3/BUILD + rm -rf hwsd-2.0.1 + /bin/gzip -dc /tmp/B.S8s1z3/hwsd-2.0.1.tar.gz + /bin/tar -xf - + STATUS=0 + '[' 0 -ne 0 ']' + cd hwsd-2.0.1 + /bin/id -u + '[' 1000 '=' 0 ']' + /bin/id -u + '[' 1000 '=' 0 ']' + /bin/chmod -Rf a+rX,u+w,g-w,o-w . + echo 'Patch #0 (servus.patch):' Patch #0 (servus.patch): + '[' -f /tmp/B.S8s1z3/servus.patch ']' + /bin/cat /tmp/B.S8s1z3/servus.patch + /usr/bin/patch -s -p1 + rmdir CMake/common + ln -s /usr/share/Eyescale-CMake CMake/common + exit 0 Executing(%build): /bin/sh -e /tmp/B.S8s1z3/BUILD/tmp/rpm-tmp.64458 HOME=/home/users/builder PATH=/home/users/builder/GNUstep/Tools:/bin:/usr/bin:/usr/local/bin TMPDIR=/tmp/B.S8s1z3/BUILD/tmp + umask 022 + cd /tmp/B.S8s1z3/BUILD + cd hwsd-2.0.1 + install -d build + cd build + CC=x86_64-pld-linux-gnux32-gcc CXX=x86_64-pld-linux-gnux32-g++ CPPFLAGS='' /usr/bin/cmake -Wno-dev '-DCMAKE_VERBOSE_MAKEFILE=ON' '-DCMAKE_BUILD_TYPE=PLD' '-DCMAKE_INSTALL_BINDIR:PATH=/usr/bin' '-DCMAKE_INSTALL_SBINDIR:PATH=/usr/sbin' '-DCMAKE_INSTALL_LIBEXECDIR:PATH=/usr/libexec' '-DCMAKE_INSTALL_SYSCONFDIR:PATH=/etc' '-DCMAKE_INSTALL_SHAREDSTATEDIRPATH:PATH=/var/lib' '-DCMAKE_INSTALL_LOCALSTATEDIRPATH:PATH=/var' '-DCMAKE_INSTALL_LIBDIR:PATH=/usr/libx32' '-DCMAKE_INSTALL_INCLUDEDIR:PATH=/usr/include' '-DCMAKE_INSTALL_OLDINCLUDEDIR:PATH=/usr/include' '-DCMAKE_INSTALL_DATAROOTDIR:PATH=/usr/share' '-DCMAKE_INSTALL_DATADIR:PATH=/usr/share' '-DCMAKE_INSTALL_INFODIR:PATH=/usr/share/info' '-DCMAKE_INSTALL_LOCALEDIR:PATH=/usr/share/locale' '-DCMAKE_INSTALL_MANDIR:PATH=/usr/share/man' '-DCMAKE_INSTALL_DOCDIR:PATH=/usr/share/doc' '-DCMAKE_INSTALL_PREFIX:PATH=/usr' '-DSYSCONF_INSTALL_DIR:PATH=/etc' '-DCMAKE_CXX_FLAGS_PLD=-O2 -fwrapv -pipe -Wformat -Werror=format-security -gdwarf-4 -fno-debug-types-section -fvar-tracking-assignments -g2 -Wp,-D_FORTIFY_SOURCE=2 -fstack-protector-strong --param=ssp-buffer-size=4 -Werror=trampolines -fPIC -mtune=generic -march=x86-64 -gdwarf-4 -fno-debug-types-section -fvar-tracking-assignments -g2 -DNDEBUG -DQT_NO_DEBUG' '-DCMAKE_C_FLAGS_PLD=-O2 -fwrapv -pipe -Wformat -Werror=format-security -gdwarf-4 -fno-debug-types-section -fvar-tracking-assignments -g2 -Wp,-D_FORTIFY_SOURCE=2 -fstack-protector-strong --param=ssp-buffer-size=4 -Werror=trampolines -fPIC -mtune=generic -march=x86-64 -gdwarf-4 -fno-debug-types-section -fvar-tracking-assignments -g2 -DNDEBUG -DQT_NO_DEBUG' '-DCMAKE_Fortran_FLAGS_PLD=-O2 -fwrapv -pipe -Wformat -Werror=format-security -gdwarf-4 -fno-debug-types-section -fvar-tracking-assignments -g2 -Wp,-D_FORTIFY_SOURCE=2 -fstack-protector-strong --param=ssp-buffer-size=4 -Werror=trampolines -fPIC -mtune=generic -march=x86-64 -gdwarf-4 -fno-debug-types-section -fvar-tracking-assignments -g2 -DNDEBUG -DQT_NO_DEBUG' '-DCMAKE_EXE_LINKER_FLAGS_PLD=-Wl,--as-needed -Wl,--no-copy-dt-needed-entries -Wl,-z,relro -Wl,-z,combreloc ' '-DCMAKE_SHARED_LINKER_FLAGS_PLD=-Wl,--as-needed -Wl,--no-copy-dt-needed-entries -Wl,-z,relro -Wl,-z,combreloc ' '-DCMAKE_MODULE_LINKER_FLAGS_PLD=-Wl,--as-needed -Wl,--no-copy-dt-needed-entries -Wl,-z,relro -Wl,-z,combreloc ' '-DLIB_SUFFIX=x32' '-DBUILD_SHARED_LIBS:BOOL=ON' .. -- The C compiler identification is GNU 10.2.0 -- The CXX compiler identification is GNU 10.2.0 -- Check for working C compiler: /usr/bin/x86_64-pld-linux-gnux32-gcc -- Check for working C compiler: /usr/bin/x86_64-pld-linux-gnux32-gcc - works -- Detecting C compiler ABI info -- Detecting C compiler ABI info - done -- Detecting C compile features -- Detecting C compile features - done -- Check for working CXX compiler: /usr/bin/x86_64-pld-linux-gnux32-g++ -- Check for working CXX compiler: /usr/bin/x86_64-pld-linux-gnux32-g++ - works -- Detecting CXX compiler ABI info -- Detecting CXX compiler ABI info - done -- Detecting CXX compile features -- Detecting CXX compile features - done CMake Warning at /usr/share/cmake/Modules/FindBoost.cmake:2003 (message): No header defined for python-py39; skipping header check (note: header-only libraries have no designated component) Call Stack (most recent call first): CMake/common/ChoosePython.cmake:57 (find_package) CMake/common/Common.cmake:134 (include) CMakeLists.txt:19 (include) CMake Warning at /usr/share/cmake/Modules/FindBoost.cmake:2003 (message): No header defined for python-py38; skipping header check (note: header-only libraries have no designated component) Call Stack (most recent call first): CMake/common/ChoosePython.cmake:57 (find_package) CMake/common/Common.cmake:134 (include) CMakeLists.txt:19 (include) CMake Warning at /usr/share/cmake/Modules/FindBoost.cmake:2003 (message): No header defined for python-py37; skipping header check (note: header-only libraries have no designated component) Call Stack (most recent call first): CMake/common/ChoosePython.cmake:57 (find_package) CMake/common/Common.cmake:134 (include) CMakeLists.txt:19 (include) CMake Warning at /usr/share/cmake/Modules/FindBoost.cmake:2003 (message): No header defined for python-py36; skipping header check (note: header-only libraries have no designated component) Call Stack (most recent call first): CMake/common/ChoosePython.cmake:57 (find_package) CMake/common/Common.cmake:134 (include) CMakeLists.txt:19 (include) CMake Warning at /usr/share/cmake/Modules/FindBoost.cmake:2003 (message): No header defined for python-py35; skipping header check (note: header-only libraries have no designated component) Call Stack (most recent call first): CMake/common/ChoosePython.cmake:57 (find_package) CMake/common/Common.cmake:134 (include) CMakeLists.txt:19 (include) CMake Warning at /usr/share/cmake/Modules/FindBoost.cmake:2003 (message): No header defined for python-py34; skipping header check (note: header-only libraries have no designated component) Call Stack (most recent call first): CMake/common/ChoosePython.cmake:57 (find_package) CMake/common/Common.cmake:134 (include) CMakeLists.txt:19 (include) CMake Warning at /usr/share/cmake/Modules/FindBoost.cmake:2003 (message): No header defined for python-py34; skipping header check (note: header-only libraries have no designated component) Call Stack (most recent call first): CMake/common/ChoosePython.cmake:57 (find_package) CMake/common/Common.cmake:134 (include) CMakeLists.txt:19 (include) CMake Warning at /usr/share/cmake/Modules/FindBoost.cmake:2003 (message): No header defined for python-py33; skipping header check (note: header-only libraries have no designated component) Call Stack (most recent call first): CMake/common/ChoosePython.cmake:57 (find_package) CMake/common/Common.cmake:134 (include) CMakeLists.txt:19 (include) CMake Warning at /usr/share/cmake/Modules/FindBoost.cmake:2003 (message): No header defined for python-py32; skipping header check (note: header-only libraries have no designated component) Call Stack (most recent call first): CMake/common/ChoosePython.cmake:57 (find_package) CMake/common/Common.cmake:134 (include) CMakeLists.txt:19 (include) -- WARNING: Can't detect whether CPPCHECK wants new or old-style arguments! -- Check if the system is big endian -- Searching 16 bit integer -- Looking for sys/types.h -- Looking for sys/types.h - found -- Looking for stdint.h -- Looking for stdint.h - found -- Looking for stddef.h -- Looking for stddef.h - found -- Check size of unsigned short -- Check size of unsigned short - done -- Searching 16 bit integer - Using unsigned short -- Check if the system is big endian - little endian -- hwsd [] -- Configuring done -- Generating done CMake Warning: Manually-specified variables were not used by the project: CMAKE_Fortran_FLAGS_PLD CMAKE_INSTALL_BINDIR CMAKE_INSTALL_DATADIR CMAKE_INSTALL_DATAROOTDIR CMAKE_INSTALL_DOCDIR CMAKE_INSTALL_INCLUDEDIR CMAKE_INSTALL_INFODIR CMAKE_INSTALL_LIBDIR CMAKE_INSTALL_LIBEXECDIR CMAKE_INSTALL_LOCALEDIR CMAKE_INSTALL_LOCALSTATEDIRPATH CMAKE_INSTALL_MANDIR CMAKE_INSTALL_OLDINCLUDEDIR CMAKE_INSTALL_SBINDIR CMAKE_INSTALL_SHAREDSTATEDIRPATH CMAKE_INSTALL_SYSCONFDIR SYSCONF_INSTALL_DIR -- Build files have been written to: /tmp/B.S8s1z3/BUILD/hwsd-2.0.1/build + /usr/bin/make -Otarget -j9 /usr/bin/cmake -S/tmp/B.S8s1z3/BUILD/hwsd-2.0.1 -B/tmp/B.S8s1z3/BUILD/hwsd-2.0.1/build --check-build-system CMakeFiles/Makefile.cmake 0 /usr/bin/cmake -E cmake_progress_start /tmp/B.S8s1z3/BUILD/hwsd-2.0.1/build/CMakeFiles /tmp/B.S8s1z3/BUILD/hwsd-2.0.1/build/CMakeFiles/progress.marks /usr/bin/make -f CMakeFiles/Makefile2 all /usr/bin/make -f hwsd/CMakeFiles/hwsd_autogen.dir/build.make hwsd/CMakeFiles/hwsd_autogen.dir/depend make[2]: Entering directory '/tmp/B.S8s1z3/BUILD/hwsd-2.0.1/build' cd /tmp/B.S8s1z3/BUILD/hwsd-2.0.1/build && /usr/bin/cmake -E cmake_depends "Unix Makefiles" /tmp/B.S8s1z3/BUILD/hwsd-2.0.1 /tmp/B.S8s1z3/BUILD/hwsd-2.0.1/hwsd /tmp/B.S8s1z3/BUILD/hwsd-2.0.1/build /tmp/B.S8s1z3/BUILD/hwsd-2.0.1/build/hwsd /tmp/B.S8s1z3/BUILD/hwsd-2.0.1/build/hwsd/CMakeFiles/hwsd_autogen.dir/DependInfo.cmake --color= Scanning dependencies of target hwsd_autogen make[2]: Leaving directory '/tmp/B.S8s1z3/BUILD/hwsd-2.0.1/build' /usr/bin/make -f hwsd/CMakeFiles/hwsd_autogen.dir/build.make hwsd/CMakeFiles/hwsd_autogen.dir/build make[2]: Entering directory '/tmp/B.S8s1z3/BUILD/hwsd-2.0.1/build' [ 2%] Automatic MOC for target hwsd cd /tmp/B.S8s1z3/BUILD/hwsd-2.0.1/build/hwsd && /usr/bin/cmake -E cmake_autogen /tmp/B.S8s1z3/BUILD/hwsd-2.0.1/build/hwsd/CMakeFiles/hwsd_autogen.dir/AutogenInfo.json PLD make[2]: Leaving directory '/tmp/B.S8s1z3/BUILD/hwsd-2.0.1/build' make[1]: Entering directory '/tmp/B.S8s1z3/BUILD/hwsd-2.0.1/build' [ 2%] Built target hwsd_autogen make[1]: Leaving directory '/tmp/B.S8s1z3/BUILD/hwsd-2.0.1/build' /usr/bin/make -f hwsd/CMakeFiles/hwsd.dir/build.make hwsd/CMakeFiles/hwsd.dir/depend make[2]: Entering directory '/tmp/B.S8s1z3/BUILD/hwsd-2.0.1/build' cd /tmp/B.S8s1z3/BUILD/hwsd-2.0.1/build && /usr/bin/cmake -E cmake_depends "Unix Makefiles" /tmp/B.S8s1z3/BUILD/hwsd-2.0.1 /tmp/B.S8s1z3/BUILD/hwsd-2.0.1/hwsd /tmp/B.S8s1z3/BUILD/hwsd-2.0.1/build /tmp/B.S8s1z3/BUILD/hwsd-2.0.1/build/hwsd /tmp/B.S8s1z3/BUILD/hwsd-2.0.1/build/hwsd/CMakeFiles/hwsd.dir/DependInfo.cmake --color= Scanning dependencies of target hwsd make[2]: Leaving directory '/tmp/B.S8s1z3/BUILD/hwsd-2.0.1/build' /usr/bin/make -f hwsd/CMakeFiles/hwsd.dir/build.make hwsd/CMakeFiles/hwsd.dir/build make[2]: Entering directory '/tmp/B.S8s1z3/BUILD/hwsd-2.0.1/build' [ 5%] Building CXX object hwsd/CMakeFiles/hwsd.dir/hwsd_autogen/mocs_compilation.cpp.o cd /tmp/B.S8s1z3/BUILD/hwsd-2.0.1/build/hwsd && /usr/bin/x86_64-pld-linux-gnux32-g++ -DBOOST_ALL_NO_LIB -DBoost_NO_BOOST_CMAKE -DHWSD_LITTLEENDIAN=1 -DHWSD_SHARED -DHWSD_SHARED_INL -DHWSD_USE_BOOST=1 -DHWSD_USE_CXX11=1 -DHWSD_USE_LUNCHBOX=1 -DHWSD_USE_OPENGL=1 -DHWSD_USE_QT5CORE=1 -DHWSD_USE_QT5NETWORK=1 -DHWSD_USE_SERVUS=1 -DHWSD_USE_X11=1 -DLinux=1 -DQT_CORE_LIB -DQT_NETWORK_LIB -DQT_NO_DEBUG -DWARN_DEPRECATED -Dhwsd_EXPORTS -I/tmp/B.S8s1z3/BUILD/hwsd-2.0.1/build/hwsd/hwsd_autogen/include -I/tmp/B.S8s1z3/BUILD/hwsd-2.0.1 -I/tmp/B.S8s1z3/BUILD/hwsd-2.0.1/build/include -I/tmp/B.S8s1z3/BUILD/hwsd-2.0.1/build -isystem /usr/include/qt5 -isystem /usr/include/qt5/QtCore -isystem /usr/libx32/qt5/./mkspecs/linux-g++ -isystem /usr/include/qt5/QtNetwork -O2 -fwrapv -pipe -Wformat -Werror=format-security -gdwarf-4 -fno-debug-types-section -fvar-tracking-assignments -g2 -Wp,-D_FORTIFY_SOURCE=2 -fstack-protector-strong --param=ssp-buffer-size=4 -Werror=trampolines -fPIC -mtune=generic -march=x86-64 -gdwarf-4 -fno-debug-types-section -fvar-tracking-assignments -g2 -DNDEBUG -DQT_NO_DEBUG -fPIC -Wnon-virtual-dtor -Wsign-promo -Wvla -fno-strict-aliasing -Wall -Wextra -Winvalid-pch -Winit-self -Wno-unknown-pragmas -Wshadow -Werror -fmax-errors=5 -fPIC -std=gnu++11 -o CMakeFiles/hwsd.dir/hwsd_autogen/mocs_compilation.cpp.o -c /tmp/B.S8s1z3/BUILD/hwsd-2.0.1/build/hwsd/hwsd_autogen/mocs_compilation.cpp make[2]: Leaving directory '/tmp/B.S8s1z3/BUILD/hwsd-2.0.1/build' make[2]: Entering directory '/tmp/B.S8s1z3/BUILD/hwsd-2.0.1/build' [ 13%] Building CXX object hwsd/CMakeFiles/hwsd.dir/version.cpp.o cd /tmp/B.S8s1z3/BUILD/hwsd-2.0.1/build/hwsd && /usr/bin/x86_64-pld-linux-gnux32-g++ -DBOOST_ALL_NO_LIB -DBoost_NO_BOOST_CMAKE -DHWSD_LITTLEENDIAN=1 -DHWSD_SHARED -DHWSD_SHARED_INL -DHWSD_USE_BOOST=1 -DHWSD_USE_CXX11=1 -DHWSD_USE_LUNCHBOX=1 -DHWSD_USE_OPENGL=1 -DHWSD_USE_QT5CORE=1 -DHWSD_USE_QT5NETWORK=1 -DHWSD_USE_SERVUS=1 -DHWSD_USE_X11=1 -DLinux=1 -DQT_CORE_LIB -DQT_NETWORK_LIB -DQT_NO_DEBUG -DWARN_DEPRECATED -Dhwsd_EXPORTS -I/tmp/B.S8s1z3/BUILD/hwsd-2.0.1/build/hwsd/hwsd_autogen/include -I/tmp/B.S8s1z3/BUILD/hwsd-2.0.1 -I/tmp/B.S8s1z3/BUILD/hwsd-2.0.1/build/include -I/tmp/B.S8s1z3/BUILD/hwsd-2.0.1/build -isystem /usr/include/qt5 -isystem /usr/include/qt5/QtCore -isystem /usr/libx32/qt5/./mkspecs/linux-g++ -isystem /usr/include/qt5/QtNetwork -O2 -fwrapv -pipe -Wformat -Werror=format-security -gdwarf-4 -fno-debug-types-section -fvar-tracking-assignments -g2 -Wp,-D_FORTIFY_SOURCE=2 -fstack-protector-strong --param=ssp-buffer-size=4 -Werror=trampolines -fPIC -mtune=generic -march=x86-64 -gdwarf-4 -fno-debug-types-section -fvar-tracking-assignments -g2 -DNDEBUG -DQT_NO_DEBUG -fPIC -Wnon-virtual-dtor -Wsign-promo -Wvla -fno-strict-aliasing -Wall -Wextra -Winvalid-pch -Winit-self -Wno-unknown-pragmas -Wshadow -Werror -fmax-errors=5 -fPIC -std=gnu++11 -o CMakeFiles/hwsd.dir/version.cpp.o -c /tmp/B.S8s1z3/BUILD/hwsd-2.0.1/build/hwsd/version.cpp make[2]: Leaving directory '/tmp/B.S8s1z3/BUILD/hwsd-2.0.1/build' make[2]: Entering directory '/tmp/B.S8s1z3/BUILD/hwsd-2.0.1/build' [ 18%] Building CXX object hwsd/CMakeFiles/hwsd.dir/gpuInfo.cpp.o cd /tmp/B.S8s1z3/BUILD/hwsd-2.0.1/build/hwsd && /usr/bin/x86_64-pld-linux-gnux32-g++ -DBOOST_ALL_NO_LIB -DBoost_NO_BOOST_CMAKE -DHWSD_LITTLEENDIAN=1 -DHWSD_SHARED -DHWSD_SHARED_INL -DHWSD_USE_BOOST=1 -DHWSD_USE_CXX11=1 -DHWSD_USE_LUNCHBOX=1 -DHWSD_USE_OPENGL=1 -DHWSD_USE_QT5CORE=1 -DHWSD_USE_QT5NETWORK=1 -DHWSD_USE_SERVUS=1 -DHWSD_USE_X11=1 -DLinux=1 -DQT_CORE_LIB -DQT_NETWORK_LIB -DQT_NO_DEBUG -DWARN_DEPRECATED -Dhwsd_EXPORTS -I/tmp/B.S8s1z3/BUILD/hwsd-2.0.1/build/hwsd/hwsd_autogen/include -I/tmp/B.S8s1z3/BUILD/hwsd-2.0.1 -I/tmp/B.S8s1z3/BUILD/hwsd-2.0.1/build/include -I/tmp/B.S8s1z3/BUILD/hwsd-2.0.1/build -isystem /usr/include/qt5 -isystem /usr/include/qt5/QtCore -isystem /usr/libx32/qt5/./mkspecs/linux-g++ -isystem /usr/include/qt5/QtNetwork -O2 -fwrapv -pipe -Wformat -Werror=format-security -gdwarf-4 -fno-debug-types-section -fvar-tracking-assignments -g2 -Wp,-D_FORTIFY_SOURCE=2 -fstack-protector-strong --param=ssp-buffer-size=4 -Werror=trampolines -fPIC -mtune=generic -march=x86-64 -gdwarf-4 -fno-debug-types-section -fvar-tracking-assignments -g2 -DNDEBUG -DQT_NO_DEBUG -fPIC -Wnon-virtual-dtor -Wsign-promo -Wvla -fno-strict-aliasing -Wall -Wextra -Winvalid-pch -Winit-self -Wno-unknown-pragmas -Wshadow -Werror -fmax-errors=5 -fPIC -std=gnu++11 -o CMakeFiles/hwsd.dir/gpuInfo.cpp.o -c /tmp/B.S8s1z3/BUILD/hwsd-2.0.1/hwsd/gpuInfo.cpp In file included from /usr/include/string.h:495, from /usr/include/c++/10.2.0/cstring:42, from /tmp/B.S8s1z3/BUILD/hwsd-2.0.1/hwsd/gpuInfo.h:25, from /tmp/B.S8s1z3/BUILD/hwsd-2.0.1/hwsd/gpuInfo.cpp:18: In function 'char* strncpy(char*, const char*, size_t)', inlined from 'hwsd::GPUInfo::GPUInfo(const string&)' at /tmp/B.S8s1z3/BUILD/hwsd-2.0.1/hwsd/gpuInfo.cpp:40:12: /usr/include/bits/string_fortified.h:106:34: error: 'char* __builtin_strncpy(char*, const char*, unsigned int)' specified bound 4 equals destination size [-Werror=stringop-truncation] 106 | return __builtin___strncpy_chk (__dest, __src, __len, __bos (__dest)); | ~~~~~~~~~~~~~~~~~~~~~~~~^~~~~~~~~~~~~~~~~~~~~~~~~~~~~~~~~~~~~~ cc1plus: all warnings being treated as errors make[2]: *** [hwsd/CMakeFiles/hwsd.dir/build.make:138: hwsd/CMakeFiles/hwsd.dir/gpuInfo.cpp.o] Error 1 make[2]: Leaving directory '/tmp/B.S8s1z3/BUILD/hwsd-2.0.1/build' make[2]: *** Waiting for unfinished jobs.... make[2]: Entering directory '/tmp/B.S8s1z3/BUILD/hwsd-2.0.1/build' [ 16%] Building CXX object hwsd/CMakeFiles/hwsd.dir/netInfo.cpp.o cd /tmp/B.S8s1z3/BUILD/hwsd-2.0.1/build/hwsd && /usr/bin/x86_64-pld-linux-gnux32-g++ -DBOOST_ALL_NO_LIB -DBoost_NO_BOOST_CMAKE -DHWSD_LITTLEENDIAN=1 -DHWSD_SHARED -DHWSD_SHARED_INL -DHWSD_USE_BOOST=1 -DHWSD_USE_CXX11=1 -DHWSD_USE_LUNCHBOX=1 -DHWSD_USE_OPENGL=1 -DHWSD_USE_QT5CORE=1 -DHWSD_USE_QT5NETWORK=1 -DHWSD_USE_SERVUS=1 -DHWSD_USE_X11=1 -DLinux=1 -DQT_CORE_LIB -DQT_NETWORK_LIB -DQT_NO_DEBUG -DWARN_DEPRECATED -Dhwsd_EXPORTS -I/tmp/B.S8s1z3/BUILD/hwsd-2.0.1/build/hwsd/hwsd_autogen/include -I/tmp/B.S8s1z3/BUILD/hwsd-2.0.1 -I/tmp/B.S8s1z3/BUILD/hwsd-2.0.1/build/include -I/tmp/B.S8s1z3/BUILD/hwsd-2.0.1/build -isystem /usr/include/qt5 -isystem /usr/include/qt5/QtCore -isystem /usr/libx32/qt5/./mkspecs/linux-g++ -isystem /usr/include/qt5/QtNetwork -O2 -fwrapv -pipe -Wformat -Werror=format-security -gdwarf-4 -fno-debug-types-section -fvar-tracking-assignments -g2 -Wp,-D_FORTIFY_SOURCE=2 -fstack-protector-strong --param=ssp-buffer-size=4 -Werror=trampolines -fPIC -mtune=generic -march=x86-64 -gdwarf-4 -fno-debug-types-section -fvar-tracking-assignments -g2 -DNDEBUG -DQT_NO_DEBUG -fPIC -Wnon-virtual-dtor -Wsign-promo -Wvla -fno-strict-aliasing -Wall -Wextra -Winvalid-pch -Winit-self -Wno-unknown-pragmas -Wshadow -Werror -fmax-errors=5 -fPIC -std=gnu++11 -o CMakeFiles/hwsd.dir/netInfo.cpp.o -c /tmp/B.S8s1z3/BUILD/hwsd-2.0.1/hwsd/netInfo.cpp make[2]: Leaving directory '/tmp/B.S8s1z3/BUILD/hwsd-2.0.1/build' make[2]: Entering directory '/tmp/B.S8s1z3/BUILD/hwsd-2.0.1/build' [ 21%] Building CXX object hwsd/CMakeFiles/hwsd.dir/nodeInfo.cpp.o cd /tmp/B.S8s1z3/BUILD/hwsd-2.0.1/build/hwsd && /usr/bin/x86_64-pld-linux-gnux32-g++ -DBOOST_ALL_NO_LIB -DBoost_NO_BOOST_CMAKE -DHWSD_LITTLEENDIAN=1 -DHWSD_SHARED -DHWSD_SHARED_INL -DHWSD_USE_BOOST=1 -DHWSD_USE_CXX11=1 -DHWSD_USE_LUNCHBOX=1 -DHWSD_USE_OPENGL=1 -DHWSD_USE_QT5CORE=1 -DHWSD_USE_QT5NETWORK=1 -DHWSD_USE_SERVUS=1 -DHWSD_USE_X11=1 -DLinux=1 -DQT_CORE_LIB -DQT_NETWORK_LIB -DQT_NO_DEBUG -DWARN_DEPRECATED -Dhwsd_EXPORTS -I/tmp/B.S8s1z3/BUILD/hwsd-2.0.1/build/hwsd/hwsd_autogen/include -I/tmp/B.S8s1z3/BUILD/hwsd-2.0.1 -I/tmp/B.S8s1z3/BUILD/hwsd-2.0.1/build/include -I/tmp/B.S8s1z3/BUILD/hwsd-2.0.1/build -isystem /usr/include/qt5 -isystem /usr/include/qt5/QtCore -isystem /usr/libx32/qt5/./mkspecs/linux-g++ -isystem /usr/include/qt5/QtNetwork -O2 -fwrapv -pipe -Wformat -Werror=format-security -gdwarf-4 -fno-debug-types-section -fvar-tracking-assignments -g2 -Wp,-D_FORTIFY_SOURCE=2 -fstack-protector-strong --param=ssp-buffer-size=4 -Werror=trampolines -fPIC -mtune=generic -march=x86-64 -gdwarf-4 -fno-debug-types-section -fvar-tracking-assignments -g2 -DNDEBUG -DQT_NO_DEBUG -fPIC -Wnon-virtual-dtor -Wsign-promo -Wvla -fno-strict-aliasing -Wall -Wextra -Winvalid-pch -Winit-self -Wno-unknown-pragmas -Wshadow -Werror -fmax-errors=5 -fPIC -std=gnu++11 -o CMakeFiles/hwsd.dir/nodeInfo.cpp.o -c /tmp/B.S8s1z3/BUILD/hwsd-2.0.1/hwsd/nodeInfo.cpp make[2]: Leaving directory '/tmp/B.S8s1z3/BUILD/hwsd-2.0.1/build' make[2]: Entering directory '/tmp/B.S8s1z3/BUILD/hwsd-2.0.1/build' [ 8%] Building CXX object hwsd/CMakeFiles/hwsd.dir/functions.cpp.o cd /tmp/B.S8s1z3/BUILD/hwsd-2.0.1/build/hwsd && /usr/bin/x86_64-pld-linux-gnux32-g++ -DBOOST_ALL_NO_LIB -DBoost_NO_BOOST_CMAKE -DHWSD_LITTLEENDIAN=1 -DHWSD_SHARED -DHWSD_SHARED_INL -DHWSD_USE_BOOST=1 -DHWSD_USE_CXX11=1 -DHWSD_USE_LUNCHBOX=1 -DHWSD_USE_OPENGL=1 -DHWSD_USE_QT5CORE=1 -DHWSD_USE_QT5NETWORK=1 -DHWSD_USE_SERVUS=1 -DHWSD_USE_X11=1 -DLinux=1 -DQT_CORE_LIB -DQT_NETWORK_LIB -DQT_NO_DEBUG -DWARN_DEPRECATED -Dhwsd_EXPORTS -I/tmp/B.S8s1z3/BUILD/hwsd-2.0.1/build/hwsd/hwsd_autogen/include -I/tmp/B.S8s1z3/BUILD/hwsd-2.0.1 -I/tmp/B.S8s1z3/BUILD/hwsd-2.0.1/build/include -I/tmp/B.S8s1z3/BUILD/hwsd-2.0.1/build -isystem /usr/include/qt5 -isystem /usr/include/qt5/QtCore -isystem /usr/libx32/qt5/./mkspecs/linux-g++ -isystem /usr/include/qt5/QtNetwork -O2 -fwrapv -pipe -Wformat -Werror=format-security -gdwarf-4 -fno-debug-types-section -fvar-tracking-assignments -g2 -Wp,-D_FORTIFY_SOURCE=2 -fstack-protector-strong --param=ssp-buffer-size=4 -Werror=trampolines -fPIC -mtune=generic -march=x86-64 -gdwarf-4 -fno-debug-types-section -fvar-tracking-assignments -g2 -DNDEBUG -DQT_NO_DEBUG -fPIC -Wnon-virtual-dtor -Wsign-promo -Wvla -fno-strict-aliasing -Wall -Wextra -Winvalid-pch -Winit-self -Wno-unknown-pragmas -Wshadow -Werror -fmax-errors=5 -fPIC -std=gnu++11 -o CMakeFiles/hwsd.dir/functions.cpp.o -c /tmp/B.S8s1z3/BUILD/hwsd-2.0.1/hwsd/functions.cpp make[2]: Leaving directory '/tmp/B.S8s1z3/BUILD/hwsd-2.0.1/build' make[2]: Entering directory '/tmp/B.S8s1z3/BUILD/hwsd-2.0.1/build' [ 10%] Building CXX object hwsd/CMakeFiles/hwsd.dir/filter.cpp.o cd /tmp/B.S8s1z3/BUILD/hwsd-2.0.1/build/hwsd && /usr/bin/x86_64-pld-linux-gnux32-g++ -DBOOST_ALL_NO_LIB -DBoost_NO_BOOST_CMAKE -DHWSD_LITTLEENDIAN=1 -DHWSD_SHARED -DHWSD_SHARED_INL -DHWSD_USE_BOOST=1 -DHWSD_USE_CXX11=1 -DHWSD_USE_LUNCHBOX=1 -DHWSD_USE_OPENGL=1 -DHWSD_USE_QT5CORE=1 -DHWSD_USE_QT5NETWORK=1 -DHWSD_USE_SERVUS=1 -DHWSD_USE_X11=1 -DLinux=1 -DQT_CORE_LIB -DQT_NETWORK_LIB -DQT_NO_DEBUG -DWARN_DEPRECATED -Dhwsd_EXPORTS -I/tmp/B.S8s1z3/BUILD/hwsd-2.0.1/build/hwsd/hwsd_autogen/include -I/tmp/B.S8s1z3/BUILD/hwsd-2.0.1 -I/tmp/B.S8s1z3/BUILD/hwsd-2.0.1/build/include -I/tmp/B.S8s1z3/BUILD/hwsd-2.0.1/build -isystem /usr/include/qt5 -isystem /usr/include/qt5/QtCore -isystem /usr/libx32/qt5/./mkspecs/linux-g++ -isystem /usr/include/qt5/QtNetwork -O2 -fwrapv -pipe -Wformat -Werror=format-security -gdwarf-4 -fno-debug-types-section -fvar-tracking-assignments -g2 -Wp,-D_FORTIFY_SOURCE=2 -fstack-protector-strong --param=ssp-buffer-size=4 -Werror=trampolines -fPIC -mtune=generic -march=x86-64 -gdwarf-4 -fno-debug-types-section -fvar-tracking-assignments -g2 -DNDEBUG -DQT_NO_DEBUG -fPIC -Wnon-virtual-dtor -Wsign-promo -Wvla -fno-strict-aliasing -Wall -Wextra -Winvalid-pch -Winit-self -Wno-unknown-pragmas -Wshadow -Werror -fmax-errors=5 -fPIC -std=gnu++11 -o CMakeFiles/hwsd.dir/filter.cpp.o -c /tmp/B.S8s1z3/BUILD/hwsd-2.0.1/hwsd/filter.cpp make[2]: Leaving directory '/tmp/B.S8s1z3/BUILD/hwsd-2.0.1/build' make[1]: *** [CMakeFiles/Makefile2:1271: hwsd/CMakeFiles/hwsd.dir/all] Error 2 make: *** [Makefile:186: all] Error 2 error: Bad exit status from /tmp/B.S8s1z3/BUILD/tmp/rpm-tmp.64458 (%build) RPM build errors: Bad exit status from /tmp/B.S8s1z3/BUILD/tmp/rpm-tmp.64458 (%build) ended at: Fri Jul 31 22:36:34 2020, done in 0:00:09.174141 error: No files produced. + chmod -R u+rwX /tmp/B.S8s1z3/BUILD + rm -rf /tmp/B.S8s1z3/tmp /tmp/B.S8s1z3/BUILD + rm -rf /tmp/B.S8s1z3 Begin-PLD-Builder-Info Build-Time: user:21.94s sys:3.10s real:28.64s (faults io:0 non-io:678173) End-PLD-Builder-Info
[Back to list of logs] [View rpm -qa of builder]