FailedOk

th/SRPMS[OK]
th/x32[OK]
th/i686[OK]
th/x86_64[OK]

ac/SRPMS[OK]
ac/i386[OK]
ac/i586[OK]
ac/i686[OK]
ac/alpha[OK]
ac/amd64[OK]
ac/athlon[OK]
ac/ppc[OK]
ac/sparc[OK]
ac/sparc64[OK]

Advanced Search
main()
Powered by PLD Linux
(c) 2002-2018 PLD Team
$Revision: 1.37 $
Powered by x-files.
Your IP: 54.80.83.123

kernel 32bc38e8-b936-428e-b81d-eb5567f63b96

Status:Failed
Source URL:ftp://buildlogs.pld-linux.org/th/x32/FAIL/kernel,32bc38e8-b936-428e-b81d-eb5567f63b96.bz2
text/plain URL:View!
rpm -qa of builder:View!
Date:2018/03/09 21:44:50
Runtime:0:02:12.465987

Toc:

  • prep
  • Executing(%prep): /bin/sh -e /tmp/B.5UxMYa/BUILD/tmp/rpm-tmp.96727
  • build
  • Executing(%build): /bin/sh -e /tmp/B.5UxMYa/BUILD/tmp/rpm-tmp.62843
  • error 1
  • error: No files produced.
  • error 2
  • cc1: fatal error: /tmp/B.5UxMYa/BUILD/kernel-4.15.7/linux-4.15/arch/x86/crypto/sha256-avx-asm.S: No such file or directory
  • error 3
  • compilation terminated.
  • error 4
  • make[4]: *** [/tmp/B.5UxMYa/BUILD/kernel-4.15.7/linux-4.15/scripts/Makefile.build:417: arch/x86/crypto/sha256-avx-asm.o] Error 1
  • error 5
  • make[3]: *** [/tmp/B.5UxMYa/BUILD/kernel-4.15.7/linux-4.15/scripts/Makefile.build:575: arch/x86/crypto] Error 2
  • error 6
  • /tmp/B.5UxMYa/BUILD/kernel-4.15.7/linux-4.15/include/linux/mm_types.h:18:10: fatal error: asm/mmu.h: No such file or directory
  • error 7
  • compilation terminated.
  • error 8
  • make[3]: *** [/tmp/B.5UxMYa/BUILD/kernel-4.15.7/linux-4.15/scripts/Makefile.build:317: mm/readahead.o] Error 1
  • error 9
  • /tmp/B.5UxMYa/BUILD/kernel-4.15.7/linux-4.15/include/uapi/linux/errno.h:1:10: fatal error: asm/errno.h: No such file or directory
  • error 10
  • compilation terminated.
  • error 11
  • make[4]: *** [/tmp/B.5UxMYa/BUILD/kernel-4.15.7/linux-4.15/scripts/Makefile.build:317: arch/x86/kernel/dumpstack.o] Error 1
  • error 12
  • /tmp/B.5UxMYa/BUILD/kernel-4.15.7/linux-4.15/include/uapi/linux/errno.h:1:10: fatal error: asm/errno.h: No such file or directory
  • error 13
  • compilation terminated.
  • error 14
  • make[3]: *** [/tmp/B.5UxMYa/BUILD/kernel-4.15.7/linux-4.15/scripts/Makefile.build:317: mm/swap.o] Error 1
  • error 15
  • x86_64-pld-linux-gnux32-gcc: error: /tmp/B.5UxMYa/BUILD/kernel-4.15.7/linux-4.15/arch/x86/events/intel/cstate.c: No such file or directory
  • error 16
  • x86_64-pld-linux-gnux32-gcc: fatal error: no input files
  • error 17
  • compilation terminated.
  • error 18
  • make[5]: *** [/tmp/B.5UxMYa/BUILD/kernel-4.15.7/linux-4.15/scripts/Makefile.build:317: arch/x86/events/intel/cstate.o] Error 1
  • error 19
  • /tmp/B.5UxMYa/BUILD/kernel-4.15.7/linux-4.15/include/linux/linkage.h:8:10: fatal error: asm/linkage.h: No such file or directory
  • error 20
  • compilation terminated.
  • error 21
  • /tmp/B.5UxMYa/BUILD/kernel-4.15.7/linux-4.15/include/linux/linkage.h:8:10: fatal error: asm/linkage.h: No such file or directory
  • error 22
  • compilation terminated.
  • error 23
  • make[4]: *** [/tmp/B.5UxMYa/BUILD/kernel-4.15.7/linux-4.15/scripts/Makefile.build:317: arch/x86/kernel/nmi.o] Error 1
  • error 24
  • make[3]: *** [/tmp/B.5UxMYa/BUILD/kernel-4.15.7/linux-4.15/scripts/Makefile.build:575: arch/x86/kernel] Error 2
  • error 25
  • x86_64-pld-linux-gnux32-gcc: error: /tmp/B.5UxMYa/BUILD/kernel-4.15.7/linux-4.15/arch/x86/kvm/../../../virt/kvm/eventfd.c: No such file or directory
  • error 26
  • x86_64-pld-linux-gnux32-gcc: fatal error: no input files
  • error 27
  • compilation terminated.
  • error 28
  • make[4]: *** [/tmp/B.5UxMYa/BUILD/kernel-4.15.7/linux-4.15/scripts/Makefile.build:316: arch/x86/kvm/../../../virt/kvm/eventfd.o] Error 1
  • error 29
  • cc1: fatal error: /tmp/B.5UxMYa/BUILD/kernel-4.15.7/linux-4.15/arch/x86/kvm/../../../virt/kvm/coalesced_mmio.c: No such file or directory
  • error 30
  • compilation terminated.
  • error 31
  • make[4]: *** [/tmp/B.5UxMYa/BUILD/kernel-4.15.7/linux-4.15/scripts/Makefile.build:316: arch/x86/kvm/../../../virt/kvm/coalesced_mmio.o] Error 1
  • error 32
  • /tmp/B.5UxMYa/BUILD/kernel-4.15.7/linux-4.15/include/linux/sched.h:12:10: fatal error: asm/current.h: No such file or directory
  • error 33
  • compilation terminated.
  • error 34
  • make[3]: *** [/tmp/B.5UxMYa/BUILD/kernel-4.15.7/linux-4.15/scripts/Makefile.build:316: kernel/capability.o] Error 1
  • error 35
  • /tmp/B.5UxMYa/BUILD/kernel-4.15.7/linux-4.15/include/uapi/linux/types.h:5:10: fatal error: asm/types.h: No such file or directory
  • error 36
  • compilation terminated.
  • error 37
  • make[3]: *** [/tmp/B.5UxMYa/BUILD/kernel-4.15.7/linux-4.15/scripts/Makefile.build:316: kernel/ptrace.o] Error 1
  • error 38
  • /tmp/B.5UxMYa/BUILD/kernel-4.15.7/linux-4.15/include/uapi/linux/types.h:5:10: fatal error: asm/types.h: No such file or directory
  • error 39
  • compilation terminated.
  • error 40
  • make[3]: *** [/tmp/B.5UxMYa/BUILD/kernel-4.15.7/linux-4.15/scripts/Makefile.build:316: kernel/user.o] Error 1
  • error 41
  • make[2]: *** [/tmp/B.5UxMYa/BUILD/kernel-4.15.7/linux-4.15/Makefile:1019: kernel] Error 2
  • error 42
  • /tmp/B.5UxMYa/BUILD/kernel-4.15.7/linux-4.15/include/linux/linkage.h:8:10: fatal error: asm/linkage.h: No such file or directory
  • error 43
  • compilation terminated.
  • error 44
  • make[3]: *** [/tmp/B.5UxMYa/BUILD/kernel-4.15.7/linux-4.15/scripts/Makefile.build:316: fs/readdir.o] Error 1
  • error 45
  • /tmp/B.5UxMYa/BUILD/kernel-4.15.7/linux-4.15/include/linux/linkage.h:8:10: fatal error: asm/linkage.h: No such file or directory
  • error 46
  • compilation terminated.
  • error 47
  • make[3]: *** [/tmp/B.5UxMYa/BUILD/kernel-4.15.7/linux-4.15/scripts/Makefile.build:316: fs/select.o] Error 1
  • error 48
  • make[2]: *** [/tmp/B.5UxMYa/BUILD/kernel-4.15.7/linux-4.15/Makefile:1019: fs] Error 2
  • error 49
  • /tmp/B.5UxMYa/BUILD/kernel-4.15.7/linux-4.15/include/linux/bug.h:5:10: fatal error: asm/bug.h: No such file or directory
  • error 50
  • compilation terminated.
  • error 51
  • make[4]: *** [/tmp/B.5UxMYa/BUILD/kernel-4.15.7/linux-4.15/scripts/Makefile.build:316: security/integrity/iint.o] Error 1
  • error 52
  • make[3]: *** [/tmp/B.5UxMYa/BUILD/kernel-4.15.7/linux-4.15/scripts/Makefile.build:575: security/integrity] Error 2
  • error 53
  • x86_64-pld-linux-gnux32-gcc: error: /tmp/B.5UxMYa/BUILD/kernel-4.15.7/linux-4.15/arch/x86/events/msr.c: No such file or directory
  • error 54
  • x86_64-pld-linux-gnux32-gcc: fatal error: no input files
  • error 55
  • compilation terminated.
  • error 56
  • make[4]: *** [/tmp/B.5UxMYa/BUILD/kernel-4.15.7/linux-4.15/scripts/Makefile.build:317: arch/x86/events/msr.o] Error 1
  • error 57
  • /tmp/B.5UxMYa/BUILD/kernel-4.15.7/linux-4.15/include/uapi/linux/types.h:5:10: fatal error: asm/types.h: No such file or directory
  • error 58
  • compilation terminated.
  • error 59
  • make[4]: *** [/tmp/B.5UxMYa/BUILD/kernel-4.15.7/linux-4.15/scripts/Makefile.build:317: security/apparmor/apparmorfs.o] Error 1
  • error 60
  • /tmp/B.5UxMYa/BUILD/kernel-4.15.7/linux-4.15/include/uapi/linux/types.h:5:10: fatal error: asm/types.h: No such file or directory
  • error 61
  • compilation terminated.
  • error 62
  • make[4]: *** [/tmp/B.5UxMYa/BUILD/kernel-4.15.7/linux-4.15/scripts/Makefile.build:316: security/keys/gc.o] Error 1
  • error 63
  • /tmp/B.5UxMYa/BUILD/kernel-4.15.7/linux-4.15/include/uapi/linux/types.h:5:10: fatal error: asm/types.h: No such file or directory
  • error 64
  • compilation terminated.
  • error 65
  • make[4]: *** [/tmp/B.5UxMYa/BUILD/kernel-4.15.7/linux-4.15/scripts/Makefile.build:316: security/keys/key.o] Error 1
  • error 66
  • /tmp/B.5UxMYa/BUILD/kernel-4.15.7/linux-4.15/include/linux/sched.h:12:10: fatal error: asm/current.h: No such file or directory
  • error 67
  • compilation terminated.
  • error 68
  • make[4]: *** [/tmp/B.5UxMYa/BUILD/kernel-4.15.7/linux-4.15/scripts/Makefile.build:317: security/apparmor/audit.o] Error 1
  • error 69
  • make[3]: *** [/tmp/B.5UxMYa/BUILD/kernel-4.15.7/linux-4.15/scripts/Makefile.build:575: security/keys] Error 2
  • error 70
  • make[3]: *** [/tmp/B.5UxMYa/BUILD/kernel-4.15.7/linux-4.15/scripts/Makefile.build:575: security/apparmor] Error 2
  • error 71
  • /tmp/B.5UxMYa/BUILD/kernel-4.15.7/linux-4.15/include/uapi/linux/types.h:5:10: fatal error: asm/types.h: No such file or directory
  • error 72
  • compilation terminated.
  • error 73
  • make[4]: *** [/tmp/B.5UxMYa/BUILD/kernel-4.15.7/linux-4.15/scripts/Makefile.build:316: security/selinux/avc.o] Error 1
  • error 74
  • /tmp/B.5UxMYa/BUILD/kernel-4.15.7/linux-4.15/include/linux/bug.h:5:10: fatal error: asm/bug.h: No such file or directory
  • error 75
  • compilation terminated.
  • error 76
  • make[4]: *** [/tmp/B.5UxMYa/BUILD/kernel-4.15.7/linux-4.15/scripts/Makefile.build:317: security/smack/smack_lsm.o] Error 1
  • error 77
  • /tmp/B.5UxMYa/BUILD/kernel-4.15.7/linux-4.15/include/uapi/linux/types.h:5:10: fatal error: asm/types.h: No such file or directory
  • error 78
  • compilation terminated.
  • error 79
  • make[4]: *** [/tmp/B.5UxMYa/BUILD/kernel-4.15.7/linux-4.15/scripts/Makefile.build:316: security/selinux/hooks.o] Error 1
  • error 80
  • make[3]: *** [/tmp/B.5UxMYa/BUILD/kernel-4.15.7/linux-4.15/scripts/Makefile.build:575: security/selinux] Error 2
  • error 81
  • /tmp/B.5UxMYa/BUILD/kernel-4.15.7/linux-4.15/include/uapi/linux/types.h:5:10: fatal error: asm/types.h: No such file or directory
  • error 82
  • compilation terminated.
  • error 83
  • make[4]: *** [/tmp/B.5UxMYa/BUILD/kernel-4.15.7/linux-4.15/scripts/Makefile.build:317: security/tomoyo/audit.o] Error 1
  • error 84
  • /tmp/B.5UxMYa/BUILD/kernel-4.15.7/linux-4.15/include/uapi/linux/types.h:5:10: fatal error: asm/types.h: No such file or directory
  • error 85
  • compilation terminated.
  • error 86
  • make[4]: *** [/tmp/B.5UxMYa/BUILD/kernel-4.15.7/linux-4.15/scripts/Makefile.build:317: security/tomoyo/condition.o] Error 1
  • error 87
  • /tmp/B.5UxMYa/BUILD/kernel-4.15.7/linux-4.15/include/uapi/linux/types.h:5:10: fatal error: asm/types.h: No such file or directory
  • error 88
  • compilation terminated.
  • error 89
  • make[4]: *** [/tmp/B.5UxMYa/BUILD/kernel-4.15.7/linux-4.15/scripts/Makefile.build:317: security/smack/smack_access.o] Error 1
  • error 90
  • make[3]: *** [/tmp/B.5UxMYa/BUILD/kernel-4.15.7/linux-4.15/scripts/Makefile.build:575: security/smack] Error 2
  • error 91
  • /tmp/B.5UxMYa/BUILD/kernel-4.15.7/linux-4.15/include/uapi/linux/types.h:5:10: fatal error: asm/types.h: No such file or directory
  • error 92
  • compilation terminated.
  • error 93
  • make[4]: *** [/tmp/B.5UxMYa/BUILD/kernel-4.15.7/linux-4.15/scripts/Makefile.build:317: security/tomoyo/domain.o] Error 1
  • error 94
  • /tmp/B.5UxMYa/BUILD/kernel-4.15.7/linux-4.15/include/uapi/linux/types.h:5:10: fatal error: asm/types.h: No such file or directory
  • error 95
  • compilation terminated.
  • error 96
  • make[4]: *** [/tmp/B.5UxMYa/BUILD/kernel-4.15.7/linux-4.15/scripts/Makefile.build:317: security/tomoyo/environ.o] Error 1
  • error 97
  • /tmp/B.5UxMYa/BUILD/kernel-4.15.7/linux-4.15/include/uapi/linux/types.h:5:10: fatal error: asm/types.h: No such file or directory
  • error 98
  • compilation terminated.
  • error 99
  • make[4]: *** [/tmp/B.5UxMYa/BUILD/kernel-4.15.7/linux-4.15/scripts/Makefile.build:317: security/tomoyo/file.o] Error 1
  • error 100
  • make[3]: *** [/tmp/B.5UxMYa/BUILD/kernel-4.15.7/linux-4.15/scripts/Makefile.build:575: security/tomoyo] Error 2
  • error 101
  • make[2]: *** [/tmp/B.5UxMYa/BUILD/kernel-4.15.7/linux-4.15/Makefile:1019: security] Error 2
  • error 102
  • make[4]: *** [/tmp/B.5UxMYa/BUILD/kernel-4.15.7/linux-4.15/scripts/Makefile.build:316: arch/x86/kvm/../../../virt/kvm/kvm_main.o] Error 2
  • error 103
  • make[3]: *** [/tmp/B.5UxMYa/BUILD/kernel-4.15.7/linux-4.15/scripts/Makefile.build:575: arch/x86/kvm] Error 2
  • error 104
  • make[5]: *** [/tmp/B.5UxMYa/BUILD/kernel-4.15.7/linux-4.15/scripts/Makefile.build:317: arch/x86/events/intel/uncore_snbep.o] Error 2
  • error 105
  • make[4]: *** [/tmp/B.5UxMYa/BUILD/kernel-4.15.7/linux-4.15/scripts/Makefile.build:575: arch/x86/events/intel] Error 2
  • error 106
  • make[3]: *** [/tmp/B.5UxMYa/BUILD/kernel-4.15.7/linux-4.15/scripts/Makefile.build:575: arch/x86/events] Error 2
  • error 107
  • make[2]: *** [/tmp/B.5UxMYa/BUILD/kernel-4.15.7/linux-4.15/Makefile:1019: arch/x86] Error 2
  • error 108
  • make[3]: *** [/tmp/B.5UxMYa/BUILD/kernel-4.15.7/linux-4.15/scripts/Makefile.build:316: mm/page_alloc.o] Error 2
  • error 109
  • make[2]: *** [/tmp/B.5UxMYa/BUILD/kernel-4.15.7/linux-4.15/Makefile:1019: mm] Error 2
  • error 110
  • make[1]: *** [Makefile:146: sub-make] Error 2

Content:

request from: arekm
checking if we should skip the build
started at: Fri Mar  9 21:42:02 2018
fetching https://srcbuilder.pld-linux.org/th//srpms/32bc38e8-b936-428e-b81d-eb5567f63b96/kernel-4.15.7-1.src.rpm
fetched 103285519 bytes, 10056.1 K/s
installing srpm: kernel-4.15.7-1.src.rpm
+ install -d /tmp/B.5UxMYa/BUILD /tmp/B.5UxMYa/RPMS
+ LC_ALL=en_US.UTF-8
+ rpm -qp --changelog kernel-4.15.7-1.src.rpm
* Fri Mar 09 2018 PLD Linux Team <feedback@pld-linux.org>
- For complete changelog see: http://git.pld-linux.org/?p=packages/kernel.git;a=log;h=master
* Thu Mar 01 2018 Arkadiusz Miśkiewicz <arekm@maven.pl> 2dfef33e - up to 4.15.7 * Sun Feb 25 2018 Arkadiusz Miśkiewicz <arekm@maven.pl> f39c158c - up to 4.15.6 * Thu Feb 22 2018 Arkadiusz Miśkiewicz <arekm@maven.pl> f19539c0 - up to 4.15.5 * Sat Feb 17 2018 Arkadiusz Miśkiewicz <arekm@maven.pl> 520f51fb - up to 4.15.4 * Thu Feb 15 2018 Arkadiusz Miśkiewicz <arekm@maven.pl> b9dcd02a - up to 4.15.3 * Fri Feb 09 2018 Arkadiusz Miśkiewicz <arekm@maven.pl> c9ee8393 - up to 4.15.2 * Sat Feb 03 2018 Arkadiusz Miśkiewicz <arekm@maven.pl> 7f09fa3e - up to 4.15.1 * Thu Feb 01 2018 Arkadiusz Miśkiewicz <arekm@maven.pl> d75b40d3 - use 4.15 patches * Mon Jan 29 2018 Arkadiusz Miśkiewicz <arekm@maven.pl> 65009694 - updated 32bit config * Mon Jan 29 2018 Arkadiusz Miśkiewicz <arekm@maven.pl> 2121bcd9 - up to 4.15 * Sat Jan 27 2018 Jan Rękorajski <baggins@pld-linux.org> fe5239d2 - rebuild with new gcc plugins - rel 2 * Wed Jan 24 2018 Arkadiusz Miśkiewicz <arekm@maven.pl> 9ed75779 - up to 4.14.15 * Wed Jan 17 2018 Jan Rękorajski <baggins@pld-linux.org> 566d3001 - gcc plugins update - rel 2 * Wed Jan 17 2018 Arkadiusz Miśkiewicz <arekm@maven.pl> 8d3d28a7 - up to 4.14.14; SECURITY: adds retpoline which mitigates Spectre variant 2 attack * Tue Jan 16 2018 Jan Rękorajski <baggins@pld-linux.org> 9f401bb3 - rel 2 * Wed Jan 10 2018 Arkadiusz Miśkiewicz <arekm@maven.pl> 5f3e5b08 - up to 4.14.13 * Fri Jan 05 2018 Jan Rękorajski <baggins@pld-linux.org> 765163a1 - PAGE_TABLE_ISOLATION is x86_64 specific * Fri Jan 05 2018 Arkadiusz Miśkiewicz <arekm@maven.pl> cb9bb895 - up to 4.14.12; SECURITY: more fixes for Meltdown mitigation * Wed Jan 03 2018 Arkadiusz Miśkiewicz <arekm@maven.pl> 92cf0c7b - up to 4.14.11 * Fri Dec 29 2017 Jan Rękorajski <baggins@pld-linux.org> f4503efa - 4.14.10 + rpm -Uhv --nodeps --define '_topdir /tmp/B.5UxMYa' --define '_specdir %{_topdir}' --define '_sourcedir %{_specdir}' --define '_rpmdir %{_topdir}/RPMS' --define '_builddir %{_topdir}/BUILD' kernel-4.15.7-1.src.rpm Preparing... ################################################## kernel ################################################## + rm -f kernel-4.15.7-1.src.rpm + install -m 700 -d /tmp/B.5UxMYa/BUILD/tmp + TMPDIR=/tmp/B.5UxMYa/BUILD/tmp + exec nice -n 0 rpmbuild -bp --short-circuit --nodeps --define '_topdir /tmp/B.5UxMYa' --define '_specdir %{_topdir}' --define '_sourcedir %{_specdir}' --define '_rpmdir %{_topdir}/RPMS' --define '_builddir %{_topdir}/BUILD' --target x32-pld-linux --define 'prep exit 0' /tmp/B.5UxMYa/kernel.spec Building target platforms: x32-pld-linux checking BuildConflict-ing packages no BuildConflicts found checking BR rpm: Building target platforms: x32-pld-linux no BR needed building RPM using: set -ex; : build-id: 32bc38e8-b936-428e-b81d-eb5567f63b96; TMPDIR=/tmp/B.5UxMYa/BUILD/tmp exec nice -n 0 rpmbuild -bb --define '_smp_mflags -j9' --define '_make_opts -Otarget' --define '_pld_builder 1' --define '_topdir /tmp/B.5UxMYa' --define '_specdir %{_topdir}' --define '_sourcedir %{_specdir}' --define '_rpmdir %{_topdir}/RPMS' --define '_builddir %{_topdir}/BUILD' --target x32-pld-linux /tmp/B.5UxMYa/kernel.spec + : build-id: 32bc38e8-b936-428e-b81d-eb5567f63b96 + TMPDIR=/tmp/B.5UxMYa/BUILD/tmp + exec nice -n 0 rpmbuild -bb --define '_smp_mflags -j9' --define '_make_opts -Otarget' --define '_pld_builder 1' --define '_topdir /tmp/B.5UxMYa' --define '_specdir %{_topdir}' --define '_sourcedir %{_specdir}' --define '_rpmdir %{_topdir}/RPMS' --define '_builddir %{_topdir}/BUILD' --target x32-pld-linux /tmp/B.5UxMYa/kernel.spec Building target platforms: x32-pld-linux Executing(%prep): /bin/sh -e /tmp/B.5UxMYa/BUILD/tmp/rpm-tmp.96727 + umask 022 + cd /tmp/B.5UxMYa/BUILD + cd /tmp/B.5UxMYa/BUILD + rm -rf kernel-4.15.7 + /bin/mkdir -p kernel-4.15.7 + cd kernel-4.15.7 + /usr/bin/xz -dc /tmp/B.5UxMYa/linux-4.15.tar.xz + /bin/tar -xf - + STATUS=0 + '[' 0 -ne 0 ']' + /bin/id -u + '[' 1000 '=' 0 ']' + /bin/id -u + '[' 1000 '=' 0 ']' + /bin/chmod -Rf a+rX,u+w,g-w,o-w . + ln -s /tmp/B.5UxMYa/kernel-module-build.pl kernel-module-build.pl + ln -s /tmp/B.5UxMYa/kernel.make Makefile + cd linux-4.15 + echo 'Patch #0 (patch-4.15.7.xz):' Patch #0 (patch-4.15.7.xz): + '[' -f /tmp/B.5UxMYa/patch-4.15.7.xz ']' + /usr/bin/xz -dc /tmp/B.5UxMYa/patch-4.15.7.xz + /usr/bin/patch -s -p1 + echo 'Patch #6 (linux-wistron-nx.patch):' Patch #6 (linux-wistron-nx.patch): + '[' -f /tmp/B.5UxMYa/linux-wistron-nx.patch ']' + /bin/cat /tmp/B.5UxMYa/linux-wistron-nx.patch + /usr/bin/patch -s -p1 + echo 'Patch #10 (kernel-pom-ng-IPV4OPTSSTRIP.patch):' Patch #10 (kernel-pom-ng-IPV4OPTSSTRIP.patch): + '[' -f /tmp/B.5UxMYa/kernel-pom-ng-IPV4OPTSSTRIP.patch ']' + /bin/cat /tmp/B.5UxMYa/kernel-pom-ng-IPV4OPTSSTRIP.patch + /usr/bin/patch -s -p1 + echo 'Patch #40 (kernel-layer7.patch):' Patch #40 (kernel-layer7.patch): + '[' -f /tmp/B.5UxMYa/kernel-layer7.patch ']' + /bin/cat /tmp/B.5UxMYa/kernel-layer7.patch + /usr/bin/patch -s -p1 + echo 'Patch #55 (kernel-atm-vbr.patch):' Patch #55 (kernel-atm-vbr.patch): + '[' -f /tmp/B.5UxMYa/kernel-atm-vbr.patch ']' + /bin/cat /tmp/B.5UxMYa/kernel-atm-vbr.patch + /usr/bin/patch -s -p1 + echo 'Patch #56 (kernel-atmdd.patch):' Patch #56 (kernel-atmdd.patch): + '[' -f /tmp/B.5UxMYa/kernel-atmdd.patch ']' + /bin/cat /tmp/B.5UxMYa/kernel-atmdd.patch + /usr/bin/patch -s -p1 + echo 'Patch #59 (kernel-rndis_host-wm5.patch):' Patch #59 (kernel-rndis_host-wm5.patch): + '[' -f /tmp/B.5UxMYa/kernel-rndis_host-wm5.patch ']' + /bin/cat /tmp/B.5UxMYa/kernel-rndis_host-wm5.patch + /usr/bin/patch -s -p1 + echo 'Patch #85 (kernel-hostap.patch):' Patch #85 (kernel-hostap.patch): + '[' -f /tmp/B.5UxMYa/kernel-hostap.patch ']' + /bin/cat /tmp/B.5UxMYa/kernel-hostap.patch + /usr/bin/patch -s -p1 + echo 'Patch #145 (kernel-aufs4.patch):' Patch #145 (kernel-aufs4.patch): + '[' -f /tmp/B.5UxMYa/kernel-aufs4.patch ']' + /bin/cat /tmp/B.5UxMYa/kernel-aufs4.patch + /usr/bin/patch -s -p1 + echo 'Patch #5001 (0001-apparmor-add-base-infastructure-for-socket-mediation.patch):' Patch #5001 (0001-apparmor-add-base-infastructure-for-socket-mediation.patch): + '[' -f /tmp/B.5UxMYa/0001-apparmor-add-base-infastructure-for-socket-mediation.patch ']' + /bin/cat /tmp/B.5UxMYa/0001-apparmor-add-base-infastructure-for-socket-mediation.patch + /usr/bin/patch -s -p1 + echo 'Patch #5002 (0002-apparmor-af_unix-mediation.patch):' Patch #5002 (0002-apparmor-af_unix-mediation.patch): + '[' -f /tmp/B.5UxMYa/0002-apparmor-af_unix-mediation.patch ']' + /bin/cat /tmp/B.5UxMYa/0002-apparmor-af_unix-mediation.patch + /usr/bin/patch -s -p1 + echo 'Patch #250 (kernel-fix_256colors_menuconfig.patch):' Patch #250 (kernel-fix_256colors_menuconfig.patch): + '[' -f /tmp/B.5UxMYa/kernel-fix_256colors_menuconfig.patch ']' + /bin/cat /tmp/B.5UxMYa/kernel-fix_256colors_menuconfig.patch + /usr/bin/patch -s -p1 + echo 'Patch #2000 (kernel-small_fixes.patch):' Patch #2000 (kernel-small_fixes.patch): + '[' -f /tmp/B.5UxMYa/kernel-small_fixes.patch ']' + /bin/cat /tmp/B.5UxMYa/kernel-small_fixes.patch + /usr/bin/patch -s -p1 + echo 'Patch #2001 (kernel-pwc-uncompress.patch):' Patch #2001 (kernel-pwc-uncompress.patch): + '[' -f /tmp/B.5UxMYa/kernel-pwc-uncompress.patch ']' + /bin/cat /tmp/B.5UxMYa/kernel-pwc-uncompress.patch + /usr/bin/patch -s -p1 + chmod 755 tools/objtool/sync-check.sh + sed -i 's#EXTRAVERSION =.*#EXTRAVERSION = #g' Makefile + find '(' -name '*~' -o -name '*.orig' -o -name .gitignore ')' -print0 + xargs -0 -r -l512 rm -f + exit 0 Executing(%build): /bin/sh -e /tmp/B.5UxMYa/BUILD/tmp/rpm-tmp.62843 HOME=/home/users/builder PATH=/home/users/builder/GNUstep/Tools:/usr/local/bin:/usr/bin:/bin TMPDIR=/tmp/B.5UxMYa/BUILD/tmp + umask 022 + cd /tmp/B.5UxMYa/BUILD + cd kernel-4.15.7 + install -d /tmp/B.5UxMYa/BUILD/kernel-4.15.7/x86_64-gcc-7.3.0 + >x86_64-gcc-7.3.0.mk + <<"EOF" + cat + cd /tmp/B.5UxMYa/BUILD/kernel-4.15.7/x86_64-gcc-7.3.0 + install -d arch/x86 + >arch/x86/defconfig + BuildConfig + set -e + Config=kernel-x86.config + >&2 + echo 'Building config file for x32 using kernel-x86.config et al.' Building config file for x32 using kernel-x86.config et al. + <<-EOCONFIG + >important.config + cat + mawk -v 'arch=all x86 x86_64 x32' -f /tmp/B.5UxMYa/kernel-config.awk important.config /tmp/B.5UxMYa/kernel-imq.config /tmp/B.5UxMYa/kernel-patches.config /tmp/B.5UxMYa/kernel-multiarch.config /tmp/B.5UxMYa/kernel-x86.config kernel-x86.config (292): Warning: CONFIG_VIDEO_IVTV_DEPRECATED_IOCTLS already defined in: kernel-multiarch.config (3513) kernel-x86.config (322): Warning: CONFIG_PCIEASPM_DEFAULT already defined in: kernel-multiarch.config (6453) kernel-x86.config (323): Warning: CONFIG_PCIEASPM_POWERSAVE already defined in: kernel-multiarch.config (6454) kernel-x86.config (324): Warning: CONFIG_PCIEASPM_POWER_SUPERSAVE already defined in: kernel-multiarch.config (6455) kernel-x86.config (325): Warning: CONFIG_PCIEASPM_PERFORMANCE already defined in: kernel-multiarch.config (6456) kernel-x86.config (330): Warning: CONFIG_INTEL_TURBO_MAX_3 already defined in: kernel-multiarch.config (6700) kernel-x86.config (349): Warning: CONFIG_PC104 already defined in: kernel-multiarch.config (10020) kernel-x86.config (373): Warning: CONFIG_KCOV already defined in: kernel-multiarch.config (10258) kernel-x86.config (374): Warning: CONFIG_WW_MUTEX_SELFTEST already defined in: kernel-multiarch.config (10286) kernel-x86.config (406): Warning: CONFIG_SND_X86 already defined in: kernel-multiarch.config (12200) kernel-x86.config (407): Warning: CONFIG_HDMI_LPE_AUDIO already defined in: kernel-multiarch.config (12201) + ln -sf arch/x86/defconfig .config + cd - /tmp/B.5UxMYa/BUILD/kernel-4.15.7 + /usr/bin/make -Otarget -j9 'TARGETOBJ=x86_64-gcc-7.3.0' oldconfig /usr/bin/make -C /tmp/B.5UxMYa/BUILD/kernel-4.15.7/linux-4.15 O=/tmp/B.5UxMYa/BUILD/kernel-4.15.7/x86_64-gcc-7.3.0 ARCH=x86_64 CC="x86_64-pld-linux-gnux32-gcc" HOSTCC="x86_64-pld-linux-gnux32-gcc -D_FILE_OFFSET_BITS=64" oldconfig make[2]: Entering directory '/tmp/B.5UxMYa/BUILD/kernel-4.15.7/x86_64-gcc-7.3.0' GEN ./Makefile make[2]: Leaving directory '/tmp/B.5UxMYa/BUILD/kernel-4.15.7/x86_64-gcc-7.3.0' HOSTCC scripts/basic/fixdep SHIPPED scripts/kconfig/zconf.tab.c SHIPPED scripts/kconfig/zconf.lex.c HOSTCC scripts/kconfig/conf.o HOSTCC scripts/kconfig/zconf.tab.o HOSTLD scripts/kconfig/conf scripts/kconfig/conf --oldconfig Kconfig # # configuration written to .config # + mawk -v 'infile=/tmp/B.5UxMYa/BUILD/kernel-4.15.7/x86_64-gcc-7.3.0/arch/x86/defconfig' -f /tmp/B.5UxMYa/kernel-track-config-change.awk /tmp/B.5UxMYa/BUILD/kernel-4.15.7/x86_64-gcc-7.3.0/.config ERROR (kernel-multiarch.config): CONFIG_MODVERSIONS redefined from `n' to `y' ERROR (kernel-multiarch.config): CONFIG_NVME_CORE redefined from `m' to `y' ERROR (kernel-multiarch.config): CONFIG_BLK_DEV_NVME redefined from `m' to `y' ERROR (kernel-multiarch.config): CONFIG_CRYPTO_AEAD redefined from `m' to `y' ERROR (kernel-multiarch.config): CONFIG_CRYPTO_GF128MUL redefined from `m' to `y' ERROR (kernel-multiarch.config): CONFIG_CRYPTO_NULL redefined from `m' to `y' ERROR (kernel-multiarch.config): CONFIG_CRYPTO_GCM redefined from `m' to `y' ERROR (kernel-multiarch.config): CONFIG_CRYPTO_SEQIV redefined from `m' to `y' ERROR (kernel-multiarch.config): CONFIG_CRYPTO_CTR redefined from `m' to `y' ERROR (kernel-multiarch.config): CONFIG_CRYPTO_GHASH redefined from `m' to `y' ERROR (kernel-multiarch.config): CONFIG_CRYPTO_DRBG_MENU redefined from `m' to `y' ERROR (kernel-multiarch.config): CONFIG_CRYPTO_JITTERENTROPY redefined from `m' to `y' ERROR (kernel-multiarch.config): CONFIG_PKCS7_MESSAGE_PARSER redefined from `m' to `y' There were 13 errors + /usr/bin/make -Otarget -j9 'TARGETOBJ=x86_64-gcc-7.3.0' all /usr/bin/make -C /tmp/B.5UxMYa/BUILD/kernel-4.15.7/linux-4.15 O=/tmp/B.5UxMYa/BUILD/kernel-4.15.7/x86_64-gcc-7.3.0 ARCH=x86_64 CC="x86_64-pld-linux-gnux32-gcc" HOSTCC="x86_64-pld-linux-gnux32-gcc -D_FILE_OFFSET_BITS=64" GEN ./Makefile scripts/kconfig/conf --silentoldconfig Kconfig WRAP arch/x86/include/generated/uapi/asm/bpf_perf_event.h make[2]: Entering directory '/tmp/B.5UxMYa/BUILD/kernel-4.15.7/x86_64-gcc-7.3.0' GEN ./Makefile make[2]: Leaving directory '/tmp/B.5UxMYa/BUILD/kernel-4.15.7/x86_64-gcc-7.3.0' make[2]: Entering directory '/tmp/B.5UxMYa/BUILD/kernel-4.15.7/x86_64-gcc-7.3.0' CHK include/generated/uapi/linux/version.h UPD include/generated/uapi/linux/version.h make[2]: Leaving directory '/tmp/B.5UxMYa/BUILD/kernel-4.15.7/x86_64-gcc-7.3.0' SYSHDR arch/x86/include/generated/asm/unistd_64_x32.h SYSHDR arch/x86/include/generated/asm/unistd_32_ia32.h DESCEND objtool SYSHDR arch/x86/include/generated/uapi/asm/unistd_32.h SYSHDR arch/x86/include/generated/uapi/asm/unistd_64.h HOSTCC scripts/basic/bin2c make[2]: Entering directory '/tmp/B.5UxMYa/BUILD/kernel-4.15.7/x86_64-gcc-7.3.0' CHK include/config/kernel.release UPD include/config/kernel.release make[2]: Leaving directory '/tmp/B.5UxMYa/BUILD/kernel-4.15.7/x86_64-gcc-7.3.0' HYPERCALLS arch/x86/include/generated/asm/xen-hypercalls.h SYSHDR arch/x86/include/generated/uapi/asm/unistd_x32.h HOSTCC /tmp/B.5UxMYa/BUILD/kernel-4.15.7/x86_64-gcc-7.3.0/tools/objtool/fixdep.o HOSTLD /tmp/B.5UxMYa/BUILD/kernel-4.15.7/x86_64-gcc-7.3.0/tools/objtool/fixdep-in.o LINK /tmp/B.5UxMYa/BUILD/kernel-4.15.7/x86_64-gcc-7.3.0/tools/objtool/fixdep CC /tmp/B.5UxMYa/BUILD/kernel-4.15.7/x86_64-gcc-7.3.0/tools/objtool/exec-cmd.o CC /tmp/B.5UxMYa/BUILD/kernel-4.15.7/x86_64-gcc-7.3.0/tools/objtool/help.o MKDIR /tmp/B.5UxMYa/BUILD/kernel-4.15.7/x86_64-gcc-7.3.0/tools/objtool/arch/x86/lib/ GEN /tmp/B.5UxMYa/BUILD/kernel-4.15.7/x86_64-gcc-7.3.0/tools/objtool/arch/x86/lib/inat-tables.c CC /tmp/B.5UxMYa/BUILD/kernel-4.15.7/x86_64-gcc-7.3.0/tools/objtool/arch/x86/decode.o CC /tmp/B.5UxMYa/BUILD/kernel-4.15.7/x86_64-gcc-7.3.0/tools/objtool/pager.o CC /tmp/B.5UxMYa/BUILD/kernel-4.15.7/x86_64-gcc-7.3.0/tools/objtool/parse-options.o CC /tmp/B.5UxMYa/BUILD/kernel-4.15.7/x86_64-gcc-7.3.0/tools/objtool/builtin-check.o CC /tmp/B.5UxMYa/BUILD/kernel-4.15.7/x86_64-gcc-7.3.0/tools/objtool/builtin-orc.o CC /tmp/B.5UxMYa/BUILD/kernel-4.15.7/x86_64-gcc-7.3.0/tools/objtool/check.o CC /tmp/B.5UxMYa/BUILD/kernel-4.15.7/x86_64-gcc-7.3.0/tools/objtool/run-command.o CC /tmp/B.5UxMYa/BUILD/kernel-4.15.7/x86_64-gcc-7.3.0/tools/objtool/sigchain.o CC /tmp/B.5UxMYa/BUILD/kernel-4.15.7/x86_64-gcc-7.3.0/tools/objtool/subcmd-config.o LD /tmp/B.5UxMYa/BUILD/kernel-4.15.7/x86_64-gcc-7.3.0/tools/objtool/arch/x86/objtool-in.o CC /tmp/B.5UxMYa/BUILD/kernel-4.15.7/x86_64-gcc-7.3.0/tools/objtool/orc_gen.o CC /tmp/B.5UxMYa/BUILD/kernel-4.15.7/x86_64-gcc-7.3.0/tools/objtool/orc_dump.o CC /tmp/B.5UxMYa/BUILD/kernel-4.15.7/x86_64-gcc-7.3.0/tools/objtool/elf.o LD /tmp/B.5UxMYa/BUILD/kernel-4.15.7/x86_64-gcc-7.3.0/tools/objtool/libsubcmd-in.o CC /tmp/B.5UxMYa/BUILD/kernel-4.15.7/x86_64-gcc-7.3.0/tools/objtool/special.o AR /tmp/B.5UxMYa/BUILD/kernel-4.15.7/x86_64-gcc-7.3.0/tools/objtool/libsubcmd.a CC /tmp/B.5UxMYa/BUILD/kernel-4.15.7/x86_64-gcc-7.3.0/tools/objtool/objtool.o CC /tmp/B.5UxMYa/BUILD/kernel-4.15.7/x86_64-gcc-7.3.0/tools/objtool/libstring.o CC /tmp/B.5UxMYa/BUILD/kernel-4.15.7/x86_64-gcc-7.3.0/tools/objtool/str_error_r.o LD /tmp/B.5UxMYa/BUILD/kernel-4.15.7/x86_64-gcc-7.3.0/tools/objtool/objtool-in.o LINK /tmp/B.5UxMYa/BUILD/kernel-4.15.7/x86_64-gcc-7.3.0/tools/objtool/objtool make[2]: Entering directory '/tmp/B.5UxMYa/BUILD/kernel-4.15.7/x86_64-gcc-7.3.0' Using /tmp/B.5UxMYa/BUILD/kernel-4.15.7/linux-4.15 as source for kernel make[2]: Leaving directory '/tmp/B.5UxMYa/BUILD/kernel-4.15.7/x86_64-gcc-7.3.0' WRAP arch/x86/include/generated/asm/clkdev.h WRAP arch/x86/include/generated/asm/dma-contiguous.h WRAP arch/x86/include/generated/asm/early_ioremap.h WRAP arch/x86/include/generated/asm/mcs_spinlock.h WRAP arch/x86/include/generated/asm/mm-arch-hooks.h HOSTCC arch/x86/tools/relocs_common.o HOSTCC arch/x86/tools/relocs_32.o HOSTCC arch/x86/tools/relocs_64.o make[2]: Entering directory '/tmp/B.5UxMYa/BUILD/kernel-4.15.7/x86_64-gcc-7.3.0' CHK include/generated/utsrelease.h UPD include/generated/utsrelease.h make[2]: Leaving directory '/tmp/B.5UxMYa/BUILD/kernel-4.15.7/x86_64-gcc-7.3.0' HOSTLD arch/x86/tools/relocs GENSEED scripts/gcc-plugins/randomize_layout_seed.h SYSTBL arch/x86/include/generated/asm/syscalls_64.h HOSTCXX -fPIC scripts/gcc-plugins/structleak_plugin.o SYSTBL arch/x86/include/generated/asm/syscalls_32.h HOSTCXX -fPIC scripts/gcc-plugins/randomize_layout_plugin.o CC arch/x86/purgatory/purgatory.o AS arch/x86/purgatory/stack.o AS arch/x86/purgatory/setup-x86_64.o AS arch/x86/purgatory/entry64.o CC arch/x86/purgatory/string.o HOSTLLD -shared scripts/gcc-plugins/structleak_plugin.so CC arch/x86/purgatory/sha256.o LD arch/x86/purgatory/purgatory.ro BIN2C arch/x86/purgatory/kexec-purgatory.c HOSTLLD -shared scripts/gcc-plugins/randomize_layout_plugin.so CHK include/generated/timeconst.h UPD include/generated/timeconst.h SHIPPED scripts/genksyms/parse.tab.c CC kernel/bounds.s CHK include/generated/bounds.h UPD include/generated/bounds.h CC scripts/mod/empty.o GEN scripts/gdb/linux/constants.py HOSTCC scripts/mod/mk_elfconfig CC scripts/mod/devicetable-offsets.s MKELF scripts/mod/elfconfig.h HOSTCC scripts/selinux/genheaders/genheaders HOSTCC scripts/genksyms/genksyms.o SHIPPED scripts/genksyms/lex.lex.c SHIPPED scripts/genksyms/parse.tab.h CHK scripts/mod/devicetable-offsets.h UPD scripts/mod/devicetable-offsets.h HOSTCC scripts/selinux/mdp/mdp HOSTCC scripts/genksyms/parse.tab.o HOSTCC scripts/mod/sumversion.o CC arch/x86/kernel/asm-offsets.s HOSTCC scripts/kallsyms HOSTCC scripts/conmakehash CHK include/generated/asm-offsets.h UPD include/generated/asm-offsets.h CALL /tmp/B.5UxMYa/BUILD/kernel-4.15.7/linux-4.15/scripts/checksyscalls.sh HOSTCC scripts/genksyms/lex.lex.o HOSTLD scripts/genksyms/genksyms HOSTCC scripts/sortextable HOSTCC scripts/insert-sys-cert HOSTCC scripts/extract-cert HOSTCC scripts/recordmcount HOSTCC scripts/asn1_compiler HOSTCC scripts/mod/file2alias.o HOSTCC scripts/mod/modpost.o HOSTLD scripts/mod/modpost AR arch/x86/crypto/built-in.o HOSTCC usr/gen_init_cpio GEN usr/initramfs_data.cpio AS arch/x86/entry/entry_64.o CC certs/system_keyring.o AS usr/initramfs_data.o AS arch/x86/entry/thunk_64.o EXTRACT_CERTS AR usr/built-in.o CC [M] arch/x86/crypto/glue_helper.o AS [M] arch/x86/crypto/aes-x86_64-asm_64.o CC [M] arch/x86/crypto/aes_glue.o CC init/main.o AS [M] arch/x86/crypto/des3_ede-asm_64.o CHK include/generated/compile.h UPD include/generated/compile.h CC fs/open.o CC arch/x86/events/core.o CC [M] arch/x86/crypto/des3_ede_glue.o CC kernel/fork.o AS [M] arch/x86/crypto/camellia-x86_64-asm_64.o CC ipc/compat.o CC fs/read_write.o CC kernel/exec_domain.o CC arch/x86/events/amd/core.o CC ipc/util.o CC [M] arch/x86/crypto/camellia_glue.o CC init/do_mounts.o AS [M] arch/x86/crypto/blowfish-x86_64-asm_64.o CC fs/file_table.o CC arch/x86/events/amd/uncore.o CC ipc/msgutil.o CC kernel/panic.o CC init/do_mounts_rd.o CC [M] arch/x86/crypto/blowfish_glue.o AS [M] arch/x86/crypto/twofish-x86_64-asm_64.o CC ipc/msg.o CC [M] arch/x86/crypto/twofish_glue.o CC init/do_mounts_initrd.o AS [M] arch/x86/crypto/twofish-x86_64-asm_64-3way.o CC arch/x86/events/amd/ibs.o CC fs/super.o CC [M] arch/x86/crypto/twofish_glue_3way.o AS [M] arch/x86/crypto/salsa20-x86_64-asm_64.o CC kernel/cpu.o CC ipc/sem.o CC init/initramfs.o CC arch/x86/events/amd/iommu.o CC init/calibrate.o CC [M] arch/x86/crypto/salsa20_glue.o AS [M] arch/x86/crypto/chacha20-ssse3-x86_64.o CC fs/char_dev.o CC [M] arch/x86/events/amd/power.o AR arch/x86/events/amd/built-in.o CC ipc/shm.o CC [M] arch/x86/crypto/chacha20_glue.o CC init/init_task.o AS [M] arch/x86/crypto/chacha20-avx2-x86_64.o AS [M] arch/x86/crypto/serpent-sse2-x86_64-asm_64.o CC init/version.o AR init/mounts.o AR init/built-in.o CC certs/blacklist.o CC arch/x86/entry/syscall_64.o CC mm/filemap.o CC ipc/syscall.o CC fs/stat.o AS [M] arch/x86/crypto/aesni-intel_asm.o CC certs/blacklist_nohashes.o AS certs/system_certificates.o AR certs/built-in.o CC [M] arch/x86/crypto/serpent_sse2_glue.o CC ipc/ipc_sysctl.o CC arch/x86/entry/vsyscall/vsyscall_gtod.o CC arch/x86/events/intel/core.o CC mm/mempool.o CC arch/x86/entry/common.o CC [M] arch/x86/crypto/aesni-intel_glue.o CC ipc/namespace.o CC arch/x86/entry/vsyscall/vsyscall_64.o CC kernel/exit.o CC arch/x86/entry/vdso/vma.o CC arch/x86/entry/vdso/vdso32-setup.o LDS arch/x86/entry/vdso/vdso.lds CC fs/exec.o CC ipc/mq_sysctl.o AS arch/x86/entry/vdso/vdso-note.o CC [M] arch/x86/crypto/fpu.o CC ipc/mqueue.o AS arch/x86/entry/entry_64_compat.o CC arch/x86/events/intel/bts.o AS arch/x86/entry/vsyscall/vsyscall_emu_64.o AR ipc/built-in.o AS [M] arch/x86/crypto/aesni-intel_avx-x86_64.o AR arch/x86/entry/vsyscall/built-in.o AS [M] arch/x86/crypto/aes_ctrby8_avx-x86_64.o AS [M] arch/x86/crypto/ghash-clmulni-intel_asm.o CC arch/x86/entry/vdso/vclock_gettime.o CC arch/x86/entry/vdso/vgetcpu.o CC arch/x86/events/intel/knc.o LDS arch/x86/entry/vdso/vdsox32.lds HOSTCC arch/x86/entry/vdso/vdso2c X32 arch/x86/entry/vdso/vdso-note-x32.o CC arch/x86/hyperv/hv_init.o X32 arch/x86/entry/vdso/vclock_gettime-x32.o CC arch/x86/ia32/sys_ia32.o X32 arch/x86/entry/vdso/vgetcpu-x32.o CC kernel/softirq.o LDS arch/x86/entry/vdso/vdso32/vdso32.lds CC arch/x86/events/intel/ds.o CC fs/pipe.o CC arch/x86/entry/vdso/vdso32/vclock_gettime.o AS arch/x86/entry/vdso/vdso32/note.o AS arch/x86/entry/vdso/vdso32/system_call.o AS arch/x86/entry/vdso/vdso32/sigreturn.o CC arch/x86/ia32/ia32_signal.o CC arch/x86/hyperv/mmu.o AR arch/x86/hyperv/built-in.o CC arch/x86/ia32/audit.o VDSO arch/x86/entry/vdso/vdso64.so.dbg VDSO arch/x86/entry/vdso/vdsox32.so.dbg VDSO arch/x86/entry/vdso/vdso32.so.dbg OBJCOPY arch/x86/entry/vdso/vdso64.so OBJCOPY arch/x86/entry/vdso/vdsox32.so OBJCOPY arch/x86/entry/vdso/vdso32.so CC arch/x86/events/intel/lbr.o VDSO2C arch/x86/entry/vdso/vdso-image-64.c VDSO2C arch/x86/entry/vdso/vdso-image-x32.c VDSO2C arch/x86/entry/vdso/vdso-image-32.c CC kernel/resource.o CC arch/x86/entry/syscall_32.o CC arch/x86/entry/vdso/vdso-image-64.o CC arch/x86/kernel/process_64.o CC arch/x86/ia32/ia32_aout.o AR arch/x86/ia32/built-in.o CC arch/x86/entry/vdso/vdso-image-x32.o CC arch/x86/entry/vdso/vdso-image-32.o AR arch/x86/entry/vdso/built-in.o AR arch/x86/entry/built-in.o CC arch/x86/events/intel/p6.o CC arch/x86/events/intel/p4.o CC arch/x86/kernel/signal_compat.o CC arch/x86/kernel/signal.o CC arch/x86/kernel/traps.o CC [M] arch/x86/events/intel/rapl.o CC fs/fcntl.o CC mm/oom_kill.o Terminated ended at: Fri Mar 9 21:44:28 2018, done in 0:02:12.465987 error: No files produced. CC arch/x86/kernel/idt.o CC kernel/sysctl.o CC fs/namei.o CC arch/x86/events/intel/pt.o CC [M] arch/x86/crypto/ghash-clmulni-intel_glue.o + chmod -R u+rwX /tmp/B.5UxMYa/BUILD CC [M] arch/x86/events/intel/uncore.o CC mm/maccess.o CC arch/x86/kernel/irq_64.o CC [M] arch/x86/crypto/crc32c-intel_glue.o AS [M] arch/x86/crypto/crc32c-pcl-intel-asm_64.o CC arch/x86/kernel/dumpstack_64.o AS [M] arch/x86/crypto/sha1_ssse3_asm.o + rm -rf /tmp/B.5UxMYa/tmp /tmp/B.5UxMYa/BUILD CC [M] arch/x86/events/intel/uncore_nhmex.o AS [M] arch/x86/crypto/sha1_avx2_x86_64_asm.o CC arch/x86/kernel/irq.o CC [M] arch/x86/crypto/sha1_ssse3_glue.o AS [M] arch/x86/crypto/sha1_ni_asm.o AS [M] arch/x86/crypto/crc32-pclmul_asm.o CC [M] arch/x86/events/intel/uncore_snb.o CC arch/x86/kernel/time.o AS [M] arch/x86/crypto/sha256-ssse3-asm.o CC [M] arch/x86/crypto/crc32-pclmul_glue.o CC arch/x86/kernel/ioport.o AS [M] arch/x86/crypto/sha256-avx-asm.o cc1: fatal error: /tmp/B.5UxMYa/BUILD/kernel-4.15.7/linux-4.15/arch/x86/crypto/sha256-avx-asm.S: No such file or directory compilation terminated. make[4]: *** [/tmp/B.5UxMYa/BUILD/kernel-4.15.7/linux-4.15/scripts/Makefile.build:417: arch/x86/crypto/sha256-avx-asm.o] Error 1 make[3]: *** [/tmp/B.5UxMYa/BUILD/kernel-4.15.7/linux-4.15/scripts/Makefile.build:575: arch/x86/crypto] Error 2 make[3]: *** Waiting for unfinished jobs.... CC mm/readahead.o In file included from /tmp/B.5UxMYa/BUILD/kernel-4.15.7/linux-4.15/include/linux/fs.h:22:0, from /tmp/B.5UxMYa/BUILD/kernel-4.15.7/linux-4.15/include/linux/dax.h:5, from /tmp/B.5UxMYa/BUILD/kernel-4.15.7/linux-4.15/mm/readahead.c:11: /tmp/B.5UxMYa/BUILD/kernel-4.15.7/linux-4.15/include/linux/mm_types.h:18:10: fatal error: asm/mmu.h: No such file or directory #include <asm/mmu.h> ^~~~~~~~~~~ compilation terminated. make[3]: *** [/tmp/B.5UxMYa/BUILD/kernel-4.15.7/linux-4.15/scripts/Makefile.build:317: mm/readahead.o] Error 1 make[3]: *** Waiting for unfinished jobs.... CC arch/x86/kernel/dumpstack.o In file included from /tmp/B.5UxMYa/BUILD/kernel-4.15.7/linux-4.15/include/linux/errno.h:5:0, from /tmp/B.5UxMYa/BUILD/kernel-4.15.7/linux-4.15/include/linux/kallsyms.h:9, from /tmp/B.5UxMYa/BUILD/kernel-4.15.7/linux-4.15/arch/x86/kernel/dumpstack.c:5: /tmp/B.5UxMYa/BUILD/kernel-4.15.7/linux-4.15/include/uapi/linux/errno.h:1:10: fatal error: asm/errno.h: No such file or directory #include <asm/errno.h> ^~~~~~~~~~~~~ compilation terminated. make[4]: *** [/tmp/B.5UxMYa/BUILD/kernel-4.15.7/linux-4.15/scripts/Makefile.build:317: arch/x86/kernel/dumpstack.o] Error 1 make[4]: *** Waiting for unfinished jobs.... CC mm/swap.o In file included from /tmp/B.5UxMYa/BUILD/kernel-4.15.7/linux-4.15/include/linux/errno.h:5:0, from /tmp/B.5UxMYa/BUILD/kernel-4.15.7/linux-4.15/include/linux/mm.h:5, from /tmp/B.5UxMYa/BUILD/kernel-4.15.7/linux-4.15/mm/swap.c:16: /tmp/B.5UxMYa/BUILD/kernel-4.15.7/linux-4.15/include/uapi/linux/errno.h:1:10: fatal error: asm/errno.h: No such file or directory #include <asm/errno.h> ^~~~~~~~~~~~~ compilation terminated. make[3]: *** [/tmp/B.5UxMYa/BUILD/kernel-4.15.7/linux-4.15/scripts/Makefile.build:317: mm/swap.o] Error 1 CC [M] arch/x86/events/intel/cstate.o x86_64-pld-linux-gnux32-gcc: error: /tmp/B.5UxMYa/BUILD/kernel-4.15.7/linux-4.15/arch/x86/events/intel/cstate.c: No such file or directory x86_64-pld-linux-gnux32-gcc: fatal error: no input files compilation terminated. make[5]: *** [/tmp/B.5UxMYa/BUILD/kernel-4.15.7/linux-4.15/scripts/Makefile.build:317: arch/x86/events/intel/cstate.o] Error 1 make[5]: *** Waiting for unfinished jobs.... CC kernel/sysctl_binary.o CC mm/page-writeback.o In file included from /tmp/B.5UxMYa/BUILD/kernel-4.15.7/linux-4.15/include/linux/kernel.h:7:0, from /tmp/B.5UxMYa/BUILD/kernel-4.15.7/linux-4.15/mm/page-writeback.c:14: /tmp/B.5UxMYa/BUILD/kernel-4.15.7/linux-4.15/include/linux/linkage.h:8:10: fatal error: asm/linkage.h: No such file or directory #include <asm/linkage.h> ^~~~~~~~~~~~~~~ compilation terminated. CC arch/x86/kernel/nmi.o In file included from /tmp/B.5UxMYa/BUILD/kernel-4.15.7/linux-4.15/include/linux/preempt.h:10:0, from /tmp/B.5UxMYa/BUILD/kernel-4.15.7/linux-4.15/include/linux/spinlock.h:51, from /tmp/B.5UxMYa/BUILD/kernel-4.15.7/linux-4.15/arch/x86/kernel/nmi.c:13: /tmp/B.5UxMYa/BUILD/kernel-4.15.7/linux-4.15/include/linux/linkage.h:8:10: fatal error: asm/linkage.h: No such file or directory #include <asm/linkage.h> ^~~~~~~~~~~~~~~ compilation terminated. make[4]: *** [/tmp/B.5UxMYa/BUILD/kernel-4.15.7/linux-4.15/scripts/Makefile.build:317: arch/x86/kernel/nmi.o] Error 1 make[3]: *** [/tmp/B.5UxMYa/BUILD/kernel-4.15.7/linux-4.15/scripts/Makefile.build:575: arch/x86/kernel] Error 2 CC [M] arch/x86/kvm/../../../virt/kvm/eventfd.o x86_64-pld-linux-gnux32-gcc: error: /tmp/B.5UxMYa/BUILD/kernel-4.15.7/linux-4.15/arch/x86/kvm/../../../virt/kvm/eventfd.c: No such file or directory x86_64-pld-linux-gnux32-gcc: fatal error: no input files compilation terminated. make[4]: *** [/tmp/B.5UxMYa/BUILD/kernel-4.15.7/linux-4.15/scripts/Makefile.build:316: arch/x86/kvm/../../../virt/kvm/eventfd.o] Error 1 make[4]: *** Waiting for unfinished jobs.... CC [M] arch/x86/kvm/../../../virt/kvm/coalesced_mmio.o cc1: fatal error: /tmp/B.5UxMYa/BUILD/kernel-4.15.7/linux-4.15/arch/x86/kvm/../../../virt/kvm/coalesced_mmio.c: No such file or directory compilation terminated. make[4]: *** [/tmp/B.5UxMYa/BUILD/kernel-4.15.7/linux-4.15/scripts/Makefile.build:316: arch/x86/kvm/../../../virt/kvm/coalesced_mmio.o] Error 1 CC kernel/capability.o In file included from /tmp/B.5UxMYa/BUILD/kernel-4.15.7/linux-4.15/include/linux/audit.h:26:0, from /tmp/B.5UxMYa/BUILD/kernel-4.15.7/linux-4.15/kernel/capability.c:13: /tmp/B.5UxMYa/BUILD/kernel-4.15.7/linux-4.15/include/linux/sched.h:12:10: fatal error: asm/current.h: No such file or directory #include <asm/current.h> ^~~~~~~~~~~~~~~ compilation terminated. make[3]: *** [/tmp/B.5UxMYa/BUILD/kernel-4.15.7/linux-4.15/scripts/Makefile.build:316: kernel/capability.o] Error 1 make[3]: *** Waiting for unfinished jobs.... CC fs/ioctl.o CC kernel/ptrace.o In file included from /tmp/B.5UxMYa/BUILD/kernel-4.15.7/linux-4.15/include/linux/types.h:6:0, from /tmp/B.5UxMYa/BUILD/kernel-4.15.7/linux-4.15/include/uapi/linux/capability.h:17, from /tmp/B.5UxMYa/BUILD/kernel-4.15.7/linux-4.15/include/linux/capability.h:16, from /tmp/B.5UxMYa/BUILD/kernel-4.15.7/linux-4.15/kernel/ptrace.c:10: /tmp/B.5UxMYa/BUILD/kernel-4.15.7/linux-4.15/include/uapi/linux/types.h:5:10: fatal error: asm/types.h: No such file or directory #include <asm/types.h> ^~~~~~~~~~~~~ compilation terminated. make[3]: *** [/tmp/B.5UxMYa/BUILD/kernel-4.15.7/linux-4.15/scripts/Makefile.build:316: kernel/ptrace.o] Error 1 CC kernel/user.o In file included from /tmp/B.5UxMYa/BUILD/kernel-4.15.7/linux-4.15/include/linux/compiler.h:164:0, from /tmp/B.5UxMYa/BUILD/kernel-4.15.7/linux-4.15/include/linux/init.h:5, from /tmp/B.5UxMYa/BUILD/kernel-4.15.7/linux-4.15/kernel/user.c:11: /tmp/B.5UxMYa/BUILD/kernel-4.15.7/linux-4.15/include/uapi/linux/types.h:5:10: fatal error: asm/types.h: No such file or directory #include <asm/types.h> ^~~~~~~~~~~~~ compilation terminated. make[3]: *** [/tmp/B.5UxMYa/BUILD/kernel-4.15.7/linux-4.15/scripts/Makefile.build:316: kernel/user.o] Error 1 make[2]: *** [/tmp/B.5UxMYa/BUILD/kernel-4.15.7/linux-4.15/Makefile:1019: kernel] Error 2 make[2]: *** Waiting for unfinished jobs.... CC fs/readdir.o In file included from /tmp/B.5UxMYa/BUILD/kernel-4.15.7/linux-4.15/include/linux/kernel.h:7:0, from /tmp/B.5UxMYa/BUILD/kernel-4.15.7/linux-4.15/fs/readdir.c:9: /tmp/B.5UxMYa/BUILD/kernel-4.15.7/linux-4.15/include/linux/linkage.h:8:10: fatal error: asm/linkage.h: No such file or directory #include <asm/linkage.h> ^~~~~~~~~~~~~~~ compilation terminated. make[3]: *** [/tmp/B.5UxMYa/BUILD/kernel-4.15.7/linux-4.15/scripts/Makefile.build:316: fs/readdir.o] Error 1 make[3]: *** Waiting for unfinished jobs.... CC fs/select.o In file included from /tmp/B.5UxMYa/BUILD/kernel-4.15.7/linux-4.15/include/linux/kernel.h:7:0, from /tmp/B.5UxMYa/BUILD/kernel-4.15.7/linux-4.15/fs/select.c:18: /tmp/B.5UxMYa/BUILD/kernel-4.15.7/linux-4.15/include/linux/linkage.h:8:10: fatal error: asm/linkage.h: No such file or directory #include <asm/linkage.h> ^~~~~~~~~~~~~~~ compilation terminated. make[3]: *** [/tmp/B.5UxMYa/BUILD/kernel-4.15.7/linux-4.15/scripts/Makefile.build:316: fs/select.o] Error 1 make[2]: *** [/tmp/B.5UxMYa/BUILD/kernel-4.15.7/linux-4.15/Makefile:1019: fs] Error 2 GEN security/selinux/flask.h security/selinux/av_permissions.h CC security/integrity/iint.o In file included from /tmp/B.5UxMYa/BUILD/kernel-4.15.7/linux-4.15/include/linux/mmdebug.h:5:0, from /tmp/B.5UxMYa/BUILD/kernel-4.15.7/linux-4.15/include/linux/gfp.h:5, from /tmp/B.5UxMYa/BUILD/kernel-4.15.7/linux-4.15/include/linux/slab.h:15, from /tmp/B.5UxMYa/BUILD/kernel-4.15.7/linux-4.15/security/integrity/iint.c:18: /tmp/B.5UxMYa/BUILD/kernel-4.15.7/linux-4.15/include/linux/bug.h:5:10: fatal error: asm/bug.h: No such file or directory #include <asm/bug.h> ^~~~~~~~~~~ compilation terminated. make[4]: *** [/tmp/B.5UxMYa/BUILD/kernel-4.15.7/linux-4.15/scripts/Makefile.build:316: security/integrity/iint.o] Error 1 make[3]: *** [/tmp/B.5UxMYa/BUILD/kernel-4.15.7/linux-4.15/scripts/Makefile.build:575: security/integrity] Error 2 make[3]: *** Waiting for unfinished jobs.... CC arch/x86/events/msr.o x86_64-pld-linux-gnux32-gcc: error: /tmp/B.5UxMYa/BUILD/kernel-4.15.7/linux-4.15/arch/x86/events/msr.c: No such file or directory x86_64-pld-linux-gnux32-gcc: fatal error: no input files compilation terminated. make[4]: *** [/tmp/B.5UxMYa/BUILD/kernel-4.15.7/linux-4.15/scripts/Makefile.build:317: arch/x86/events/msr.o] Error 1 make[4]: *** Waiting for unfinished jobs.... CC security/apparmor/apparmorfs.o In file included from /tmp/B.5UxMYa/BUILD/kernel-4.15.7/linux-4.15/include/linux/types.h:6:0, from /tmp/B.5UxMYa/BUILD/kernel-4.15.7/linux-4.15/include/linux/key.h:18, from /tmp/B.5UxMYa/BUILD/kernel-4.15.7/linux-4.15/include/linux/security.h:26, from /tmp/B.5UxMYa/BUILD/kernel-4.15.7/linux-4.15/security/apparmor/apparmorfs.c:16: /tmp/B.5UxMYa/BUILD/kernel-4.15.7/linux-4.15/include/uapi/linux/types.h:5:10: fatal error: asm/types.h: No such file or directory #include <asm/types.h> ^~~~~~~~~~~~~ compilation terminated. make[4]: *** [/tmp/B.5UxMYa/BUILD/kernel-4.15.7/linux-4.15/scripts/Makefile.build:317: security/apparmor/apparmorfs.o] Error 1 make[4]: *** Waiting for unfinished jobs.... CC security/keys/gc.o In file included from /tmp/B.5UxMYa/BUILD/kernel-4.15.7/linux-4.15/include/linux/types.h:6:0, from /tmp/B.5UxMYa/BUILD/kernel-4.15.7/linux-4.15/include/linux/list.h:5, from /tmp/B.5UxMYa/BUILD/kernel-4.15.7/linux-4.15/include/linux/module.h:9, from /tmp/B.5UxMYa/BUILD/kernel-4.15.7/linux-4.15/security/keys/gc.c:12: /tmp/B.5UxMYa/BUILD/kernel-4.15.7/linux-4.15/include/uapi/linux/types.h:5:10: fatal error: asm/types.h: No such file or directory #include <asm/types.h> ^~~~~~~~~~~~~ compilation terminated. make[4]: *** [/tmp/B.5UxMYa/BUILD/kernel-4.15.7/linux-4.15/scripts/Makefile.build:316: security/keys/gc.o] Error 1 make[4]: *** Waiting for unfinished jobs.... CC security/keys/key.o In file included from /tmp/B.5UxMYa/BUILD/kernel-4.15.7/linux-4.15/include/linux/types.h:6:0, from /tmp/B.5UxMYa/BUILD/kernel-4.15.7/linux-4.15/include/linux/list.h:5, from /tmp/B.5UxMYa/BUILD/kernel-4.15.7/linux-4.15/include/linux/module.h:9, from /tmp/B.5UxMYa/BUILD/kernel-4.15.7/linux-4.15/security/keys/key.c:12: /tmp/B.5UxMYa/BUILD/kernel-4.15.7/linux-4.15/include/uapi/linux/types.h:5:10: fatal error: asm/types.h: No such file or directory #include <asm/types.h> ^~~~~~~~~~~~~ compilation terminated. make[4]: *** [/tmp/B.5UxMYa/BUILD/kernel-4.15.7/linux-4.15/scripts/Makefile.build:316: security/keys/key.o] Error 1 CC security/apparmor/audit.o In file included from /tmp/B.5UxMYa/BUILD/kernel-4.15.7/linux-4.15/include/linux/audit.h:26:0, from /tmp/B.5UxMYa/BUILD/kernel-4.15.7/linux-4.15/security/apparmor/audit.c:15: /tmp/B.5UxMYa/BUILD/kernel-4.15.7/linux-4.15/include/linux/sched.h:12:10: fatal error: asm/current.h: No such file or directory #include <asm/current.h> ^~~~~~~~~~~~~~~ compilation terminated. make[4]: *** [/tmp/B.5UxMYa/BUILD/kernel-4.15.7/linux-4.15/scripts/Makefile.build:317: security/apparmor/audit.o] Error 1 make[3]: *** [/tmp/B.5UxMYa/BUILD/kernel-4.15.7/linux-4.15/scripts/Makefile.build:575: security/keys] Error 2 make[3]: *** [/tmp/B.5UxMYa/BUILD/kernel-4.15.7/linux-4.15/scripts/Makefile.build:575: security/apparmor] Error 2 CC security/selinux/avc.o In file included from /tmp/B.5UxMYa/BUILD/kernel-4.15.7/linux-4.15/include/linux/types.h:6:0, from /tmp/B.5UxMYa/BUILD/kernel-4.15.7/linux-4.15/security/selinux/avc.c:16: /tmp/B.5UxMYa/BUILD/kernel-4.15.7/linux-4.15/include/uapi/linux/types.h:5:10: fatal error: asm/types.h: No such file or directory #include <asm/types.h> ^~~~~~~~~~~~~ compilation terminated. make[4]: *** [/tmp/B.5UxMYa/BUILD/kernel-4.15.7/linux-4.15/scripts/Makefile.build:316: security/selinux/avc.o] Error 1 make[4]: *** Waiting for unfinished jobs.... CC security/smack/smack_lsm.o In file included from /tmp/B.5UxMYa/BUILD/kernel-4.15.7/linux-4.15/include/linux/mmdebug.h:5:0, from /tmp/B.5UxMYa/BUILD/kernel-4.15.7/linux-4.15/include/linux/gfp.h:5, from /tmp/B.5UxMYa/BUILD/kernel-4.15.7/linux-4.15/include/linux/slab.h:15, from /tmp/B.5UxMYa/BUILD/kernel-4.15.7/linux-4.15/include/linux/xattr.h:15, from /tmp/B.5UxMYa/BUILD/kernel-4.15.7/linux-4.15/security/smack/smack_lsm.c:21: /tmp/B.5UxMYa/BUILD/kernel-4.15.7/linux-4.15/include/linux/bug.h:5:10: fatal error: asm/bug.h: No such file or directory #include <asm/bug.h> ^~~~~~~~~~~ compilation terminated. make[4]: *** [/tmp/B.5UxMYa/BUILD/kernel-4.15.7/linux-4.15/scripts/Makefile.build:317: security/smack/smack_lsm.o] Error 1 make[4]: *** Waiting for unfinished jobs.... CC security/selinux/hooks.o In file included from /tmp/B.5UxMYa/BUILD/kernel-4.15.7/linux-4.15/include/linux/compiler.h:164:0, from /tmp/B.5UxMYa/BUILD/kernel-4.15.7/linux-4.15/include/linux/init.h:5, from /tmp/B.5UxMYa/BUILD/kernel-4.15.7/linux-4.15/security/selinux/hooks.c:27: /tmp/B.5UxMYa/BUILD/kernel-4.15.7/linux-4.15/include/uapi/linux/types.h:5:10: fatal error: asm/types.h: No such file or directory #include <asm/types.h> ^~~~~~~~~~~~~ compilation terminated. make[4]: *** [/tmp/B.5UxMYa/BUILD/kernel-4.15.7/linux-4.15/scripts/Makefile.build:316: security/selinux/hooks.o] Error 1 make[3]: *** [/tmp/B.5UxMYa/BUILD/kernel-4.15.7/linux-4.15/scripts/Makefile.build:575: security/selinux] Error 2 POLICY security/tomoyo/builtin-policy.h CC security/tomoyo/audit.o In file included from /tmp/B.5UxMYa/BUILD/kernel-4.15.7/linux-4.15/include/linux/compiler.h:164:0, from /tmp/B.5UxMYa/BUILD/kernel-4.15.7/linux-4.15/include/linux/string.h:6, from /tmp/B.5UxMYa/BUILD/kernel-4.15.7/linux-4.15/security/tomoyo/common.h:14, from /tmp/B.5UxMYa/BUILD/kernel-4.15.7/linux-4.15/security/tomoyo/audit.c:8: /tmp/B.5UxMYa/BUILD/kernel-4.15.7/linux-4.15/include/uapi/linux/types.h:5:10: fatal error: asm/types.h: No such file or directory #include <asm/types.h> ^~~~~~~~~~~~~ compilation terminated. make[4]: *** [/tmp/B.5UxMYa/BUILD/kernel-4.15.7/linux-4.15/scripts/Makefile.build:317: security/tomoyo/audit.o] Error 1 make[4]: *** Waiting for unfinished jobs.... CC security/tomoyo/condition.o In file included from /tmp/B.5UxMYa/BUILD/kernel-4.15.7/linux-4.15/include/linux/compiler.h:164:0, from /tmp/B.5UxMYa/BUILD/kernel-4.15.7/linux-4.15/include/linux/string.h:6, from /tmp/B.5UxMYa/BUILD/kernel-4.15.7/linux-4.15/security/tomoyo/common.h:14, from /tmp/B.5UxMYa/BUILD/kernel-4.15.7/linux-4.15/security/tomoyo/condition.c:8: /tmp/B.5UxMYa/BUILD/kernel-4.15.7/linux-4.15/include/uapi/linux/types.h:5:10: fatal error: asm/types.h: No such file or directory #include <asm/types.h> ^~~~~~~~~~~~~ compilation terminated. make[4]: *** [/tmp/B.5UxMYa/BUILD/kernel-4.15.7/linux-4.15/scripts/Makefile.build:317: security/tomoyo/condition.o] Error 1 CC security/smack/smack_access.o In file included from /tmp/B.5UxMYa/BUILD/kernel-4.15.7/linux-4.15/include/linux/types.h:6:0, from /tmp/B.5UxMYa/BUILD/kernel-4.15.7/linux-4.15/security/smack/smack_access.c:13: /tmp/B.5UxMYa/BUILD/kernel-4.15.7/linux-4.15/include/uapi/linux/types.h:5:10: fatal error: asm/types.h: No such file or directory #include <asm/types.h> ^~~~~~~~~~~~~ compilation terminated. make[4]: *** [/tmp/B.5UxMYa/BUILD/kernel-4.15.7/linux-4.15/scripts/Makefile.build:317: security/smack/smack_access.o] Error 1 make[3]: *** [/tmp/B.5UxMYa/BUILD/kernel-4.15.7/linux-4.15/scripts/Makefile.build:575: security/smack] Error 2 CC security/tomoyo/domain.o In file included from /tmp/B.5UxMYa/BUILD/kernel-4.15.7/linux-4.15/include/linux/compiler.h:164:0, from /tmp/B.5UxMYa/BUILD/kernel-4.15.7/linux-4.15/include/linux/string.h:6, from /tmp/B.5UxMYa/BUILD/kernel-4.15.7/linux-4.15/security/tomoyo/common.h:14, from /tmp/B.5UxMYa/BUILD/kernel-4.15.7/linux-4.15/security/tomoyo/domain.c:8: /tmp/B.5UxMYa/BUILD/kernel-4.15.7/linux-4.15/include/uapi/linux/types.h:5:10: fatal error: asm/types.h: No such file or directory #include <asm/types.h> ^~~~~~~~~~~~~ compilation terminated. make[4]: *** [/tmp/B.5UxMYa/BUILD/kernel-4.15.7/linux-4.15/scripts/Makefile.build:317: security/tomoyo/domain.o] Error 1 CC security/tomoyo/environ.o In file included from /tmp/B.5UxMYa/BUILD/kernel-4.15.7/linux-4.15/include/linux/compiler.h:164:0, from /tmp/B.5UxMYa/BUILD/kernel-4.15.7/linux-4.15/include/linux/string.h:6, from /tmp/B.5UxMYa/BUILD/kernel-4.15.7/linux-4.15/security/tomoyo/common.h:14, from /tmp/B.5UxMYa/BUILD/kernel-4.15.7/linux-4.15/security/tomoyo/environ.c:8: /tmp/B.5UxMYa/BUILD/kernel-4.15.7/linux-4.15/include/uapi/linux/types.h:5:10: fatal error: asm/types.h: No such file or directory #include <asm/types.h> ^~~~~~~~~~~~~ compilation terminated. make[4]: *** [/tmp/B.5UxMYa/BUILD/kernel-4.15.7/linux-4.15/scripts/Makefile.build:317: security/tomoyo/environ.o] Error 1 CC security/tomoyo/file.o In file included from /tmp/B.5UxMYa/BUILD/kernel-4.15.7/linux-4.15/include/linux/compiler.h:164:0, from /tmp/B.5UxMYa/BUILD/kernel-4.15.7/linux-4.15/include/linux/string.h:6, from /tmp/B.5UxMYa/BUILD/kernel-4.15.7/linux-4.15/security/tomoyo/common.h:14, from /tmp/B.5UxMYa/BUILD/kernel-4.15.7/linux-4.15/security/tomoyo/file.c:8: /tmp/B.5UxMYa/BUILD/kernel-4.15.7/linux-4.15/include/uapi/linux/types.h:5:10: fatal error: asm/types.h: No such file or directory #include <asm/types.h> ^~~~~~~~~~~~~ compilation terminated. make[4]: *** [/tmp/B.5UxMYa/BUILD/kernel-4.15.7/linux-4.15/scripts/Makefile.build:317: security/tomoyo/file.o] Error 1 make[3]: *** [/tmp/B.5UxMYa/BUILD/kernel-4.15.7/linux-4.15/scripts/Makefile.build:575: security/tomoyo] Error 2 make[2]: *** [/tmp/B.5UxMYa/BUILD/kernel-4.15.7/linux-4.15/Makefile:1019: security] Error 2 CC [M] arch/x86/kvm/../../../virt/kvm/kvm_main.o fixdep: error opening config file: /tmp/B.5UxMYa/BUILD/kernel-4.15.7/linux-4.15/arch/x86/kvm/../../../virt/kvm/kvm_main.c: No such file or directory make[4]: *** [/tmp/B.5UxMYa/BUILD/kernel-4.15.7/linux-4.15/scripts/Makefile.build:316: arch/x86/kvm/../../../virt/kvm/kvm_main.o] Error 2 make[3]: *** [/tmp/B.5UxMYa/BUILD/kernel-4.15.7/linux-4.15/scripts/Makefile.build:575: arch/x86/kvm] Error 2 CC [M] arch/x86/events/intel/uncore_snbep.o fixdep: error opening config file: /tmp/B.5UxMYa/BUILD/kernel-4.15.7/linux-4.15/arch/x86/events/intel/uncore_snbep.c: No such file or directory make[5]: *** [/tmp/B.5UxMYa/BUILD/kernel-4.15.7/linux-4.15/scripts/Makefile.build:317: arch/x86/events/intel/uncore_snbep.o] Error 2 make[4]: *** [/tmp/B.5UxMYa/BUILD/kernel-4.15.7/linux-4.15/scripts/Makefile.build:575: arch/x86/events/intel] Error 2 make[3]: *** [/tmp/B.5UxMYa/BUILD/kernel-4.15.7/linux-4.15/scripts/Makefile.build:575: arch/x86/events] Error 2 make[2]: *** [/tmp/B.5UxMYa/BUILD/kernel-4.15.7/linux-4.15/Makefile:1019: arch/x86] Error 2 CC mm/page_alloc.o fixdep: error opening config file: /tmp/B.5UxMYa/BUILD/kernel-4.15.7/linux-4.15/arch/x86/include/uapi/asm/errno.h: No such file or directory make[3]: *** [/tmp/B.5UxMYa/BUILD/kernel-4.15.7/linux-4.15/scripts/Makefile.build:316: mm/page_alloc.o] Error 2 make[2]: *** [/tmp/B.5UxMYa/BUILD/kernel-4.15.7/linux-4.15/Makefile:1019: mm] Error 2 make[1]: *** [Makefile:146: sub-make] Error 2 make: *** [Makefile:9: all] Error 2 + rm -rf /tmp/B.5UxMYa Begin-PLD-Builder-Info Build-Time: user:19.11s sys:28.27s real:169.13s (faults io:193 non-io:115818) End-PLD-Builder-Info
[Back to list of logs] [View rpm -qa of builder]