FailedOk

th/SRPMS[OK]
th/x32[OK]
th/i686[OK]
th/x86_64[OK]

ac/SRPMS[OK]
ac/i386[OK]
ac/i586[OK]
ac/i686[OK]
ac/alpha[OK]
ac/amd64[OK]
ac/athlon[OK]
ac/ppc[OK]
ac/sparc[OK]
ac/sparc64[OK]

Advanced Search
main()
Powered by PLD Linux
(c) 2002-2018 PLD Team
$Revision: 1.37 $
Powered by Leppe'.
Your IP: 52.91.245.237

kernel 32bc38e8-b936-428e-b81d-eb5567f63b96

Status:Failed
Source URL:ftp://buildlogs.pld-linux.org/th/x32/FAIL/kernel,32bc38e8-b936-428e-b81d-eb5567f63b96.bz2
text/plain URL:View!
full text:View!
rpm -qa of builder:View!
Date:2018/03/09 21:44:50
Runtime:0:02:12.465987

Toc:

  • error 1
  • error: No files produced.
  • error 2
  • cc1: fatal error: /tmp/B.5UxMYa/BUILD/kernel-4.15.7/linux-4.15/arch/x86/crypto/sha256-avx-asm.S: No such file or directory
  • error 3
  • compilation terminated.
  • error 4
  • make[4]: *** [/tmp/B.5UxMYa/BUILD/kernel-4.15.7/linux-4.15/scripts/Makefile.build:417: arch/x86/crypto/sha256-avx-asm.o] Error 1
  • error 5
  • make[3]: *** [/tmp/B.5UxMYa/BUILD/kernel-4.15.7/linux-4.15/scripts/Makefile.build:575: arch/x86/crypto] Error 2
  • error 6
  • /tmp/B.5UxMYa/BUILD/kernel-4.15.7/linux-4.15/include/linux/mm_types.h:18:10: fatal error: asm/mmu.h: No such file or directory
  • error 7
  • compilation terminated.
  • error 8
  • make[3]: *** [/tmp/B.5UxMYa/BUILD/kernel-4.15.7/linux-4.15/scripts/Makefile.build:317: mm/readahead.o] Error 1
  • error 9
  • /tmp/B.5UxMYa/BUILD/kernel-4.15.7/linux-4.15/include/uapi/linux/errno.h:1:10: fatal error: asm/errno.h: No such file or directory
  • error 10
  • compilation terminated.
  • error 11
  • make[4]: *** [/tmp/B.5UxMYa/BUILD/kernel-4.15.7/linux-4.15/scripts/Makefile.build:317: arch/x86/kernel/dumpstack.o] Error 1
  • error 12
  • /tmp/B.5UxMYa/BUILD/kernel-4.15.7/linux-4.15/include/uapi/linux/errno.h:1:10: fatal error: asm/errno.h: No such file or directory
  • error 13
  • compilation terminated.
  • error 14
  • make[3]: *** [/tmp/B.5UxMYa/BUILD/kernel-4.15.7/linux-4.15/scripts/Makefile.build:317: mm/swap.o] Error 1
  • error 15
  • x86_64-pld-linux-gnux32-gcc: error: /tmp/B.5UxMYa/BUILD/kernel-4.15.7/linux-4.15/arch/x86/events/intel/cstate.c: No such file or directory
  • error 16
  • x86_64-pld-linux-gnux32-gcc: fatal error: no input files
  • error 17
  • compilation terminated.
  • error 18
  • make[5]: *** [/tmp/B.5UxMYa/BUILD/kernel-4.15.7/linux-4.15/scripts/Makefile.build:317: arch/x86/events/intel/cstate.o] Error 1
  • error 19
  • /tmp/B.5UxMYa/BUILD/kernel-4.15.7/linux-4.15/include/linux/linkage.h:8:10: fatal error: asm/linkage.h: No such file or directory
  • error 20
  • compilation terminated.
  • error 21
  • /tmp/B.5UxMYa/BUILD/kernel-4.15.7/linux-4.15/include/linux/linkage.h:8:10: fatal error: asm/linkage.h: No such file or directory
  • error 22
  • compilation terminated.
  • error 23
  • make[4]: *** [/tmp/B.5UxMYa/BUILD/kernel-4.15.7/linux-4.15/scripts/Makefile.build:317: arch/x86/kernel/nmi.o] Error 1
  • error 24
  • make[3]: *** [/tmp/B.5UxMYa/BUILD/kernel-4.15.7/linux-4.15/scripts/Makefile.build:575: arch/x86/kernel] Error 2
  • error 25
  • x86_64-pld-linux-gnux32-gcc: error: /tmp/B.5UxMYa/BUILD/kernel-4.15.7/linux-4.15/arch/x86/kvm/../../../virt/kvm/eventfd.c: No such file or directory
  • error 26
  • x86_64-pld-linux-gnux32-gcc: fatal error: no input files
  • error 27
  • compilation terminated.
  • error 28
  • make[4]: *** [/tmp/B.5UxMYa/BUILD/kernel-4.15.7/linux-4.15/scripts/Makefile.build:316: arch/x86/kvm/../../../virt/kvm/eventfd.o] Error 1
  • error 29
  • cc1: fatal error: /tmp/B.5UxMYa/BUILD/kernel-4.15.7/linux-4.15/arch/x86/kvm/../../../virt/kvm/coalesced_mmio.c: No such file or directory
  • error 30
  • compilation terminated.
  • error 31
  • make[4]: *** [/tmp/B.5UxMYa/BUILD/kernel-4.15.7/linux-4.15/scripts/Makefile.build:316: arch/x86/kvm/../../../virt/kvm/coalesced_mmio.o] Error 1
  • error 32
  • /tmp/B.5UxMYa/BUILD/kernel-4.15.7/linux-4.15/include/linux/sched.h:12:10: fatal error: asm/current.h: No such file or directory
  • error 33
  • compilation terminated.
  • error 34
  • make[3]: *** [/tmp/B.5UxMYa/BUILD/kernel-4.15.7/linux-4.15/scripts/Makefile.build:316: kernel/capability.o] Error 1
  • error 35
  • /tmp/B.5UxMYa/BUILD/kernel-4.15.7/linux-4.15/include/uapi/linux/types.h:5:10: fatal error: asm/types.h: No such file or directory
  • error 36
  • compilation terminated.
  • error 37
  • make[3]: *** [/tmp/B.5UxMYa/BUILD/kernel-4.15.7/linux-4.15/scripts/Makefile.build:316: kernel/ptrace.o] Error 1
  • error 38
  • /tmp/B.5UxMYa/BUILD/kernel-4.15.7/linux-4.15/include/uapi/linux/types.h:5:10: fatal error: asm/types.h: No such file or directory
  • error 39
  • compilation terminated.
  • error 40
  • make[3]: *** [/tmp/B.5UxMYa/BUILD/kernel-4.15.7/linux-4.15/scripts/Makefile.build:316: kernel/user.o] Error 1
  • error 41
  • make[2]: *** [/tmp/B.5UxMYa/BUILD/kernel-4.15.7/linux-4.15/Makefile:1019: kernel] Error 2
  • error 42
  • /tmp/B.5UxMYa/BUILD/kernel-4.15.7/linux-4.15/include/linux/linkage.h:8:10: fatal error: asm/linkage.h: No such file or directory
  • error 43
  • compilation terminated.
  • error 44
  • make[3]: *** [/tmp/B.5UxMYa/BUILD/kernel-4.15.7/linux-4.15/scripts/Makefile.build:316: fs/readdir.o] Error 1
  • error 45
  • /tmp/B.5UxMYa/BUILD/kernel-4.15.7/linux-4.15/include/linux/linkage.h:8:10: fatal error: asm/linkage.h: No such file or directory
  • error 46
  • compilation terminated.
  • error 47
  • make[3]: *** [/tmp/B.5UxMYa/BUILD/kernel-4.15.7/linux-4.15/scripts/Makefile.build:316: fs/select.o] Error 1
  • error 48
  • make[2]: *** [/tmp/B.5UxMYa/BUILD/kernel-4.15.7/linux-4.15/Makefile:1019: fs] Error 2
  • error 49
  • /tmp/B.5UxMYa/BUILD/kernel-4.15.7/linux-4.15/include/linux/bug.h:5:10: fatal error: asm/bug.h: No such file or directory
  • error 50
  • compilation terminated.
  • error 51
  • make[4]: *** [/tmp/B.5UxMYa/BUILD/kernel-4.15.7/linux-4.15/scripts/Makefile.build:316: security/integrity/iint.o] Error 1
  • error 52
  • make[3]: *** [/tmp/B.5UxMYa/BUILD/kernel-4.15.7/linux-4.15/scripts/Makefile.build:575: security/integrity] Error 2
  • error 53
  • x86_64-pld-linux-gnux32-gcc: error: /tmp/B.5UxMYa/BUILD/kernel-4.15.7/linux-4.15/arch/x86/events/msr.c: No such file or directory
  • error 54
  • x86_64-pld-linux-gnux32-gcc: fatal error: no input files
  • error 55
  • compilation terminated.
  • error 56
  • make[4]: *** [/tmp/B.5UxMYa/BUILD/kernel-4.15.7/linux-4.15/scripts/Makefile.build:317: arch/x86/events/msr.o] Error 1
  • error 57
  • /tmp/B.5UxMYa/BUILD/kernel-4.15.7/linux-4.15/include/uapi/linux/types.h:5:10: fatal error: asm/types.h: No such file or directory
  • error 58
  • compilation terminated.
  • error 59
  • make[4]: *** [/tmp/B.5UxMYa/BUILD/kernel-4.15.7/linux-4.15/scripts/Makefile.build:317: security/apparmor/apparmorfs.o] Error 1
  • error 60
  • /tmp/B.5UxMYa/BUILD/kernel-4.15.7/linux-4.15/include/uapi/linux/types.h:5:10: fatal error: asm/types.h: No such file or directory
  • error 61
  • compilation terminated.
  • error 62
  • make[4]: *** [/tmp/B.5UxMYa/BUILD/kernel-4.15.7/linux-4.15/scripts/Makefile.build:316: security/keys/gc.o] Error 1
  • error 63
  • /tmp/B.5UxMYa/BUILD/kernel-4.15.7/linux-4.15/include/uapi/linux/types.h:5:10: fatal error: asm/types.h: No such file or directory
  • error 64
  • compilation terminated.
  • error 65
  • make[4]: *** [/tmp/B.5UxMYa/BUILD/kernel-4.15.7/linux-4.15/scripts/Makefile.build:316: security/keys/key.o] Error 1
  • error 66
  • /tmp/B.5UxMYa/BUILD/kernel-4.15.7/linux-4.15/include/linux/sched.h:12:10: fatal error: asm/current.h: No such file or directory
  • error 67
  • compilation terminated.
  • error 68
  • make[4]: *** [/tmp/B.5UxMYa/BUILD/kernel-4.15.7/linux-4.15/scripts/Makefile.build:317: security/apparmor/audit.o] Error 1
  • error 69
  • make[3]: *** [/tmp/B.5UxMYa/BUILD/kernel-4.15.7/linux-4.15/scripts/Makefile.build:575: security/keys] Error 2
  • error 70
  • make[3]: *** [/tmp/B.5UxMYa/BUILD/kernel-4.15.7/linux-4.15/scripts/Makefile.build:575: security/apparmor] Error 2
  • error 71
  • /tmp/B.5UxMYa/BUILD/kernel-4.15.7/linux-4.15/include/uapi/linux/types.h:5:10: fatal error: asm/types.h: No such file or directory
  • error 72
  • compilation terminated.
  • error 73
  • make[4]: *** [/tmp/B.5UxMYa/BUILD/kernel-4.15.7/linux-4.15/scripts/Makefile.build:316: security/selinux/avc.o] Error 1
  • error 74
  • /tmp/B.5UxMYa/BUILD/kernel-4.15.7/linux-4.15/include/linux/bug.h:5:10: fatal error: asm/bug.h: No such file or directory
  • error 75
  • compilation terminated.
  • error 76
  • make[4]: *** [/tmp/B.5UxMYa/BUILD/kernel-4.15.7/linux-4.15/scripts/Makefile.build:317: security/smack/smack_lsm.o] Error 1
  • error 77
  • /tmp/B.5UxMYa/BUILD/kernel-4.15.7/linux-4.15/include/uapi/linux/types.h:5:10: fatal error: asm/types.h: No such file or directory
  • error 78
  • compilation terminated.
  • error 79
  • make[4]: *** [/tmp/B.5UxMYa/BUILD/kernel-4.15.7/linux-4.15/scripts/Makefile.build:316: security/selinux/hooks.o] Error 1
  • error 80
  • make[3]: *** [/tmp/B.5UxMYa/BUILD/kernel-4.15.7/linux-4.15/scripts/Makefile.build:575: security/selinux] Error 2
  • error 81
  • /tmp/B.5UxMYa/BUILD/kernel-4.15.7/linux-4.15/include/uapi/linux/types.h:5:10: fatal error: asm/types.h: No such file or directory
  • error 82
  • compilation terminated.
  • error 83
  • make[4]: *** [/tmp/B.5UxMYa/BUILD/kernel-4.15.7/linux-4.15/scripts/Makefile.build:317: security/tomoyo/audit.o] Error 1
  • error 84
  • /tmp/B.5UxMYa/BUILD/kernel-4.15.7/linux-4.15/include/uapi/linux/types.h:5:10: fatal error: asm/types.h: No such file or directory
  • error 85
  • compilation terminated.
  • error 86
  • make[4]: *** [/tmp/B.5UxMYa/BUILD/kernel-4.15.7/linux-4.15/scripts/Makefile.build:317: security/tomoyo/condition.o] Error 1
  • error 87
  • /tmp/B.5UxMYa/BUILD/kernel-4.15.7/linux-4.15/include/uapi/linux/types.h:5:10: fatal error: asm/types.h: No such file or directory
  • error 88
  • compilation terminated.
  • error 89
  • make[4]: *** [/tmp/B.5UxMYa/BUILD/kernel-4.15.7/linux-4.15/scripts/Makefile.build:317: security/smack/smack_access.o] Error 1
  • error 90
  • make[3]: *** [/tmp/B.5UxMYa/BUILD/kernel-4.15.7/linux-4.15/scripts/Makefile.build:575: security/smack] Error 2
  • error 91
  • /tmp/B.5UxMYa/BUILD/kernel-4.15.7/linux-4.15/include/uapi/linux/types.h:5:10: fatal error: asm/types.h: No such file or directory
  • error 92
  • compilation terminated.
  • error 93
  • make[4]: *** [/tmp/B.5UxMYa/BUILD/kernel-4.15.7/linux-4.15/scripts/Makefile.build:317: security/tomoyo/domain.o] Error 1
  • error 94
  • /tmp/B.5UxMYa/BUILD/kernel-4.15.7/linux-4.15/include/uapi/linux/types.h:5:10: fatal error: asm/types.h: No such file or directory
  • error 95
  • compilation terminated.
  • error 96
  • make[4]: *** [/tmp/B.5UxMYa/BUILD/kernel-4.15.7/linux-4.15/scripts/Makefile.build:317: security/tomoyo/environ.o] Error 1
  • error 97
  • /tmp/B.5UxMYa/BUILD/kernel-4.15.7/linux-4.15/include/uapi/linux/types.h:5:10: fatal error: asm/types.h: No such file or directory
  • error 98
  • compilation terminated.
  • error 99
  • make[4]: *** [/tmp/B.5UxMYa/BUILD/kernel-4.15.7/linux-4.15/scripts/Makefile.build:317: security/tomoyo/file.o] Error 1
  • error 100
  • make[3]: *** [/tmp/B.5UxMYa/BUILD/kernel-4.15.7/linux-4.15/scripts/Makefile.build:575: security/tomoyo] Error 2
  • error 101
  • make[2]: *** [/tmp/B.5UxMYa/BUILD/kernel-4.15.7/linux-4.15/Makefile:1019: security] Error 2
  • error 102
  • make[4]: *** [/tmp/B.5UxMYa/BUILD/kernel-4.15.7/linux-4.15/scripts/Makefile.build:316: arch/x86/kvm/../../../virt/kvm/kvm_main.o] Error 2
  • error 103
  • make[3]: *** [/tmp/B.5UxMYa/BUILD/kernel-4.15.7/linux-4.15/scripts/Makefile.build:575: arch/x86/kvm] Error 2
  • error 104
  • make[5]: *** [/tmp/B.5UxMYa/BUILD/kernel-4.15.7/linux-4.15/scripts/Makefile.build:317: arch/x86/events/intel/uncore_snbep.o] Error 2
  • error 105
  • make[4]: *** [/tmp/B.5UxMYa/BUILD/kernel-4.15.7/linux-4.15/scripts/Makefile.build:575: arch/x86/events/intel] Error 2
  • error 106
  • make[3]: *** [/tmp/B.5UxMYa/BUILD/kernel-4.15.7/linux-4.15/scripts/Makefile.build:575: arch/x86/events] Error 2
  • error 107
  • make[2]: *** [/tmp/B.5UxMYa/BUILD/kernel-4.15.7/linux-4.15/Makefile:1019: arch/x86] Error 2
  • error 108
  • make[3]: *** [/tmp/B.5UxMYa/BUILD/kernel-4.15.7/linux-4.15/scripts/Makefile.build:316: mm/page_alloc.o] Error 2
  • error 109
  • make[2]: *** [/tmp/B.5UxMYa/BUILD/kernel-4.15.7/linux-4.15/Makefile:1019: mm] Error 2
  • error 110
  • make[1]: *** [Makefile:146: sub-make] Error 2

Content:

  AS [M]  arch/x86/crypto/chacha20-ssse3-x86_64.o
  CC      fs/char_dev.o
  CC [M]  arch/x86/events/amd/power.o
  AR      arch/x86/events/amd/built-in.o
  CC      ipc/shm.o
  CC [M]  arch/x86/crypto/chacha20_glue.o
  CC      init/init_task.o
  AS [M]  arch/x86/crypto/chacha20-avx2-x86_64.o
  AS [M]  arch/x86/crypto/serpent-sse2-x86_64-asm_64.o
  CC      init/version.o
  AR      init/mounts.o
  AR      init/built-in.o
  CC      certs/blacklist.o
  CC      arch/x86/entry/syscall_64.o
  CC      mm/filemap.o
  CC      ipc/syscall.o
  CC      fs/stat.o
  AS [M]  arch/x86/crypto/aesni-intel_asm.o
  CC      certs/blacklist_nohashes.o
  AS      certs/system_certificates.o
  AR      certs/built-in.o
  CC [M]  arch/x86/crypto/serpent_sse2_glue.o
  CC      ipc/ipc_sysctl.o
  CC      arch/x86/entry/vsyscall/vsyscall_gtod.o
  CC      arch/x86/events/intel/core.o
  CC      mm/mempool.o
  CC      arch/x86/entry/common.o
  CC [M]  arch/x86/crypto/aesni-intel_glue.o
  CC      ipc/namespace.o
  CC      arch/x86/entry/vsyscall/vsyscall_64.o
  CC      kernel/exit.o
  CC      arch/x86/entry/vdso/vma.o
  CC      arch/x86/entry/vdso/vdso32-setup.o
  LDS     arch/x86/entry/vdso/vdso.lds
  CC      fs/exec.o
  CC      ipc/mq_sysctl.o
  AS      arch/x86/entry/vdso/vdso-note.o
  CC [M]  arch/x86/crypto/fpu.o
  CC      ipc/mqueue.o
  AS      arch/x86/entry/entry_64_compat.o
  CC      arch/x86/events/intel/bts.o
  AS      arch/x86/entry/vsyscall/vsyscall_emu_64.o
  AR      ipc/built-in.o
  AS [M]  arch/x86/crypto/aesni-intel_avx-x86_64.o
  AR      arch/x86/entry/vsyscall/built-in.o
  AS [M]  arch/x86/crypto/aes_ctrby8_avx-x86_64.o
  AS [M]  arch/x86/crypto/ghash-clmulni-intel_asm.o
  CC      arch/x86/entry/vdso/vclock_gettime.o
  CC      arch/x86/entry/vdso/vgetcpu.o
  CC      arch/x86/events/intel/knc.o
  LDS     arch/x86/entry/vdso/vdsox32.lds
  HOSTCC  arch/x86/entry/vdso/vdso2c
  X32     arch/x86/entry/vdso/vdso-note-x32.o
  CC      arch/x86/hyperv/hv_init.o
  X32     arch/x86/entry/vdso/vclock_gettime-x32.o
  CC      arch/x86/ia32/sys_ia32.o
  X32     arch/x86/entry/vdso/vgetcpu-x32.o
  CC      kernel/softirq.o
  LDS     arch/x86/entry/vdso/vdso32/vdso32.lds
  CC      arch/x86/events/intel/ds.o
  CC      fs/pipe.o
  CC      arch/x86/entry/vdso/vdso32/vclock_gettime.o
  AS      arch/x86/entry/vdso/vdso32/note.o
  AS      arch/x86/entry/vdso/vdso32/system_call.o
  AS      arch/x86/entry/vdso/vdso32/sigreturn.o
  CC      arch/x86/ia32/ia32_signal.o
  CC      arch/x86/hyperv/mmu.o
  AR      arch/x86/hyperv/built-in.o
  CC      arch/x86/ia32/audit.o
  VDSO    arch/x86/entry/vdso/vdso64.so.dbg
  VDSO    arch/x86/entry/vdso/vdsox32.so.dbg
  VDSO    arch/x86/entry/vdso/vdso32.so.dbg
  OBJCOPY arch/x86/entry/vdso/vdso64.so
  OBJCOPY arch/x86/entry/vdso/vdsox32.so
  OBJCOPY arch/x86/entry/vdso/vdso32.so
  CC      arch/x86/events/intel/lbr.o
  VDSO2C  arch/x86/entry/vdso/vdso-image-64.c
  VDSO2C  arch/x86/entry/vdso/vdso-image-x32.c
  VDSO2C  arch/x86/entry/vdso/vdso-image-32.c
  CC      kernel/resource.o
  CC      arch/x86/entry/syscall_32.o
  CC      arch/x86/entry/vdso/vdso-image-64.o
  CC      arch/x86/kernel/process_64.o
  CC      arch/x86/ia32/ia32_aout.o
  AR      arch/x86/ia32/built-in.o
  CC      arch/x86/entry/vdso/vdso-image-x32.o
  CC      arch/x86/entry/vdso/vdso-image-32.o
  AR      arch/x86/entry/vdso/built-in.o
  AR      arch/x86/entry/built-in.o
  CC      arch/x86/events/intel/p6.o
  CC      arch/x86/events/intel/p4.o
  CC      arch/x86/kernel/signal_compat.o
  CC      arch/x86/kernel/signal.o
  CC      arch/x86/kernel/traps.o
  CC [M]  arch/x86/events/intel/rapl.o
  CC      fs/fcntl.o
  CC      mm/oom_kill.o
Terminated
ended at: Fri Mar  9 21:44:28 2018, done in 0:02:12.465987
error: No files produced.
  CC      arch/x86/kernel/idt.o
  CC      kernel/sysctl.o
  CC      fs/namei.o
  CC      arch/x86/events/intel/pt.o
  CC [M]  arch/x86/crypto/ghash-clmulni-intel_glue.o
+ chmod -R u+rwX /tmp/B.5UxMYa/BUILD
  CC [M]  arch/x86/events/intel/uncore.o
  CC      mm/maccess.o
  CC      arch/x86/kernel/irq_64.o
  CC [M]  arch/x86/crypto/crc32c-intel_glue.o
  AS [M]  arch/x86/crypto/crc32c-pcl-intel-asm_64.o
  CC      arch/x86/kernel/dumpstack_64.o
  AS [M]  arch/x86/crypto/sha1_ssse3_asm.o
+ rm -rf /tmp/B.5UxMYa/tmp /tmp/B.5UxMYa/BUILD
  CC [M]  arch/x86/events/intel/uncore_nhmex.o
  AS [M]  arch/x86/crypto/sha1_avx2_x86_64_asm.o
  CC      arch/x86/kernel/irq.o
  CC [M]  arch/x86/crypto/sha1_ssse3_glue.o
  AS [M]  arch/x86/crypto/sha1_ni_asm.o
  AS [M]  arch/x86/crypto/crc32-pclmul_asm.o
  CC [M]  arch/x86/events/intel/uncore_snb.o
  CC      arch/x86/kernel/time.o
  AS [M]  arch/x86/crypto/sha256-ssse3-asm.o
  CC [M]  arch/x86/crypto/crc32-pclmul_glue.o
  CC      arch/x86/kernel/ioport.o
  AS [M]  arch/x86/crypto/sha256-avx-asm.o
cc1: fatal error: /tmp/B.5UxMYa/BUILD/kernel-4.15.7/linux-4.15/arch/x86/crypto/sha256-avx-asm.S: No such file or directory
compilation terminated.
make[4]: *** [/tmp/B.5UxMYa/BUILD/kernel-4.15.7/linux-4.15/scripts/Makefile.build:417: arch/x86/crypto/sha256-avx-asm.o] Error 1
make[3]: *** [/tmp/B.5UxMYa/BUILD/kernel-4.15.7/linux-4.15/scripts/Makefile.build:575: arch/x86/crypto] Error 2
make[3]: *** Waiting for unfinished jobs....
  CC      mm/readahead.o
In file included from /tmp/B.5UxMYa/BUILD/kernel-4.15.7/linux-4.15/include/linux/fs.h:22:0,
                 from /tmp/B.5UxMYa/BUILD/kernel-4.15.7/linux-4.15/include/linux/dax.h:5,
                 from /tmp/B.5UxMYa/BUILD/kernel-4.15.7/linux-4.15/mm/readahead.c:11:
/tmp/B.5UxMYa/BUILD/kernel-4.15.7/linux-4.15/include/linux/mm_types.h:18:10: fatal error: asm/mmu.h: No such file or directory
 #include <asm/mmu.h>
          ^~~~~~~~~~~
compilation terminated.
make[3]: *** [/tmp/B.5UxMYa/BUILD/kernel-4.15.7/linux-4.15/scripts/Makefile.build:317: mm/readahead.o] Error 1
make[3]: *** Waiting for unfinished jobs....
  CC      arch/x86/kernel/dumpstack.o
In file included from /tmp/B.5UxMYa/BUILD/kernel-4.15.7/linux-4.15/include/linux/errno.h:5:0,
                 from /tmp/B.5UxMYa/BUILD/kernel-4.15.7/linux-4.15/include/linux/kallsyms.h:9,
                 from /tmp/B.5UxMYa/BUILD/kernel-4.15.7/linux-4.15/arch/x86/kernel/dumpstack.c:5:
/tmp/B.5UxMYa/BUILD/kernel-4.15.7/linux-4.15/include/uapi/linux/errno.h:1:10: fatal error: asm/errno.h: No such file or directory
 #include <asm/errno.h>
          ^~~~~~~~~~~~~
compilation terminated.
make[4]: *** [/tmp/B.5UxMYa/BUILD/kernel-4.15.7/linux-4.15/scripts/Makefile.build:317: arch/x86/kernel/dumpstack.o] Error 1
make[4]: *** Waiting for unfinished jobs....
  CC      mm/swap.o
In file included from /tmp/B.5UxMYa/BUILD/kernel-4.15.7/linux-4.15/include/linux/errno.h:5:0,
                 from /tmp/B.5UxMYa/BUILD/kernel-4.15.7/linux-4.15/include/linux/mm.h:5,
                 from /tmp/B.5UxMYa/BUILD/kernel-4.15.7/linux-4.15/mm/swap.c:16:
/tmp/B.5UxMYa/BUILD/kernel-4.15.7/linux-4.15/include/uapi/linux/errno.h:1:10: fatal error: asm/errno.h: No such file or directory
 #include <asm/errno.h>
          ^~~~~~~~~~~~~
compilation terminated.
make[3]: *** [/tmp/B.5UxMYa/BUILD/kernel-4.15.7/linux-4.15/scripts/Makefile.build:317: mm/swap.o] Error 1
  CC [M]  arch/x86/events/intel/cstate.o
x86_64-pld-linux-gnux32-gcc: error: /tmp/B.5UxMYa/BUILD/kernel-4.15.7/linux-4.15/arch/x86/events/intel/cstate.c: No such file or directory
x86_64-pld-linux-gnux32-gcc: fatal error: no input files
compilation terminated.
make[5]: *** [/tmp/B.5UxMYa/BUILD/kernel-4.15.7/linux-4.15/scripts/Makefile.build:317: arch/x86/events/intel/cstate.o] Error 1
make[5]: *** Waiting for unfinished jobs....
  CC      kernel/sysctl_binary.o
  CC      mm/page-writeback.o
In file included from /tmp/B.5UxMYa/BUILD/kernel-4.15.7/linux-4.15/include/linux/kernel.h:7:0,
                 from /tmp/B.5UxMYa/BUILD/kernel-4.15.7/linux-4.15/mm/page-writeback.c:14:
/tmp/B.5UxMYa/BUILD/kernel-4.15.7/linux-4.15/include/linux/linkage.h:8:10: fatal error: asm/linkage.h: No such file or directory
 #include <asm/linkage.h>
          ^~~~~~~~~~~~~~~
compilation terminated.
  CC      arch/x86/kernel/nmi.o
In file included from /tmp/B.5UxMYa/BUILD/kernel-4.15.7/linux-4.15/include/linux/preempt.h:10:0,
                 from /tmp/B.5UxMYa/BUILD/kernel-4.15.7/linux-4.15/include/linux/spinlock.h:51,
                 from /tmp/B.5UxMYa/BUILD/kernel-4.15.7/linux-4.15/arch/x86/kernel/nmi.c:13:
/tmp/B.5UxMYa/BUILD/kernel-4.15.7/linux-4.15/include/linux/linkage.h:8:10: fatal error: asm/linkage.h: No such file or directory
 #include <asm/linkage.h>
          ^~~~~~~~~~~~~~~
compilation terminated.
make[4]: *** [/tmp/B.5UxMYa/BUILD/kernel-4.15.7/linux-4.15/scripts/Makefile.build:317: arch/x86/kernel/nmi.o] Error 1
make[3]: *** [/tmp/B.5UxMYa/BUILD/kernel-4.15.7/linux-4.15/scripts/Makefile.build:575: arch/x86/kernel] Error 2
  CC [M]  arch/x86/kvm/../../../virt/kvm/eventfd.o
x86_64-pld-linux-gnux32-gcc: error: /tmp/B.5UxMYa/BUILD/kernel-4.15.7/linux-4.15/arch/x86/kvm/../../../virt/kvm/eventfd.c: No such file or directory
x86_64-pld-linux-gnux32-gcc: fatal error: no input files
compilation terminated.
make[4]: *** [/tmp/B.5UxMYa/BUILD/kernel-4.15.7/linux-4.15/scripts/Makefile.build:316: arch/x86/kvm/../../../virt/kvm/eventfd.o] Error 1
make[4]: *** Waiting for unfinished jobs....
  CC [M]  arch/x86/kvm/../../../virt/kvm/coalesced_mmio.o
cc1: fatal error: /tmp/B.5UxMYa/BUILD/kernel-4.15.7/linux-4.15/arch/x86/kvm/../../../virt/kvm/coalesced_mmio.c: No such file or directory
compilation terminated.
make[4]: *** [/tmp/B.5UxMYa/BUILD/kernel-4.15.7/linux-4.15/scripts/Makefile.build:316: arch/x86/kvm/../../../virt/kvm/coalesced_mmio.o] Error 1
  CC      kernel/capability.o
In file included from /tmp/B.5UxMYa/BUILD/kernel-4.15.7/linux-4.15/include/linux/audit.h:26:0,
                 from /tmp/B.5UxMYa/BUILD/kernel-4.15.7/linux-4.15/kernel/capability.c:13:
/tmp/B.5UxMYa/BUILD/kernel-4.15.7/linux-4.15/include/linux/sched.h:12:10: fatal error: asm/current.h: No such file or directory
 #include <asm/current.h>
          ^~~~~~~~~~~~~~~
compilation terminated.
make[3]: *** [/tmp/B.5UxMYa/BUILD/kernel-4.15.7/linux-4.15/scripts/Makefile.build:316: kernel/capability.o] Error 1
make[3]: *** Waiting for unfinished jobs....
  CC      fs/ioctl.o
  CC      kernel/ptrace.o
In file included from /tmp/B.5UxMYa/BUILD/kernel-4.15.7/linux-4.15/include/linux/types.h:6:0,
                 from /tmp/B.5UxMYa/BUILD/kernel-4.15.7/linux-4.15/include/uapi/linux/capability.h:17,
                 from /tmp/B.5UxMYa/BUILD/kernel-4.15.7/linux-4.15/include/linux/capability.h:16,
                 from /tmp/B.5UxMYa/BUILD/kernel-4.15.7/linux-4.15/kernel/ptrace.c:10:
/tmp/B.5UxMYa/BUILD/kernel-4.15.7/linux-4.15/include/uapi/linux/types.h:5:10: fatal error: asm/types.h: No such file or directory
 #include <asm/types.h>
          ^~~~~~~~~~~~~
compilation terminated.
make[3]: *** [/tmp/B.5UxMYa/BUILD/kernel-4.15.7/linux-4.15/scripts/Makefile.build:316: kernel/ptrace.o] Error 1
  CC      kernel/user.o
In file included from /tmp/B.5UxMYa/BUILD/kernel-4.15.7/linux-4.15/include/linux/compiler.h:164:0,
                 from /tmp/B.5UxMYa/BUILD/kernel-4.15.7/linux-4.15/include/linux/init.h:5,
                 from /tmp/B.5UxMYa/BUILD/kernel-4.15.7/linux-4.15/kernel/user.c:11:
/tmp/B.5UxMYa/BUILD/kernel-4.15.7/linux-4.15/include/uapi/linux/types.h:5:10: fatal error: asm/types.h: No such file or directory
 #include <asm/types.h>
          ^~~~~~~~~~~~~
compilation terminated.
make[3]: *** [/tmp/B.5UxMYa/BUILD/kernel-4.15.7/linux-4.15/scripts/Makefile.build:316: kernel/user.o] Error 1
make[2]: *** [/tmp/B.5UxMYa/BUILD/kernel-4.15.7/linux-4.15/Makefile:1019: kernel] Error 2
make[2]: *** Waiting for unfinished jobs....
  CC      fs/readdir.o
In file included from /tmp/B.5UxMYa/BUILD/kernel-4.15.7/linux-4.15/include/linux/kernel.h:7:0,
                 from /tmp/B.5UxMYa/BUILD/kernel-4.15.7/linux-4.15/fs/readdir.c:9:
/tmp/B.5UxMYa/BUILD/kernel-4.15.7/linux-4.15/include/linux/linkage.h:8:10: fatal error: asm/linkage.h: No such file or directory
 #include <asm/linkage.h>
          ^~~~~~~~~~~~~~~
compilation terminated.
make[3]: *** [/tmp/B.5UxMYa/BUILD/kernel-4.15.7/linux-4.15/scripts/Makefile.build:316: fs/readdir.o] Error 1
make[3]: *** Waiting for unfinished jobs....
  CC      fs/select.o
In file included from /tmp/B.5UxMYa/BUILD/kernel-4.15.7/linux-4.15/include/linux/kernel.h:7:0,
                 from /tmp/B.5UxMYa/BUILD/kernel-4.15.7/linux-4.15/fs/select.c:18:
/tmp/B.5UxMYa/BUILD/kernel-4.15.7/linux-4.15/include/linux/linkage.h:8:10: fatal error: asm/linkage.h: No such file or directory
 #include <asm/linkage.h>
          ^~~~~~~~~~~~~~~
compilation terminated.
make[3]: *** [/tmp/B.5UxMYa/BUILD/kernel-4.15.7/linux-4.15/scripts/Makefile.build:316: fs/select.o] Error 1
make[2]: *** [/tmp/B.5UxMYa/BUILD/kernel-4.15.7/linux-4.15/Makefile:1019: fs] Error 2
  GEN     security/selinux/flask.h security/selinux/av_permissions.h
  CC      security/integrity/iint.o
In file included from /tmp/B.5UxMYa/BUILD/kernel-4.15.7/linux-4.15/include/linux/mmdebug.h:5:0,
                 from /tmp/B.5UxMYa/BUILD/kernel-4.15.7/linux-4.15/include/linux/gfp.h:5,
                 from /tmp/B.5UxMYa/BUILD/kernel-4.15.7/linux-4.15/include/linux/slab.h:15,
                 from /tmp/B.5UxMYa/BUILD/kernel-4.15.7/linux-4.15/security/integrity/iint.c:18:
/tmp/B.5UxMYa/BUILD/kernel-4.15.7/linux-4.15/include/linux/bug.h:5:10: fatal error: asm/bug.h: No such file or directory
 #include <asm/bug.h>
          ^~~~~~~~~~~
compilation terminated.
make[4]: *** [/tmp/B.5UxMYa/BUILD/kernel-4.15.7/linux-4.15/scripts/Makefile.build:316: security/integrity/iint.o] Error 1
make[3]: *** [/tmp/B.5UxMYa/BUILD/kernel-4.15.7/linux-4.15/scripts/Makefile.build:575: security/integrity] Error 2
make[3]: *** Waiting for unfinished jobs....
  CC      arch/x86/events/msr.o
x86_64-pld-linux-gnux32-gcc: error: /tmp/B.5UxMYa/BUILD/kernel-4.15.7/linux-4.15/arch/x86/events/msr.c: No such file or directory
x86_64-pld-linux-gnux32-gcc: fatal error: no input files
compilation terminated.
make[4]: *** [/tmp/B.5UxMYa/BUILD/kernel-4.15.7/linux-4.15/scripts/Makefile.build:317: arch/x86/events/msr.o] Error 1
make[4]: *** Waiting for unfinished jobs....
  CC      security/apparmor/apparmorfs.o
In file included from /tmp/B.5UxMYa/BUILD/kernel-4.15.7/linux-4.15/include/linux/types.h:6:0,
                 from /tmp/B.5UxMYa/BUILD/kernel-4.15.7/linux-4.15/include/linux/key.h:18,
                 from /tmp/B.5UxMYa/BUILD/kernel-4.15.7/linux-4.15/include/linux/security.h:26,
                 from /tmp/B.5UxMYa/BUILD/kernel-4.15.7/linux-4.15/security/apparmor/apparmorfs.c:16:
/tmp/B.5UxMYa/BUILD/kernel-4.15.7/linux-4.15/include/uapi/linux/types.h:5:10: fatal error: asm/types.h: No such file or directory
 #include <asm/types.h>
          ^~~~~~~~~~~~~
compilation terminated.
make[4]: *** [/tmp/B.5UxMYa/BUILD/kernel-4.15.7/linux-4.15/scripts/Makefile.build:317: security/apparmor/apparmorfs.o] Error 1
make[4]: *** Waiting for unfinished jobs....
  CC      security/keys/gc.o
In file included from /tmp/B.5UxMYa/BUILD/kernel-4.15.7/linux-4.15/include/linux/types.h:6:0,
                 from /tmp/B.5UxMYa/BUILD/kernel-4.15.7/linux-4.15/include/linux/list.h:5,
                 from /tmp/B.5UxMYa/BUILD/kernel-4.15.7/linux-4.15/include/linux/module.h:9,
                 from /tmp/B.5UxMYa/BUILD/kernel-4.15.7/linux-4.15/security/keys/gc.c:12:
/tmp/B.5UxMYa/BUILD/kernel-4.15.7/linux-4.15/include/uapi/linux/types.h:5:10: fatal error: asm/types.h: No such file or directory
 #include <asm/types.h>
          ^~~~~~~~~~~~~
compilation terminated.
make[4]: *** [/tmp/B.5UxMYa/BUILD/kernel-4.15.7/linux-4.15/scripts/Makefile.build:316: security/keys/gc.o] Error 1
make[4]: *** Waiting for unfinished jobs....
  CC      security/keys/key.o
In file included from /tmp/B.5UxMYa/BUILD/kernel-4.15.7/linux-4.15/include/linux/types.h:6:0,
                 from /tmp/B.5UxMYa/BUILD/kernel-4.15.7/linux-4.15/include/linux/list.h:5,
                 from /tmp/B.5UxMYa/BUILD/kernel-4.15.7/linux-4.15/include/linux/module.h:9,
                 from /tmp/B.5UxMYa/BUILD/kernel-4.15.7/linux-4.15/security/keys/key.c:12:
/tmp/B.5UxMYa/BUILD/kernel-4.15.7/linux-4.15/include/uapi/linux/types.h:5:10: fatal error: asm/types.h: No such file or directory
 #include <asm/types.h>
          ^~~~~~~~~~~~~
compilation terminated.
make[4]: *** [/tmp/B.5UxMYa/BUILD/kernel-4.15.7/linux-4.15/scripts/Makefile.build:316: security/keys/key.o] Error 1
  CC      security/apparmor/audit.o
In file included from /tmp/B.5UxMYa/BUILD/kernel-4.15.7/linux-4.15/include/linux/audit.h:26:0,
                 from /tmp/B.5UxMYa/BUILD/kernel-4.15.7/linux-4.15/security/apparmor/audit.c:15:
/tmp/B.5UxMYa/BUILD/kernel-4.15.7/linux-4.15/include/linux/sched.h:12:10: fatal error: asm/current.h: No such file or directory
 #include <asm/current.h>
          ^~~~~~~~~~~~~~~
compilation terminated.
make[4]: *** [/tmp/B.5UxMYa/BUILD/kernel-4.15.7/linux-4.15/scripts/Makefile.build:317: security/apparmor/audit.o] Error 1
make[3]: *** [/tmp/B.5UxMYa/BUILD/kernel-4.15.7/linux-4.15/scripts/Makefile.build:575: security/keys] Error 2
make[3]: *** [/tmp/B.5UxMYa/BUILD/kernel-4.15.7/linux-4.15/scripts/Makefile.build:575: security/apparmor] Error 2
  CC      security/selinux/avc.o
In file included from /tmp/B.5UxMYa/BUILD/kernel-4.15.7/linux-4.15/include/linux/types.h:6:0,
                 from /tmp/B.5UxMYa/BUILD/kernel-4.15.7/linux-4.15/security/selinux/avc.c:16:
/tmp/B.5UxMYa/BUILD/kernel-4.15.7/linux-4.15/include/uapi/linux/types.h:5:10: fatal error: asm/types.h: No such file or directory
 #include <asm/types.h>
          ^~~~~~~~~~~~~
compilation terminated.
make[4]: *** [/tmp/B.5UxMYa/BUILD/kernel-4.15.7/linux-4.15/scripts/Makefile.build:316: security/selinux/avc.o] Error 1
make[4]: *** Waiting for unfinished jobs....
  CC      security/smack/smack_lsm.o
In file included from /tmp/B.5UxMYa/BUILD/kernel-4.15.7/linux-4.15/include/linux/mmdebug.h:5:0,
                 from /tmp/B.5UxMYa/BUILD/kernel-4.15.7/linux-4.15/include/linux/gfp.h:5,
                 from /tmp/B.5UxMYa/BUILD/kernel-4.15.7/linux-4.15/include/linux/slab.h:15,
                 from /tmp/B.5UxMYa/BUILD/kernel-4.15.7/linux-4.15/include/linux/xattr.h:15,
                 from /tmp/B.5UxMYa/BUILD/kernel-4.15.7/linux-4.15/security/smack/smack_lsm.c:21:
/tmp/B.5UxMYa/BUILD/kernel-4.15.7/linux-4.15/include/linux/bug.h:5:10: fatal error: asm/bug.h: No such file or directory
 #include <asm/bug.h>
          ^~~~~~~~~~~
compilation terminated.
make[4]: *** [/tmp/B.5UxMYa/BUILD/kernel-4.15.7/linux-4.15/scripts/Makefile.build:317: security/smack/smack_lsm.o] Error 1
make[4]: *** Waiting for unfinished jobs....
  CC      security/selinux/hooks.o
In file included from /tmp/B.5UxMYa/BUILD/kernel-4.15.7/linux-4.15/include/linux/compiler.h:164:0,
                 from /tmp/B.5UxMYa/BUILD/kernel-4.15.7/linux-4.15/include/linux/init.h:5,
                 from /tmp/B.5UxMYa/BUILD/kernel-4.15.7/linux-4.15/security/selinux/hooks.c:27:
/tmp/B.5UxMYa/BUILD/kernel-4.15.7/linux-4.15/include/uapi/linux/types.h:5:10: fatal error: asm/types.h: No such file or directory
 #include <asm/types.h>
          ^~~~~~~~~~~~~
compilation terminated.
make[4]: *** [/tmp/B.5UxMYa/BUILD/kernel-4.15.7/linux-4.15/scripts/Makefile.build:316: security/selinux/hooks.o] Error 1
make[3]: *** [/tmp/B.5UxMYa/BUILD/kernel-4.15.7/linux-4.15/scripts/Makefile.build:575: security/selinux] Error 2
  POLICY  security/tomoyo/builtin-policy.h
  CC      security/tomoyo/audit.o
In file included from /tmp/B.5UxMYa/BUILD/kernel-4.15.7/linux-4.15/include/linux/compiler.h:164:0,
                 from /tmp/B.5UxMYa/BUILD/kernel-4.15.7/linux-4.15/include/linux/string.h:6,
                 from /tmp/B.5UxMYa/BUILD/kernel-4.15.7/linux-4.15/security/tomoyo/common.h:14,
                 from /tmp/B.5UxMYa/BUILD/kernel-4.15.7/linux-4.15/security/tomoyo/audit.c:8:
/tmp/B.5UxMYa/BUILD/kernel-4.15.7/linux-4.15/include/uapi/linux/types.h:5:10: fatal error: asm/types.h: No such file or directory
 #include <asm/types.h>
          ^~~~~~~~~~~~~
compilation terminated.
make[4]: *** [/tmp/B.5UxMYa/BUILD/kernel-4.15.7/linux-4.15/scripts/Makefile.build:317: security/tomoyo/audit.o] Error 1
make[4]: *** Waiting for unfinished jobs....
  CC      security/tomoyo/condition.o
In file included from /tmp/B.5UxMYa/BUILD/kernel-4.15.7/linux-4.15/include/linux/compiler.h:164:0,
                 from /tmp/B.5UxMYa/BUILD/kernel-4.15.7/linux-4.15/include/linux/string.h:6,
                 from /tmp/B.5UxMYa/BUILD/kernel-4.15.7/linux-4.15/security/tomoyo/common.h:14,
                 from /tmp/B.5UxMYa/BUILD/kernel-4.15.7/linux-4.15/security/tomoyo/condition.c:8:
/tmp/B.5UxMYa/BUILD/kernel-4.15.7/linux-4.15/include/uapi/linux/types.h:5:10: fatal error: asm/types.h: No such file or directory
 #include <asm/types.h>
          ^~~~~~~~~~~~~
compilation terminated.
make[4]: *** [/tmp/B.5UxMYa/BUILD/kernel-4.15.7/linux-4.15/scripts/Makefile.build:317: security/tomoyo/condition.o] Error 1
  CC      security/smack/smack_access.o
In file included from /tmp/B.5UxMYa/BUILD/kernel-4.15.7/linux-4.15/include/linux/types.h:6:0,
                 from /tmp/B.5UxMYa/BUILD/kernel-4.15.7/linux-4.15/security/smack/smack_access.c:13:
/tmp/B.5UxMYa/BUILD/kernel-4.15.7/linux-4.15/include/uapi/linux/types.h:5:10: fatal error: asm/types.h: No such file or directory
 #include <asm/types.h>
          ^~~~~~~~~~~~~
compilation terminated.
make[4]: *** [/tmp/B.5UxMYa/BUILD/kernel-4.15.7/linux-4.15/scripts/Makefile.build:317: security/smack/smack_access.o] Error 1
make[3]: *** [/tmp/B.5UxMYa/BUILD/kernel-4.15.7/linux-4.15/scripts/Makefile.build:575: security/smack] Error 2
  CC      security/tomoyo/domain.o
In file included from /tmp/B.5UxMYa/BUILD/kernel-4.15.7/linux-4.15/include/linux/compiler.h:164:0,
                 from /tmp/B.5UxMYa/BUILD/kernel-4.15.7/linux-4.15/include/linux/string.h:6,
                 from /tmp/B.5UxMYa/BUILD/kernel-4.15.7/linux-4.15/security/tomoyo/common.h:14,
                 from /tmp/B.5UxMYa/BUILD/kernel-4.15.7/linux-4.15/security/tomoyo/domain.c:8:
/tmp/B.5UxMYa/BUILD/kernel-4.15.7/linux-4.15/include/uapi/linux/types.h:5:10: fatal error: asm/types.h: No such file or directory
 #include <asm/types.h>
          ^~~~~~~~~~~~~
compilation terminated.
make[4]: *** [/tmp/B.5UxMYa/BUILD/kernel-4.15.7/linux-4.15/scripts/Makefile.build:317: security/tomoyo/domain.o] Error 1
  CC      security/tomoyo/environ.o
In file included from /tmp/B.5UxMYa/BUILD/kernel-4.15.7/linux-4.15/include/linux/compiler.h:164:0,
                 from /tmp/B.5UxMYa/BUILD/kernel-4.15.7/linux-4.15/include/linux/string.h:6,
                 from /tmp/B.5UxMYa/BUILD/kernel-4.15.7/linux-4.15/security/tomoyo/common.h:14,
                 from /tmp/B.5UxMYa/BUILD/kernel-4.15.7/linux-4.15/security/tomoyo/environ.c:8:
/tmp/B.5UxMYa/BUILD/kernel-4.15.7/linux-4.15/include/uapi/linux/types.h:5:10: fatal error: asm/types.h: No such file or directory
 #include <asm/types.h>
          ^~~~~~~~~~~~~
compilation terminated.
make[4]: *** [/tmp/B.5UxMYa/BUILD/kernel-4.15.7/linux-4.15/scripts/Makefile.build:317: security/tomoyo/environ.o] Error 1
  CC      security/tomoyo/file.o
In file included from /tmp/B.5UxMYa/BUILD/kernel-4.15.7/linux-4.15/include/linux/compiler.h:164:0,
                 from /tmp/B.5UxMYa/BUILD/kernel-4.15.7/linux-4.15/include/linux/string.h:6,
                 from /tmp/B.5UxMYa/BUILD/kernel-4.15.7/linux-4.15/security/tomoyo/common.h:14,
                 from /tmp/B.5UxMYa/BUILD/kernel-4.15.7/linux-4.15/security/tomoyo/file.c:8:
/tmp/B.5UxMYa/BUILD/kernel-4.15.7/linux-4.15/include/uapi/linux/types.h:5:10: fatal error: asm/types.h: No such file or directory
 #include <asm/types.h>
          ^~~~~~~~~~~~~
compilation terminated.
make[4]: *** [/tmp/B.5UxMYa/BUILD/kernel-4.15.7/linux-4.15/scripts/Makefile.build:317: security/tomoyo/file.o] Error 1
make[3]: *** [/tmp/B.5UxMYa/BUILD/kernel-4.15.7/linux-4.15/scripts/Makefile.build:575: security/tomoyo] Error 2
make[2]: *** [/tmp/B.5UxMYa/BUILD/kernel-4.15.7/linux-4.15/Makefile:1019: security] Error 2
  CC [M]  arch/x86/kvm/../../../virt/kvm/kvm_main.o
fixdep: error opening config file: /tmp/B.5UxMYa/BUILD/kernel-4.15.7/linux-4.15/arch/x86/kvm/../../../virt/kvm/kvm_main.c: No such file or directory
make[4]: *** [/tmp/B.5UxMYa/BUILD/kernel-4.15.7/linux-4.15/scripts/Makefile.build:316: arch/x86/kvm/../../../virt/kvm/kvm_main.o] Error 2
make[3]: *** [/tmp/B.5UxMYa/BUILD/kernel-4.15.7/linux-4.15/scripts/Makefile.build:575: arch/x86/kvm] Error 2
  CC [M]  arch/x86/events/intel/uncore_snbep.o
fixdep: error opening config file: /tmp/B.5UxMYa/BUILD/kernel-4.15.7/linux-4.15/arch/x86/events/intel/uncore_snbep.c: No such file or directory
make[5]: *** [/tmp/B.5UxMYa/BUILD/kernel-4.15.7/linux-4.15/scripts/Makefile.build:317: arch/x86/events/intel/uncore_snbep.o] Error 2
make[4]: *** [/tmp/B.5UxMYa/BUILD/kernel-4.15.7/linux-4.15/scripts/Makefile.build:575: arch/x86/events/intel] Error 2
make[3]: *** [/tmp/B.5UxMYa/BUILD/kernel-4.15.7/linux-4.15/scripts/Makefile.build:575: arch/x86/events] Error 2
make[2]: *** [/tmp/B.5UxMYa/BUILD/kernel-4.15.7/linux-4.15/Makefile:1019: arch/x86] Error 2
  CC      mm/page_alloc.o
fixdep: error opening config file: /tmp/B.5UxMYa/BUILD/kernel-4.15.7/linux-4.15/arch/x86/include/uapi/asm/errno.h: No such file or directory
make[3]: *** [/tmp/B.5UxMYa/BUILD/kernel-4.15.7/linux-4.15/scripts/Makefile.build:316: mm/page_alloc.o] Error 2
make[2]: *** [/tmp/B.5UxMYa/BUILD/kernel-4.15.7/linux-4.15/Makefile:1019: mm] Error 2
make[1]: *** [Makefile:146: sub-make] Error 2
make: *** [Makefile:9: all] Error 2
+ rm -rf /tmp/B.5UxMYa
Begin-PLD-Builder-Info
Build-Time: user:19.11s sys:28.27s real:169.13s (faults io:193 non-io:115818)

End-PLD-Builder-Info
[Back to list of logs] [View rpm -qa of builder]