FailedOk

th/SRPMS[OK]
th/x32[OK]
th/i686[OK]
th/x86_64[OK]

ac/SRPMS[OK]
ac/i386[OK]
ac/i586[OK]
ac/i686[OK]
ac/alpha[OK]
ac/amd64[OK]
ac/athlon[OK]
ac/ppc[OK]
ac/sparc[OK]
ac/sparc64[OK]

Advanced Search
main()
Powered by PLD Linux
(c) 2002-2018 PLD Team
$Revision: 1.37 $
Powered by overclock.
Your IP: 54.166.141.69

libeXosip2 35b10e8d-aea7-4493-bbcb-9c35f39538c5

Status:Failed
Source URL:ftp://buildlogs.pld-linux.org/th/x32/FAIL/libeXosip2,35b10e8d-aea7-4493-bbcb-9c35f39538c5.bz2
text/plain URL:View!
full text:View!
rpm -qa of builder:View!
Date:2018/09/14 20:24:34
Runtime:0:00:33.430821

Toc:

  • error 1
  • eXtl_dtls.c:236:43: error: dereferencing pointer to incomplete type 'SSL' {aka 'struct ssl_st'}
  • error 2
  • make[2]: *** [Makefile:537: eXtl_dtls.lo] Error 1
  • error 3
  • make[1]: *** [Makefile:418: all-recursive] Error 1
  • error 4
  • error: Bad exit status from /tmp/B.r_qaJn/BUILD/tmp/rpm-tmp.79582 (%build)
  • error 5
  • RPM build errors:
  • error 6
  • error: No files produced.

Content:

In file included from /usr/include/stdio.h:873,
                 from eXosip2.h:91,
                 from eXutils.c:33:
/usr/include/bits/stdio2.h:67:10: note: '__builtin___snprintf_chk' output between 12 and 523 bytes into a destination of size 512
   return __builtin___snprintf_chk (__s, __n, __USE_FORTIFY_LEVEL - 1,
          ^~~~~~~~~~~~~~~~~~~~~~~~~~~~~~~~~~~~~~~~~~~~~~~~~~~~~~~~~~~~
        __bos (__s), __fmt, __va_arg_pack ());
        ~~~~~~~~~~~~~~~~~~~~~~~~~~~~~~~~~~~~~
eXutils.c:1869:70: warning: '%s' directive output may be truncated writing up to 511 bytes into a region of size 501 [-Wformat-truncation=]
       snprintf (srvrecord.name, sizeof (srvrecord.name), "_sips._udp.%s", output_record->domain);
                                                                      ^~
In file included from /usr/include/stdio.h:873,
                 from eXosip2.h:91,
                 from eXutils.c:33:
/usr/include/bits/stdio2.h:67:10: note: '__builtin___snprintf_chk' output between 12 and 523 bytes into a destination of size 512
   return __builtin___snprintf_chk (__s, __n, __USE_FORTIFY_LEVEL - 1,
          ^~~~~~~~~~~~~~~~~~~~~~~~~~~~~~~~~~~~~~~~~~~~~~~~~~~~~~~~~~~~
        __bos (__s), __fmt, __va_arg_pack ());
        ~~~~~~~~~~~~~~~~~~~~~~~~~~~~~~~~~~~~~
libtool: compile:  x86_64-pld-linux-gnux32-gcc -DHAVE_CONFIG_H -I. -I.. -I.. -I../include -Wall -Wcast-align -Wchar-subscripts -Wformat -Winline -Wmissing-declarations -Wmissing-prototypes -Wnested-externs -Wpointer-arith -DENABLE_TRACE -O2 -fwrapv -pipe -Wformat -Werror=format-security -gdwarf-4 -fno-debug-types-section -fvar-tracking-assignments -g2 -Wp,-D_FORTIFY_SOURCE=2 -fstack-protector-strong --param=ssp-buffer-size=4 -fPIC -mtune=generic -march=x86-64 -gdwarf-4 -fno-debug-types-section -fvar-tracking-assignments -g2 -pthread -MT eXutils.lo -MD -MP -MF .deps/eXutils.Tpo -c eXutils.c -o eXutils.o >/dev/null 2>&1
mv -f .deps/eXutils.Tpo .deps/eXutils.Plo
/bin/sh ../libtool  --tag=CC   --mode=compile x86_64-pld-linux-gnux32-gcc -DHAVE_CONFIG_H -I. -I..  -I.. -I../include  -Wall -Wcast-align -Wchar-subscripts -Wformat -Winline -Wmissing-declarations -Wmissing-prototypes -Wnested-externs -Wpointer-arith -DENABLE_TRACE -O2 -fwrapv -pipe -Wformat -Werror=format-security -gdwarf-4 -fno-debug-types-section -fvar-tracking-assignments -g2 -Wp,-D_FORTIFY_SOURCE=2 -fstack-protector-strong --param=ssp-buffer-size=4 -fPIC -mtune=generic -march=x86-64 -gdwarf-4 -fno-debug-types-section -fvar-tracking-assignments -g2  -pthread -MT jevents.lo -MD -MP -MF .deps/jevents.Tpo -c -o jevents.lo jevents.c
libtool: compile:  x86_64-pld-linux-gnux32-gcc -DHAVE_CONFIG_H -I. -I.. -I.. -I../include -Wall -Wcast-align -Wchar-subscripts -Wformat -Winline -Wmissing-declarations -Wmissing-prototypes -Wnested-externs -Wpointer-arith -DENABLE_TRACE -O2 -fwrapv -pipe -Wformat -Werror=format-security -gdwarf-4 -fno-debug-types-section -fvar-tracking-assignments -g2 -Wp,-D_FORTIFY_SOURCE=2 -fstack-protector-strong --param=ssp-buffer-size=4 -fPIC -mtune=generic -march=x86-64 -gdwarf-4 -fno-debug-types-section -fvar-tracking-assignments -g2 -pthread -MT jevents.lo -MD -MP -MF .deps/jevents.Tpo -c jevents.c  -fPIC -DPIC -o .libs/jevents.o
libtool: compile:  x86_64-pld-linux-gnux32-gcc -DHAVE_CONFIG_H -I. -I.. -I.. -I../include -Wall -Wcast-align -Wchar-subscripts -Wformat -Winline -Wmissing-declarations -Wmissing-prototypes -Wnested-externs -Wpointer-arith -DENABLE_TRACE -O2 -fwrapv -pipe -Wformat -Werror=format-security -gdwarf-4 -fno-debug-types-section -fvar-tracking-assignments -g2 -Wp,-D_FORTIFY_SOURCE=2 -fstack-protector-strong --param=ssp-buffer-size=4 -fPIC -mtune=generic -march=x86-64 -gdwarf-4 -fno-debug-types-section -fvar-tracking-assignments -g2 -pthread -MT jevents.lo -MD -MP -MF .deps/jevents.Tpo -c jevents.c -o jevents.o >/dev/null 2>&1
mv -f .deps/jevents.Tpo .deps/jevents.Plo
/bin/sh ../libtool  --tag=CC   --mode=compile x86_64-pld-linux-gnux32-gcc -DHAVE_CONFIG_H -I. -I..  -I.. -I../include  -Wall -Wcast-align -Wchar-subscripts -Wformat -Winline -Wmissing-declarations -Wmissing-prototypes -Wnested-externs -Wpointer-arith -DENABLE_TRACE -O2 -fwrapv -pipe -Wformat -Werror=format-security -gdwarf-4 -fno-debug-types-section -fvar-tracking-assignments -g2 -Wp,-D_FORTIFY_SOURCE=2 -fstack-protector-strong --param=ssp-buffer-size=4 -fPIC -mtune=generic -march=x86-64 -gdwarf-4 -fno-debug-types-section -fvar-tracking-assignments -g2  -pthread -MT misc.lo -MD -MP -MF .deps/misc.Tpo -c -o misc.lo misc.c
libtool: compile:  x86_64-pld-linux-gnux32-gcc -DHAVE_CONFIG_H -I. -I.. -I.. -I../include -Wall -Wcast-align -Wchar-subscripts -Wformat -Winline -Wmissing-declarations -Wmissing-prototypes -Wnested-externs -Wpointer-arith -DENABLE_TRACE -O2 -fwrapv -pipe -Wformat -Werror=format-security -gdwarf-4 -fno-debug-types-section -fvar-tracking-assignments -g2 -Wp,-D_FORTIFY_SOURCE=2 -fstack-protector-strong --param=ssp-buffer-size=4 -fPIC -mtune=generic -march=x86-64 -gdwarf-4 -fno-debug-types-section -fvar-tracking-assignments -g2 -pthread -MT misc.lo -MD -MP -MF .deps/misc.Tpo -c misc.c  -fPIC -DPIC -o .libs/misc.o
libtool: compile:  x86_64-pld-linux-gnux32-gcc -DHAVE_CONFIG_H -I. -I.. -I.. -I../include -Wall -Wcast-align -Wchar-subscripts -Wformat -Winline -Wmissing-declarations -Wmissing-prototypes -Wnested-externs -Wpointer-arith -DENABLE_TRACE -O2 -fwrapv -pipe -Wformat -Werror=format-security -gdwarf-4 -fno-debug-types-section -fvar-tracking-assignments -g2 -Wp,-D_FORTIFY_SOURCE=2 -fstack-protector-strong --param=ssp-buffer-size=4 -fPIC -mtune=generic -march=x86-64 -gdwarf-4 -fno-debug-types-section -fvar-tracking-assignments -g2 -pthread -MT misc.lo -MD -MP -MF .deps/misc.Tpo -c misc.c -o misc.o >/dev/null 2>&1
mv -f .deps/misc.Tpo .deps/misc.Plo
/bin/sh ../libtool  --tag=CC   --mode=compile x86_64-pld-linux-gnux32-gcc -DHAVE_CONFIG_H -I. -I..  -I.. -I../include  -Wall -Wcast-align -Wchar-subscripts -Wformat -Winline -Wmissing-declarations -Wmissing-prototypes -Wnested-externs -Wpointer-arith -DENABLE_TRACE -O2 -fwrapv -pipe -Wformat -Werror=format-security -gdwarf-4 -fno-debug-types-section -fvar-tracking-assignments -g2 -Wp,-D_FORTIFY_SOURCE=2 -fstack-protector-strong --param=ssp-buffer-size=4 -fPIC -mtune=generic -march=x86-64 -gdwarf-4 -fno-debug-types-section -fvar-tracking-assignments -g2  -pthread -MT jpipe.lo -MD -MP -MF .deps/jpipe.Tpo -c -o jpipe.lo jpipe.c
libtool: compile:  x86_64-pld-linux-gnux32-gcc -DHAVE_CONFIG_H -I. -I.. -I.. -I../include -Wall -Wcast-align -Wchar-subscripts -Wformat -Winline -Wmissing-declarations -Wmissing-prototypes -Wnested-externs -Wpointer-arith -DENABLE_TRACE -O2 -fwrapv -pipe -Wformat -Werror=format-security -gdwarf-4 -fno-debug-types-section -fvar-tracking-assignments -g2 -Wp,-D_FORTIFY_SOURCE=2 -fstack-protector-strong --param=ssp-buffer-size=4 -fPIC -mtune=generic -march=x86-64 -gdwarf-4 -fno-debug-types-section -fvar-tracking-assignments -g2 -pthread -MT jpipe.lo -MD -MP -MF .deps/jpipe.Tpo -c jpipe.c  -fPIC -DPIC -o .libs/jpipe.o
libtool: compile:  x86_64-pld-linux-gnux32-gcc -DHAVE_CONFIG_H -I. -I.. -I.. -I../include -Wall -Wcast-align -Wchar-subscripts -Wformat -Winline -Wmissing-declarations -Wmissing-prototypes -Wnested-externs -Wpointer-arith -DENABLE_TRACE -O2 -fwrapv -pipe -Wformat -Werror=format-security -gdwarf-4 -fno-debug-types-section -fvar-tracking-assignments -g2 -Wp,-D_FORTIFY_SOURCE=2 -fstack-protector-strong --param=ssp-buffer-size=4 -fPIC -mtune=generic -march=x86-64 -gdwarf-4 -fno-debug-types-section -fvar-tracking-assignments -g2 -pthread -MT jpipe.lo -MD -MP -MF .deps/jpipe.Tpo -c jpipe.c -o jpipe.o >/dev/null 2>&1
mv -f .deps/jpipe.Tpo .deps/jpipe.Plo
/bin/sh ../libtool  --tag=CC   --mode=compile x86_64-pld-linux-gnux32-gcc -DHAVE_CONFIG_H -I. -I..  -I.. -I../include  -Wall -Wcast-align -Wchar-subscripts -Wformat -Winline -Wmissing-declarations -Wmissing-prototypes -Wnested-externs -Wpointer-arith -DENABLE_TRACE -O2 -fwrapv -pipe -Wformat -Werror=format-security -gdwarf-4 -fno-debug-types-section -fvar-tracking-assignments -g2 -Wp,-D_FORTIFY_SOURCE=2 -fstack-protector-strong --param=ssp-buffer-size=4 -fPIC -mtune=generic -march=x86-64 -gdwarf-4 -fno-debug-types-section -fvar-tracking-assignments -g2  -pthread -MT jauth.lo -MD -MP -MF .deps/jauth.Tpo -c -o jauth.lo jauth.c
libtool: compile:  x86_64-pld-linux-gnux32-gcc -DHAVE_CONFIG_H -I. -I.. -I.. -I../include -Wall -Wcast-align -Wchar-subscripts -Wformat -Winline -Wmissing-declarations -Wmissing-prototypes -Wnested-externs -Wpointer-arith -DENABLE_TRACE -O2 -fwrapv -pipe -Wformat -Werror=format-security -gdwarf-4 -fno-debug-types-section -fvar-tracking-assignments -g2 -Wp,-D_FORTIFY_SOURCE=2 -fstack-protector-strong --param=ssp-buffer-size=4 -fPIC -mtune=generic -march=x86-64 -gdwarf-4 -fno-debug-types-section -fvar-tracking-assignments -g2 -pthread -MT jauth.lo -MD -MP -MF .deps/jauth.Tpo -c jauth.c  -fPIC -DPIC -o .libs/jauth.o
libtool: compile:  x86_64-pld-linux-gnux32-gcc -DHAVE_CONFIG_H -I. -I.. -I.. -I../include -Wall -Wcast-align -Wchar-subscripts -Wformat -Winline -Wmissing-declarations -Wmissing-prototypes -Wnested-externs -Wpointer-arith -DENABLE_TRACE -O2 -fwrapv -pipe -Wformat -Werror=format-security -gdwarf-4 -fno-debug-types-section -fvar-tracking-assignments -g2 -Wp,-D_FORTIFY_SOURCE=2 -fstack-protector-strong --param=ssp-buffer-size=4 -fPIC -mtune=generic -march=x86-64 -gdwarf-4 -fno-debug-types-section -fvar-tracking-assignments -g2 -pthread -MT jauth.lo -MD -MP -MF .deps/jauth.Tpo -c jauth.c -o jauth.o >/dev/null 2>&1
mv -f .deps/jauth.Tpo .deps/jauth.Plo
/bin/sh ../libtool  --tag=CC   --mode=compile x86_64-pld-linux-gnux32-gcc -DHAVE_CONFIG_H -I. -I..  -I.. -I../include  -Wall -Wcast-align -Wchar-subscripts -Wformat -Winline -Wmissing-declarations -Wmissing-prototypes -Wnested-externs -Wpointer-arith -DENABLE_TRACE -O2 -fwrapv -pipe -Wformat -Werror=format-security -gdwarf-4 -fno-debug-types-section -fvar-tracking-assignments -g2 -Wp,-D_FORTIFY_SOURCE=2 -fstack-protector-strong --param=ssp-buffer-size=4 -fPIC -mtune=generic -march=x86-64 -gdwarf-4 -fno-debug-types-section -fvar-tracking-assignments -g2  -pthread -MT eXtl_udp.lo -MD -MP -MF .deps/eXtl_udp.Tpo -c -o eXtl_udp.lo eXtl_udp.c
libtool: compile:  x86_64-pld-linux-gnux32-gcc -DHAVE_CONFIG_H -I. -I.. -I.. -I../include -Wall -Wcast-align -Wchar-subscripts -Wformat -Winline -Wmissing-declarations -Wmissing-prototypes -Wnested-externs -Wpointer-arith -DENABLE_TRACE -O2 -fwrapv -pipe -Wformat -Werror=format-security -gdwarf-4 -fno-debug-types-section -fvar-tracking-assignments -g2 -Wp,-D_FORTIFY_SOURCE=2 -fstack-protector-strong --param=ssp-buffer-size=4 -fPIC -mtune=generic -march=x86-64 -gdwarf-4 -fno-debug-types-section -fvar-tracking-assignments -g2 -pthread -MT eXtl_udp.lo -MD -MP -MF .deps/eXtl_udp.Tpo -c eXtl_udp.c  -fPIC -DPIC -o .libs/eXtl_udp.o
eXtl_udp.c: In function 'udp_tl_masquerade_contact':
eXtl_udp.c:1415:87: warning: '__builtin___snprintf_chk' output may be truncated before the last format character [-Wformat-truncation=]
     snprintf (excontext->udp_firewall_port, sizeof (excontext->udp_firewall_port), "%i", port);
                                                                                       ^
In file included from /usr/include/stdio.h:873,
                 from eXosip2.h:91,
                 from eXtl_udp.c:33:
/usr/include/bits/stdio2.h:67:10: note: '__builtin___snprintf_chk' output between 2 and 11 bytes into a destination of size 10
   return __builtin___snprintf_chk (__s, __n, __USE_FORTIFY_LEVEL - 1,
          ^~~~~~~~~~~~~~~~~~~~~~~~~~~~~~~~~~~~~~~~~~~~~~~~~~~~~~~~~~~~
        __bos (__s), __fmt, __va_arg_pack ());
        ~~~~~~~~~~~~~~~~~~~~~~~~~~~~~~~~~~~~~
eXtl_udp.c: In function 'udp_tl_read_message':
eXtl_udp.c:785:107: warning: '%s' directive output may be truncated writing up to 1024 bytes into a region of size 64 [-Wformat-truncation=]
               snprintf(reserved->socket_tab[pos].remote_ip, sizeof(reserved->socket_tab[pos].remote_ip), "%s", src6host);
                                                                                                           ^~   ~~~~~~~~
In file included from /usr/include/stdio.h:873,
                 from eXosip2.h:91,
                 from eXtl_udp.c:33:
/usr/include/bits/stdio2.h:67:10: note: '__builtin_snprintf' output between 1 and 1025 bytes into a destination of size 64
   return __builtin___snprintf_chk (__s, __n, __USE_FORTIFY_LEVEL - 1,
          ^~~~~~~~~~~~~~~~~~~~~~~~~~~~~~~~~~~~~~~~~~~~~~~~~~~~~~~~~~~~
        __bos (__s), __fmt, __va_arg_pack ());
        ~~~~~~~~~~~~~~~~~~~~~~~~~~~~~~~~~~~~~
libtool: compile:  x86_64-pld-linux-gnux32-gcc -DHAVE_CONFIG_H -I. -I.. -I.. -I../include -Wall -Wcast-align -Wchar-subscripts -Wformat -Winline -Wmissing-declarations -Wmissing-prototypes -Wnested-externs -Wpointer-arith -DENABLE_TRACE -O2 -fwrapv -pipe -Wformat -Werror=format-security -gdwarf-4 -fno-debug-types-section -fvar-tracking-assignments -g2 -Wp,-D_FORTIFY_SOURCE=2 -fstack-protector-strong --param=ssp-buffer-size=4 -fPIC -mtune=generic -march=x86-64 -gdwarf-4 -fno-debug-types-section -fvar-tracking-assignments -g2 -pthread -MT eXtl_udp.lo -MD -MP -MF .deps/eXtl_udp.Tpo -c eXtl_udp.c -o eXtl_udp.o >/dev/null 2>&1
mv -f .deps/eXtl_udp.Tpo .deps/eXtl_udp.Plo
/bin/sh ../libtool  --tag=CC   --mode=compile x86_64-pld-linux-gnux32-gcc -DHAVE_CONFIG_H -I. -I..  -I.. -I../include  -Wall -Wcast-align -Wchar-subscripts -Wformat -Winline -Wmissing-declarations -Wmissing-prototypes -Wnested-externs -Wpointer-arith -DENABLE_TRACE -O2 -fwrapv -pipe -Wformat -Werror=format-security -gdwarf-4 -fno-debug-types-section -fvar-tracking-assignments -g2 -Wp,-D_FORTIFY_SOURCE=2 -fstack-protector-strong --param=ssp-buffer-size=4 -fPIC -mtune=generic -march=x86-64 -gdwarf-4 -fno-debug-types-section -fvar-tracking-assignments -g2  -pthread -MT eXtl_tcp.lo -MD -MP -MF .deps/eXtl_tcp.Tpo -c -o eXtl_tcp.lo eXtl_tcp.c
libtool: compile:  x86_64-pld-linux-gnux32-gcc -DHAVE_CONFIG_H -I. -I.. -I.. -I../include -Wall -Wcast-align -Wchar-subscripts -Wformat -Winline -Wmissing-declarations -Wmissing-prototypes -Wnested-externs -Wpointer-arith -DENABLE_TRACE -O2 -fwrapv -pipe -Wformat -Werror=format-security -gdwarf-4 -fno-debug-types-section -fvar-tracking-assignments -g2 -Wp,-D_FORTIFY_SOURCE=2 -fstack-protector-strong --param=ssp-buffer-size=4 -fPIC -mtune=generic -march=x86-64 -gdwarf-4 -fno-debug-types-section -fvar-tracking-assignments -g2 -pthread -MT eXtl_tcp.lo -MD -MP -MF .deps/eXtl_tcp.Tpo -c eXtl_tcp.c  -fPIC -DPIC -o .libs/eXtl_tcp.o
eXtl_tcp.c: In function 'tcp_tl_masquerade_contact':
eXtl_tcp.c:1677:91: warning: '__builtin___snprintf_chk' output may be truncated before the last format character [-Wformat-truncation=]
         snprintf (excontext->tcp_firewall_port, sizeof (excontext->tcp_firewall_port), "%i", port);
                                                                                           ^
In file included from /usr/include/stdio.h:873,
                 from eXosip2.h:91,
                 from eXtl_tcp.c:33:
/usr/include/bits/stdio2.h:67:10: note: '__builtin___snprintf_chk' output between 2 and 11 bytes into a destination of size 10
   return __builtin___snprintf_chk (__s, __n, __USE_FORTIFY_LEVEL - 1,
          ^~~~~~~~~~~~~~~~~~~~~~~~~~~~~~~~~~~~~~~~~~~~~~~~~~~~~~~~~~~~
        __bos (__s), __fmt, __va_arg_pack ());
        ~~~~~~~~~~~~~~~~~~~~~~~~~~~~~~~~~~~~~
eXtl_tcp.c: In function 'tcp_tl_send_message':
eXtl_tcp.c:1198:44: warning: '%i' directive output may be truncated writing between 1 and 10 bytes into a region of size 9 [-Wformat-truncation=]
               snprintf (co->url->port, 9, "%i", natted_port);
                                            ^~
eXtl_tcp.c:1198:43: note: directive argument in the range [1, 2147483647]
               snprintf (co->url->port, 9, "%i", natted_port);
                                           ^~~~
In file included from /usr/include/stdio.h:873,
                 from eXosip2.h:91,
                 from eXtl_tcp.c:33:
/usr/include/bits/stdio2.h:67:10: note: '__builtin___snprintf_chk' output between 2 and 11 bytes into a destination of size 9
   return __builtin___snprintf_chk (__s, __n, __USE_FORTIFY_LEVEL - 1,
          ^~~~~~~~~~~~~~~~~~~~~~~~~~~~~~~~~~~~~~~~~~~~~~~~~~~~~~~~~~~~
        __bos (__s), __fmt, __va_arg_pack ());
        ~~~~~~~~~~~~~~~~~~~~~~~~~~~~~~~~~~~~~
libtool: compile:  x86_64-pld-linux-gnux32-gcc -DHAVE_CONFIG_H -I. -I.. -I.. -I../include -Wall -Wcast-align -Wchar-subscripts -Wformat -Winline -Wmissing-declarations -Wmissing-prototypes -Wnested-externs -Wpointer-arith -DENABLE_TRACE -O2 -fwrapv -pipe -Wformat -Werror=format-security -gdwarf-4 -fno-debug-types-section -fvar-tracking-assignments -g2 -Wp,-D_FORTIFY_SOURCE=2 -fstack-protector-strong --param=ssp-buffer-size=4 -fPIC -mtune=generic -march=x86-64 -gdwarf-4 -fno-debug-types-section -fvar-tracking-assignments -g2 -pthread -MT eXtl_tcp.lo -MD -MP -MF .deps/eXtl_tcp.Tpo -c eXtl_tcp.c -o eXtl_tcp.o >/dev/null 2>&1
mv -f .deps/eXtl_tcp.Tpo .deps/eXtl_tcp.Plo
/bin/sh ../libtool  --tag=CC   --mode=compile x86_64-pld-linux-gnux32-gcc -DHAVE_CONFIG_H -I. -I..  -I.. -I../include  -Wall -Wcast-align -Wchar-subscripts -Wformat -Winline -Wmissing-declarations -Wmissing-prototypes -Wnested-externs -Wpointer-arith -DENABLE_TRACE -O2 -fwrapv -pipe -Wformat -Werror=format-security -gdwarf-4 -fno-debug-types-section -fvar-tracking-assignments -g2 -Wp,-D_FORTIFY_SOURCE=2 -fstack-protector-strong --param=ssp-buffer-size=4 -fPIC -mtune=generic -march=x86-64 -gdwarf-4 -fno-debug-types-section -fvar-tracking-assignments -g2  -pthread -MT eXtl_dtls.lo -MD -MP -MF .deps/eXtl_dtls.Tpo -c -o eXtl_dtls.lo eXtl_dtls.c
libtool: compile:  x86_64-pld-linux-gnux32-gcc -DHAVE_CONFIG_H -I. -I.. -I.. -I../include -Wall -Wcast-align -Wchar-subscripts -Wformat -Winline -Wmissing-declarations -Wmissing-prototypes -Wnested-externs -Wpointer-arith -DENABLE_TRACE -O2 -fwrapv -pipe -Wformat -Werror=format-security -gdwarf-4 -fno-debug-types-section -fvar-tracking-assignments -g2 -Wp,-D_FORTIFY_SOURCE=2 -fstack-protector-strong --param=ssp-buffer-size=4 -fPIC -mtune=generic -march=x86-64 -gdwarf-4 -fno-debug-types-section -fvar-tracking-assignments -g2 -pthread -MT eXtl_dtls.lo -MD -MP -MF .deps/eXtl_dtls.Tpo -c eXtl_dtls.c  -fPIC -DPIC -o .libs/eXtl_dtls.o
eXtl_dtls.c: In function 'shutdown_free_client_dtls':
eXtl_dtls.c:236:43: error: dereferencing pointer to incomplete type 'SSL' {aka 'struct ssl_st'}
       (reserved->socket_tab[pos].ssl_conn)->rbio = rbio;
                                           ^~
eXtl_dtls.c: In function 'dtls_tl_free':
eXtl_dtls.c:297:3: warning: 'ERR_remove_state' is deprecated [-Wdeprecated-declarations]
   ERR_remove_state (0);
   ^~~~~~~~~~~~~~~~
In file included from /usr/include/openssl/e_os2.h:13,
                 from /usr/include/openssl/ssl.h:15,
                 from eXtl_dtls.c:52:
/usr/include/openssl/err.h:260:1: note: declared here
 DEPRECATEDIN_1_0_0(void ERR_remove_state(unsigned long pid))
 ^~~~~~~~~~~~~~~~~~
make[2]: *** [Makefile:537: eXtl_dtls.lo] Error 1
make[2]: Leaving directory '/tmp/B.r_qaJn/BUILD/libexosip2-5.0.0/src'
make[1]: *** [Makefile:418: all-recursive] Error 1
make[1]: Leaving directory '/tmp/B.r_qaJn/BUILD/libexosip2-5.0.0'
make: *** [Makefile:350: all] Error 2
error: Bad exit status from /tmp/B.r_qaJn/BUILD/tmp/rpm-tmp.79582 (%build)


RPM build errors:
    Bad exit status from /tmp/B.r_qaJn/BUILD/tmp/rpm-tmp.79582 (%build)
ended at: Fri Sep 14 20:24:34 2018, done in 0:00:33.430821
error: No files produced.
+ chmod -R u+rwX /tmp/B.r_qaJn/BUILD
+ rm -rf /tmp/B.r_qaJn/tmp /tmp/B.r_qaJn/BUILD
+ rm -rf /tmp/B.r_qaJn
Begin-PLD-Builder-Info
Build-Time: user:27.75s sys:4.88s real:36.47s (faults io:0 non-io:957613)

End-PLD-Builder-Info
[Back to list of logs] [View rpm -qa of builder]