FailedOk

th/SRPMS[OK]
th/x32[OK]
th/i686[OK]
th/x86_64[OK]

ac/SRPMS[OK]
ac/i386[OK]
ac/i586[OK]
ac/i686[OK]
ac/alpha[OK]
ac/amd64[OK]
ac/athlon[OK]
ac/ppc[OK]
ac/sparc[OK]
ac/sparc64[OK]

Advanced Search
main()
Powered by PLD Linux
(c) 2002-2018 PLD Team
$Revision: 1.37 $
Powered by Leppe'.
Your IP: 54.198.205.153

libgit2 005e3b8c-2887-4a82-8437-c5c8e9b1188b

Status:Failed
Source URL:ftp://buildlogs.pld-linux.org/th/x32/FAIL/libgit2,005e3b8c-2887-4a82-8437-c5c8e9b1188b.bz2
text/plain URL:View!
full text:View!
rpm -qa of builder:View!
Date:2018/09/14 20:34:56
Runtime:0:02:31.146431

Toc:

  • error 1
  • 1: error -1 (expected -17) - curl error: Could not resolve: expired.badssl.com (Could not contact DNS servers)
  • error 2
  • 1: error -1 (expected -17) - curl error: Could not resolve: wrong.host.badssl.com (Could not contact DNS servers)
  • error 3
  • 1: error -1 (expected -17) - curl error: Could not resolve: self-signed.badssl.com (Could not contact DNS servers)
  • error 4
  • 1: error -1 - curl error: Could not resolve: github.com (Could not contact DNS servers)
  • error 5
  • 1: error -1 - curl error: Could not resolve: github.com (Could not contact DNS servers)
  • error 6
  • 1: error -1 - curl error: Could not resolve: github.com (Could not contact DNS servers)
  • error 7
  • 1: error -1 - curl error: Could not resolve: github.com (Could not contact DNS servers)
  • error 8
  • 1: error -1 - curl error: Could not resolve: github.com (Could not contact DNS servers)
  • error 9
  • 1: error -1 - curl error: Could not resolve: github.com (Could not contact DNS servers)
  • error 10
  • 1: error -1 - curl error: Could not resolve: github.com (Could not contact DNS servers)
  • error 11
  • 1: error -1 (expected -172) - curl error: Could not resolve: github.com (Could not contact DNS servers)
  • error 12
  • 1: error -1 (expected -7) - curl error: Could not resolve: github.com (Could not contact DNS servers)
  • error 13
  • 1: error -1 - curl error: Could not resolve: bitbucket.org (Could not contact DNS servers)
  • error 14
  • 1: error -1 - curl error: Could not resolve: bitbucket.org (Could not contact DNS servers)
  • error 15
  • 1: error 4321 (expected -1) - curl error: Could not resolve: github.com (Could not contact DNS servers)
  • error 16
  • 1: error -17 (expected -1) - curl error: Could not resolve: github.com (Could not contact DNS servers)
  • error 17
  • 1: error -1 - curl error: Could not resolve: github.com (Could not contact DNS servers)
  • error 18
  • 1: error -1 - curl error: Could not resolve: github.com (Could not contact DNS servers)
  • error 19
  • 1: error -1 - curl error: Could not resolve: github.com (Could not contact DNS servers)
  • error 20
  • 1: error -1 - curl error: Could not resolve: github.com (Could not contact DNS servers)
  • error 21
  • 1: error -1 - curl error: Could not resolve: github.com (Could not contact DNS servers)
  • error 22
  • 1: error -1 - curl error: Could not resolve: github.com (Could not contact DNS servers)
  • error 23
  • 1: error -1 - curl error: Could not resolve: github.com (Could not contact DNS servers)
  • error 24
  • 1: error -1 - curl error: Could not resolve: github.com (Could not contact DNS servers)
  • error 25
  • 1: error -1 - curl error: Could not resolve: github.com (Could not contact DNS servers)
  • error 26
  • 1: error -1 - curl error: Could not resolve: github.com (Could not contact DNS servers)
  • error 27
  • error: Bad exit status from /tmp/B.AP928T/BUILD/tmp/rpm-tmp.94748 (%build)
  • error 28
  • RPM build errors:
  • error 29
  • error: No files produced.

Content:

1: refs::branches::upstream..........
1: refs::branches::upstreamname..
1: refs::crashes.
1: refs::create.............
1: refs::delete...
1: refs::dup..
1: refs::foreachglob.....
1: refs::isvalidname..
1: refs::iterator........
1: refs::list..
1: refs::listall...
1: refs::lookup.....
1: refs::namespaces..
1: refs::normalize......
1: refs::overwrite....
1: refs::pack...
1: refs::peel.......
1: refs::races.....
1: refs::read...............
1: refs::reflog::drop.......
1: refs::reflog::messages.............
1: refs::reflog::reflog.................
1: refs::rename...........
1: refs::revparse.................................
1: refs::setter....
1: refs::shorthand.
1: refs::transactions......
1: refs::unicode.
1: refs::update.
1: remote::insteadof.....
1: repo::config...
1: repo::discover..........
1: repo::env.
1: repo::getters...
1: repo::hashfile..
1: repo::head...............
1: repo::headtree....
1: repo::init.........................S
1: repo::message..
1: repo::new..
1: repo::open.............
1: repo::pathspec..........
1: repo::reservedname.....
1: repo::setters.....
1: repo::shallow....
1: repo::state.............
1: reset::default.....
1: reset::hard......
1: reset::mixed...
1: reset::soft.........
1: revert::bare...
1: revert::workdir...............
1: revwalk::basic....................
1: revwalk::hidecb......
1: revwalk::mergebase..............
1: revwalk::signatureparsing.
1: revwalk::simplify.
1: stash::apply...................
1: stash::drop.......
1: stash::foreach..
1: stash::save................
1: stash::submodules..
1: status::ignore................................
1: status::renames................
1: status::single..
1: status::submodules...........
1: status::worktree...........................................
1: status::worktree::init........
1: submodule::add....
1: submodule::escape..
1: submodule::init...
1: submodule::lookup..............
1: submodule::modify.......
1: submodule::nosubs.....
1: submodule::open...
1: submodule::repository::init.
1: submodule::status.......
1: submodule::update.......
1: threads::basic....
1: threads::diff..
1: threads::iterator.
1: threads::refdb.
1: trace::traceSSSSSS
1: trace::windows::stacktrace...
1: transport::register....
1: win32::forbidden..........
1: win32::longpath.
1: worktree::config..
1: worktree::merge...
1: worktree::open........
1: worktree::reflog....
1: worktree::refs..........
1: worktree::repository....
1: worktree::submodule....
1: worktree::worktree...............................
1: 
1:   1) Failure:
1: online::badssl::expired [/tmp/B.AP928T/BUILD/libgit2-0.27.4/tests/online/badssl.c:31]
1:   Function call failed: (git_clone(&g_repo, "https://expired.badssl.com/fake.git", "./fake", ((void *)0)))
1:   error -1 (expected -17) - curl error: Could not resolve: expired.badssl.com (Could not contact DNS servers)
1: 
1: 
1:   2) Failure:
1: online::badssl::wrong_host [/tmp/B.AP928T/BUILD/libgit2-0.27.4/tests/online/badssl.c:46]
1:   Function call failed: (git_clone(&g_repo, "https://wrong.host.badssl.com/fake.git", "./fake", ((void *)0)))
1:   error -1 (expected -17) - curl error: Could not resolve: wrong.host.badssl.com (Could not contact DNS servers)
1: 
1: 
1:   3) Failure:
1: online::badssl::self_signed [/tmp/B.AP928T/BUILD/libgit2-0.27.4/tests/online/badssl.c:60]
1:   Function call failed: (git_clone(&g_repo, "https://self-signed.badssl.com/fake.git", "./fake", ((void *)0)))
1:   error -1 (expected -17) - curl error: Could not resolve: self-signed.badssl.com (Could not contact DNS servers)
1: 
1: 
1:   4) Failure:
1: online::clone::network_full [/tmp/B.AP928T/BUILD/libgit2-0.27.4/tests/online/clone.c:81]
1:   Function call failed: (git_clone(&g_repo, "http://github.com/libgit2/TestGitRepository", "./foo", &g_options))
1:   error -1 - curl error: Could not resolve: github.com (Could not contact DNS servers)
1: 
1: 
1:   5) Failure:
1: online::clone::network_bare [/tmp/B.AP928T/BUILD/libgit2-0.27.4/tests/online/clone.c:96]
1:   Function call failed: (git_clone(&g_repo, "http://github.com/libgit2/TestGitRepository", "./foo", &g_options))
1:   error -1 - curl error: Could not resolve: github.com (Could not contact DNS servers)
1: 
1: 
1:   6) Failure:
1: online::clone::empty_repository [/tmp/B.AP928T/BUILD/libgit2-0.27.4/tests/online/clone.c:107]
1:   Function call failed: (git_clone(&g_repo, "http://github.com/libgit2/TestEmptyRepository", "./foo", &g_options))
1:   error -1 - curl error: Could not resolve: github.com (Could not contact DNS servers)
1: 
1: 
1:   7) Failure:
1: online::clone::can_checkout_a_cloned_repo [/tmp/B.AP928T/BUILD/libgit2-0.27.4/tests/online/clone.c:147]
1:   Function call failed: (git_clone(&g_repo, "http://github.com/libgit2/TestGitRepository", "./foo", &g_options))
1:   error -1 - curl error: Could not resolve: github.com (Could not contact DNS servers)
1: 
1: 
1:   8) Failure:
1: online::clone::clone_mirror [/tmp/B.AP928T/BUILD/libgit2-0.27.4/tests/online/clone.c:191]
1:   Function call failed: (git_clone(&g_repo, "http://github.com/libgit2/TestGitRepository", "./foo.git", &opts))
1:   error -1 - curl error: Could not resolve: github.com (Could not contact DNS servers)
1: 
1: 
1:   9) Failure:
1: online::clone::custom_remote_callbacks [/tmp/B.AP928T/BUILD/libgit2-0.27.4/tests/online/clone.c:221]
1:   Function call failed: (git_clone(&g_repo, "http://github.com/libgit2/TestGitRepository", "./foo", &g_options))
1:   error -1 - curl error: Could not resolve: github.com (Could not contact DNS servers)
1: 
1: 
1:   10) Failure:
1: online::clone::custom_headers [/tmp/B.AP928T/BUILD/libgit2-0.27.4/tests/online/clone.c:249]
1:   Function call failed: (git_clone(&g_repo, "http://github.com/libgit2/TestGitRepository", "./foo", &g_options))
1:   error -1 - curl error: Could not resolve: github.com (Could not contact DNS servers)
1: 
1: 
1:   11) Failure:
1: online::clone::cred_callback_failure_return_code_is_tunnelled [/tmp/B.AP928T/BUILD/libgit2-0.27.4/tests/online/clone.c:271]
1:   Function call failed: (git_clone(&g_repo, _remote_url, "./foo", &g_options))
1:   error -1 (expected -172) - curl error: Could not resolve: github.com (Could not contact DNS servers)
1: 
1: 
1:   12) Failure:
1: online::clone::cred_callback_called_again_on_auth_failure [/tmp/B.AP928T/BUILD/libgit2-0.27.4/tests/online/clone.c:302]
1:   Function call failed: (git_clone(&g_repo, _remote_url, "./foo", &g_options))
1:   error -1 (expected -7) - curl error: Could not resolve: github.com (Could not contact DNS servers)
1: 
1: 
1:   13) Failure:
1: online::clone::bitbucket_style [/tmp/B.AP928T/BUILD/libgit2-0.27.4/tests/online/clone.c:357]
1:   Function call failed: (git_clone(&g_repo, "https://libgit3@bitbucket.org/libgit2/testgitrepository.git", "./foo", &g_options))
1:   error -1 - curl error: Could not resolve: bitbucket.org (Could not contact DNS servers)
1: 
1: 
1:   14) Failure:
1: online::clone::bitbucket_uses_creds_in_url [/tmp/B.AP928T/BUILD/libgit2-0.27.4/tests/online/clone.c:375]
1:   Function call failed: (git_clone(&g_repo, "https://libgit3:libgit3@bitbucket.org/libgit2/testgitrepository.git", "./foo", &g_options))
1:   error -1 - curl error: Could not resolve: bitbucket.org (Could not contact DNS servers)
1: 
1: 
1:   15) Failure:
1: online::clone::can_cancel [/tmp/B.AP928T/BUILD/libgit2-0.27.4/tests/online/clone.c:418]
1:   Function call failed: (4321)
1:   error 4321 (expected -1) - curl error: Could not resolve: github.com (Could not contact DNS servers)
1: 
1: 
1:   16) Failure:
1: online::clone::ssh_auth_methods [/tmp/B.AP928T/BUILD/libgit2-0.27.4/tests/online/clone.c:464]
1:   Function call failed: (git_clone(&g_repo, "ssh://github.com/libgit2/TestGitRepository", "./foo", &g_options))
1:   error -1 (expected -7) - failed to resolve address for github.com: Temporary failure in name resolution
1: 
1:   17) Failure:
1: online::clone::certificate_invalid [/tmp/B.AP928T/BUILD/libgit2-0.27.4/tests/online/clone.c:663]
1:   Function call failed: (GIT_ECERTIFICATE)
1:   error -17 (expected -1) - curl error: Could not resolve: github.com (Could not contact DNS servers)
1: 
1: 
1:   18) Failure:
1: online::clone::certificate_valid [/tmp/B.AP928T/BUILD/libgit2-0.27.4/tests/online/clone.c:686]
1:   Function call failed: (git_clone(&g_repo, "https://github.com/libgit2/TestGitRepository", "./foo", &g_options))
1:   error -1 - curl error: Could not resolve: github.com (Could not contact DNS servers)
1: 
1: 
1:   19) Failure:
1: online::clone::start_with_http [/tmp/B.AP928T/BUILD/libgit2-0.27.4/tests/online/clone.c:693]
1:   Function call failed: (git_clone(&g_repo, "http://github.com/libgit2/TestGitRepository", "./foo", &g_options))
1:   error -1 - curl error: Could not resolve: github.com (Could not contact DNS servers)
1: 
1: 
1:   20) Failure:
1: online::fetch::default_git [/tmp/B.AP928T/BUILD/libgit2-0.27.4/tests/online/fetch.c:48]
1:   Function call failed: (git_remote_fetch(remote, ((void *)0), &options, ((void *)0)))
1:   error -1 - failed to resolve address for github.com: Temporary failure in name resolution
1: 
1:   21) Failure:
1: online::fetch::default_http [/tmp/B.AP928T/BUILD/libgit2-0.27.4/tests/online/fetch.c:48]
1:   Function call failed: (git_remote_fetch(remote, ((void *)0), &options, ((void *)0)))
1:   error -1 - curl error: Could not resolve: github.com (Could not contact DNS servers)
1: 
1: 
1:   22) Failure:
1: online::fetch::default_https [/tmp/B.AP928T/BUILD/libgit2-0.27.4/tests/online/fetch.c:48]
1:   Function call failed: (git_remote_fetch(remote, ((void *)0), &options, ((void *)0)))
1:   error -1 - curl error: Could not resolve: github.com (Could not contact DNS servers)
1: 
1: 
1:   23) Failure:
1: online::fetch::no_tags_git [/tmp/B.AP928T/BUILD/libgit2-0.27.4/tests/online/fetch.c:48]
1:   Function call failed: (git_remote_fetch(remote, ((void *)0), &options, ((void *)0)))
1:   error -1 - failed to resolve address for github.com: Temporary failure in name resolution
1: 
1:   24) Failure:
1: online::fetch::no_tags_http [/tmp/B.AP928T/BUILD/libgit2-0.27.4/tests/online/fetch.c:48]
1:   Function call failed: (git_remote_fetch(remote, ((void *)0), &options, ((void *)0)))
1:   error -1 - curl error: Could not resolve: github.com (Could not contact DNS servers)
1: 
1: 
1:   25) Failure:
1: online::fetch::fetch_twice [/tmp/B.AP928T/BUILD/libgit2-0.27.4/tests/online/fetch.c:84]
1:   Function call failed: (git_remote_connect(remote, GIT_DIRECTION_FETCH, ((void *)0), ((void *)0), ((void *)0)))
1:   error -1 - failed to resolve address for github.com: Temporary failure in name resolution
1: 
1:   26) Failure:
1: online::fetch::doesnt_retrieve_a_pack_when_the_repository_is_up_to_date [/tmp/B.AP928T/BUILD/libgit2-0.27.4/tests/online/fetch.c:114]
1:   Function call failed: (git_clone(&_repository, "https://github.com/libgit2/TestGitRepository.git", "./fetch/lg2", &opts))
1:   error -1 - curl error: Could not resolve: github.com (Could not contact DNS servers)
1: 
1: 
1:   27) Failure:
1: online::fetch::can_cancel [/tmp/B.AP928T/BUILD/libgit2-0.27.4/tests/online/fetch.c:158]
1:   Function call failed: (git_remote_connect(remote, GIT_DIRECTION_FETCH, ((void *)0), ((void *)0), ((void *)0)))
1:   error -1 - curl error: Could not resolve: github.com (Could not contact DNS servers)
1: 
1: 
1:   28) Failure:
1: online::fetch::ls_disconnected [/tmp/B.AP928T/BUILD/libgit2-0.27.4/tests/online/fetch.c:172]
1:   Function call failed: (git_remote_connect(remote, GIT_DIRECTION_FETCH, ((void *)0), ((void *)0), ((void *)0)))
1:   error -1 - curl error: Could not resolve: github.com (Could not contact DNS servers)
1: 
1: 
1:   29) Failure:
1: online::fetch::remote_symrefs [/tmp/B.AP928T/BUILD/libgit2-0.27.4/tests/online/fetch.c:190]
1:   Function call failed: (git_remote_connect(remote, GIT_DIRECTION_FETCH, ((void *)0), ((void *)0), ((void *)0)))
1:   error -1 - curl error: Could not resolve: github.com (Could not contact DNS servers)
1: 
1: 
1:   30) Failure:
1: online::fetch::twice [/tmp/B.AP928T/BUILD/libgit2-0.27.4/tests/online/fetch.c:205]
1:   Function call failed: (git_remote_fetch(remote, ((void *)0), ((void *)0), ((void *)0)))
1:   error -1 - curl error: Could not resolve: github.com (Could not contact DNS servers)
1: 
1: 
1:   31) Failure:
1: online::fetchhead::wildcard_spec [/tmp/B.AP928T/BUILD/libgit2-0.27.4/tests/online/fetchhead.c:35]
1:   Function call failed: (git_clone(&g_repo, "git://github.com/libgit2/TestGitRepository", "./foo", &g_options))
1:   error -1 - failed to resolve address for github.com: Temporary failure in name resolution
1: 
1:   32) Failure:
1: online::fetchhead::explicit_spec [/tmp/B.AP928T/BUILD/libgit2-0.27.4/tests/online/fetchhead.c:35]
1:   Function call failed: (git_clone(&g_repo, "git://github.com/libgit2/TestGitRepository", "./foo", &g_options))
1:   error -1 - failed to resolve address for github.com: Temporary failure in name resolution
1: 
1:   33) Failure:
1: online::fetchhead::no_merges [/tmp/B.AP928T/BUILD/libgit2-0.27.4/tests/online/fetchhead.c:35]
1:   Function call failed: (git_clone(&g_repo, "git://github.com/libgit2/TestGitRepository", "./foo", &g_options))
1:   error -1 - failed to resolve address for github.com: Temporary failure in name resolution
1: 
1:   34) Failure:
1: online::fetchhead::explicit_dst_refspec_creates_branch [/tmp/B.AP928T/BUILD/libgit2-0.27.4/tests/online/fetchhead.c:35]
1:   Function call failed: (git_clone(&g_repo, "git://github.com/libgit2/TestGitRepository", "./foo", &g_options))
1:   error -1 - failed to resolve address for github.com: Temporary failure in name resolution
1: 
1:   35) Failure:
1: online::fetchhead::empty_dst_refspec_creates_no_branch [/tmp/B.AP928T/BUILD/libgit2-0.27.4/tests/online/fetchhead.c:35]
1:   Function call failed: (git_clone(&g_repo, "git://github.com/libgit2/TestGitRepository", "./foo", &g_options))
1:   error -1 - failed to resolve address for github.com: Temporary failure in name resolution
1: 
1:   36) Failure:
1: online::fetchhead::colon_only_dst_refspec_creates_no_branch [/tmp/B.AP928T/BUILD/libgit2-0.27.4/tests/online/fetchhead.c:35]
1:   Function call failed: (git_clone(&g_repo, "git://github.com/libgit2/TestGitRepository", "./foo", &g_options))
1:   error -1 - failed to resolve address for github.com: Temporary failure in name resolution
1: 
1:   37) Failure:
1: online::remotes::single_branch [/tmp/B.AP928T/BUILD/libgit2-0.27.4/tests/online/remotes.c:26]
1:   Function call failed: (git_clone(&repo, "git://github.com/libgit2/TestGitRepository", "./single-branch", &opts))
1:   error -1 - failed to resolve address for github.com: Temporary failure in name resolution
1: 
1:   38) Failure:
1: online::remotes::restricted_refspecs [/tmp/B.AP928T/BUILD/libgit2-0.27.4/tests/online/remotes.c:55]
1:   Function call failed: (git_clone(&repo, "git://github.com/libgit2/TestGitRepository", "./restrict-refspec", &opts))
1:   error -1 (expected -12) - failed to resolve address for github.com: Temporary failure in name resolution
1: 
1:   39) Failure:
1: online::remotes::detached_remote_fails_downloading [/tmp/B.AP928T/BUILD/libgit2-0.27.4/tests/online/remotes.c:63]
1:   Function call failed: (git_remote_connect(remote, GIT_DIRECTION_FETCH, ((void *)0), ((void *)0), ((void *)0)))
1:   error -1 - failed to resolve address for github.com: Temporary failure in name resolution
1: 
1:   40) Failure:
1: online::remotes::detached_remote_fails_uploading [/tmp/B.AP928T/BUILD/libgit2-0.27.4/tests/online/remotes.c:74]
1:   Function call failed: (git_remote_connect(remote, GIT_DIRECTION_FETCH, ((void *)0), ((void *)0), ((void *)0)))
1:   error -1 - failed to resolve address for github.com: Temporary failure in name resolution
1: 
1:   41) Failure:
1: online::remotes::detached_remote_fails_pushing [/tmp/B.AP928T/BUILD/libgit2-0.27.4/tests/online/remotes.c:85]
1:   Function call failed: (git_remote_connect(remote, GIT_DIRECTION_FETCH, ((void *)0), ((void *)0), ((void *)0)))
1:   error -1 - failed to resolve address for github.com: Temporary failure in name resolution
1: 
1:   42) Failure:
1: online::remotes::detached_remote_succeeds_ls [/tmp/B.AP928T/BUILD/libgit2-0.27.4/tests/online/remotes.c:109]
1:   Function call failed: (git_remote_connect(remote, GIT_DIRECTION_FETCH, ((void *)0), ((void *)0), ((void *)0)))
1:   error -1 - failed to resolve address for github.com: Temporary failure in name resolution
1: 
1/3 Test #1: libgit2_clar .....................***Failed   56.81 sec
test 2
    Start 2: libgit2_clar-proxy_credentials

2: Test command: /tmp/B.AP928T/BUILD/libgit2-0.27.4/build/libgit2_clar "-v" "-sonline::clone::proxy_credentials_in_url" "-sonline::clone::proxy_credentials_request"
2: Test timeout computed to be: 10000000
2: Loaded 346 suites: 
2: Started (test status codes: OK='.' FAILURE='F' SKIPPED='S')
2: 
2: online::cloneS
2: online::cloneS
2: 
2/3 Test #2: libgit2_clar-proxy_credentials ...   Passed    0.04 sec
test 3
    Start 3: libgit2_clar-ssh

3: Test command: /tmp/B.AP928T/BUILD/libgit2-0.27.4/build/libgit2_clar "-v" "-sonline::push" "-sonline::clone::ssh_cert" "-sonline::clone::ssh_with_paths"
3: Test timeout computed to be: 10000000
3: Loaded 346 suites: 
3: Started (test status codes: OK='.' FAILURE='F' SKIPPED='S')
3: 
3: online::pushSSSSSSSSSSSSSSSSSSSSS
3: online::cloneS
3: online::cloneS
3: 
3/3 Test #3: libgit2_clar-ssh .................   Passed    1.11 sec

67% tests passed, 1 tests failed out of 3

Total Test time (real) =  57.96 sec

The following tests FAILED:
	  1 - libgit2_clar (Failed)
Errors while running CTest
make: *** [Makefile:121: test] Error 8
error: Bad exit status from /tmp/B.AP928T/BUILD/tmp/rpm-tmp.94748 (%build)


RPM build errors:
    Bad exit status from /tmp/B.AP928T/BUILD/tmp/rpm-tmp.94748 (%build)
ended at: Fri Sep 14 20:34:55 2018, done in 0:02:31.146431
error: No files produced.
+ chmod -R u+rwX /tmp/B.AP928T/BUILD
+ rm -rf /tmp/B.AP928T/tmp /tmp/B.AP928T/BUILD
+ rm -rf /tmp/B.AP928T
Begin-PLD-Builder-Info
Build-Time: user:464.42s sys:217.88s real:155.13s (faults io:0 non-io:4137353)

End-PLD-Builder-Info
[Back to list of logs] [View rpm -qa of builder]