FailedOk

th/SRPMS[OK]
th/x32[OK]
th/i686[OK]
th/x86_64[OK]

ac/SRPMS[OK]
ac/i386[OK]
ac/i586[OK]
ac/i686[OK]
ac/alpha[OK]
ac/amd64[OK]
ac/athlon[OK]
ac/ppc[OK]
ac/sparc[OK]
ac/sparc64[OK]

Advanced Search
main()
Powered by PLD Linux
(c) 2002-2018 PLD Team
$Revision: 1.37 $
Powered by Star Treck.
Your IP: 54.162.239.233

libinput b059f3bc-6ca6-46fc-9a6d-1576a45deab9

Status:Failed
Source URL:ftp://buildlogs.pld-linux.org/th/x32/FAIL/libinput,b059f3bc-6ca6-46fc-9a6d-1576a45deab9.bz2
text/plain URL:View!
full text:View!
rpm -qa of builder:View!
Date:2018/09/12 23:10:05
Runtime:0:00:59.528957

Toc:

  • error 1
  • rpm: error: Failed build dependencies:
  • error 2
  • rpm: error: Failed build dependencies:
  • prep
  • Executing(%prep): /bin/sh -e /tmp/B.AoR4Oe/BUILD/tmp/rpm-tmp.77239
  • build
  • Executing(%build): /bin/sh -e /tmp/B.AoR4Oe/BUILD/tmp/rpm-tmp.77239
  • error 3
  • FAIL: 1
  • error 4
  • 95%: Checks: 66, Failures: 3, Errors: 0
  • error 5
  • error: Bad exit status from /tmp/B.AoR4Oe/BUILD/tmp/rpm-tmp.77239 (%build)
  • error 6
  • RPM build errors:
  • error 7
  • error: No files produced.

Content:

checking if we should skip the build
started at: Wed Sep 12 23:08:36 2018
killing old processes on a builder
sending signal 9 to pid -1
Killed
cleaning up /tmp
fetching https://srcbuilder.pld-linux.org/th//srpms/b059f3bc-6ca6-46fc-9a6d-1576a45deab9/libinput-1.12.0-1.src.rpm
fetched 531386 bytes, 969.4 K/s
installing srpm: libinput-1.12.0-1.src.rpm
+ install -d /tmp/B.AoR4Oe/BUILD /tmp/B.AoR4Oe/RPMS
+ LC_ALL=en_US.UTF-8
+ rpm -qp --changelog libinput-1.12.0-1.src.rpm
* Wed Sep 12 2018 PLD Linux Team <feedback@pld-linux.org>
- For complete changelog see: http://git.pld-linux.org/?p=packages/libinput.git;a=log;h=master
* Tue Sep 11 2018 Jan Palus <atler@pld-linux.org> 578a380
- up to 1.12.0 * Wed Jul 25 2018 Jan Palus <atler@pld-linux.org> d322c3a
- up to 1.11.3 * Tue Jul 03 2018 Jan Palus <atler@pld-linux.org> 24dd20b
- up to 1.11.2 * Tue Jun 19 2018 Jan Palus <atler@pld-linux.org> f90c666
- up to 1.11.1 * Tue Jun 05 2018 Jan Palus <atler@pld-linux.org> 9a19d5a
- up to 1.11.0 * Thu May 17 2018 Jan Palus <atler@pld-linux.org> 31a6a14
- up to 1.10.7 * Tue May 01 2018 Jan Palus <atler@pld-linux.org> bf1706e
- up to 1.10.6 * Thu Apr 19 2018 Jan Palus <atler@pld-linux.org> df80c7d
- up to 1.10.5 * Mon Apr 09 2018 Jan Palus <atler@pld-linux.org> 5805419
- up to 1.10.4 * Sat Mar 31 2018 Jakub Bogusz <qboosh@pld-linux.org> 4592281
- dropped unsupported static_libs bcond * Wed Mar 14 2018 Jan Palus <atler@pld-linux.org> c1449f3
- up to 1.10.3 * Tue Mar 13 2018 Marcin Krol <hawk@tld-linux.org> aed3808
- missing BRs: valgring, ninja >= 1.5, fixed doc bcond * Wed Mar 07 2018 Jan Palus <atler@pld-linux.org> bc46e24
- up to 1.10.2 * Wed Feb 28 2018 Jan Palus <atler@pld-linux.org> bc749be
- up to 1.10.1 * Tue Feb 13 2018 Jan Palus <atler@pld-linux.org> 3b606d2
- up to 1.10.0 * Thu Dec 14 2017 Jan Palus <atler@pld-linux.org> cf277fb
- up to 1.9.4 * Wed Nov 29 2017 Jakub Bogusz <qboosh@pld-linux.org> 407ae80
- updated to 1.9.3 * Wed Nov 15 2017 Arkadiusz Miśkiewicz <arekm@maven.pl> f783b5e
- up to 1.9.2 * Sat Oct 21 2017 Arkadiusz Miśkiewicz <arekm@maven.pl> 2de9132
- use __true_false macro * Sat Oct 21 2017 Arkadiusz Miśkiewicz <arekm@maven.pl> 11306b0
- simplify meson call + rpm -Uhv --nodeps --define '_topdir /tmp/B.AoR4Oe' --define '_specdir %{_topdir}' --define '_sourcedir %{_specdir}' --define '_rpmdir %{_topdir}/RPMS' --define '_builddir %{_topdir}/BUILD' libinput-1.12.0-1.src.rpm Preparing... ################################################## libinput ################################################## + rm -f libinput-1.12.0-1.src.rpm + install -m 700 -d /tmp/B.AoR4Oe/BUILD/tmp + TMPDIR=/tmp/B.AoR4Oe/BUILD/tmp + exec nice -n 0 rpmbuild -bp --short-circuit --nodeps --define '_topdir /tmp/B.AoR4Oe' --define '_specdir %{_topdir}' --define '_sourcedir %{_specdir}' --define '_rpmdir %{_topdir}/RPMS' --define '_builddir %{_topdir}/BUILD' --target x32-pld-linux --define 'prep exit 0' /tmp/B.AoR4Oe/libinput.spec Building target platforms: x32-pld-linux checking BuildConflict-ing packages no BuildConflicts found checking BR rpm: error: Failed build dependencies: rpm: python3-recommonmark is needed by libinput-1.12.0-1.src rpm: Building target platforms: x32-pld-linux updating poldek cache... ready is up to date Retrieving th::packages.ndir.md... th is up to date Retrieving th::packages.ndir.md... th is up to date Retrieving th-ready::packages.ndir.md... th-ready is up to date Retrieving th-ready::packages.ndir.md... th-ready is up to date Retrieving th-test::packages.ndir.md... Retrieving th-test::packages.ndir.diff.toc.gz... Retrieving diff::packages.ndir.2018.09.11-19.51.01.gz... Retrieving diff::packages.ndir.dscr.2018.09.11-19.51.01.gz... Loading [pndir]th-test... Applying packages.ndir.2018.09.11-19.51.01.gz... Retrieving diff::packages.ndir.2018.09.11-19.53.01.gz... Retrieving diff::packages.ndir.dscr.2018.09.11-19.53.01.gz... Applying packages.ndir.2018.09.11-19.53.01.gz... Retrieving diff::packages.ndir.2018.09.12-14.12.02.gz... Retrieving diff::packages.ndir.dscr.2018.09.12-14.12.02.gz... Applying packages.ndir.2018.09.12-14.12.02.gz... Retrieving diff::packages.ndir.2018.09.12-20.27.02.gz... ..............................done Retrieving diff::packages.ndir.dscr.2018.09.12-20.27.02.gz... Applying packages.ndir.2018.09.12-20.27.02.gz... Writing /root/tmp/poldek-cache-root/[...]/packages.ndir.gz... Retrieving th-test::packages.ndir.md... Retrieving th-test::packages.ndir.diff.toc.gz... ..............................done Retrieving diff::packages.ndir.2018.09.11-19.50.01.gz... Loading [pndir]th-test... Applying packages.ndir.2018.09.11-19.50.01.gz... Retrieving diff::packages.ndir.2018.09.12-01.47.01.gz... ..............................done Retrieving diff::packages.ndir.dscr.2018.09.12-01.47.01.gz... Applying packages.ndir.2018.09.12-01.47.01.gz... Retrieving diff::packages.ndir.2018.09.12-13.01.01.gz... ..............................done Retrieving diff::packages.ndir.dscr.2018.09.12-13.01.01.gz... Applying packages.ndir.2018.09.12-13.01.01.gz... Retrieving diff::packages.ndir.2018.09.12-14.13.02.gz... ..............................done Retrieving diff::packages.ndir.dscr.2018.09.12-14.13.02.gz... Applying packages.ndir.2018.09.12-14.13.02.gz... Writing /root/tmp/poldek-cache-root/[...]/packages.ndir.gz... checking conflicting packages in BRed packages poldek: Loading [pndir]ready... poldek: Loading [pndir]th-test... poldek: Loading [pndir]th-test... poldek: Loading [pndir]th-ready... poldek: Loading [pndir]th-ready... poldek: Loading [pndir]th... poldek: Loading [pndir]th... poldek: 26403 packages read poldek: Removed 2956 duplicate packages from available set poldek: Processing dependencies... poldek: python3-recommonmark-0.5.0-0.20180907.1.noarch marks python3-commonmark-0.7.5-1.noarch (cap python3egg(commonmark) >= 0.7.3) poldek: python3-commonmark-0.7.5-1.noarch marks python3-future-0.16.0-1.noarch (cap python3egg(future)) poldek: There are 3 packages to install (2 marked by dependencies): poldek: I python3-recommonmark-0.5.0-0.20180907.1.noarch poldek: D python3-commonmark-0.7.5-1.noarch python3-future-0.16.0-1.noarch poldek: This operation will use 4.1MB of disk space. poldek: Need to get 795.7KB of archives. poldek: Executing pm-command.sh --upgrade -vh --test --root / --define _check_dirname_deps 1... poldek: Preparing... ################################################## no conflicts found checking BR rpm: error: Failed build dependencies: rpm: python3-recommonmark is needed by libinput-1.12.0-1.src rpm: Building target platforms: x32-pld-linux installing BR: python3\-recommonmark + poldek --noask --caplookup -Q -v '--ignore=hhvm-*' '--ignore=php4-*' '--ignore=php52-*' '--ignore=php54-*' '--ignore=php55-*' '--ignore=php56-*' '--ignore=php70-*' '--ignore=php71-*' '--ignore=php72-*' --upgrade python3-recommonmark Loading [pndir]ready... Loading [pndir]th-test... Loading [pndir]th-test... Loading [pndir]th-ready... Loading [pndir]th-ready... Loading [pndir]th... Loading [pndir]th... 26403 packages read Removed 2956 duplicate packages from available set Processing dependencies... python3-recommonmark-0.5.0-0.20180907.1.noarch marks python3-commonmark-0.7.5-1.noarch (cap python3egg(commonmark) >= 0.7.3) python3-commonmark-0.7.5-1.noarch marks python3-future-0.16.0-1.noarch (cap python3egg(future)) There are 3 packages to install (2 marked by dependencies): I python3-recommonmark-0.5.0-0.20180907.1.noarch D python3-commonmark-0.7.5-1.noarch python3-future-0.16.0-1.noarch This operation will use 4.1MB of disk space. Need to get 795.7KB of archives. Executing pm-command.sh --upgrade -vh --root / --define _check_dirname_deps 1... Preparing... ################################################## python3-future ################################################## python3-commonmark ################################################## python3-recommonmark ################################################## building RPM using: set -ex; : build-id: b059f3bc-6ca6-46fc-9a6d-1576a45deab9; TMPDIR=/tmp/B.AoR4Oe/BUILD/tmp exec nice -n 0 rpmbuild -bb --define '_smp_mflags -j9' --define '_make_opts -Otarget' --define '_pld_builder 1' --define '_topdir /tmp/B.AoR4Oe' --define '_specdir %{_topdir}' --define '_sourcedir %{_specdir}' --define '_rpmdir %{_topdir}/RPMS' --define '_builddir %{_topdir}/BUILD' --target x32-pld-linux /tmp/B.AoR4Oe/libinput.spec + : build-id: b059f3bc-6ca6-46fc-9a6d-1576a45deab9 + TMPDIR=/tmp/B.AoR4Oe/BUILD/tmp + exec nice -n 0 rpmbuild -bb --define '_smp_mflags -j9' --define '_make_opts -Otarget' --define '_pld_builder 1' --define '_topdir /tmp/B.AoR4Oe' --define '_specdir %{_topdir}' --define '_sourcedir %{_specdir}' --define '_rpmdir %{_topdir}/RPMS' --define '_builddir %{_topdir}/BUILD' --target x32-pld-linux /tmp/B.AoR4Oe/libinput.spec Building target platforms: x32-pld-linux Executing(%prep): /bin/sh -e /tmp/B.AoR4Oe/BUILD/tmp/rpm-tmp.77239 + umask 022 + cd /tmp/B.AoR4Oe/BUILD + cd /tmp/B.AoR4Oe/BUILD + rm -rf libinput-1.12.0 + /usr/bin/xz -dc /tmp/B.AoR4Oe/libinput-1.12.0.tar.xz + /bin/tar -xf - + STATUS=0 + '[' 0 -ne 0 ']' + cd libinput-1.12.0 + /bin/id -u + '[' 1000 '=' 0 ']' + /bin/id -u + '[' 1000 '=' 0 ']' + /bin/chmod -Rf a+rX,u+w,g-w,o-w . + /bin/sed -i -e '1s,/usr/bin/env python3,/usr/bin/python3,' tools/libinput-measure-touchpad-pressure.py tools/libinput-measure-touch-size.py tools/libinput-measure-touchpad-tap.py + exit 0 Executing(%build): /bin/sh -e /tmp/B.AoR4Oe/BUILD/tmp/rpm-tmp.77239 HOME=/home/users/builder PATH=/home/users/builder/GNUstep/Tools:/usr/local/bin:/usr/bin:/bin TMPDIR=/tmp/B.AoR4Oe/BUILD/tmp + umask 022 + cd /tmp/B.AoR4Oe/BUILD + cd libinput-1.12.0 + CC=x86_64-pld-linux-gnux32-gcc CXX=x86_64-pld-linux-gnux32-g++ CFLAGS='-O2 -fwrapv -pipe -Wformat -Werror=format-security -gdwarf-4 -fno-debug-types-section -fvar-tracking-assignments -g2 -Wp,-D_FORTIFY_SOURCE=2 -fstack-protector-strong --param=ssp-buffer-size=4 -fPIC -mtune=generic -march=x86-64 -gdwarf-4 -fno-debug-types-section -fvar-tracking-assignments -g2 ' CPPFLAGS= CXXFLAGS='-O2 -fwrapv -pipe -Wformat -Werror=format-security -gdwarf-4 -fno-debug-types-section -fvar-tracking-assignments -g2 -Wp,-D_FORTIFY_SOURCE=2 -fstack-protector-strong --param=ssp-buffer-size=4 -fPIC -mtune=generic -march=x86-64 -gdwarf-4 -fno-debug-types-section -fvar-tracking-assignments -g2 ' LDFLAGS='-Wl,--as-needed -Wl,--no-copy-dt-needed-entries -Wl,-z,relro -Wl,-z,combreloc ' LC_ALL=C.UTF-8 /usr/bin/meson '--buildtype=plain' '--bindir=/usr/bin' '--datadir=/usr/share' '--includedir=/usr/include' '--infodir=/usr/share/info' '--libdir=/usr/libx32' '--libexecdir=/usr/libexec' '--localedir=/usr/share/locale' '--localstatedir=/var' '--mandir=/usr/share/man' '--prefix=/usr' '--sbindir=/usr/sbin' '--sharedstatedir=/var/lib' '--sysconfdir=/etc' '--wrap-mode=nodownload' '--default-library=both' build '-Ddebug-gui=true' '-Ddocumentation=true' '-Dudev-dir=/lib/udev' The Meson build system Version: 0.47.1 Source dir: /tmp/B.AoR4Oe/BUILD/libinput-1.12.0 Build dir: /tmp/B.AoR4Oe/BUILD/libinput-1.12.0/build Build type: native build Project name: libinput Project version: 1.12.0 Appending CFLAGS from environment: '-O2 -fwrapv -pipe -Wformat -Werror=format-security -gdwarf-4 -fno-debug-types-section -fvar-tracking-assignments -g2 -Wp,-D_FORTIFY_SOURCE=2 -fstack-protector-strong --param=ssp-buffer-size=4 -fPIC -mtune=generic -march=x86-64 -gdwarf-4 -fno-debug-types-section -fvar-tracking-assignments -g2 ' Appending LDFLAGS from environment: '-Wl,--as-needed -Wl,--no-copy-dt-needed-entries -Wl,-z,relro -Wl,-z,combreloc ' DEPRECATION: Duplicated values in array option "c_args" is deprecated. This will become a hard error in the future. DEPRECATION: Duplicated values in array option "c_link_args" is deprecated. This will become a hard error in the future. Native C compiler: x86_64-pld-linux-gnux32-gcc (gcc 8.2.0 "x86_64-pld-linux-gnux32-gcc (PLD-Linux) 8.2.0 20180726 (release)") Appending CXXFLAGS from environment: '-O2 -fwrapv -pipe -Wformat -Werror=format-security -gdwarf-4 -fno-debug-types-section -fvar-tracking-assignments -g2 -Wp,-D_FORTIFY_SOURCE=2 -fstack-protector-strong --param=ssp-buffer-size=4 -fPIC -mtune=generic -march=x86-64 -gdwarf-4 -fno-debug-types-section -fvar-tracking-assignments -g2 ' Appending LDFLAGS from environment: '-Wl,--as-needed -Wl,--no-copy-dt-needed-entries -Wl,-z,relro -Wl,-z,combreloc ' DEPRECATION: Duplicated values in array option "cpp_args" is deprecated. This will become a hard error in the future. DEPRECATION: Duplicated values in array option "cpp_link_args" is deprecated. This will become a hard error in the future. Native C++ compiler: x86_64-pld-linux-gnux32-g++ (gcc 8.2.0 "x86_64-pld-linux-gnux32-g++ (PLD-Linux) 8.2.0 20180726 (release)") Build machine cpu family: x86_64 Build machine cpu: x86_64 Fetching value of define "static_assert": _Static_assert Header <dirent.h> has symbol "versionsort": YES Header <errno.h> has symbol "program_invocation_short_name": YES Has header "xlocale.h": NO Header <sys/ptrace.h> has symbol "PTRACE_ATTACH": YES Found pkg-config: /usr/bin/pkg-config (0.29.2) Native dependency libudev found: YES 235 Native dependency mtdev found: YES 1.1.5 Native dependency libevdev found: YES 1.5.9 Library m found: YES Library rt found: YES Native dependency libwacom found: YES 0.29 Checking if "libwacom_get_paired_device check" links: YES Checking if "libwacom_get_button_evdev_code check" links: YES Configuring 80-libinput-device-groups.rules using configuration Configuring 90-libinput-model-quirks.rules using configuration Configuring 80-libinput-device-groups-litest.rules using configuration Configuring 90-libinput-model-quirks-litest.rules using configuration Header <sys/epoll.h> has symbol "epoll_create1": YES Configuring libinput-version.h using configuration WARNING: Project targetting '>= 0.41.0' but tried to use feature introduced in '0.47.0': build_always_stale arg in custom_target Program install found: YES (/usr/bin/install) Program doxygen found: YES (/usr/bin/doxygen) Program dot found: YES (/usr/bin/dot) Program grep found: YES (/bin/grep) Configuring libinput.h using configuration Configuring header.html using configuration Configuring footer.html using configuration Configuring customdoxygen.css using configuration Configuring bootstrap.css using configuration Configuring libinputdoxygen.css using configuration Configuring libinput.doxygen using configuration Program sphinx-build-3 found: YES (/usr/bin/sphinx-build-3) Configuring conf.py using configuration Configuring absolute_axes.rst using configuration Configuring absolute_coordinate_ranges.rst using configuration Configuring building_libinput.rst using configuration Configuring button_debouncing.rst using configuration Configuring clickpad_softbuttons.rst using configuration Configuring config_options.rst using configuration Configuring udev_config.rst using configuration Configuring faq.rst using configuration Configuring middle_button_emulation.rst using configuration Configuring motion_normalization.rst using configuration Configuring palm_detection.rst using configuration Configuring reporting_bugs.rst using configuration Configuring t440_support.rst using configuration Configuring touchpad_jitter.rst using configuration Configuring touchpad_jumping_cursor.rst using configuration Configuring touchpad_pressure.rst using configuration Configuring what_is_libinput.rst using configuration Configuring seats-sketch.gv using configuration Configuring seats-sketch-libinput.gv using configuration Configuring libinput-stack-wayland.gv using configuration Configuring libinput-stack-xorg.gv using configuration Configuring libinput-stack-gnome.gv using configuration Configuring evemu.gv using configuration Configuring libinput-record.gv using configuration Configuring button-debouncing-wave-diagram.svg using configuration Configuring button-scrolling.svg using configuration Configuring clickfinger.svg using configuration Configuring clickfinger-distance.svg using configuration Configuring edge-scrolling.svg using configuration Configuring gesture-2fg-ambiguity.svg using configuration Configuring palm-detection.svg using configuration Configuring pinch-gestures.svg using configuration Configuring pinch-gestures-softbuttons.svg using configuration Configuring ptraccel-linear.svg using configuration Configuring ptraccel-low-dpi.svg using configuration Configuring ptraccel-touchpad.svg using configuration Configuring ptraccel-trackpoint.svg using configuration Configuring software-buttons.svg using configuration Configuring software-buttons-conditions.svg using configuration Configuring software-buttons-thumbpress.svg using configuration Configuring software-buttons-visualized.svg using configuration Configuring swipe-gestures.svg using configuration Configuring tablet-axes.svg using configuration Configuring tablet-cintiq24hd-modes.svg using configuration Configuring tablet-interfaces.svg using configuration Configuring tablet-intuos-modes.svg using configuration Configuring tablet-left-handed.svg using configuration Configuring tablet-out-of-bounds.svg using configuration Configuring tablet.svg using configuration Configuring tap-n-drag.svg using configuration Configuring thumb-detection.svg using configuration Configuring top-software-buttons.svg using configuration Configuring touchscreen-gestures.svg using configuration Configuring trackpoint-delta-illustration.svg using configuration Configuring twofinger-scrolling.svg using configuration Configuring absolute-axes.rst using configuration Configuring absolute-coordinate-ranges.rst using configuration Configuring architecture.rst using configuration Configuring building.rst using configuration Configuring button-debouncing.rst using configuration Configuring clickpad-softbuttons.rst using configuration Configuring contributing.rst using configuration Configuring device-configuration-via-udev.rst using configuration Configuring device-quirks.rst using configuration Configuring faqs.rst using configuration Configuring gestures.rst using configuration Configuring index.rst using configuration Configuring middle-button-emulation.rst using configuration Configuring normalization-of-relative-motion.rst using configuration Configuring palm-detection.rst using configuration Configuring pointer-acceleration.rst using configuration Configuring reporting-bugs.rst using configuration Configuring scrolling.rst using configuration Configuring seats.rst using configuration Configuring switches.rst using configuration Configuring t440-support.rst using configuration Configuring tablet-support.rst using configuration Configuring tapping.rst using configuration Configuring test-suite.rst using configuration Configuring timestamps.rst using configuration Configuring tablet-debugging.rst using configuration Configuring tools.rst using configuration Configuring touchpad-jumping-cursors.rst using configuration Configuring touchpad-pressure.rst using configuration Configuring touchpad-pressure-debugging.rst using configuration Configuring touchpad-jitter.rst using configuration Configuring touchpads.rst using configuration Configuring trackpoints.rst using configuration Configuring trackpoint-configuration.rst using configuration Configuring what-is-libinput.rst using configuration Configuring features.rst using configuration Configuring development.rst using configuration Configuring troubleshooting.rst using configuration Configuring configuration.rst using configuration Configuring libinput-debug-events.1 using configuration Configuring libinput-quirks.1 using configuration Configuring libinput-quirks-list.1 using configuration Configuring libinput-quirks-validate.1 using configuration Configuring libinput-list-devices.1 using configuration Configuring libinput-measure.1 using configuration Configuring libinput-measure-fuzz using configuration Configuring libinput-measure-touchpad-tap using configuration Configuring libinput-measure-touchpad-pressure using configuration Configuring libinput-measure-touch-size using configuration Configuring libinput-measure-fuzz.1 using configuration Configuring libinput-measure-touchpad-tap.1 using configuration Configuring libinput-measure-touchpad-pressure.1 using configuration Configuring libinput-measure-touch-size.1 using configuration Configuring libinput-record.1 using configuration Configuring libinput-replay.1 using configuration Native dependency gtk+-3.0 found: YES 3.22.30 Native dependency cairo found: YES 1.14.12 Native dependency glib-2.0 found: YES 2.56.2 Configuring libinput-debug-gui.1 using configuration Configuring libinput.1 using configuration Program tools/helper-copy-and-exec-from-tmp.sh found: YES (/tmp/B.AoR4Oe/BUILD/libinput-1.12.0/tools/helper-copy-and-exec-from-tmp.sh) Program test/symbols-leak-test found: YES (/tmp/B.AoR4Oe/BUILD/libinput-1.12.0/test/symbols-leak-test) Native dependency check found: YES 0.9.10 Program valgrind found: YES (/usr/bin/valgrind) Program test/check-leftover-udev-rules.sh found: YES (/tmp/B.AoR4Oe/BUILD/libinput-1.12.0/test/check-leftover-udev-rules.sh) Program gstack found: YES (/usr/bin/gstack) Native dependency libsystemd found: YES 235 Library dl found: YES Configuring 80-libinput-test-device.rules using configuration Configuring config.h using configuration Build targets in project: 27 WARNING: Project specifies a minimum meson_version '>= 0.41.0' which conflicts with: * 0.47.0: {'build_always_stale arg in custom_target'} Found ninja-1.8.2 at /usr/bin/ninja + LC_ALL=C.UTF-8 /usr/bin/ninja -v -j9 -C build ninja: Entering directory `build' [1/178] x86_64-pld-linux-gnux32-gcc -Ifilter@sta -I. -I.. -I../include -fdiagnostics-color=always -pipe -D_FILE_OFFSET_BITS=64 -std=gnu99 -Wno-unused-parameter -g -fvisibility=hidden -Wmissing-prototypes -Wstrict-prototypes -O2 -fwrapv -Wformat -Werror=format-security -gdwarf-4 -fno-debug-types-section -fvar-tracking-assignments -g2 -Wp,-D_FORTIFY_SOURCE=2 -fstack-protector-strong --param=ssp-buffer-size=4 -fPIC -mtune=generic -march=x86-64 -gdwarf-4 -fno-debug-types-section -fvar-tracking-assignments -g2 -fPIC -MD -MQ 'filter@sta/src_filter-flat.c.o' -MF 'filter@sta/src_filter-flat.c.o.d' -o 'filter@sta/src_filter-flat.c.o' -c ../src/filter-flat.c [2/178] x86_64-pld-linux-gnux32-gcc -Ilibinput-device-group@exe -I. -I.. -I../src -I../include -I/usr/include/libwacom-1.0 -I/usr/include/glib-2.0 -I/usr/libx32/glib-2.0/include -fdiagnostics-color=always -pipe -D_FILE_OFFSET_BITS=64 -std=gnu99 -Wno-unused-parameter -g -fvisibility=hidden -Wmissing-prototypes -Wstrict-prototypes -O2 -fwrapv -Wformat -Werror=format-security -gdwarf-4 -fno-debug-types-section -fvar-tracking-assignments -g2 -Wp,-D_FORTIFY_SOURCE=2 -fstack-protector-strong --param=ssp-buffer-size=4 -fPIC -mtune=generic -march=x86-64 -gdwarf-4 -fno-debug-types-section -fvar-tracking-assignments -g2 -MD -MQ 'libinput-device-group@exe/udev_libinput-device-group.c.o' -MF 'libinput-device-group@exe/udev_libinput-device-group.c.o.d' -o 'libinput-device-group@exe/udev_libinput-device-group.c.o' -c ../udev/libinput-device-group.c [3/178] x86_64-pld-linux-gnux32-gcc -Ifilter@sta -I. -I.. -I../include -fdiagnostics-color=always -pipe -D_FILE_OFFSET_BITS=64 -std=gnu99 -Wno-unused-parameter -g -fvisibility=hidden -Wmissing-prototypes -Wstrict-prototypes -O2 -fwrapv -Wformat -Werror=format-security -gdwarf-4 -fno-debug-types-section -fvar-tracking-assignments -g2 -Wp,-D_FORTIFY_SOURCE=2 -fstack-protector-strong --param=ssp-buffer-size=4 -fPIC -mtune=generic -march=x86-64 -gdwarf-4 -fno-debug-types-section -fvar-tracking-assignments -g2 -fPIC -MD -MQ 'filter@sta/src_filter-touchpad.c.o' -MF 'filter@sta/src_filter-touchpad.c.o.d' -o 'filter@sta/src_filter-touchpad.c.o' -c ../src/filter-touchpad.c [4/178] x86_64-pld-linux-gnux32-gcc -Ifilter@sta -I. -I.. -I../include -fdiagnostics-color=always -pipe -D_FILE_OFFSET_BITS=64 -std=gnu99 -Wno-unused-parameter -g -fvisibility=hidden -Wmissing-prototypes -Wstrict-prototypes -O2 -fwrapv -Wformat -Werror=format-security -gdwarf-4 -fno-debug-types-section -fvar-tracking-assignments -g2 -Wp,-D_FORTIFY_SOURCE=2 -fstack-protector-strong --param=ssp-buffer-size=4 -fPIC -mtune=generic -march=x86-64 -gdwarf-4 -fno-debug-types-section -fvar-tracking-assignments -g2 -fPIC -MD -MQ 'filter@sta/src_filter-mouse.c.o' -MF 'filter@sta/src_filter-mouse.c.o.d' -o 'filter@sta/src_filter-mouse.c.o' -c ../src/filter-mouse.c [5/178] x86_64-pld-linux-gnux32-gcc -Ilibinput-model-quirks@exe -I. -I.. -I../src -I../include -I/usr/include/libevdev-1.0/ -fdiagnostics-color=always -pipe -D_FILE_OFFSET_BITS=64 -std=gnu99 -Wno-unused-parameter -g -fvisibility=hidden -Wmissing-prototypes -Wstrict-prototypes -O2 -fwrapv -Wformat -Werror=format-security -gdwarf-4 -fno-debug-types-section -fvar-tracking-assignments -g2 -Wp,-D_FORTIFY_SOURCE=2 -fstack-protector-strong --param=ssp-buffer-size=4 -fPIC -mtune=generic -march=x86-64 -gdwarf-4 -fno-debug-types-section -fvar-tracking-assignments -g2 -MD -MQ 'libinput-model-quirks@exe/udev_libinput-model-quirks.c.o' -MF 'libinput-model-quirks@exe/udev_libinput-model-quirks.c.o.d' -o 'libinput-model-quirks@exe/udev_libinput-model-quirks.c.o' -c ../udev/libinput-model-quirks.c [6/178] x86_64-pld-linux-gnux32-gcc -Ifilter@sta -I. -I.. -I../include -fdiagnostics-color=always -pipe -D_FILE_OFFSET_BITS=64 -std=gnu99 -Wno-unused-parameter -g -fvisibility=hidden -Wmissing-prototypes -Wstrict-prototypes -O2 -fwrapv -Wformat -Werror=format-security -gdwarf-4 -fno-debug-types-section -fvar-tracking-assignments -g2 -Wp,-D_FORTIFY_SOURCE=2 -fstack-protector-strong --param=ssp-buffer-size=4 -fPIC -mtune=generic -march=x86-64 -gdwarf-4 -fno-debug-types-section -fvar-tracking-assignments -g2 -fPIC -MD -MQ 'filter@sta/src_filter.c.o' -MF 'filter@sta/src_filter.c.o.d' -o 'filter@sta/src_filter.c.o' -c ../src/filter.c [7/178] x86_64-pld-linux-gnux32-gcc -Ifilter@sta -I. -I.. -I../include -fdiagnostics-color=always -pipe -D_FILE_OFFSET_BITS=64 -std=gnu99 -Wno-unused-parameter -g -fvisibility=hidden -Wmissing-prototypes -Wstrict-prototypes -O2 -fwrapv -Wformat -Werror=format-security -gdwarf-4 -fno-debug-types-section -fvar-tracking-assignments -g2 -Wp,-D_FORTIFY_SOURCE=2 -fstack-protector-strong --param=ssp-buffer-size=4 -fPIC -mtune=generic -march=x86-64 -gdwarf-4 -fno-debug-types-section -fvar-tracking-assignments -g2 -fPIC -MD -MQ 'filter@sta/src_filter-low-dpi.c.o' -MF 'filter@sta/src_filter-low-dpi.c.o.d' -o 'filter@sta/src_filter-low-dpi.c.o' -c ../src/filter-low-dpi.c [8/178] x86_64-pld-linux-gnux32-gcc -Ifilter@sta -I. -I.. -I../include -fdiagnostics-color=always -pipe -D_FILE_OFFSET_BITS=64 -std=gnu99 -Wno-unused-parameter -g -fvisibility=hidden -Wmissing-prototypes -Wstrict-prototypes -O2 -fwrapv -Wformat -Werror=format-security -gdwarf-4 -fno-debug-types-section -fvar-tracking-assignments -g2 -Wp,-D_FORTIFY_SOURCE=2 -fstack-protector-strong --param=ssp-buffer-size=4 -fPIC -mtune=generic -march=x86-64 -gdwarf-4 -fno-debug-types-section -fvar-tracking-assignments -g2 -fPIC -MD -MQ 'filter@sta/src_filter-touchpad-x230.c.o' -MF 'filter@sta/src_filter-touchpad-x230.c.o.d' -o 'filter@sta/src_filter-touchpad-x230.c.o' -c ../src/filter-touchpad-x230.c [9/178] x86_64-pld-linux-gnux32-gcc -o libinput-device-group 'libinput-device-group@exe/udev_libinput-device-group.c.o' -Wl,--no-undefined -Wl,--as-needed -O2 -fwrapv -pipe -Wformat -Werror=format-security -gdwarf-4 -fno-debug-types-section -fvar-tracking-assignments -g2 -Wp,-D_FORTIFY_SOURCE=2 -fstack-protector-strong --param=ssp-buffer-size=4 -fPIC -mtune=generic -march=x86-64 -gdwarf-4 -fno-debug-types-section -fvar-tracking-assignments -g2 -Wl,--as-needed -Wl,--no-copy-dt-needed-entries -Wl,-z,relro -Wl,-z,combreloc -Wl,--start-group /libx32/libudev.so /usr/libx32/libwacom.so -Wl,--end-group [10/178] x86_64-pld-linux-gnux32-gcc -Ilibinput-util@sta -I. -I.. -I../include -fdiagnostics-color=always -pipe -D_FILE_OFFSET_BITS=64 -std=gnu99 -Wno-unused-parameter -g -fvisibility=hidden -Wmissing-prototypes -Wstrict-prototypes -O2 -fwrapv -Wformat -Werror=format-security -gdwarf-4 -fno-debug-types-section -fvar-tracking-assignments -g2 -Wp,-D_FORTIFY_SOURCE=2 -fstack-protector-strong --param=ssp-buffer-size=4 -fPIC -mtune=generic -march=x86-64 -gdwarf-4 -fno-debug-types-section -fvar-tracking-assignments -g2 -fPIC -MD -MQ 'libinput-util@sta/src_libinput-util.c.o' -MF 'libinput-util@sta/src_libinput-util.c.o.d' -o 'libinput-util@sta/src_libinput-util.c.o' -c ../src/libinput-util.c [11/178] x86_64-pld-linux-gnux32-gcc -Ifilter@sta -I. -I.. -I../include -fdiagnostics-color=always -pipe -D_FILE_OFFSET_BITS=64 -std=gnu99 -Wno-unused-parameter -g -fvisibility=hidden -Wmissing-prototypes -Wstrict-prototypes -O2 -fwrapv -Wformat -Werror=format-security -gdwarf-4 -fno-debug-types-section -fvar-tracking-assignments -g2 -Wp,-D_FORTIFY_SOURCE=2 -fstack-protector-strong --param=ssp-buffer-size=4 -fPIC -mtune=generic -march=x86-64 -gdwarf-4 -fno-debug-types-section -fvar-tracking-assignments -g2 -fPIC -MD -MQ 'filter@sta/src_filter-tablet.c.o' -MF 'filter@sta/src_filter-tablet.c.o.d' -o 'filter@sta/src_filter-tablet.c.o' -c ../src/filter-tablet.c [12/178] rm -f liblibinput-util.a && gcc-ar csrD liblibinput-util.a 'libinput-util@sta/src_libinput-util.c.o' [13/178] x86_64-pld-linux-gnux32-gcc -o libinput-model-quirks 'libinput-model-quirks@exe/udev_libinput-model-quirks.c.o' -Wl,--no-undefined -Wl,--as-needed -O2 -fwrapv -pipe -Wformat -Werror=format-security -gdwarf-4 -fno-debug-types-section -fvar-tracking-assignments -g2 -Wp,-D_FORTIFY_SOURCE=2 -fstack-protector-strong --param=ssp-buffer-size=4 -fPIC -mtune=generic -march=x86-64 -gdwarf-4 -fno-debug-types-section -fvar-tracking-assignments -g2 -Wl,--as-needed -Wl,--no-copy-dt-needed-entries -Wl,-z,relro -Wl,-z,combreloc -Wl,--start-group /libx32/libudev.so /usr/libx32/libevdev.so -Wl,--end-group [14/178] x86_64-pld-linux-gnux32-gcc -Iinput@sha -I. -I.. -I../ -I../include -I/usr/include/libevdev-1.0/ -I/usr/include/libwacom-1.0 -I/usr/include/glib-2.0 -I/usr/libx32/glib-2.0/include -fdiagnostics-color=always -pipe -D_FILE_OFFSET_BITS=64 -std=gnu99 -Wno-unused-parameter -g -fvisibility=hidden -Wmissing-prototypes -Wstrict-prototypes -O2 -fwrapv -Wformat -Werror=format-security -gdwarf-4 -fno-debug-types-section -fvar-tracking-assignments -g2 -Wp,-D_FORTIFY_SOURCE=2 -fstack-protector-strong --param=ssp-buffer-size=4 -fPIC -mtune=generic -march=x86-64 -gdwarf-4 -fno-debug-types-section -fvar-tracking-assignments -g2 -fPIC -MD -MQ 'input@sha/src_filter-low-dpi.c.o' -MF 'input@sha/src_filter-low-dpi.c.o.d' -o 'input@sha/src_filter-low-dpi.c.o' -c ../src/filter-low-dpi.c [15/178] x86_64-pld-linux-gnux32-gcc -Iinput@sha -I. -I.. -I../ -I../include -I/usr/include/libevdev-1.0/ -I/usr/include/libwacom-1.0 -I/usr/include/glib-2.0 -I/usr/libx32/glib-2.0/include -fdiagnostics-color=always -pipe -D_FILE_OFFSET_BITS=64 -std=gnu99 -Wno-unused-parameter -g -fvisibility=hidden -Wmissing-prototypes -Wstrict-prototypes -O2 -fwrapv -Wformat -Werror=format-security -gdwarf-4 -fno-debug-types-section -fvar-tracking-assignments -g2 -Wp,-D_FORTIFY_SOURCE=2 -fstack-protector-strong --param=ssp-buffer-size=4 -fPIC -mtune=generic -march=x86-64 -gdwarf-4 -fno-debug-types-section -fvar-tracking-assignments -g2 -fPIC -MD -MQ 'input@sha/src_filter-flat.c.o' -MF 'input@sha/src_filter-flat.c.o.d' -o 'input@sha/src_filter-flat.c.o' -c ../src/filter-flat.c [16/178] x86_64-pld-linux-gnux32-gcc -Ifilter@sta -I. -I.. -I../include -fdiagnostics-color=always -pipe -D_FILE_OFFSET_BITS=64 -std=gnu99 -Wno-unused-parameter -g -fvisibility=hidden -Wmissing-prototypes -Wstrict-prototypes -O2 -fwrapv -Wformat -Werror=format-security -gdwarf-4 -fno-debug-types-section -fvar-tracking-assignments -g2 -Wp,-D_FORTIFY_SOURCE=2 -fstack-protector-strong --param=ssp-buffer-size=4 -fPIC -mtune=generic -march=x86-64 -gdwarf-4 -fno-debug-types-section -fvar-tracking-assignments -g2 -fPIC -MD -MQ 'filter@sta/src_filter-trackpoint.c.o' -MF 'filter@sta/src_filter-trackpoint.c.o.d' -o 'filter@sta/src_filter-trackpoint.c.o' -c ../src/filter-trackpoint.c [17/178] rm -f libfilter.a && gcc-ar csrD libfilter.a 'filter@sta/src_filter.c.o' 'filter@sta/src_filter-flat.c.o' 'filter@sta/src_filter-low-dpi.c.o' 'filter@sta/src_filter-mouse.c.o' 'filter@sta/src_filter-touchpad.c.o' 'filter@sta/src_filter-touchpad-x230.c.o' 'filter@sta/src_filter-tablet.c.o' 'filter@sta/src_filter-trackpoint.c.o' [18/178] x86_64-pld-linux-gnux32-gcc -Iinput@sha -I. -I.. -I../ -I../include -I/usr/include/libevdev-1.0/ -I/usr/include/libwacom-1.0 -I/usr/include/glib-2.0 -I/usr/libx32/glib-2.0/include -fdiagnostics-color=always -pipe -D_FILE_OFFSET_BITS=64 -std=gnu99 -Wno-unused-parameter -g -fvisibility=hidden -Wmissing-prototypes -Wstrict-prototypes -O2 -fwrapv -Wformat -Werror=format-security -gdwarf-4 -fno-debug-types-section -fvar-tracking-assignments -g2 -Wp,-D_FORTIFY_SOURCE=2 -fstack-protector-strong --param=ssp-buffer-size=4 -fPIC -mtune=generic -march=x86-64 -gdwarf-4 -fno-debug-types-section -fvar-tracking-assignments -g2 -fPIC -MD -MQ 'input@sha/src_filter-touchpad.c.o' -MF 'input@sha/src_filter-touchpad.c.o.d' -o 'input@sha/src_filter-touchpad.c.o' -c ../src/filter-touchpad.c [19/178] x86_64-pld-linux-gnux32-gcc -Iinput@sha -I. -I.. -I../ -I../include -I/usr/include/libevdev-1.0/ -I/usr/include/libwacom-1.0 -I/usr/include/glib-2.0 -I/usr/libx32/glib-2.0/include -fdiagnostics-color=always -pipe -D_FILE_OFFSET_BITS=64 -std=gnu99 -Wno-unused-parameter -g -fvisibility=hidden -Wmissing-prototypes -Wstrict-prototypes -O2 -fwrapv -Wformat -Werror=format-security -gdwarf-4 -fno-debug-types-section -fvar-tracking-assignments -g2 -Wp,-D_FORTIFY_SOURCE=2 -fstack-protector-strong --param=ssp-buffer-size=4 -fPIC -mtune=generic -march=x86-64 -gdwarf-4 -fno-debug-types-section -fvar-tracking-assignments -g2 -fPIC -MD -MQ 'input@sha/src_filter-tablet.c.o' -MF 'input@sha/src_filter-tablet.c.o.d' -o 'input@sha/src_filter-tablet.c.o' -c ../src/filter-tablet.c [20/178] x86_64-pld-linux-gnux32-gcc -Iinput@sha -I. -I.. -I../ -I../include -I/usr/include/libevdev-1.0/ -I/usr/include/libwacom-1.0 -I/usr/include/glib-2.0 -I/usr/libx32/glib-2.0/include -fdiagnostics-color=always -pipe -D_FILE_OFFSET_BITS=64 -std=gnu99 -Wno-unused-parameter -g -fvisibility=hidden -Wmissing-prototypes -Wstrict-prototypes -O2 -fwrapv -Wformat -Werror=format-security -gdwarf-4 -fno-debug-types-section -fvar-tracking-assignments -g2 -Wp,-D_FORTIFY_SOURCE=2 -fstack-protector-strong --param=ssp-buffer-size=4 -fPIC -mtune=generic -march=x86-64 -gdwarf-4 -fno-debug-types-section -fvar-tracking-assignments -g2 -fPIC -MD -MQ 'input@sha/src_filter-mouse.c.o' -MF 'input@sha/src_filter-mouse.c.o.d' -o 'input@sha/src_filter-mouse.c.o' -c ../src/filter-mouse.c [21/178] x86_64-pld-linux-gnux32-gcc -Iinput@sha -I. -I.. -I../ -I../include -I/usr/include/libevdev-1.0/ -I/usr/include/libwacom-1.0 -I/usr/include/glib-2.0 -I/usr/libx32/glib-2.0/include -fdiagnostics-color=always -pipe -D_FILE_OFFSET_BITS=64 -std=gnu99 -Wno-unused-parameter -g -fvisibility=hidden -Wmissing-prototypes -Wstrict-prototypes -O2 -fwrapv -Wformat -Werror=format-security -gdwarf-4 -fno-debug-types-section -fvar-tracking-assignments -g2 -Wp,-D_FORTIFY_SOURCE=2 -fstack-protector-strong --param=ssp-buffer-size=4 -fPIC -mtune=generic -march=x86-64 -gdwarf-4 -fno-debug-types-section -fvar-tracking-assignments -g2 -fPIC -MD -MQ 'input@sha/src_filter.c.o' -MF 'input@sha/src_filter.c.o.d' -o 'input@sha/src_filter.c.o' -c ../src/filter.c [22/178] x86_64-pld-linux-gnux32-gcc -Iinput@sha -I. -I.. -I../ -I../include -I/usr/include/libevdev-1.0/ -I/usr/include/libwacom-1.0 -I/usr/include/glib-2.0 -I/usr/libx32/glib-2.0/include -fdiagnostics-color=always -pipe -D_FILE_OFFSET_BITS=64 -std=gnu99 -Wno-unused-parameter -g -fvisibility=hidden -Wmissing-prototypes -Wstrict-prototypes -O2 -fwrapv -Wformat -Werror=format-security -gdwarf-4 -fno-debug-types-section -fvar-tracking-assignments -g2 -Wp,-D_FORTIFY_SOURCE=2 -fstack-protector-strong --param=ssp-buffer-size=4 -fPIC -mtune=generic -march=x86-64 -gdwarf-4 -fno-debug-types-section -fvar-tracking-assignments -g2 -fPIC -MD -MQ 'input@sha/src_filter-touchpad-x230.c.o' -MF 'input@sha/src_filter-touchpad-x230.c.o.d' -o 'input@sha/src_filter-touchpad-x230.c.o' -c ../src/filter-touchpad-x230.c [23/178] x86_64-pld-linux-gnux32-gcc -Iinput@sha -I. -I.. -I../ -I../include -I/usr/include/libevdev-1.0/ -I/usr/include/libwacom-1.0 -I/usr/include/glib-2.0 -I/usr/libx32/glib-2.0/include -fdiagnostics-color=always -pipe -D_FILE_OFFSET_BITS=64 -std=gnu99 -Wno-unused-parameter -g -fvisibility=hidden -Wmissing-prototypes -Wstrict-prototypes -O2 -fwrapv -Wformat -Werror=format-security -gdwarf-4 -fno-debug-types-section -fvar-tracking-assignments -g2 -Wp,-D_FORTIFY_SOURCE=2 -fstack-protector-strong --param=ssp-buffer-size=4 -fPIC -mtune=generic -march=x86-64 -gdwarf-4 -fno-debug-types-section -fvar-tracking-assignments -g2 -fPIC -MD -MQ 'input@sha/src_filter-trackpoint.c.o' -MF 'input@sha/src_filter-trackpoint.c.o.d' -o 'input@sha/src_filter-trackpoint.c.o' -c ../src/filter-trackpoint.c [24/178] x86_64-pld-linux-gnux32-gcc -Iinput@sha -I. -I.. -I../ -I../include -I/usr/include/libevdev-1.0/ -I/usr/include/libwacom-1.0 -I/usr/include/glib-2.0 -I/usr/libx32/glib-2.0/include -fdiagnostics-color=always -pipe -D_FILE_OFFSET_BITS=64 -std=gnu99 -Wno-unused-parameter -g -fvisibility=hidden -Wmissing-prototypes -Wstrict-prototypes -O2 -fwrapv -Wformat -Werror=format-security -gdwarf-4 -fno-debug-types-section -fvar-tracking-assignments -g2 -Wp,-D_FORTIFY_SOURCE=2 -fstack-protector-strong --param=ssp-buffer-size=4 -fPIC -mtune=generic -march=x86-64 -gdwarf-4 -fno-debug-types-section -fvar-tracking-assignments -g2 -fPIC -MD -MQ 'input@sha/src_evdev-middle-button.c.o' -MF 'input@sha/src_evdev-middle-button.c.o.d' -o 'input@sha/src_evdev-middle-button.c.o' -c ../src/evdev-middle-button.c [25/178] x86_64-pld-linux-gnux32-gcc -Iinput@sha -I. -I.. -I../ -I../include -I/usr/include/libevdev-1.0/ -I/usr/include/libwacom-1.0 -I/usr/include/glib-2.0 -I/usr/libx32/glib-2.0/include -fdiagnostics-color=always -pipe -D_FILE_OFFSET_BITS=64 -std=gnu99 -Wno-unused-parameter -g -fvisibility=hidden -Wmissing-prototypes -Wstrict-prototypes -O2 -fwrapv -Wformat -Werror=format-security -gdwarf-4 -fno-debug-types-section -fvar-tracking-assignments -g2 -Wp,-D_FORTIFY_SOURCE=2 -fstack-protector-strong --param=ssp-buffer-size=4 -fPIC -mtune=generic -march=x86-64 -gdwarf-4 -fno-debug-types-section -fvar-tracking-assignments -g2 -fPIC -MD -MQ 'input@sha/src_evdev-debounce.c.o' -MF 'input@sha/src_evdev-debounce.c.o.d' -o 'input@sha/src_evdev-debounce.c.o' -c ../src/evdev-debounce.c [26/178] x86_64-pld-linux-gnux32-gcc -Iinput@sha -I. -I.. -I../ -I../include -I/usr/include/libevdev-1.0/ -I/usr/include/libwacom-1.0 -I/usr/include/glib-2.0 -I/usr/libx32/glib-2.0/include -fdiagnostics-color=always -pipe -D_FILE_OFFSET_BITS=64 -std=gnu99 -Wno-unused-parameter -g -fvisibility=hidden -Wmissing-prototypes -Wstrict-prototypes -O2 -fwrapv -Wformat -Werror=format-security -gdwarf-4 -fno-debug-types-section -fvar-tracking-assignments -g2 -Wp,-D_FORTIFY_SOURCE=2 -fstack-protector-strong --param=ssp-buffer-size=4 -fPIC -mtune=generic -march=x86-64 -gdwarf-4 -fno-debug-types-section -fvar-tracking-assignments -g2 -fPIC -MD -MQ 'input@sha/src_evdev-mt-touchpad-tap.c.o' -MF 'input@sha/src_evdev-mt-touchpad-tap.c.o.d' -o 'input@sha/src_evdev-mt-touchpad-tap.c.o' -c ../src/evdev-mt-touchpad-tap.c [27/178] x86_64-pld-linux-gnux32-gcc -Iquirks@sta -I. -I.. -I../include -fdiagnostics-color=always -pipe -D_FILE_OFFSET_BITS=64 -std=gnu99 -Wno-unused-parameter -g -fvisibility=hidden -Wmissing-prototypes -Wstrict-prototypes -O2 -fwrapv -Wformat -Werror=format-security -gdwarf-4 -fno-debug-types-section -fvar-tracking-assignments -g2 -Wp,-D_FORTIFY_SOURCE=2 -fstack-protector-strong --param=ssp-buffer-size=4 -fPIC -mtune=generic -march=x86-64 -gdwarf-4 -fno-debug-types-section -fvar-tracking-assignments -g2 -fPIC -MD -MQ 'quirks@sta/src_quirks.c.o' -MF 'quirks@sta/src_quirks.c.o.d' -o 'quirks@sta/src_quirks.c.o' -c ../src/quirks.c [28/178] rm -f libquirks.a && gcc-ar csrD libquirks.a 'quirks@sta/src_quirks.c.o' [29/178] x86_64-pld-linux-gnux32-gcc -Iinput@sha -I. -I.. -I../ -I../include -I/usr/include/libevdev-1.0/ -I/usr/include/libwacom-1.0 -I/usr/include/glib-2.0 -I/usr/libx32/glib-2.0/include -fdiagnostics-color=always -pipe -D_FILE_OFFSET_BITS=64 -std=gnu99 -Wno-unused-parameter -g -fvisibility=hidden -Wmissing-prototypes -Wstrict-prototypes -O2 -fwrapv -Wformat -Werror=format-security -gdwarf-4 -fno-debug-types-section -fvar-tracking-assignments -g2 -Wp,-D_FORTIFY_SOURCE=2 -fstack-protector-strong --param=ssp-buffer-size=4 -fPIC -mtune=generic -march=x86-64 -gdwarf-4 -fno-debug-types-section -fvar-tracking-assignments -g2 -fPIC -MD -MQ 'input@sha/src_evdev-mt-touchpad-buttons.c.o' -MF 'input@sha/src_evdev-mt-touchpad-buttons.c.o.d' -o 'input@sha/src_evdev-mt-touchpad-buttons.c.o' -c ../src/evdev-mt-touchpad-buttons.c [30/178] x86_64-pld-linux-gnux32-gcc -Iinput@sha -I. -I.. -I../ -I../include -I/usr/include/libevdev-1.0/ -I/usr/include/libwacom-1.0 -I/usr/include/glib-2.0 -I/usr/libx32/glib-2.0/include -fdiagnostics-color=always -pipe -D_FILE_OFFSET_BITS=64 -std=gnu99 -Wno-unused-parameter -g -fvisibility=hidden -Wmissing-prototypes -Wstrict-prototypes -O2 -fwrapv -Wformat -Werror=format-security -gdwarf-4 -fno-debug-types-section -fvar-tracking-assignments -g2 -Wp,-D_FORTIFY_SOURCE=2 -fstack-protector-strong --param=ssp-buffer-size=4 -fPIC -mtune=generic -march=x86-64 -gdwarf-4 -fno-debug-types-section -fvar-tracking-assignments -g2 -fPIC -MD -MQ 'input@sha/src_evdev-fallback.c.o' -MF 'input@sha/src_evdev-fallback.c.o.d' -o 'input@sha/src_evdev-fallback.c.o' -c ../src/evdev-fallback.c [31/178] x86_64-pld-linux-gnux32-gcc -Iinput@sha -I. -I.. -I../ -I../include -I/usr/include/libevdev-1.0/ -I/usr/include/libwacom-1.0 -I/usr/include/glib-2.0 -I/usr/libx32/glib-2.0/include -fdiagnostics-color=always -pipe -D_FILE_OFFSET_BITS=64 -std=gnu99 -Wno-unused-parameter -g -fvisibility=hidden -Wmissing-prototypes -Wstrict-prototypes -O2 -fwrapv -Wformat -Werror=format-security -gdwarf-4 -fno-debug-types-section -fvar-tracking-assignments -g2 -Wp,-D_FORTIFY_SOURCE=2 -fstack-protector-strong --param=ssp-buffer-size=4 -fPIC -mtune=generic -march=x86-64 -gdwarf-4 -fno-debug-types-section -fvar-tracking-assignments -g2 -fPIC -MD -MQ 'input@sha/src_evdev-mt-touchpad-edge-scroll.c.o' -MF 'input@sha/src_evdev-mt-touchpad-edge-scroll.c.o.d' -o 'input@sha/src_evdev-mt-touchpad-edge-scroll.c.o' -c ../src/evdev-mt-touchpad-edge-scroll.c [32/178] x86_64-pld-linux-gnux32-gcc -Iinput@sha -I. -I.. -I../ -I../include -I/usr/include/libevdev-1.0/ -I/usr/include/libwacom-1.0 -I/usr/include/glib-2.0 -I/usr/libx32/glib-2.0/include -fdiagnostics-color=always -pipe -D_FILE_OFFSET_BITS=64 -std=gnu99 -Wno-unused-parameter -g -fvisibility=hidden -Wmissing-prototypes -Wstrict-prototypes -O2 -fwrapv -Wformat -Werror=format-security -gdwarf-4 -fno-debug-types-section -fvar-tracking-assignments -g2 -Wp,-D_FORTIFY_SOURCE=2 -fstack-protector-strong --param=ssp-buffer-size=4 -fPIC -mtune=generic -march=x86-64 -gdwarf-4 -fno-debug-types-section -fvar-tracking-assignments -g2 -fPIC -MD -MQ 'input@sha/src_evdev-mt-touchpad-gestures.c.o' -MF 'input@sha/src_evdev-mt-touchpad-gestures.c.o.d' -o 'input@sha/src_evdev-mt-touchpad-gestures.c.o' -c ../src/evdev-mt-touchpad-gestures.c [33/178] x86_64-pld-linux-gnux32-gcc -Iinput@sha -I. -I.. -I../ -I../include -I/usr/include/libevdev-1.0/ -I/usr/include/libwacom-1.0 -I/usr/include/glib-2.0 -I/usr/libx32/glib-2.0/include -fdiagnostics-color=always -pipe -D_FILE_OFFSET_BITS=64 -std=gnu99 -Wno-unused-parameter -g -fvisibility=hidden -Wmissing-prototypes -Wstrict-prototypes -O2 -fwrapv -Wformat -Werror=format-security -gdwarf-4 -fno-debug-types-section -fvar-tracking-assignments -g2 -Wp,-D_FORTIFY_SOURCE=2 -fstack-protector-strong --param=ssp-buffer-size=4 -fPIC -mtune=generic -march=x86-64 -gdwarf-4 -fno-debug-types-section -fvar-tracking-assignments -g2 -fPIC -MD -MQ 'input@sha/src_path-seat.c.o' -MF 'input@sha/src_path-seat.c.o.d' -o 'input@sha/src_path-seat.c.o' -c ../src/path-seat.c [34/178] x86_64-pld-linux-gnux32-gcc -Iinput@sha -I. -I.. -I../ -I../include -I/usr/include/libevdev-1.0/ -I/usr/include/libwacom-1.0 -I/usr/include/glib-2.0 -I/usr/libx32/glib-2.0/include -fdiagnostics-color=always -pipe -D_FILE_OFFSET_BITS=64 -std=gnu99 -Wno-unused-parameter -g -fvisibility=hidden -Wmissing-prototypes -Wstrict-prototypes -O2 -fwrapv -Wformat -Werror=format-security -gdwarf-4 -fno-debug-types-section -fvar-tracking-assignments -g2 -Wp,-D_FORTIFY_SOURCE=2 -fstack-protector-strong --param=ssp-buffer-size=4 -fPIC -mtune=generic -march=x86-64 -gdwarf-4 -fno-debug-types-section -fvar-tracking-assignments -g2 -fPIC -MD -MQ 'input@sha/src_evdev-tablet-pad-leds.c.o' -MF 'input@sha/src_evdev-tablet-pad-leds.c.o.d' -o 'input@sha/src_evdev-tablet-pad-leds.c.o' -c ../src/evdev-tablet-pad-leds.c [35/178] x86_64-pld-linux-gnux32-gcc -Iinput@sha -I. -I.. -I../ -I../include -I/usr/include/libevdev-1.0/ -I/usr/include/libwacom-1.0 -I/usr/include/glib-2.0 -I/usr/libx32/glib-2.0/include -fdiagnostics-color=always -pipe -D_FILE_OFFSET_BITS=64 -std=gnu99 -Wno-unused-parameter -g -fvisibility=hidden -Wmissing-prototypes -Wstrict-prototypes -O2 -fwrapv -Wformat -Werror=format-security -gdwarf-4 -fno-debug-types-section -fvar-tracking-assignments -g2 -Wp,-D_FORTIFY_SOURCE=2 -fstack-protector-strong --param=ssp-buffer-size=4 -fPIC -mtune=generic -march=x86-64 -gdwarf-4 -fno-debug-types-section -fvar-tracking-assignments -g2 -fPIC -MD -MQ 'input@sha/src_udev-seat.c.o' -MF 'input@sha/src_udev-seat.c.o.d' -o 'input@sha/src_udev-seat.c.o' -c ../src/udev-seat.c [36/178] x86_64-pld-linux-gnux32-gcc -Iinput@sha -I. -I.. -I../ -I../include -I/usr/include/libevdev-1.0/ -I/usr/include/libwacom-1.0 -I/usr/include/glib-2.0 -I/usr/libx32/glib-2.0/include -fdiagnostics-color=always -pipe -D_FILE_OFFSET_BITS=64 -std=gnu99 -Wno-unused-parameter -g -fvisibility=hidden -Wmissing-prototypes -Wstrict-prototypes -O2 -fwrapv -Wformat -Werror=format-security -gdwarf-4 -fno-debug-types-section -fvar-tracking-assignments -g2 -Wp,-D_FORTIFY_SOURCE=2 -fstack-protector-strong --param=ssp-buffer-size=4 -fPIC -mtune=generic -march=x86-64 -gdwarf-4 -fno-debug-types-section -fvar-tracking-assignments -g2 -fPIC -MD -MQ 'input@sha/src_timer.c.o' -MF 'input@sha/src_timer.c.o.d' -o 'input@sha/src_timer.c.o' -c ../src/timer.c [37/178] x86_64-pld-linux-gnux32-gcc -Iinput@sha -I. -I.. -I../ -I../include -I/usr/include/libevdev-1.0/ -I/usr/include/libwacom-1.0 -I/usr/include/glib-2.0 -I/usr/libx32/glib-2.0/include -fdiagnostics-color=always -pipe -D_FILE_OFFSET_BITS=64 -std=gnu99 -Wno-unused-parameter -g -fvisibility=hidden -Wmissing-prototypes -Wstrict-prototypes -O2 -fwrapv -Wformat -Werror=format-security -gdwarf-4 -fno-debug-types-section -fvar-tracking-assignments -g2 -Wp,-D_FORTIFY_SOURCE=2 -fstack-protector-strong --param=ssp-buffer-size=4 -fPIC -mtune=generic -march=x86-64 -gdwarf-4 -fno-debug-types-section -fvar-tracking-assignments -g2 -fPIC -MD -MQ 'input@sha/src_evdev-tablet-pad.c.o' -MF 'input@sha/src_evdev-tablet-pad.c.o.d' -o 'input@sha/src_evdev-tablet-pad.c.o' -c ../src/evdev-tablet-pad.c [38/178] x86_64-pld-linux-gnux32-gcc -Ilibinput-quirks@exe -I. -I.. -I../src -I../include -I/usr/include/libevdev-1.0/ -I/usr/include/libwacom-1.0 -I/usr/include/glib-2.0 -I/usr/libx32/glib-2.0/include -fdiagnostics-color=always -pipe -D_FILE_OFFSET_BITS=64 -std=gnu99 -Wno-unused-parameter -g -fvisibility=hidden -Wmissing-prototypes -Wstrict-prototypes -O2 -fwrapv -Wformat -Werror=format-security -gdwarf-4 -fno-debug-types-section -fvar-tracking-assignments -g2 -Wp,-D_FORTIFY_SOURCE=2 -fstack-protector-strong --param=ssp-buffer-size=4 -fPIC -mtune=generic -march=x86-64 -gdwarf-4 -fno-debug-types-section -fvar-tracking-assignments -g2 -MD -MQ 'libinput-quirks@exe/tools_libinput-quirks.c.o' -MF 'libinput-quirks@exe/tools_libinput-quirks.c.o.d' -o 'libinput-quirks@exe/tools_libinput-quirks.c.o' -c ../tools/libinput-quirks.c [39/178] x86_64-pld-linux-gnux32-gcc -Iinput@sha -I. -I.. -I../ -I../include -I/usr/include/libevdev-1.0/ -I/usr/include/libwacom-1.0 -I/usr/include/glib-2.0 -I/usr/libx32/glib-2.0/include -fdiagnostics-color=always -pipe -D_FILE_OFFSET_BITS=64 -std=gnu99 -Wno-unused-parameter -g -fvisibility=hidden -Wmissing-prototypes -Wstrict-prototypes -O2 -fwrapv -Wformat -Werror=format-security -gdwarf-4 -fno-debug-types-section -fvar-tracking-assignments -g2 -Wp,-D_FORTIFY_SOURCE=2 -fstack-protector-strong --param=ssp-buffer-size=4 -fPIC -mtune=generic -march=x86-64 -gdwarf-4 -fno-debug-types-section -fvar-tracking-assignments -g2 -fPIC -MD -MQ 'input@sha/src_evdev.c.o' -MF 'input@sha/src_evdev.c.o.d' -o 'input@sha/src_evdev.c.o' -c ../src/evdev.c [40/178] /usr/bin/python3 /usr/bin/meson --internal vcstagger ../src/libinput-git-version.h.in libinput-git-version.h unknown /tmp/B.AoR4Oe/BUILD/libinput-1.12.0 @VCS_TAG@ '(.*)' /usr/bin/git describe fatal: not a git repository (or any of the parent directories): .git [41/178] /usr/bin/python3 /usr/bin/meson --internal vcstagger ../doc/api/mainpage.dox doc/api/mainpage.dox unknown /tmp/B.AoR4Oe/BUILD/libinput-1.12.0/doc/api __GIT_VERSION__ '(.*)' /usr/bin/git log -1 --format=%h fatal: not a git repository (or any of the parent directories): .git [42/178] x86_64-pld-linux-gnux32-gcc -Iinput@sha -I. -I.. -I../ -I../include -I/usr/include/libevdev-1.0/ -I/usr/include/libwacom-1.0 -I/usr/include/glib-2.0 -I/usr/libx32/glib-2.0/include -fdiagnostics-color=always -pipe -D_FILE_OFFSET_BITS=64 -std=gnu99 -Wno-unused-parameter -g -fvisibility=hidden -Wmissing-prototypes -Wstrict-prototypes -O2 -fwrapv -Wformat -Werror=format-security -gdwarf-4 -fno-debug-types-section -fvar-tracking-assignments -g2 -Wp,-D_FORTIFY_SOURCE=2 -fstack-protector-strong --param=ssp-buffer-size=4 -fPIC -mtune=generic -march=x86-64 -gdwarf-4 -fno-debug-types-section -fvar-tracking-assignments -g2 -fPIC -MD -MQ 'input@sha/src_evdev-mt-touchpad.c.o' -MF 'input@sha/src_evdev-mt-touchpad.c.o.d' -o 'input@sha/src_evdev-mt-touchpad.c.o' -c ../src/evdev-mt-touchpad.c [43/178] x86_64-pld-linux-gnux32-gcc -Iinput@sha -I. -I.. -I../ -I../include -I/usr/include/libevdev-1.0/ -I/usr/include/libwacom-1.0 -I/usr/include/glib-2.0 -I/usr/libx32/glib-2.0/include -fdiagnostics-color=always -pipe -D_FILE_OFFSET_BITS=64 -std=gnu99 -Wno-unused-parameter -g -fvisibility=hidden -Wmissing-prototypes -Wstrict-prototypes -O2 -fwrapv -Wformat -Werror=format-security -gdwarf-4 -fno-debug-types-section -fvar-tracking-assignments -g2 -Wp,-D_FORTIFY_SOURCE=2 -fstack-protector-strong --param=ssp-buffer-size=4 -fPIC -mtune=generic -march=x86-64 -gdwarf-4 -fno-debug-types-section -fvar-tracking-assignments -g2 -fPIC -MD -MQ 'input@sha/src_evdev-tablet.c.o' -MF 'input@sha/src_evdev-tablet.c.o.d' -o 'input@sha/src_evdev-tablet.c.o' -c ../src/evdev-tablet.c [44/178] x86_64-pld-linux-gnux32-gcc -Ilibinput-test-suite-runner@exe -I. -I.. -I../src -I../include -I/usr/include/libevdev-1.0/ -I/usr/include/libwacom-1.0 -I/usr/include/glib-2.0 -I/usr/libx32/glib-2.0/include -fdiagnostics-color=always -pipe -D_FILE_OFFSET_BITS=64 -std=gnu99 -Wno-unused-parameter -g -fvisibility=hidden -Wmissing-prototypes -Wstrict-prototypes -O2 -fwrapv -Wformat -Werror=format-security -gdwarf-4 -fno-debug-types-section -fvar-tracking-assignments -g2 -Wp,-D_FORTIFY_SOURCE=2 -fstack-protector-strong --param=ssp-buffer-size=4 -fPIC -mtune=generic -march=x86-64 -gdwarf-4 -fno-debug-types-section -fvar-tracking-assignments -g2 -pthread '-DLIBINPUT_LT_VERSION="23:0:13"' -MD -MQ 'libinput-test-suite-runner@exe/test_litest-device-synaptics-hover.c.o' -MF 'libinput-test-suite-runner@exe/test_litest-device-synaptics-hover.c.o.d' -o 'libinput-test-suite-runner@exe/test_litest-device-synaptics-hover.c.o' -c ../test/litest-device-synaptics-hover.c [45/178] x86_64-pld-linux-gnux32-gcc -Ilibinput-debug-events@exe -I. -I.. -I../src -I../include -I/usr/include/libevdev-1.0/ -I/usr/include/libwacom-1.0 -I/usr/include/glib-2.0 -I/usr/libx32/glib-2.0/include -fdiagnostics-color=always -pipe -D_FILE_OFFSET_BITS=64 -std=gnu99 -Wno-unused-parameter -g -fvisibility=hidden -Wmissing-prototypes -Wstrict-prototypes -O2 -fwrapv -Wformat -Werror=format-security -gdwarf-4 -fno-debug-types-section -fvar-tracking-assignments -g2 -Wp,-D_FORTIFY_SOURCE=2 -fstack-protector-strong --param=ssp-buffer-size=4 -fPIC -mtune=generic -march=x86-64 -gdwarf-4 -fno-debug-types-section -fvar-tracking-assignments -g2 -MD -MQ 'libinput-debug-events@exe/tools_libinput-debug-events.c.o' -MF 'libinput-debug-events@exe/tools_libinput-debug-events.c.o.d' -o 'libinput-debug-events@exe/tools_libinput-debug-events.c.o' -c ../tools/libinput-debug-events.c [46/178] /usr/bin/python3 /usr/bin/meson --internal vcstagger ../doc/user/git_version.py.in doc/user/git_version.py unknown /tmp/B.AoR4Oe/BUILD/libinput-1.12.0/doc/user __GIT_VERSION__ '(.*)' /usr/bin/git log -1 --format=%H fatal: not a git repository (or any of the parent directories): .git [47/178] x86_64-pld-linux-gnux32-gcc -Ilibinput-test-suite-runner@exe -I. -I.. -I../src -I../include -I/usr/include/libevdev-1.0/ -I/usr/include/libwacom-1.0 -I/usr/include/glib-2.0 -I/usr/libx32/glib-2.0/include -fdiagnostics-color=always -pipe -D_FILE_OFFSET_BITS=64 -std=gnu99 -Wno-unused-parameter -g -fvisibility=hidden -Wmissing-prototypes -Wstrict-prototypes -O2 -fwrapv -Wformat -Werror=format-security -gdwarf-4 -fno-debug-types-section -fvar-tracking-assignments -g2 -Wp,-D_FORTIFY_SOURCE=2 -fstack-protector-strong --param=ssp-buffer-size=4 -fPIC -mtune=generic -march=x86-64 -gdwarf-4 -fno-debug-types-section -fvar-tracking-assignments -g2 -pthread '-DLIBINPUT_LT_VERSION="23:0:13"' -MD -MQ 'libinput-test-suite-runner@exe/test_litest-device-synaptics-x220.c.o' -MF 'libinput-test-suite-runner@exe/test_litest-device-synaptics-x220.c.o.d' -o 'libinput-test-suite-runner@exe/test_litest-device-synaptics-x220.c.o' -c ../test/litest-device-synaptics-x220.c [48/178] x86_64-pld-linux-gnux32-gcc -Ilibinput-measure@exe -I. -I.. -I../src -I../include -I/usr/include/libevdev-1.0/ -I/usr/include/libwacom-1.0 -I/usr/include/glib-2.0 -I/usr/libx32/glib-2.0/include -fdiagnostics-color=always -pipe -D_FILE_OFFSET_BITS=64 -std=gnu99 -Wno-unused-parameter -g -fvisibility=hidden -Wmissing-prototypes -Wstrict-prototypes -O2 -fwrapv -Wformat -Werror=format-security -gdwarf-4 -fno-debug-types-section -fvar-tracking-assignments -g2 -Wp,-D_FORTIFY_SOURCE=2 -fstack-protector-strong --param=ssp-buffer-size=4 -fPIC -mtune=generic -march=x86-64 -gdwarf-4 -fno-debug-types-section -fvar-tracking-assignments -g2 -MD -MQ 'libinput-measure@exe/tools_libinput-measure.c.o' -MF 'libinput-measure@exe/tools_libinput-measure.c.o.d' -o 'libinput-measure@exe/tools_libinput-measure.c.o' -c ../tools/libinput-measure.c [49/178] x86_64-pld-linux-gnux32-gcc -Ilibinput-list-devices@exe -I. -I.. -I../src -I../include -I/usr/include/libevdev-1.0/ -I/usr/include/libwacom-1.0 -I/usr/include/glib-2.0 -I/usr/libx32/glib-2.0/include -fdiagnostics-color=always -pipe -D_FILE_OFFSET_BITS=64 -std=gnu99 -Wno-unused-parameter -g -fvisibility=hidden -Wmissing-prototypes -Wstrict-prototypes -O2 -fwrapv -Wformat -Werror=format-security -gdwarf-4 -fno-debug-types-section -fvar-tracking-assignments -g2 -Wp,-D_FORTIFY_SOURCE=2 -fstack-protector-strong --param=ssp-buffer-size=4 -fPIC -mtune=generic -march=x86-64 -gdwarf-4 -fno-debug-types-section -fvar-tracking-assignments -g2 -MD -MQ 'libinput-list-devices@exe/tools_libinput-list-devices.c.o' -MF 'libinput-list-devices@exe/tools_libinput-list-devices.c.o.d' -o 'libinput-list-devices@exe/tools_libinput-list-devices.c.o' -c ../tools/libinput-list-devices.c [50/178] x86_64-pld-linux-gnux32-gcc -Itools_shared@sta -I. -I.. -I../src -I../include -I/usr/include/libevdev-1.0/ -I/usr/include/libwacom-1.0 -I/usr/include/glib-2.0 -I/usr/libx32/glib-2.0/include -fdiagnostics-color=always -pipe -D_FILE_OFFSET_BITS=64 -std=gnu99 -Wno-unused-parameter -g -fvisibility=hidden -Wmissing-prototypes -Wstrict-prototypes -O2 -fwrapv -Wformat -Werror=format-security -gdwarf-4 -fno-debug-types-section -fvar-tracking-assignments -g2 -Wp,-D_FORTIFY_SOURCE=2 -fstack-protector-strong --param=ssp-buffer-size=4 -fPIC -mtune=generic -march=x86-64 -gdwarf-4 -fno-debug-types-section -fvar-tracking-assignments -g2 -fPIC -MD -MQ 'tools_shared@sta/tools_shared.c.o' -MF 'tools_shared@sta/tools_shared.c.o.d' -o 'tools_shared@sta/tools_shared.c.o' -c ../tools/shared.c ../tools/shared.c: In function ‘tools_list_device_quirks’: ../tools/shared.c:700:37: warning: format ‘%ld’ expects argument of type ‘long int’, but argument 5 has type ‘size_t’ {aka ‘unsigned int’} [-Wformat=] snprintf(buf, sizeof(buf), "%s=%ldx%ld", name, dim.x, dim.y); ~~^ ~~~~~ %d ../tools/shared.c:700:41: warning: format ‘%ld’ expects argument of type ‘long int’, but argument 6 has type ‘size_t’ {aka ‘unsigned int’} [-Wformat=] snprintf(buf, sizeof(buf), "%s=%ldx%ld", name, dim.x, dim.y); ~~^ ~~~~~ %d [51/178] rm -f libtools_shared.a && gcc-ar csrD libtools_shared.a 'tools_shared@sta/tools_shared.c.o' [52/178] x86_64-pld-linux-gnux32-gcc -Ilibinput@exe -I. -I.. -I../src -I../include -I/usr/include/libevdev-1.0/ -I/usr/include/libwacom-1.0 -I/usr/include/glib-2.0 -I/usr/libx32/glib-2.0/include -fdiagnostics-color=always -pipe -D_FILE_OFFSET_BITS=64 -std=gnu99 -Wno-unused-parameter -g -fvisibility=hidden -Wmissing-prototypes -Wstrict-prototypes -O2 -fwrapv -Wformat -Werror=format-security -gdwarf-4 -fno-debug-types-section -fvar-tracking-assignments -g2 -Wp,-D_FORTIFY_SOURCE=2 -fstack-protector-strong --param=ssp-buffer-size=4 -fPIC -mtune=generic -march=x86-64 -gdwarf-4 -fno-debug-types-section -fvar-tracking-assignments -g2 -MD -MQ 'libinput@exe/tools_libinput-tool.c.o' -MF 'libinput@exe/tools_libinput-tool.c.o.d' -o 'libinput@exe/tools_libinput-tool.c.o' -c ../tools/libinput-tool.c [53/178] x86_64-pld-linux-gnux32-gcc -Iinput@sha -I. -I.. -I../ -I../include -I/usr/include/libevdev-1.0/ -I/usr/include/libwacom-1.0 -I/usr/include/glib-2.0 -I/usr/libx32/glib-2.0/include -fdiagnostics-color=always -pipe -D_FILE_OFFSET_BITS=64 -std=gnu99 -Wno-unused-parameter -g -fvisibility=hidden -Wmissing-prototypes -Wstrict-prototypes -O2 -fwrapv -Wformat -Werror=format-security -gdwarf-4 -fno-debug-types-section -fvar-tracking-assignments -g2 -Wp,-D_FORTIFY_SOURCE=2 -fstack-protector-strong --param=ssp-buffer-size=4 -fPIC -mtune=generic -march=x86-64 -gdwarf-4 -fno-debug-types-section -fvar-tracking-assignments -g2 -fPIC -MD -MQ 'input@sha/src_libinput.c.o' -MF 'input@sha/src_libinput.c.o.d' -o 'input@sha/src_libinput.c.o' -c ../src/libinput.c [54/178] x86_64-pld-linux-gnux32-gcc -Itest-build-pedantic@exe -I. -I.. -I../src -I../include -fdiagnostics-color=always -pipe -D_FILE_OFFSET_BITS=64 -std=gnu99 -Wno-unused-parameter -g -fvisibility=hidden -Wmissing-prototypes -Wstrict-prototypes -O2 -fwrapv -Wformat -Werror=format-security -gdwarf-4 -fno-debug-types-section -fvar-tracking-assignments -g2 -Wp,-D_FORTIFY_SOURCE=2 -fstack-protector-strong --param=ssp-buffer-size=4 -fPIC -mtune=generic -march=x86-64 -gdwarf-4 -fno-debug-types-section -fvar-tracking-assignments -g2 -std=c99 -pedantic -Werror -MD -MQ 'test-build-pedantic@exe/test_build-pedantic.c.o' -MF 'test-build-pedantic@exe/test_build-pedantic.c.o.d' -o 'test-build-pedantic@exe/test_build-pedantic.c.o' -c ../test/build-pedantic.c [55/178] x86_64-pld-linux-gnux32-gcc -Itest-build-std-gnuc90@exe -I. -I.. -I../src -I../include -fdiagnostics-color=always -pipe -D_FILE_OFFSET_BITS=64 -std=gnu99 -Wno-unused-parameter -g -fvisibility=hidden -Wmissing-prototypes -Wstrict-prototypes -O2 -fwrapv -Wformat -Werror=format-security -gdwarf-4 -fno-debug-types-section -fvar-tracking-assignments -g2 -Wp,-D_FORTIFY_SOURCE=2 -fstack-protector-strong --param=ssp-buffer-size=4 -fPIC -mtune=generic -march=x86-64 -gdwarf-4 -fno-debug-types-section -fvar-tracking-assignments -g2 -std=gnu90 -Werror -MD -MQ 'test-build-std-gnuc90@exe/test_build-pedantic.c.o' -MF 'test-build-std-gnuc90@exe/test_build-pedantic.c.o.d' -o 'test-build-std-gnuc90@exe/test_build-pedantic.c.o' -c ../test/build-pedantic.c [56/178] x86_64-pld-linux-gnux32-gcc -Itest-builddir-lookup@exe -I. -I.. -I../src -I../include -I/usr/include/libevdev-1.0/ -I/usr/include/libwacom-1.0 -I/usr/include/glib-2.0 -I/usr/libx32/glib-2.0/include -fdiagnostics-color=always -pipe -D_FILE_OFFSET_BITS=64 -std=gnu99 -Wno-unused-parameter -g -fvisibility=hidden -Wmissing-prototypes -Wstrict-prototypes -O2 -fwrapv -Wformat -Werror=format-security -gdwarf-4 -fno-debug-types-section -fvar-tracking-assignments -g2 -Wp,-D_FORTIFY_SOURCE=2 -fstack-protector-strong --param=ssp-buffer-size=4 -fPIC -mtune=generic -march=x86-64 -gdwarf-4 -fno-debug-types-section -fvar-tracking-assignments -g2 -MD -MQ 'test-builddir-lookup@exe/tools_test-builddir-lookup.c.o' -MF 'test-builddir-lookup@exe/tools_test-builddir-lookup.c.o.d' -o 'test-builddir-lookup@exe/tools_test-builddir-lookup.c.o' -c ../tools/test-builddir-lookup.c [57/178] /usr/bin/doxygen doc/api/libinput.doxygen [58/178] x86_64-pld-linux-gnux32-gcc -o test-build-pedantic 'test-build-pedantic@exe/test_build-pedantic.c.o' -Wl,--no-undefined -Wl,--as-needed -O2 -fwrapv -pipe -Wformat -Werror=format-security -gdwarf-4 -fno-debug-types-section -fvar-tracking-assignments -g2 -Wp,-D_FORTIFY_SOURCE=2 -fstack-protector-strong --param=ssp-buffer-size=4 -fPIC -mtune=generic -march=x86-64 -gdwarf-4 -fno-debug-types-section -fvar-tracking-assignments -g2 -Wl,--as-needed -Wl,--no-copy-dt-needed-entries -Wl,-z,relro -Wl,-z,combreloc -Wl,--start-group /libx32/libudev.so -Wl,--end-group [59/178] x86_64-pld-linux-gnux32-gcc -Iptraccel-debug@exe -I. -I.. -I../src -I../include -I/usr/include/libevdev-1.0/ -I/usr/include/libwacom-1.0 -I/usr/include/glib-2.0 -I/usr/libx32/glib-2.0/include -fdiagnostics-color=always -pipe -D_FILE_OFFSET_BITS=64 -std=gnu99 -Wno-unused-parameter -g -fvisibility=hidden -Wmissing-prototypes -Wstrict-prototypes -O2 -fwrapv -Wformat -Werror=format-security -gdwarf-4 -fno-debug-types-section -fvar-tracking-assignments -g2 -Wp,-D_FORTIFY_SOURCE=2 -fstack-protector-strong --param=ssp-buffer-size=4 -fPIC -mtune=generic -march=x86-64 -gdwarf-4 -fno-debug-types-section -fvar-tracking-assignments -g2 -MD -MQ 'ptraccel-debug@exe/tools_ptraccel-debug.c.o' -MF 'ptraccel-debug@exe/tools_ptraccel-debug.c.o.d' -o 'ptraccel-debug@exe/tools_ptraccel-debug.c.o' -c ../tools/ptraccel-debug.c [60/178] x86_64-pld-linux-gnux32-gcc -o test-build-std-gnuc90 'test-build-std-gnuc90@exe/test_build-pedantic.c.o' -Wl,--no-undefined -Wl,--as-needed -O2 -fwrapv -pipe -Wformat -Werror=format-security -gdwarf-4 -fno-debug-types-section -fvar-tracking-assignments -g2 -Wp,-D_FORTIFY_SOURCE=2 -fstack-protector-strong --param=ssp-buffer-size=4 -fPIC -mtune=generic -march=x86-64 -gdwarf-4 -fno-debug-types-section -fvar-tracking-assignments -g2 -Wl,--as-needed -Wl,--no-copy-dt-needed-entries -Wl,-z,relro -Wl,-z,combreloc -Wl,--start-group /libx32/libudev.so -Wl,--end-group [61/178] x86_64-pld-linux-gnux32-gcc -Itest-build-linker@exe -I. -I.. -I../src -I../include -I/usr/include/libevdev-1.0/ -I/usr/include/libwacom-1.0 -I/usr/include/glib-2.0 -I/usr/libx32/glib-2.0/include -fdiagnostics-color=always -pipe -D_FILE_OFFSET_BITS=64 -std=gnu99 -Wno-unused-parameter -g -fvisibility=hidden -Wmissing-prototypes -Wstrict-prototypes -O2 -fwrapv -Wformat -Werror=format-security -gdwarf-4 -fno-debug-types-section -fvar-tracking-assignments -g2 -Wp,-D_FORTIFY_SOURCE=2 -fstack-protector-strong --param=ssp-buffer-size=4 -fPIC -mtune=generic -march=x86-64 -gdwarf-4 -fno-debug-types-section -fvar-tracking-assignments -g2 -MD -MQ 'test-build-linker@exe/test_build-pedantic.c.o' -MF 'test-build-linker@exe/test_build-pedantic.c.o.d' -o 'test-build-linker@exe/test_build-pedantic.c.o' -c ../test/build-pedantic.c [62/178] x86_64-pld-linux-gnux32-gcc -o libinput.so.10.13.0 'input@sha/src_filter.c.o' 'input@sha/src_filter-flat.c.o' 'input@sha/src_filter-low-dpi.c.o' 'input@sha/src_filter-mouse.c.o' 'input@sha/src_filter-touchpad.c.o' 'input@sha/src_filter-touchpad-x230.c.o' 'input@sha/src_filter-tablet.c.o' 'input@sha/src_filter-trackpoint.c.o' 'input@sha/src_libinput.c.o' 'input@sha/src_evdev.c.o' 'input@sha/src_evdev-debounce.c.o' 'input@sha/src_evdev-fallback.c.o' 'input@sha/src_evdev-middle-button.c.o' 'input@sha/src_evdev-mt-touchpad.c.o' 'input@sha/src_evdev-mt-touchpad-tap.c.o' 'input@sha/src_evdev-mt-touchpad-buttons.c.o' 'input@sha/src_evdev-mt-touchpad-edge-scroll.c.o' 'input@sha/src_evdev-mt-touchpad-gestures.c.o' 'input@sha/src_evdev-tablet.c.o' 'input@sha/src_evdev-tablet-pad.c.o' 'input@sha/src_evdev-tablet-pad-leds.c.o' 'input@sha/src_path-seat.c.o' 'input@sha/src_udev-seat.c.o' 'input@sha/src_timer.c.o' -Wl,--no-undefined -Wl,--as-needed -shared -fPIC -Wl,--start-group -Wl,-soname,libinput.so.10 -O2 -fwrapv -pipe -Wformat -Werror=format-security -gdwarf-4 -fno-debug-types-section -fvar-tracking-assignments -g2 -Wp,-D_FORTIFY_SOURCE=2 -fstack-protector-strong --param=ssp-buffer-size=4 -fPIC -mtune=generic -march=x86-64 -gdwarf-4 -fno-debug-types-section -fvar-tracking-assignments -g2 -Wl,--as-needed -Wl,--no-copy-dt-needed-entries -Wl,-z,relro -Wl,-z,combreloc liblibinput-util.a libquirks.a -Wl,--version-script,/tmp/B.AoR4Oe/BUILD/libinput-1.12.0/src/libinput.sym /usr/libx32/libmtdev.so /libx32/libudev.so /usr/libx32/libevdev.so -lm -lrt /usr/libx32/libwacom.so -Wl,--end-group [63/178] x86_64-pld-linux-gnux32-g++ -Itest-build-cxx@exe -I. -I.. -I../src -I../include -fdiagnostics-color=always -pipe -D_FILE_OFFSET_BITS=64 -Wno-unused-parameter -g -fvisibility=hidden -O2 -fwrapv -Wformat -Werror=format-security -gdwarf-4 -fno-debug-types-section -fvar-tracking-assignments -g2 -Wp,-D_FORTIFY_SOURCE=2 -fstack-protector-strong --param=ssp-buffer-size=4 -fPIC -mtune=generic -march=x86-64 -gdwarf-4 -fno-debug-types-section -fvar-tracking-assignments -g2 -MD -MQ 'test-build-cxx@exe/test_build-cxx.cc.o' -MF 'test-build-cxx@exe/test_build-cxx.cc.o.d' -o 'test-build-cxx@exe/test_build-cxx.cc.o' -c ../test/build-cxx.cc [64/178] x86_64-pld-linux-gnux32-gcc -Ilibinput-test-suite-runner@exe -I. -I.. -I../src -I../include -I/usr/include/libevdev-1.0/ -I/usr/include/libwacom-1.0 -I/usr/include/glib-2.0 -I/usr/libx32/glib-2.0/include -fdiagnostics-color=always -pipe -D_FILE_OFFSET_BITS=64 -std=gnu99 -Wno-unused-parameter -g -fvisibility=hidden -Wmissing-prototypes -Wstrict-prototypes -O2 -fwrapv -Wformat -Werror=format-security -gdwarf-4 -fno-debug-types-section -fvar-tracking-assignments -g2 -Wp,-D_FORTIFY_SOURCE=2 -fstack-protector-strong --param=ssp-buffer-size=4 -fPIC -mtune=generic -march=x86-64 -gdwarf-4 -fno-debug-types-section -fvar-tracking-assignments -g2 -pthread '-DLIBINPUT_LT_VERSION="23:0:13"' -MD -MQ 'libinput-test-suite-runner@exe/test_litest-device-acer-hawaii-keyboard.c.o' -MF 'libinput-test-suite-runner@exe/test_litest-device-acer-hawaii-keyboard.c.o.d' -o 'libinput-test-suite-runner@exe/test_litest-device-acer-hawaii-keyboard.c.o' -c ../test/litest-device-acer-hawaii-keyboard.c [65/178] x86_64-pld-linux-gnux32-g++ -o test-build-cxx 'test-build-cxx@exe/test_build-cxx.cc.o' -Wl,--no-undefined -Wl,--as-needed -O2 -fwrapv -pipe -Wformat -Werror=format-security -gdwarf-4 -fno-debug-types-section -fvar-tracking-assignments -g2 -Wp,-D_FORTIFY_SOURCE=2 -fstack-protector-strong --param=ssp-buffer-size=4 -fPIC -mtune=generic -march=x86-64 -gdwarf-4 -fno-debug-types-section -fvar-tracking-assignments -g2 -Wl,--as-needed -Wl,--no-copy-dt-needed-entries -Wl,-z,relro -Wl,-z,combreloc -Wl,--start-group /libx32/libudev.so -Wl,--end-group [66/178] x86_64-pld-linux-gnux32-gcc -Ilibinput-test-suite-runner@exe -I. -I.. -I../src -I../include -I/usr/include/libevdev-1.0/ -I/usr/include/libwacom-1.0 -I/usr/include/glib-2.0 -I/usr/libx32/glib-2.0/include -fdiagnostics-color=always -pipe -D_FILE_OFFSET_BITS=64 -std=gnu99 -Wno-unused-parameter -g -fvisibility=hidden -Wmissing-prototypes -Wstrict-prototypes -O2 -fwrapv -Wformat -Werror=format-security -gdwarf-4 -fno-debug-types-section -fvar-tracking-assignments -g2 -Wp,-D_FORTIFY_SOURCE=2 -fstack-protector-strong --param=ssp-buffer-size=4 -fPIC -mtune=generic -march=x86-64 -gdwarf-4 -fno-debug-types-section -fvar-tracking-assignments -g2 -pthread '-DLIBINPUT_LT_VERSION="23:0:13"' -MD -MQ 'libinput-test-suite-runner@exe/test_litest-device-acer-hawaii-touchpad.c.o' -MF 'libinput-test-suite-runner@exe/test_litest-device-acer-hawaii-touchpad.c.o.d' -o 'libinput-test-suite-runner@exe/test_litest-device-acer-hawaii-touchpad.c.o' -c ../test/litest-device-acer-hawaii-touchpad.c [67/178] x86_64-pld-linux-gnux32-gcc -Itest-litest-selftest@exe -I. -I.. -I../src -I../include -I/usr/include/libevdev-1.0/ -I/usr/include/libwacom-1.0 -I/usr/include/glib-2.0 -I/usr/libx32/glib-2.0/include -fdiagnostics-color=always -pipe -D_FILE_OFFSET_BITS=64 -std=gnu99 -Wno-unused-parameter -g -fvisibility=hidden -Wmissing-prototypes -Wstrict-prototypes -O2 -fwrapv -Wformat -Werror=format-security -gdwarf-4 -fno-debug-types-section -fvar-tracking-assignments -g2 -Wp,-D_FORTIFY_SOURCE=2 -fstack-protector-strong --param=ssp-buffer-size=4 -fPIC -mtune=generic -march=x86-64 -gdwarf-4 -fno-debug-types-section -fvar-tracking-assignments -g2 -pthread -DLITEST_NO_MAIN -DLITEST_DISABLE_BACKTRACE_LOGGING -MD -MQ 'test-litest-selftest@exe/test_litest-selftest.c.o' -MF 'test-litest-selftest@exe/test_litest-selftest.c.o.d' -o 'test-litest-selftest@exe/test_litest-selftest.c.o' -c ../test/litest-selftest.c [68/178] x86_64-pld-linux-gnux32-gcc -Ilibinput-test-suite-runner@exe -I. -I.. -I../src -I../include -I/usr/include/libevdev-1.0/ -I/usr/include/libwacom-1.0 -I/usr/include/glib-2.0 -I/usr/libx32/glib-2.0/include -fdiagnostics-color=always -pipe -D_FILE_OFFSET_BITS=64 -std=gnu99 -Wno-unused-parameter -g -fvisibility=hidden -Wmissing-prototypes -Wstrict-prototypes -O2 -fwrapv -Wformat -Werror=format-security -gdwarf-4 -fno-debug-types-section -fvar-tracking-assignments -g2 -Wp,-D_FORTIFY_SOURCE=2 -fstack-protector-strong --param=ssp-buffer-size=4 -fPIC -mtune=generic -march=x86-64 -gdwarf-4 -fno-debug-types-section -fvar-tracking-assignments -g2 -pthread '-DLIBINPUT_LT_VERSION="23:0:13"' -MD -MQ 'libinput-test-suite-runner@exe/test_litest-device-aiptek-tablet.c.o' -MF 'libinput-test-suite-runner@exe/test_litest-device-aiptek-tablet.c.o.d' -o 'libinput-test-suite-runner@exe/test_litest-device-aiptek-tablet.c.o' -c ../test/litest-device-aiptek-tablet.c [69/178] x86_64-pld-linux-gnux32-gcc -Ilibinput-test-suite-runner@exe -I. -I.. -I../src -I../include -I/usr/include/libevdev-1.0/ -I/usr/include/libwacom-1.0 -I/usr/include/glib-2.0 -I/usr/libx32/glib-2.0/include -fdiagnostics-color=always -pipe -D_FILE_OFFSET_BITS=64 -std=gnu99 -Wno-unused-parameter -g -fvisibility=hidden -Wmissing-prototypes -Wstrict-prototypes -O2 -fwrapv -Wformat -Werror=format-security -gdwarf-4 -fno-debug-types-section -fvar-tracking-assignments -g2 -Wp,-D_FORTIFY_SOURCE=2 -fstack-protector-strong --param=ssp-buffer-size=4 -fPIC -mtune=generic -march=x86-64 -gdwarf-4 -fno-debug-types-section -fvar-tracking-assignments -g2 -pthread '-DLIBINPUT_LT_VERSION="23:0:13"' -MD -MQ 'libinput-test-suite-runner@exe/test_litest-device-alps-dualpoint.c.o' -MF 'libinput-test-suite-runner@exe/test_litest-device-alps-dualpoint.c.o.d' -o 'libinput-test-suite-runner@exe/test_litest-device-alps-dualpoint.c.o' -c ../test/litest-device-alps-dualpoint.c [70/178] x86_64-pld-linux-gnux32-gcc -Ilibinput-test-suite-runner@exe -I. -I.. -I../src -I../include -I/usr/include/libevdev-1.0/ -I/usr/include/libwacom-1.0 -I/usr/include/glib-2.0 -I/usr/libx32/glib-2.0/include -fdiagnostics-color=always -pipe -D_FILE_OFFSET_BITS=64 -std=gnu99 -Wno-unused-parameter -g -fvisibility=hidden -Wmissing-prototypes -Wstrict-prototypes -O2 -fwrapv -Wformat -Werror=format-security -gdwarf-4 -fno-debug-types-section -fvar-tracking-assignments -g2 -Wp,-D_FORTIFY_SOURCE=2 -fstack-protector-strong --param=ssp-buffer-size=4 -fPIC -mtune=generic -march=x86-64 -gdwarf-4 -fno-debug-types-section -fvar-tracking-assignments -g2 -pthread '-DLIBINPUT_LT_VERSION="23:0:13"' -MD -MQ 'libinput-test-suite-runner@exe/test_litest-device-alps-semi-mt.c.o' -MF 'libinput-test-suite-runner@exe/test_litest-device-alps-semi-mt.c.o.d' -o 'libinput-test-suite-runner@exe/test_litest-device-alps-semi-mt.c.o' -c ../test/litest-device-alps-semi-mt.c [71/178] x86_64-pld-linux-gnux32-gcc -Ilibinput-test-suite-runner@exe -I. -I.. -I../src -I../include -I/usr/include/libevdev-1.0/ -I/usr/include/libwacom-1.0 -I/usr/include/glib-2.0 -I/usr/libx32/glib-2.0/include -fdiagnostics-color=always -pipe -D_FILE_OFFSET_BITS=64 -std=gnu99 -Wno-unused-parameter -g -fvisibility=hidden -Wmissing-prototypes -Wstrict-prototypes -O2 -fwrapv -Wformat -Werror=format-security -gdwarf-4 -fno-debug-types-section -fvar-tracking-assignments -g2 -Wp,-D_FORTIFY_SOURCE=2 -fstack-protector-strong --param=ssp-buffer-size=4 -fPIC -mtune=generic -march=x86-64 -gdwarf-4 -fno-debug-types-section -fvar-tracking-assignments -g2 -pthread '-DLIBINPUT_LT_VERSION="23:0:13"' -MD -MQ 'libinput-test-suite-runner@exe/test_litest-device-anker-mouse-kbd.c.o' -MF 'libinput-test-suite-runner@exe/test_litest-device-anker-mouse-kbd.c.o.d' -o 'libinput-test-suite-runner@exe/test_litest-device-anker-mouse-kbd.c.o' -c ../test/litest-device-anker-mouse-kbd.c [72/178] x86_64-pld-linux-gnux32-gcc -Ilibinput-test-suite-runner@exe -I. -I.. -I../src -I../include -I/usr/include/libevdev-1.0/ -I/usr/include/libwacom-1.0 -I/usr/include/glib-2.0 -I/usr/libx32/glib-2.0/include -fdiagnostics-color=always -pipe -D_FILE_OFFSET_BITS=64 -std=gnu99 -Wno-unused-parameter -g -fvisibility=hidden -Wmissing-prototypes -Wstrict-prototypes -O2 -fwrapv -Wformat -Werror=format-security -gdwarf-4 -fno-debug-types-section -fvar-tracking-assignments -g2 -Wp,-D_FORTIFY_SOURCE=2 -fstack-protector-strong --param=ssp-buffer-size=4 -fPIC -mtune=generic -march=x86-64 -gdwarf-4 -fno-debug-types-section -fvar-tracking-assignments -g2 -pthread '-DLIBINPUT_LT_VERSION="23:0:13"' -MD -MQ 'libinput-test-suite-runner@exe/test_litest-device-apple-appletouch.c.o' -MF 'libinput-test-suite-runner@exe/test_litest-device-apple-appletouch.c.o.d' -o 'libinput-test-suite-runner@exe/test_litest-device-apple-appletouch.c.o' -c ../test/litest-device-apple-appletouch.c [73/178] /usr/bin/python3 /usr/bin/meson --internal symbolextractor libinput.so.10.13.0 'input@sha/libinput.so.10.13.0.symbols' [74/178] x86_64-pld-linux-gnux32-gcc -Ilibinput-test-suite-runner@exe -I. -I.. -I../src -I../include -I/usr/include/libevdev-1.0/ -I/usr/include/libwacom-1.0 -I/usr/include/glib-2.0 -I/usr/libx32/glib-2.0/include -fdiagnostics-color=always -pipe -D_FILE_OFFSET_BITS=64 -std=gnu99 -Wno-unused-parameter -g -fvisibility=hidden -Wmissing-prototypes -Wstrict-prototypes -O2 -fwrapv -Wformat -Werror=format-security -gdwarf-4 -fno-debug-types-section -fvar-tracking-assignments -g2 -Wp,-D_FORTIFY_SOURCE=2 -fstack-protector-strong --param=ssp-buffer-size=4 -fPIC -mtune=generic -march=x86-64 -gdwarf-4 -fno-debug-types-section -fvar-tracking-assignments -g2 -pthread '-DLIBINPUT_LT_VERSION="23:0:13"' -MD -MQ 'libinput-test-suite-runner@exe/test_litest-device-apple-internal-keyboard.c.o' -MF 'libinput-test-suite-runner@exe/test_litest-device-apple-internal-keyboard.c.o.d' -o 'libinput-test-suite-runner@exe/test_litest-device-apple-internal-keyboard.c.o' -c ../test/litest-device-apple-internal-keyboard.c [75/178] x86_64-pld-linux-gnux32-gcc -Ilibinput-test-suite-runner@exe -I. -I.. -I../src -I../include -I/usr/include/libevdev-1.0/ -I/usr/include/libwacom-1.0 -I/usr/include/glib-2.0 -I/usr/libx32/glib-2.0/include -fdiagnostics-color=always -pipe -D_FILE_OFFSET_BITS=64 -std=gnu99 -Wno-unused-parameter -g -fvisibility=hidden -Wmissing-prototypes -Wstrict-prototypes -O2 -fwrapv -Wformat -Werror=format-security -gdwarf-4 -fno-debug-types-section -fvar-tracking-assignments -g2 -Wp,-D_FORTIFY_SOURCE=2 -fstack-protector-strong --param=ssp-buffer-size=4 -fPIC -mtune=generic -march=x86-64 -gdwarf-4 -fno-debug-types-section -fvar-tracking-assignments -g2 -pthread '-DLIBINPUT_LT_VERSION="23:0:13"' -MD -MQ 'libinput-test-suite-runner@exe/test_litest-device-apple-magicmouse.c.o' -MF 'libinput-test-suite-runner@exe/test_litest-device-apple-magicmouse.c.o.d' -o 'libinput-test-suite-runner@exe/test_litest-device-apple-magicmouse.c.o' -c ../test/litest-device-apple-magicmouse.c [76/178] x86_64-pld-linux-gnux32-gcc -o libinput-debug-events 'libinput-debug-events@exe/tools_libinput-debug-events.c.o' -Wl,--no-undefined -Wl,--as-needed -O2 -fwrapv -pipe -Wformat -Werror=format-security -gdwarf-4 -fno-debug-types-section -fvar-tracking-assignments -g2 -Wp,-D_FORTIFY_SOURCE=2 -fstack-protector-strong --param=ssp-buffer-size=4 -fPIC -mtune=generic -march=x86-64 -gdwarf-4 -fno-debug-types-section -fvar-tracking-assignments -g2 -Wl,--as-needed -Wl,--no-copy-dt-needed-entries -Wl,-z,relro -Wl,-z,combreloc -Wl,--start-group libtools_shared.a libinput.so.10.13.0 liblibinput-util.a libquirks.a /usr/libx32/libmtdev.so /libx32/libudev.so /usr/libx32/libevdev.so -lm -lrt -Wl,--end-group /usr/libx32/libwacom.so -lm -lrt -lm -lrt '-Wl,-rpath,$ORIGIN/' -Wl,-rpath-link,/tmp/B.AoR4Oe/BUILD/libinput-1.12.0/build/ [77/178] x86_64-pld-linux-gnux32-gcc -Ilibinput-test-suite-runner@exe -I. -I.. -I../src -I../include -I/usr/include/libevdev-1.0/ -I/usr/include/libwacom-1.0 -I/usr/include/glib-2.0 -I/usr/libx32/glib-2.0/include -fdiagnostics-color=always -pipe -D_FILE_OFFSET_BITS=64 -std=gnu99 -Wno-unused-parameter -g -fvisibility=hidden -Wmissing-prototypes -Wstrict-prototypes -O2 -fwrapv -Wformat -Werror=format-security -gdwarf-4 -fno-debug-types-section -fvar-tracking-assignments -g2 -Wp,-D_FORTIFY_SOURCE=2 -fstack-protector-strong --param=ssp-buffer-size=4 -fPIC -mtune=generic -march=x86-64 -gdwarf-4 -fno-debug-types-section -fvar-tracking-assignments -g2 -pthread '-DLIBINPUT_LT_VERSION="23:0:13"' -MD -MQ 'libinput-test-suite-runner@exe/test_litest-device-asus-rog-gladius.c.o' -MF 'libinput-test-suite-runner@exe/test_litest-device-asus-rog-gladius.c.o.d' -o 'libinput-test-suite-runner@exe/test_litest-device-asus-rog-gladius.c.o' -c ../test/litest-device-asus-rog-gladius.c [78/178] x86_64-pld-linux-gnux32-gcc -Ilibinput-debug-gui@exe -I. -I.. -I../src -I../include -I/usr/include/at-spi2-atk/2.0 -I/usr/include/at-spi-2.0 -I/usr/include/dbus-1.0 -I/usr/libx32/dbus-1.0/include -I/usr/include/gtk-3.0 -I/usr/include/gio-unix-2.0/ -I/usr/include/pango-1.0 -I/usr/include/fribidi -I/usr/include/atk-1.0 -I/usr/include/cairo -I/usr/include/pixman-1 -I/usr/include/uuid -I/usr/include/freetype2 -I/usr/include/harfbuzz -I/usr/include/libpng16 -I/usr/include/gdk-pixbuf-2.0 -I/usr/include/glib-2.0 -I/usr/libx32/glib-2.0/include -I/usr/include/libevdev-1.0/ -I/usr/include/libwacom-1.0 -fdiagnostics-color=always -pipe -D_FILE_OFFSET_BITS=64 -std=gnu99 -Wno-unused-parameter -g -fvisibility=hidden -Wmissing-prototypes -Wstrict-prototypes -O2 -fwrapv -Wformat -Werror=format-security -gdwarf-4 -fno-debug-types-section -fvar-tracking-assignments -g2 -Wp,-D_FORTIFY_SOURCE=2 -fstack-protector-strong --param=ssp-buffer-size=4 -fPIC -mtune=generic -march=x86-64 -gdwarf-4 -fno-debug-types-section -fvar-tracking-assignments -g2 -pthread -MD -MQ 'libinput-debug-gui@exe/tools_libinput-debug-gui.c.o' -MF 'libinput-debug-gui@exe/tools_libinput-debug-gui.c.o.d' -o 'libinput-debug-gui@exe/tools_libinput-debug-gui.c.o' -c ../tools/libinput-debug-gui.c [79/178] x86_64-pld-linux-gnux32-gcc -Ilibinput-test-suite-runner@exe -I. -I.. -I../src -I../include -I/usr/include/libevdev-1.0/ -I/usr/include/libwacom-1.0 -I/usr/include/glib-2.0 -I/usr/libx32/glib-2.0/include -fdiagnostics-color=always -pipe -D_FILE_OFFSET_BITS=64 -std=gnu99 -Wno-unused-parameter -g -fvisibility=hidden -Wmissing-prototypes -Wstrict-prototypes -O2 -fwrapv -Wformat -Werror=format-security -gdwarf-4 -fno-debug-types-section -fvar-tracking-assignments -g2 -Wp,-D_FORTIFY_SOURCE=2 -fstack-protector-strong --param=ssp-buffer-size=4 -fPIC -mtune=generic -march=x86-64 -gdwarf-4 -fno-debug-types-section -fvar-tracking-assignments -g2 -pthread '-DLIBINPUT_LT_VERSION="23:0:13"' -MD -MQ 'libinput-test-suite-runner@exe/test_litest-device-atmel-hover.c.o' -MF 'libinput-test-suite-runner@exe/test_litest-device-atmel-hover.c.o.d' -o 'libinput-test-suite-runner@exe/test_litest-device-atmel-hover.c.o' -c ../test/litest-device-atmel-hover.c [80/178] x86_64-pld-linux-gnux32-gcc -Ilibinput-record@exe -I. -I.. -I../src -I../include -I/usr/include/libevdev-1.0/ -I/usr/include/libwacom-1.0 -I/usr/include/glib-2.0 -I/usr/libx32/glib-2.0/include -fdiagnostics-color=always -pipe -D_FILE_OFFSET_BITS=64 -std=gnu99 -Wno-unused-parameter -g -fvisibility=hidden -Wmissing-prototypes -Wstrict-prototypes -O2 -fwrapv -Wformat -Werror=format-security -gdwarf-4 -fno-debug-types-section -fvar-tracking-assignments -g2 -Wp,-D_FORTIFY_SOURCE=2 -fstack-protector-strong --param=ssp-buffer-size=4 -fPIC -mtune=generic -march=x86-64 -gdwarf-4 -fno-debug-types-section -fvar-tracking-assignments -g2 -MD -MQ 'libinput-record@exe/tools_libinput-record.c.o' -MF 'libinput-record@exe/tools_libinput-record.c.o.d' -o 'libinput-record@exe/tools_libinput-record.c.o' -c ../tools/libinput-record.c ../tools/libinput-record.c: In function ‘buffer_key_event’: ../tools/libinput-record.c:381:14: warning: format ‘%ld’ expects argument of type ‘long int’, but argument 4 has type ‘uint64_t’ {aka ‘long long unsigned int’} [-Wformat=] "{time: %ld.%06ld, type: %s, key: %d, state: %s}", ~~^ %lld time / (int)1e6, ~~~~~~~~~~~~~~~ ../tools/libinput-record.c:381:20: warning: format ‘%ld’ expects argument of type ‘long int’, but argument 5 has type ‘uint64_t’ {aka ‘long long unsigned int’} [-Wformat=] "{time: %ld.%06ld, type: %s, key: %d, state: %s}", ~~~~^ %06lld ../tools/libinput-record.c:383:4: time % (int)1e6, ~~~~~~~~~~~~~~~ ../tools/libinput-record.c: In function ‘buffer_motion_event’: ../tools/libinput-record.c:416:14: warning: format ‘%ld’ expects argument of type ‘long int’, but argument 4 has type ‘uint64_t’ {aka ‘long long unsigned int’} [-Wformat=] "{time: %ld.%06ld, type: %s, delta: [%6.2f, %6.2f], unaccel: [%6.2f, %6.2f]}", ~~^ %lld time / (int)1e6, ~~~~~~~~~~~~~~~ ../tools/libinput-record.c:416:20: warning: format ‘%ld’ expects argument of type ‘long int’, but argument 5 has type ‘uint64_t’ {aka ‘long long unsigned int’} [-Wformat=] "{time: %ld.%06ld, type: %s, delta: [%6.2f, %6.2f], unaccel: [%6.2f, %6.2f]}", ~~~~^ %06lld ../tools/libinput-record.c:418:4: time % (int)1e6, ~~~~~~~~~~~~~~~ ../tools/libinput-record.c: In function ‘buffer_absmotion_event’: ../tools/libinput-record.c:451:14: warning: format ‘%ld’ expects argument of type ‘long int’, but argument 4 has type ‘uint64_t’ {aka ‘long long unsigned int’} [-Wformat=] "{time: %ld.%06ld, type: %s, point: [%6.2f, %6.2f], transformed: [%6.2f, %6.2f]}", ~~^ %lld time / (int)1e6, ~~~~~~~~~~~~~~~ ../tools/libinput-record.c:451:20: warning: format ‘%ld’ expects argument of type ‘long int’, but argument 5 has type ‘uint64_t’ {aka ‘long long unsigned int’} [-Wformat=] "{time: %ld.%06ld, type: %s, point: [%6.2f, %6.2f], transformed: [%6.2f, %6.2f]}", ~~~~^ %06lld ../tools/libinput-record.c:453:4: time % (int)1e6, ~~~~~~~~~~~~~~~ ../tools/libinput-record.c: In function ‘buffer_pointer_button_event’: ../tools/libinput-record.c:486:14: warning: format ‘%ld’ expects argument of type ‘long int’, but argument 4 has type ‘uint64_t’ {aka ‘long long unsigned int’} [-Wformat=] "{time: %ld.%06ld, type: %s, button: %d, state: %s, seat_count: %u}", ~~^ %lld time / (int)1e6, ~~~~~~~~~~~~~~~ ../tools/libinput-record.c:486:20: warning: format ‘%ld’ expects argument of type ‘long int’, but argument 5 has type ‘uint64_t’ {aka ‘long long unsigned int’} [-Wformat=] "{time: %ld.%06ld, type: %s, button: %d, state: %s, seat_count: %u}", ~~~~^ %06lld ../tools/libinput-record.c:488:4: time % (int)1e6, ~~~~~~~~~~~~~~~ ../tools/libinput-record.c: In function ‘buffer_pointer_axis_event’: ../tools/libinput-record.c:543:14: warning: format ‘%ld’ expects argument of type ‘long int’, but argument 4 has type ‘uint64_t’ {aka ‘long long unsigned int’} [-Wformat=] "{time: %ld.%06ld, type: %s, axes: [%2.2f, %2.2f], discrete: [%d, %d], source: %s}", ~~^ %lld time / (int)1e6, ~~~~~~~~~~~~~~~ ../tools/libinput-record.c:543:20: warning: format ‘%ld’ expects argument of type ‘long int’, but argument 5 has type ‘uint64_t’ {aka ‘long long unsigned int’} [-Wformat=] "{time: %ld.%06ld, type: %s, axes: [%2.2f, %2.2f], discrete: [%d, %d], source: %s}", ~~~~^ %06lld ../tools/libinput-record.c:545:4: time % (int)1e6, ~~~~~~~~~~~~~~~ ../tools/libinput-record.c: In function ‘buffer_touch_event’: ../tools/libinput-record.c:598:15: warning: format ‘%ld’ expects argument of type ‘long int’, but argument 4 has type ‘uint64_t’ {aka ‘long long unsigned int’} [-Wformat=] "{time: %ld.%06ld, type: %s}", ~~^ %lld time / (int)1e6, ~~~~~~~~~~~~~~~ ../tools/libinput-record.c:598:21: warning: format ‘%ld’ expects argument of type ‘long int’, but argument 5 has type ‘uint64_t’ {aka ‘long long unsigned int’} [-Wformat=] "{time: %ld.%06ld, type: %s}", ~~~~^ %06lld ../tools/libinput-record.c:600:5: time % (int)1e6, ~~~~~~~~~~~~~~~ ../tools/libinput-record.c:611:15: warning: format ‘%ld’ expects argument of type ‘long int’, but argument 4 has type ‘uint64_t’ {aka ‘long long unsigned int’} [-Wformat=] "{time: %ld.%06ld, type: %s, slot: %d, seat_slot: %d, point: [%6.2f, %6.2f], transformed: [%6.2f, %6.2f]}", ~~^ %lld time / (int)1e6, ~~~~~~~~~~~~~~~ ../tools/libinput-record.c:611:21: warning: format ‘%ld’ expects argument of type ‘long int’, but argument 5 has type ‘uint64_t’ {aka ‘long long unsigned int’} [-Wformat=] "{time: %ld.%06ld, type: %s, slot: %d, seat_slot: %d, point: [%6.2f, %6.2f], transformed: [%6.2f, %6.2f]}", ~~~~^ %06lld ../tools/libinput-record.c:613:5: time % (int)1e6, ~~~~~~~~~~~~~~~ ../tools/libinput-record.c:624:15: warning: format ‘%ld’ expects argument of type ‘long int’, but argument 4 has type ‘uint64_t’ {aka ‘long long unsigned int’} [-Wformat=] "{time: %ld.%06ld, type: %s, slot: %d, seat_slot: %d}", ~~^ %lld time / (int)1e6, ~~~~~~~~~~~~~~~ ../tools/libinput-record.c:624:21: warning: format ‘%ld’ expects argument of type ‘long int’, but argument 5 has type ‘uint64_t’ {aka ‘long long unsigned int’} [-Wformat=] "{time: %ld.%06ld, type: %s, slot: %d, seat_slot: %d}", ~~~~^ %06lld ../tools/libinput-record.c:626:5: time % (int)1e6, ~~~~~~~~~~~~~~~ ../tools/libinput-record.c: In function ‘buffer_gesture_event’: ../tools/libinput-record.c:679:15: warning: format ‘%ld’ expects argument of type ‘long int’, but argument 4 has type ‘uint64_t’ {aka ‘long long unsigned int’} [-Wformat=] "{time: %ld.%06ld, type: %s, nfingers: %d, " ~~^ %lld ../tools/libinput-record.c:682:5: time / (int)1e6, ~~~~~~~~~~~~~~~ ../tools/libinput-record.c:679:21: warning: format ‘%ld’ expects argument of type ‘long int’, but argument 5 has type ‘uint64_t’ {aka ‘long long unsigned int’} [-Wformat=] "{time: %ld.%06ld, type: %s, nfingers: %d, " ~~~~^ %06lld ../tools/libinput-record.c:683:5: time % (int)1e6, ~~~~~~~~~~~~~~~ ../tools/libinput-record.c:699:15: warning: format ‘%ld’ expects argument of type ‘long int’, but argument 4 has type ‘uint64_t’ {aka ‘long long unsigned int’} [-Wformat=] "{time: %ld.%06ld, type: %s, nfingers: %d, " ~~^ %lld ../tools/libinput-record.c:701:5: time / (int)1e6, ~~~~~~~~~~~~~~~ ../tools/libinput-record.c:699:21: warning: format ‘%ld’ expects argument of type ‘long int’, but argument 5 has type ‘uint64_t’ {aka ‘long long unsigned int’} [-Wformat=] "{time: %ld.%06ld, type: %s, nfingers: %d, " ~~~~^ %06lld ../tools/libinput-record.c:702:5: time % (int)1e6, ~~~~~~~~~~~~~~~ ../tools/libinput-record.c: In function ‘buffer_tablet_tool_proximity_event’: ../tools/libinput-record.c:877:14: warning: format ‘%ld’ expects argument of type ‘long int’, but argument 4 has type ‘uint64_t’ {aka ‘long long unsigned int’} [-Wformat=] "{time: %ld.%06ld, type: %s, proximity: %s, tool-type: %s, serial: %" PRIu64 ", axes: %s, %s}", ~~^ %lld time / (int)1e6, ~~~~~~~~~~~~~~~ ../tools/libinput-record.c:877:20: warning: format ‘%ld’ expects argument of type ‘long int’, but argument 5 has type ‘uint64_t’ {aka ‘long long unsigned int’} [-Wformat=] "{time: %ld.%06ld, type: %s, proximity: %s, tool-type: %s, serial: %" PRIu64 ", axes: %s, %s}", ~~~~^ %06lld ../tools/libinput-record.c:879:4: time % (int)1e6, ~~~~~~~~~~~~~~~ ../tools/libinput-record.c: In function ‘buffer_tablet_tool_button_event’: ../tools/libinput-record.c:919:14: warning: format ‘%ld’ expects argument of type ‘long int’, but argument 4 has type ‘uint64_t’ {aka ‘long long unsigned int’} [-Wformat=] "{time: %ld.%06ld, type: %s, button: %d, state: %s}", ~~^ %lld time / (int)1e6, ~~~~~~~~~~~~~~~ ../tools/libinput-record.c:919:20: warning: format ‘%ld’ expects argument of type ‘long int’, but argument 5 has type ‘uint64_t’ {aka ‘long long unsigned int’} [-Wformat=] "{time: %ld.%06ld, type: %s, button: %d, state: %s}", ~~~~^ %06lld ../tools/libinput-record.c:921:4: time % (int)1e6, ~~~~~~~~~~~~~~~ ../tools/libinput-record.c: In function ‘buffer_tablet_tool_event’: ../tools/libinput-record.c:976:14: warning: format ‘%ld’ expects argument of type ‘long int’, but argument 4 has type ‘uint64_t’ {aka ‘long long unsigned int’} [-Wformat=] "{time: %ld.%06ld, type: %s%s, tip: %s, %s}", ~~^ %lld time / (int)1e6, ~~~~~~~~~~~~~~~ ../tools/libinput-record.c:976:20: warning: format ‘%ld’ expects argument of type ‘long int’, but argument 5 has type ‘uint64_t’ {aka ‘long long unsigned int’} [-Wformat=] "{time: %ld.%06ld, type: %s%s, tip: %s, %s}", ~~~~^ %06lld ../tools/libinput-record.c:978:4: time % (int)1e6, ~~~~~~~~~~~~~~~ ../tools/libinput-record.c: In function ‘buffer_tablet_pad_button_event’: ../tools/libinput-record.c:1018:14: warning: format ‘%ld’ expects argument of type ‘long int’, but argument 4 has type ‘uint64_t’ {aka ‘long long unsigned int’} [-Wformat=] "{time: %ld.%06ld, type: %s, button: %d, state: %s, mode: %d, is-toggle: %s}", ~~^ %lld time / (int)1e6, ~~~~~~~~~~~~~~~ ../tools/libinput-record.c:1018:20: warning: format ‘%ld’ expects argument of type ‘long int’, but argument 5 has type ‘uint64_t’ {aka ‘long long unsigned int’} [-Wformat=] "{time: %ld.%06ld, type: %s, button: %d, state: %s, mode: %d, is-toggle: %s}", ~~~~^ %06lld ../tools/libinput-record.c:1020:4: time % (int)1e6, ~~~~~~~~~~~~~~~ ../tools/libinput-record.c: In function ‘buffer_tablet_pad_ringstrip_event’: ../tools/libinput-record.c:1085:14: warning: format ‘%ld’ expects argument of type ‘long int’, but argument 4 has type ‘uint64_t’ {aka ‘long long unsigned int’} [-Wformat=] "{time: %ld.%06ld, type: %s, number: %d, position: %.2f, source: %s, mode: %d}", ~~^ %lld time / (int)1e6, ~~~~~~~~~~~~~~~ ../tools/libinput-record.c:1085:20: warning: format ‘%ld’ expects argument of type ‘long int’, but argument 5 has type ‘uint64_t’ {aka ‘long long unsigned int’} [-Wformat=] "{time: %ld.%06ld, type: %s, number: %d, position: %.2f, source: %s, mode: %d}", ~~~~^ %06lld ../tools/libinput-record.c:1087:4: time % (int)1e6, ~~~~~~~~~~~~~~~ ../tools/libinput-record.c: In function ‘buffer_switch_event’: ../tools/libinput-record.c:1123:14: warning: format ‘%ld’ expects argument of type ‘long int’, but argument 4 has type ‘uint64_t’ {aka ‘long long unsigned int’} [-Wformat=] "{time: %ld.%06ld, type: %s, switch: %d, state: %s}", ~~^ %lld time / (int)1e6, ~~~~~~~~~~~~~~~ ../tools/libinput-record.c:1123:20: warning: format ‘%ld’ expects argument of type ‘long int’, but argument 5 has type ‘uint64_t’ {aka ‘long long unsigned int’} [-Wformat=] "{time: %ld.%06ld, type: %s, switch: %d, state: %s}", ~~~~^ %06lld ../tools/libinput-record.c:1125:4: time % (int)1e6, ~~~~~~~~~~~~~~~ [81/178] x86_64-pld-linux-gnux32-gcc -o libinput-quirks 'libinput-quirks@exe/tools_libinput-quirks.c.o' -Wl,--no-undefined -Wl,--as-needed -O2 -fwrapv -pipe -Wformat -Werror=format-security -gdwarf-4 -fno-debug-types-section -fvar-tracking-assignments -g2 -Wp,-D_FORTIFY_SOURCE=2 -fstack-protector-strong --param=ssp-buffer-size=4 -fPIC -mtune=generic -march=x86-64 -gdwarf-4 -fno-debug-types-section -fvar-tracking-assignments -g2 -Wl,--as-needed -Wl,--no-copy-dt-needed-entries -Wl,-z,relro -Wl,-z,combreloc -Wl,--start-group libquirks.a liblibinput-util.a libtools_shared.a libinput.so.10.13.0 /usr/libx32/libmtdev.so /libx32/libudev.so /usr/libx32/libevdev.so -lm -lrt -Wl,--end-group /usr/libx32/libwacom.so -lm -lrt -lm -lrt '-Wl,-rpath,$ORIGIN/' -Wl,-rpath-link,/tmp/B.AoR4Oe/BUILD/libinput-1.12.0/build/ [82/178] x86_64-pld-linux-gnux32-gcc -o ptraccel-debug 'ptraccel-debug@exe/tools_ptraccel-debug.c.o' -Wl,--no-undefined -Wl,--as-needed -O2 -fwrapv -pipe -Wformat -Werror=format-security -gdwarf-4 -fno-debug-types-section -fvar-tracking-assignments -g2 -Wp,-D_FORTIFY_SOURCE=2 -fstack-protector-strong --param=ssp-buffer-size=4 -fPIC -mtune=generic -march=x86-64 -gdwarf-4 -fno-debug-types-section -fvar-tracking-assignments -g2 -Wl,--as-needed -Wl,--no-copy-dt-needed-entries -Wl,-z,relro -Wl,-z,combreloc -Wl,--start-group libfilter.a libinput.so.10.13.0 liblibinput-util.a libquirks.a /usr/libx32/libmtdev.so /libx32/libudev.so /usr/libx32/libevdev.so -lm -lrt /usr/libx32/libwacom.so -Wl,--end-group '-Wl,-rpath,$ORIGIN/' -Wl,-rpath-link,/tmp/B.AoR4Oe/BUILD/libinput-1.12.0/build/ [83/178] x86_64-pld-linux-gnux32-gcc -o libinput-list-devices 'libinput-list-devices@exe/tools_libinput-list-devices.c.o' -Wl,--no-undefined -Wl,--as-needed -O2 -fwrapv -pipe -Wformat -Werror=format-security -gdwarf-4 -fno-debug-types-section -fvar-tracking-assignments -g2 -Wp,-D_FORTIFY_SOURCE=2 -fstack-protector-strong --param=ssp-buffer-size=4 -fPIC -mtune=generic -march=x86-64 -gdwarf-4 -fno-debug-types-section -fvar-tracking-assignments -g2 -Wl,--as-needed -Wl,--no-copy-dt-needed-entries -Wl,-z,relro -Wl,-z,combreloc -Wl,--start-group libtools_shared.a libinput.so.10.13.0 liblibinput-util.a libquirks.a /usr/libx32/libmtdev.so /libx32/libudev.so /usr/libx32/libevdev.so -lm -lrt -Wl,--end-group /usr/libx32/libwacom.so -lm -lrt -lm -lrt '-Wl,-rpath,$ORIGIN/' -Wl,-rpath-link,/tmp/B.AoR4Oe/BUILD/libinput-1.12.0/build/ [84/178] x86_64-pld-linux-gnux32-gcc -o libinput 'libinput@exe/tools_libinput-tool.c.o' -Wl,--no-undefined -Wl,--as-needed -O2 -fwrapv -pipe -Wformat -Werror=format-security -gdwarf-4 -fno-debug-types-section -fvar-tracking-assignments -g2 -Wp,-D_FORTIFY_SOURCE=2 -fstack-protector-strong --param=ssp-buffer-size=4 -fPIC -mtune=generic -march=x86-64 -gdwarf-4 -fno-debug-types-section -fvar-tracking-assignments -g2 -Wl,--as-needed -Wl,--no-copy-dt-needed-entries -Wl,-z,relro -Wl,-z,combreloc -Wl,--start-group libtools_shared.a libinput.so.10.13.0 liblibinput-util.a libquirks.a /usr/libx32/libmtdev.so /libx32/libudev.so /usr/libx32/libevdev.so -lm -lrt -Wl,--end-group /usr/libx32/libwacom.so -lm -lrt -lm -lrt '-Wl,-rpath,$ORIGIN/' -Wl,-rpath-link,/tmp/B.AoR4Oe/BUILD/libinput-1.12.0/build/ [85/178] x86_64-pld-linux-gnux32-gcc -o libinput-measure 'libinput-measure@exe/tools_libinput-measure.c.o' -Wl,--no-undefined -Wl,--as-needed -O2 -fwrapv -pipe -Wformat -Werror=format-security -gdwarf-4 -fno-debug-types-section -fvar-tracking-assignments -g2 -Wp,-D_FORTIFY_SOURCE=2 -fstack-protector-strong --param=ssp-buffer-size=4 -fPIC -mtune=generic -march=x86-64 -gdwarf-4 -fno-debug-types-section -fvar-tracking-assignments -g2 -Wl,--as-needed -Wl,--no-copy-dt-needed-entries -Wl,-z,relro -Wl,-z,combreloc -Wl,--start-group libtools_shared.a libinput.so.10.13.0 liblibinput-util.a libquirks.a /usr/libx32/libmtdev.so /libx32/libudev.so /usr/libx32/libevdev.so -lm -lrt -Wl,--end-group /usr/libx32/libwacom.so -lm -lrt -lm -lrt '-Wl,-rpath,$ORIGIN/' -Wl,-rpath-link,/tmp/B.AoR4Oe/BUILD/libinput-1.12.0/build/ [86/178] x86_64-pld-linux-gnux32-gcc -o test-build-linker 'test-build-linker@exe/test_build-pedantic.c.o' -Wl,--no-undefined -Wl,--as-needed -O2 -fwrapv -pipe -Wformat -Werror=format-security -gdwarf-4 -fno-debug-types-section -fvar-tracking-assignments -g2 -Wp,-D_FORTIFY_SOURCE=2 -fstack-protector-strong --param=ssp-buffer-size=4 -fPIC -mtune=generic -march=x86-64 -gdwarf-4 -fno-debug-types-section -fvar-tracking-assignments -g2 -Wl,--as-needed -Wl,--no-copy-dt-needed-entries -Wl,-z,relro -Wl,-z,combreloc -Wl,--start-group libinput.so.10.13.0 liblibinput-util.a libquirks.a /usr/libx32/libmtdev.so /libx32/libudev.so /usr/libx32/libevdev.so -lm -lrt /usr/libx32/libwacom.so -Wl,--end-group '-Wl,-rpath,$ORIGIN/' -Wl,-rpath-link,/tmp/B.AoR4Oe/BUILD/libinput-1.12.0/build/ [87/178] x86_64-pld-linux-gnux32-gcc -o test-builddir-lookup 'test-builddir-lookup@exe/tools_test-builddir-lookup.c.o' -Wl,--no-undefined -Wl,--as-needed -O2 -fwrapv -pipe -Wformat -Werror=format-security -gdwarf-4 -fno-debug-types-section -fvar-tracking-assignments -g2 -Wp,-D_FORTIFY_SOURCE=2 -fstack-protector-strong --param=ssp-buffer-size=4 -fPIC -mtune=generic -march=x86-64 -gdwarf-4 -fno-debug-types-section -fvar-tracking-assignments -g2 -Wl,--as-needed -Wl,--no-copy-dt-needed-entries -Wl,-z,relro -Wl,-z,combreloc -Wl,--start-group libtools_shared.a libinput.so.10.13.0 liblibinput-util.a libquirks.a /usr/libx32/libmtdev.so /libx32/libudev.so /usr/libx32/libevdev.so -lm -lrt -Wl,--end-group /usr/libx32/libwacom.so -lm -lrt '-Wl,-rpath,$ORIGIN/' -Wl,-rpath-link,/tmp/B.AoR4Oe/BUILD/libinput-1.12.0/build/ [88/178] x86_64-pld-linux-gnux32-gcc -o libinput-record 'libinput-record@exe/tools_libinput-record.c.o' -Wl,--no-undefined -Wl,--as-needed -O2 -fwrapv -pipe -Wformat -Werror=format-security -gdwarf-4 -fno-debug-types-section -fvar-tracking-assignments -g2 -Wp,-D_FORTIFY_SOURCE=2 -fstack-protector-strong --param=ssp-buffer-size=4 -fPIC -mtune=generic -march=x86-64 -gdwarf-4 -fno-debug-types-section -fvar-tracking-assignments -g2 -Wl,--as-needed -Wl,--no-copy-dt-needed-entries -Wl,-z,relro -Wl,-z,combreloc -Wl,--start-group libtools_shared.a libinput.so.10.13.0 liblibinput-util.a libquirks.a /usr/libx32/libmtdev.so /libx32/libudev.so /usr/libx32/libevdev.so -lm -lrt -Wl,--end-group /usr/libx32/libwacom.so -lm -lrt -lm -lrt '-Wl,-rpath,$ORIGIN/' -Wl,-rpath-link,/tmp/B.AoR4Oe/BUILD/libinput-1.12.0/build/ [89/178] x86_64-pld-linux-gnux32-gcc -Ilibinput-test-suite-runner@exe -I. -I.. -I../src -I../include -I/usr/include/libevdev-1.0/ -I/usr/include/libwacom-1.0 -I/usr/include/glib-2.0 -I/usr/libx32/glib-2.0/include -fdiagnostics-color=always -pipe -D_FILE_OFFSET_BITS=64 -std=gnu99 -Wno-unused-parameter -g -fvisibility=hidden -Wmissing-prototypes -Wstrict-prototypes -O2 -fwrapv -Wformat -Werror=format-security -gdwarf-4 -fno-debug-types-section -fvar-tracking-assignments -g2 -Wp,-D_FORTIFY_SOURCE=2 -fstack-protector-strong --param=ssp-buffer-size=4 -fPIC -mtune=generic -march=x86-64 -gdwarf-4 -fno-debug-types-section -fvar-tracking-assignments -g2 -pthread '-DLIBINPUT_LT_VERSION="23:0:13"' -MD -MQ 'libinput-test-suite-runner@exe/test_litest-device-calibrated-touchscreen.c.o' -MF 'libinput-test-suite-runner@exe/test_litest-device-calibrated-touchscreen.c.o.d' -o 'libinput-test-suite-runner@exe/test_litest-device-calibrated-touchscreen.c.o' -c ../test/litest-device-calibrated-touchscreen.c [90/178] x86_64-pld-linux-gnux32-gcc -Ilibinput-test-suite-runner@exe -I. -I.. -I../src -I../include -I/usr/include/libevdev-1.0/ -I/usr/include/libwacom-1.0 -I/usr/include/glib-2.0 -I/usr/libx32/glib-2.0/include -fdiagnostics-color=always -pipe -D_FILE_OFFSET_BITS=64 -std=gnu99 -Wno-unused-parameter -g -fvisibility=hidden -Wmissing-prototypes -Wstrict-prototypes -O2 -fwrapv -Wformat -Werror=format-security -gdwarf-4 -fno-debug-types-section -fvar-tracking-assignments -g2 -Wp,-D_FORTIFY_SOURCE=2 -fstack-protector-strong --param=ssp-buffer-size=4 -fPIC -mtune=generic -march=x86-64 -gdwarf-4 -fno-debug-types-section -fvar-tracking-assignments -g2 -pthread '-DLIBINPUT_LT_VERSION="23:0:13"' -MD -MQ 'libinput-test-suite-runner@exe/test_litest-device-elantech-touchpad.c.o' -MF 'libinput-test-suite-runner@exe/test_litest-device-elantech-touchpad.c.o.d' -o 'libinput-test-suite-runner@exe/test_litest-device-elantech-touchpad.c.o' -c ../test/litest-device-elantech-touchpad.c [91/178] x86_64-pld-linux-gnux32-gcc -Ilibinput-test-suite-runner@exe -I. -I.. -I../src -I../include -I/usr/include/libevdev-1.0/ -I/usr/include/libwacom-1.0 -I/usr/include/glib-2.0 -I/usr/libx32/glib-2.0/include -fdiagnostics-color=always -pipe -D_FILE_OFFSET_BITS=64 -std=gnu99 -Wno-unused-parameter -g -fvisibility=hidden -Wmissing-prototypes -Wstrict-prototypes -O2 -fwrapv -Wformat -Werror=format-security -gdwarf-4 -fno-debug-types-section -fvar-tracking-assignments -g2 -Wp,-D_FORTIFY_SOURCE=2 -fstack-protector-strong --param=ssp-buffer-size=4 -fPIC -mtune=generic -march=x86-64 -gdwarf-4 -fno-debug-types-section -fvar-tracking-assignments -g2 -pthread '-DLIBINPUT_LT_VERSION="23:0:13"' -MD -MQ 'libinput-test-suite-runner@exe/test_litest-device-cyborg-rat-5.c.o' -MF 'libinput-test-suite-runner@exe/test_litest-device-cyborg-rat-5.c.o.d' -o 'libinput-test-suite-runner@exe/test_litest-device-cyborg-rat-5.c.o' -c ../test/litest-device-cyborg-rat-5.c [92/178] x86_64-pld-linux-gnux32-gcc -Ilibinput-test-suite-runner@exe -I. -I.. -I../src -I../include -I/usr/include/libevdev-1.0/ -I/usr/include/libwacom-1.0 -I/usr/include/glib-2.0 -I/usr/libx32/glib-2.0/include -fdiagnostics-color=always -pipe -D_FILE_OFFSET_BITS=64 -std=gnu99 -Wno-unused-parameter -g -fvisibility=hidden -Wmissing-prototypes -Wstrict-prototypes -O2 -fwrapv -Wformat -Werror=format-security -gdwarf-4 -fno-debug-types-section -fvar-tracking-assignments -g2 -Wp,-D_FORTIFY_SOURCE=2 -fstack-protector-strong --param=ssp-buffer-size=4 -fPIC -mtune=generic -march=x86-64 -gdwarf-4 -fno-debug-types-section -fvar-tracking-assignments -g2 -pthread '-DLIBINPUT_LT_VERSION="23:0:13"' -MD -MQ 'libinput-test-suite-runner@exe/test_litest-device-bcm5974.c.o' -MF 'libinput-test-suite-runner@exe/test_litest-device-bcm5974.c.o.d' -o 'libinput-test-suite-runner@exe/test_litest-device-bcm5974.c.o' -c ../test/litest-device-bcm5974.c [93/178] x86_64-pld-linux-gnux32-gcc -Ilibinput-test-suite-runner@exe -I. -I.. -I../src -I../include -I/usr/include/libevdev-1.0/ -I/usr/include/libwacom-1.0 -I/usr/include/glib-2.0 -I/usr/libx32/glib-2.0/include -fdiagnostics-color=always -pipe -D_FILE_OFFSET_BITS=64 -std=gnu99 -Wno-unused-parameter -g -fvisibility=hidden -Wmissing-prototypes -Wstrict-prototypes -O2 -fwrapv -Wformat -Werror=format-security -gdwarf-4 -fno-debug-types-section -fvar-tracking-assignments -g2 -Wp,-D_FORTIFY_SOURCE=2 -fstack-protector-strong --param=ssp-buffer-size=4 -fPIC -mtune=generic -march=x86-64 -gdwarf-4 -fno-debug-types-section -fvar-tracking-assignments -g2 -pthread '-DLIBINPUT_LT_VERSION="23:0:13"' -MD -MQ 'libinput-test-suite-runner@exe/test_litest-device-gpio-keys.c.o' -MF 'libinput-test-suite-runner@exe/test_litest-device-gpio-keys.c.o.d' -o 'libinput-test-suite-runner@exe/test_litest-device-gpio-keys.c.o' -c ../test/litest-device-gpio-keys.c [94/178] x86_64-pld-linux-gnux32-gcc -Ilibinput-test-suite-runner@exe -I. -I.. -I../src -I../include -I/usr/include/libevdev-1.0/ -I/usr/include/libwacom-1.0 -I/usr/include/glib-2.0 -I/usr/libx32/glib-2.0/include -fdiagnostics-color=always -pipe -D_FILE_OFFSET_BITS=64 -std=gnu99 -Wno-unused-parameter -g -fvisibility=hidden -Wmissing-prototypes -Wstrict-prototypes -O2 -fwrapv -Wformat -Werror=format-security -gdwarf-4 -fno-debug-types-section -fvar-tracking-assignments -g2 -Wp,-D_FORTIFY_SOURCE=2 -fstack-protector-strong --param=ssp-buffer-size=4 -fPIC -mtune=generic -march=x86-64 -gdwarf-4 -fno-debug-types-section -fvar-tracking-assignments -g2 -pthread '-DLIBINPUT_LT_VERSION="23:0:13"' -MD -MQ 'libinput-test-suite-runner@exe/test_litest-device-generic-singletouch.c.o' -MF 'libinput-test-suite-runner@exe/test_litest-device-generic-singletouch.c.o.d' -o 'libinput-test-suite-runner@exe/test_litest-device-generic-singletouch.c.o' -c ../test/litest-device-generic-singletouch.c [95/178] x86_64-pld-linux-gnux32-gcc -Ilibinput-test-suite-runner@exe -I. -I.. -I../src -I../include -I/usr/include/libevdev-1.0/ -I/usr/include/libwacom-1.0 -I/usr/include/glib-2.0 -I/usr/libx32/glib-2.0/include -fdiagnostics-color=always -pipe -D_FILE_OFFSET_BITS=64 -std=gnu99 -Wno-unused-parameter -g -fvisibility=hidden -Wmissing-prototypes -Wstrict-prototypes -O2 -fwrapv -Wformat -Werror=format-security -gdwarf-4 -fno-debug-types-section -fvar-tracking-assignments -g2 -Wp,-D_FORTIFY_SOURCE=2 -fstack-protector-strong --param=ssp-buffer-size=4 -fPIC -mtune=generic -march=x86-64 -gdwarf-4 -fno-debug-types-section -fvar-tracking-assignments -g2 -pthread '-DLIBINPUT_LT_VERSION="23:0:13"' -MD -MQ 'libinput-test-suite-runner@exe/test_litest-device-huion-pentablet.c.o' -MF 'libinput-test-suite-runner@exe/test_litest-device-huion-pentablet.c.o.d' -o 'libinput-test-suite-runner@exe/test_litest-device-huion-pentablet.c.o' -c ../test/litest-device-huion-pentablet.c [96/178] x86_64-pld-linux-gnux32-gcc -Ilibinput-test-suite-runner@exe -I. -I.. -I../src -I../include -I/usr/include/libevdev-1.0/ -I/usr/include/libwacom-1.0 -I/usr/include/glib-2.0 -I/usr/libx32/glib-2.0/include -fdiagnostics-color=always -pipe -D_FILE_OFFSET_BITS=64 -std=gnu99 -Wno-unused-parameter -g -fvisibility=hidden -Wmissing-prototypes -Wstrict-prototypes -O2 -fwrapv -Wformat -Werror=format-security -gdwarf-4 -fno-debug-types-section -fvar-tracking-assignments -g2 -Wp,-D_FORTIFY_SOURCE=2 -fstack-protector-strong --param=ssp-buffer-size=4 -fPIC -mtune=generic -march=x86-64 -gdwarf-4 -fno-debug-types-section -fvar-tracking-assignments -g2 -pthread '-DLIBINPUT_LT_VERSION="23:0:13"' -MD -MQ 'libinput-test-suite-runner@exe/test_litest-device-ignored-mouse.c.o' -MF 'libinput-test-suite-runner@exe/test_litest-device-ignored-mouse.c.o.d' -o 'libinput-test-suite-runner@exe/test_litest-device-ignored-mouse.c.o' -c ../test/litest-device-ignored-mouse.c [97/178] x86_64-pld-linux-gnux32-gcc -Ilibinput-test-suite-runner@exe -I. -I.. -I../src -I../include -I/usr/include/libevdev-1.0/ -I/usr/include/libwacom-1.0 -I/usr/include/glib-2.0 -I/usr/libx32/glib-2.0/include -fdiagnostics-color=always -pipe -D_FILE_OFFSET_BITS=64 -std=gnu99 -Wno-unused-parameter -g -fvisibility=hidden -Wmissing-prototypes -Wstrict-prototypes -O2 -fwrapv -Wformat -Werror=format-security -gdwarf-4 -fno-debug-types-section -fvar-tracking-assignments -g2 -Wp,-D_FORTIFY_SOURCE=2 -fstack-protector-strong --param=ssp-buffer-size=4 -fPIC -mtune=generic -march=x86-64 -gdwarf-4 -fno-debug-types-section -fvar-tracking-assignments -g2 -pthread '-DLIBINPUT_LT_VERSION="23:0:13"' -MD -MQ 'libinput-test-suite-runner@exe/test_litest-device-keyboard.c.o' -MF 'libinput-test-suite-runner@exe/test_litest-device-keyboard.c.o.d' -o 'libinput-test-suite-runner@exe/test_litest-device-keyboard.c.o' -c ../test/litest-device-keyboard.c [98/178] x86_64-pld-linux-gnux32-gcc -Ilibinput-test-suite-runner@exe -I. -I.. -I../src -I../include -I/usr/include/libevdev-1.0/ -I/usr/include/libwacom-1.0 -I/usr/include/glib-2.0 -I/usr/libx32/glib-2.0/include -fdiagnostics-color=always -pipe -D_FILE_OFFSET_BITS=64 -std=gnu99 -Wno-unused-parameter -g -fvisibility=hidden -Wmissing-prototypes -Wstrict-prototypes -O2 -fwrapv -Wformat -Werror=format-security -gdwarf-4 -fno-debug-types-section -fvar-tracking-assignments -g2 -Wp,-D_FORTIFY_SOURCE=2 -fstack-protector-strong --param=ssp-buffer-size=4 -fPIC -mtune=generic -march=x86-64 -gdwarf-4 -fno-debug-types-section -fvar-tracking-assignments -g2 -pthread '-DLIBINPUT_LT_VERSION="23:0:13"' -MD -MQ 'libinput-test-suite-runner@exe/test_litest-device-hp-wmi-hotkeys.c.o' -MF 'libinput-test-suite-runner@exe/test_litest-device-hp-wmi-hotkeys.c.o.d' -o 'libinput-test-suite-runner@exe/test_litest-device-hp-wmi-hotkeys.c.o' -c ../test/litest-device-hp-wmi-hotkeys.c [99/178] x86_64-pld-linux-gnux32-gcc -Ilibinput-test-suite-runner@exe -I. -I.. -I../src -I../include -I/usr/include/libevdev-1.0/ -I/usr/include/libwacom-1.0 -I/usr/include/glib-2.0 -I/usr/libx32/glib-2.0/include -fdiagnostics-color=always -pipe -D_FILE_OFFSET_BITS=64 -std=gnu99 -Wno-unused-parameter -g -fvisibility=hidden -Wmissing-prototypes -Wstrict-prototypes -O2 -fwrapv -Wformat -Werror=format-security -gdwarf-4 -fno-debug-types-section -fvar-tracking-assignments -g2 -Wp,-D_FORTIFY_SOURCE=2 -fstack-protector-strong --param=ssp-buffer-size=4 -fPIC -mtune=generic -march=x86-64 -gdwarf-4 -fno-debug-types-section -fvar-tracking-assignments -g2 -pthread '-DLIBINPUT_LT_VERSION="23:0:13"' -MD -MQ 'libinput-test-suite-runner@exe/test_litest-device-keyboard-all-codes.c.o' -MF 'libinput-test-suite-runner@exe/test_litest-device-keyboard-all-codes.c.o.d' -o 'libinput-test-suite-runner@exe/test_litest-device-keyboard-all-codes.c.o' -c ../test/litest-device-keyboard-all-codes.c [100/178] x86_64-pld-linux-gnux32-gcc -Ilibinput-test-suite-runner@exe -I. -I.. -I../src -I../include -I/usr/include/libevdev-1.0/ -I/usr/include/libwacom-1.0 -I/usr/include/glib-2.0 -I/usr/libx32/glib-2.0/include -fdiagnostics-color=always -pipe -D_FILE_OFFSET_BITS=64 -std=gnu99 -Wno-unused-parameter -g -fvisibility=hidden -Wmissing-prototypes -Wstrict-prototypes -O2 -fwrapv -Wformat -Werror=format-security -gdwarf-4 -fno-debug-types-section -fvar-tracking-assignments -g2 -Wp,-D_FORTIFY_SOURCE=2 -fstack-protector-strong --param=ssp-buffer-size=4 -fPIC -mtune=generic -march=x86-64 -gdwarf-4 -fno-debug-types-section -fvar-tracking-assignments -g2 -pthread '-DLIBINPUT_LT_VERSION="23:0:13"' -MD -MQ 'libinput-test-suite-runner@exe/test_litest-device-keyboard-razer-blackwidow.c.o' -MF 'libinput-test-suite-runner@exe/test_litest-device-keyboard-razer-blackwidow.c.o.d' -o 'libinput-test-suite-runner@exe/test_litest-device-keyboard-razer-blackwidow.c.o' -c ../test/litest-device-keyboard-razer-blackwidow.c [101/178] x86_64-pld-linux-gnux32-gcc -Ilibinput-test-suite-runner@exe -I. -I.. -I../src -I../include -I/usr/include/libevdev-1.0/ -I/usr/include/libwacom-1.0 -I/usr/include/glib-2.0 -I/usr/libx32/glib-2.0/include -fdiagnostics-color=always -pipe -D_FILE_OFFSET_BITS=64 -std=gnu99 -Wno-unused-parameter -g -fvisibility=hidden -Wmissing-prototypes -Wstrict-prototypes -O2 -fwrapv -Wformat -Werror=format-security -gdwarf-4 -fno-debug-types-section -fvar-tracking-assignments -g2 -Wp,-D_FORTIFY_SOURCE=2 -fstack-protector-strong --param=ssp-buffer-size=4 -fPIC -mtune=generic -march=x86-64 -gdwarf-4 -fno-debug-types-section -fvar-tracking-assignments -g2 -pthread '-DLIBINPUT_LT_VERSION="23:0:13"' -MD -MQ 'libinput-test-suite-runner@exe/test_litest-device-keyboard-razer-blade-stealth-videoswitch.c.o' -MF 'libinput-test-suite-runner@exe/test_litest-device-keyboard-razer-blade-stealth-videoswitch.c.o.d' -o 'libinput-test-suite-runner@exe/test_litest-device-keyboard-razer-blade-stealth-videoswitch.c.o' -c ../test/litest-device-keyboard-razer-blade-stealth-videoswitch.c [102/178] x86_64-pld-linux-gnux32-gcc -Ilibinput-test-suite-runner@exe -I. -I.. -I../src -I../include -I/usr/include/libevdev-1.0/ -I/usr/include/libwacom-1.0 -I/usr/include/glib-2.0 -I/usr/libx32/glib-2.0/include -fdiagnostics-color=always -pipe -D_FILE_OFFSET_BITS=64 -std=gnu99 -Wno-unused-parameter -g -fvisibility=hidden -Wmissing-prototypes -Wstrict-prototypes -O2 -fwrapv -Wformat -Werror=format-security -gdwarf-4 -fno-debug-types-section -fvar-tracking-assignments -g2 -Wp,-D_FORTIFY_SOURCE=2 -fstack-protector-strong --param=ssp-buffer-size=4 -fPIC -mtune=generic -march=x86-64 -gdwarf-4 -fno-debug-types-section -fvar-tracking-assignments -g2 -pthread '-DLIBINPUT_LT_VERSION="23:0:13"' -MD -MQ 'libinput-test-suite-runner@exe/test_litest-device-keyboard-razer-blade-stealth.c.o' -MF 'libinput-test-suite-runner@exe/test_litest-device-keyboard-razer-blade-stealth.c.o.d' -o 'libinput-test-suite-runner@exe/test_litest-device-keyboard-razer-blade-stealth.c.o' -c ../test/litest-device-keyboard-razer-blade-stealth.c [103/178] x86_64-pld-linux-gnux32-gcc -Ilibinput-test-suite-runner@exe -I. -I.. -I../src -I../include -I/usr/include/libevdev-1.0/ -I/usr/include/libwacom-1.0 -I/usr/include/glib-2.0 -I/usr/libx32/glib-2.0/include -fdiagnostics-color=always -pipe -D_FILE_OFFSET_BITS=64 -std=gnu99 -Wno-unused-parameter -g -fvisibility=hidden -Wmissing-prototypes -Wstrict-prototypes -O2 -fwrapv -Wformat -Werror=format-security -gdwarf-4 -fno-debug-types-section -fvar-tracking-assignments -g2 -Wp,-D_FORTIFY_SOURCE=2 -fstack-protector-strong --param=ssp-buffer-size=4 -fPIC -mtune=generic -march=x86-64 -gdwarf-4 -fno-debug-types-section -fvar-tracking-assignments -g2 -pthread '-DLIBINPUT_LT_VERSION="23:0:13"' -MD -MQ 'libinput-test-suite-runner@exe/test_litest-device-lid-switch-surface3.c.o' -MF 'libinput-test-suite-runner@exe/test_litest-device-lid-switch-surface3.c.o.d' -o 'libinput-test-suite-runner@exe/test_litest-device-lid-switch-surface3.c.o' -c ../test/litest-device-lid-switch-surface3.c [104/178] x86_64-pld-linux-gnux32-gcc -Ilibinput-test-suite-runner@exe -I. -I.. -I../src -I../include -I/usr/include/libevdev-1.0/ -I/usr/include/libwacom-1.0 -I/usr/include/glib-2.0 -I/usr/libx32/glib-2.0/include -fdiagnostics-color=always -pipe -D_FILE_OFFSET_BITS=64 -std=gnu99 -Wno-unused-parameter -g -fvisibility=hidden -Wmissing-prototypes -Wstrict-prototypes -O2 -fwrapv -Wformat -Werror=format-security -gdwarf-4 -fno-debug-types-section -fvar-tracking-assignments -g2 -Wp,-D_FORTIFY_SOURCE=2 -fstack-protector-strong --param=ssp-buffer-size=4 -fPIC -mtune=generic -march=x86-64 -gdwarf-4 -fno-debug-types-section -fvar-tracking-assignments -g2 -pthread '-DLIBINPUT_LT_VERSION="23:0:13"' -MD -MQ 'libinput-test-suite-runner@exe/test_litest-device-lid-switch.c.o' -MF 'libinput-test-suite-runner@exe/test_litest-device-lid-switch.c.o.d' -o 'libinput-test-suite-runner@exe/test_litest-device-lid-switch.c.o' -c ../test/litest-device-lid-switch.c [105/178] x86_64-pld-linux-gnux32-gcc -Ilibinput-test-suite-runner@exe -I. -I.. -I../src -I../include -I/usr/include/libevdev-1.0/ -I/usr/include/libwacom-1.0 -I/usr/include/glib-2.0 -I/usr/libx32/glib-2.0/include -fdiagnostics-color=always -pipe -D_FILE_OFFSET_BITS=64 -std=gnu99 -Wno-unused-parameter -g -fvisibility=hidden -Wmissing-prototypes -Wstrict-prototypes -O2 -fwrapv -Wformat -Werror=format-security -gdwarf-4 -fno-debug-types-section -fvar-tracking-assignments -g2 -Wp,-D_FORTIFY_SOURCE=2 -fstack-protector-strong --param=ssp-buffer-size=4 -fPIC -mtune=generic -march=x86-64 -gdwarf-4 -fno-debug-types-section -fvar-tracking-assignments -g2 -pthread '-DLIBINPUT_LT_VERSION="23:0:13"' -MD -MQ 'libinput-test-suite-runner@exe/test_litest-device-magic-trackpad.c.o' -MF 'libinput-test-suite-runner@exe/test_litest-device-magic-trackpad.c.o.d' -o 'libinput-test-suite-runner@exe/test_litest-device-magic-trackpad.c.o' -c ../test/litest-device-magic-trackpad.c [106/178] x86_64-pld-linux-gnux32-gcc -Ilibinput-test-suite-runner@exe -I. -I.. -I../src -I../include -I/usr/include/libevdev-1.0/ -I/usr/include/libwacom-1.0 -I/usr/include/glib-2.0 -I/usr/libx32/glib-2.0/include -fdiagnostics-color=always -pipe -D_FILE_OFFSET_BITS=64 -std=gnu99 -Wno-unused-parameter -g -fvisibility=hidden -Wmissing-prototypes -Wstrict-prototypes -O2 -fwrapv -Wformat -Werror=format-security -gdwarf-4 -fno-debug-types-section -fvar-tracking-assignments -g2 -Wp,-D_FORTIFY_SOURCE=2 -fstack-protector-strong --param=ssp-buffer-size=4 -fPIC -mtune=generic -march=x86-64 -gdwarf-4 -fno-debug-types-section -fvar-tracking-assignments -g2 -pthread '-DLIBINPUT_LT_VERSION="23:0:13"' -MD -MQ 'libinput-test-suite-runner@exe/test_litest-device-logitech-trackball.c.o' -MF 'libinput-test-suite-runner@exe/test_litest-device-logitech-trackball.c.o.d' -o 'libinput-test-suite-runner@exe/test_litest-device-logitech-trackball.c.o' -c ../test/litest-device-logitech-trackball.c [107/178] x86_64-pld-linux-gnux32-gcc -Ilibinput-test-suite-runner@exe -I. -I.. -I../src -I../include -I/usr/include/libevdev-1.0/ -I/usr/include/libwacom-1.0 -I/usr/include/glib-2.0 -I/usr/libx32/glib-2.0/include -fdiagnostics-color=always -pipe -D_FILE_OFFSET_BITS=64 -std=gnu99 -Wno-unused-parameter -g -fvisibility=hidden -Wmissing-prototypes -Wstrict-prototypes -O2 -fwrapv -Wformat -Werror=format-security -gdwarf-4 -fno-debug-types-section -fvar-tracking-assignments -g2 -Wp,-D_FORTIFY_SOURCE=2 -fstack-protector-strong --param=ssp-buffer-size=4 -fPIC -mtune=generic -march=x86-64 -gdwarf-4 -fno-debug-types-section -fvar-tracking-assignments -g2 -pthread '-DLIBINPUT_LT_VERSION="23:0:13"' -MD -MQ 'libinput-test-suite-runner@exe/test_litest-device-mouse-wheel-tilt.c.o' -MF 'libinput-test-suite-runner@exe/test_litest-device-mouse-wheel-tilt.c.o.d' -o 'libinput-test-suite-runner@exe/test_litest-device-mouse-wheel-tilt.c.o' -c ../test/litest-device-mouse-wheel-tilt.c [108/178] x86_64-pld-linux-gnux32-gcc -Ilibinput-test-suite-runner@exe -I. -I.. -I../src -I../include -I/usr/include/libevdev-1.0/ -I/usr/include/libwacom-1.0 -I/usr/include/glib-2.0 -I/usr/libx32/glib-2.0/include -fdiagnostics-color=always -pipe -D_FILE_OFFSET_BITS=64 -std=gnu99 -Wno-unused-parameter -g -fvisibility=hidden -Wmissing-prototypes -Wstrict-prototypes -O2 -fwrapv -Wformat -Werror=format-security -gdwarf-4 -fno-debug-types-section -fvar-tracking-assignments -g2 -Wp,-D_FORTIFY_SOURCE=2 -fstack-protector-strong --param=ssp-buffer-size=4 -fPIC -mtune=generic -march=x86-64 -gdwarf-4 -fno-debug-types-section -fvar-tracking-assignments -g2 -pthread '-DLIBINPUT_LT_VERSION="23:0:13"' -MD -MQ 'libinput-test-suite-runner@exe/test_litest-device-mouse.c.o' -MF 'libinput-test-suite-runner@exe/test_litest-device-mouse.c.o.d' -o 'libinput-test-suite-runner@exe/test_litest-device-mouse.c.o' -c ../test/litest-device-mouse.c [109/178] x86_64-pld-linux-gnux32-gcc -Ilibinput-test-suite-runner@exe -I. -I.. -I../src -I../include -I/usr/include/libevdev-1.0/ -I/usr/include/libwacom-1.0 -I/usr/include/glib-2.0 -I/usr/libx32/glib-2.0/include -fdiagnostics-color=always -pipe -D_FILE_OFFSET_BITS=64 -std=gnu99 -Wno-unused-parameter -g -fvisibility=hidden -Wmissing-prototypes -Wstrict-prototypes -O2 -fwrapv -Wformat -Werror=format-security -gdwarf-4 -fno-debug-types-section -fvar-tracking-assignments -g2 -Wp,-D_FORTIFY_SOURCE=2 -fstack-protector-strong --param=ssp-buffer-size=4 -fPIC -mtune=generic -march=x86-64 -gdwarf-4 -fno-debug-types-section -fvar-tracking-assignments -g2 -pthread '-DLIBINPUT_LT_VERSION="23:0:13"' -MD -MQ 'libinput-test-suite-runner@exe/test_litest-device-nexus4-touch-screen.c.o' -MF 'libinput-test-suite-runner@exe/test_litest-device-nexus4-touch-screen.c.o.d' -o 'libinput-test-suite-runner@exe/test_litest-device-nexus4-touch-screen.c.o' -c ../test/litest-device-nexus4-touch-screen.c [110/178] x86_64-pld-linux-gnux32-gcc -Ilibinput-test-suite-runner@exe -I. -I.. -I../src -I../include -I/usr/include/libevdev-1.0/ -I/usr/include/libwacom-1.0 -I/usr/include/glib-2.0 -I/usr/libx32/glib-2.0/include -fdiagnostics-color=always -pipe -D_FILE_OFFSET_BITS=64 -std=gnu99 -Wno-unused-parameter -g -fvisibility=hidden -Wmissing-prototypes -Wstrict-prototypes -O2 -fwrapv -Wformat -Werror=format-security -gdwarf-4 -fno-debug-types-section -fvar-tracking-assignments -g2 -Wp,-D_FORTIFY_SOURCE=2 -fstack-protector-strong --param=ssp-buffer-size=4 -fPIC -mtune=generic -march=x86-64 -gdwarf-4 -fno-debug-types-section -fvar-tracking-assignments -g2 -pthread '-DLIBINPUT_LT_VERSION="23:0:13"' -MD -MQ 'libinput-test-suite-runner@exe/test_litest-device-mouse-roccat.c.o' -MF 'libinput-test-suite-runner@exe/test_litest-device-mouse-roccat.c.o.d' -o 'libinput-test-suite-runner@exe/test_litest-device-mouse-roccat.c.o' -c ../test/litest-device-mouse-roccat.c [111/178] x86_64-pld-linux-gnux32-gcc -Ilibinput-test-suite-runner@exe -I. -I.. -I../src -I../include -I/usr/include/libevdev-1.0/ -I/usr/include/libwacom-1.0 -I/usr/include/glib-2.0 -I/usr/libx32/glib-2.0/include -fdiagnostics-color=always -pipe -D_FILE_OFFSET_BITS=64 -std=gnu99 -Wno-unused-parameter -g -fvisibility=hidden -Wmissing-prototypes -Wstrict-prototypes -O2 -fwrapv -Wformat -Werror=format-security -gdwarf-4 -fno-debug-types-section -fvar-tracking-assignments -g2 -Wp,-D_FORTIFY_SOURCE=2 -fstack-protector-strong --param=ssp-buffer-size=4 -fPIC -mtune=generic -march=x86-64 -gdwarf-4 -fno-debug-types-section -fvar-tracking-assignments -g2 -pthread '-DLIBINPUT_LT_VERSION="23:0:13"' -MD -MQ 'libinput-test-suite-runner@exe/test_litest-device-ms-nano-transceiver-mouse.c.o' -MF 'libinput-test-suite-runner@exe/test_litest-device-ms-nano-transceiver-mouse.c.o.d' -o 'libinput-test-suite-runner@exe/test_litest-device-ms-nano-transceiver-mouse.c.o' -c ../test/litest-device-ms-nano-transceiver-mouse.c [112/178] x86_64-pld-linux-gnux32-gcc -Ilibinput-test-suite-runner@exe -I. -I.. -I../src -I../include -I/usr/include/libevdev-1.0/ -I/usr/include/libwacom-1.0 -I/usr/include/glib-2.0 -I/usr/libx32/glib-2.0/include -fdiagnostics-color=always -pipe -D_FILE_OFFSET_BITS=64 -std=gnu99 -Wno-unused-parameter -g -fvisibility=hidden -Wmissing-prototypes -Wstrict-prototypes -O2 -fwrapv -Wformat -Werror=format-security -gdwarf-4 -fno-debug-types-section -fvar-tracking-assignments -g2 -Wp,-D_FORTIFY_SOURCE=2 -fstack-protector-strong --param=ssp-buffer-size=4 -fPIC -mtune=generic -march=x86-64 -gdwarf-4 -fno-debug-types-section -fvar-tracking-assignments -g2 -pthread '-DLIBINPUT_LT_VERSION="23:0:13"' -MD -MQ 'libinput-test-suite-runner@exe/test_litest-device-mouse-wheel-click-angle.c.o' -MF 'libinput-test-suite-runner@exe/test_litest-device-mouse-wheel-click-angle.c.o.d' -o 'libinput-test-suite-runner@exe/test_litest-device-mouse-wheel-click-angle.c.o' -c ../test/litest-device-mouse-wheel-click-angle.c [113/178] x86_64-pld-linux-gnux32-gcc -Ilibinput-test-suite-runner@exe -I. -I.. -I../src -I../include -I/usr/include/libevdev-1.0/ -I/usr/include/libwacom-1.0 -I/usr/include/glib-2.0 -I/usr/libx32/glib-2.0/include -fdiagnostics-color=always -pipe -D_FILE_OFFSET_BITS=64 -std=gnu99 -Wno-unused-parameter -g -fvisibility=hidden -Wmissing-prototypes -Wstrict-prototypes -O2 -fwrapv -Wformat -Werror=format-security -gdwarf-4 -fno-debug-types-section -fvar-tracking-assignments -g2 -Wp,-D_FORTIFY_SOURCE=2 -fstack-protector-strong --param=ssp-buffer-size=4 -fPIC -mtune=generic -march=x86-64 -gdwarf-4 -fno-debug-types-section -fvar-tracking-assignments -g2 -pthread '-DLIBINPUT_LT_VERSION="23:0:13"' -MD -MQ 'libinput-test-suite-runner@exe/test_litest-device-mouse-low-dpi.c.o' -MF 'libinput-test-suite-runner@exe/test_litest-device-mouse-low-dpi.c.o.d' -o 'libinput-test-suite-runner@exe/test_litest-device-mouse-low-dpi.c.o' -c ../test/litest-device-mouse-low-dpi.c [114/178] x86_64-pld-linux-gnux32-gcc -Ilibinput-test-suite-runner@exe -I. -I.. -I../src -I../include -I/usr/include/libevdev-1.0/ -I/usr/include/libwacom-1.0 -I/usr/include/glib-2.0 -I/usr/libx32/glib-2.0/include -fdiagnostics-color=always -pipe -D_FILE_OFFSET_BITS=64 -std=gnu99 -Wno-unused-parameter -g -fvisibility=hidden -Wmissing-prototypes -Wstrict-prototypes -O2 -fwrapv -Wformat -Werror=format-security -gdwarf-4 -fno-debug-types-section -fvar-tracking-assignments -g2 -Wp,-D_FORTIFY_SOURCE=2 -fstack-protector-strong --param=ssp-buffer-size=4 -fPIC -mtune=generic -march=x86-64 -gdwarf-4 -fno-debug-types-section -fvar-tracking-assignments -g2 -pthread '-DLIBINPUT_LT_VERSION="23:0:13"' -MD -MQ 'libinput-test-suite-runner@exe/test_litest-device-ms-surface-cover.c.o' -MF 'libinput-test-suite-runner@exe/test_litest-device-ms-surface-cover.c.o.d' -o 'libinput-test-suite-runner@exe/test_litest-device-ms-surface-cover.c.o' -c ../test/litest-device-ms-surface-cover.c [115/178] x86_64-pld-linux-gnux32-gcc -Ilibinput-test-suite-runner@exe -I. -I.. -I../src -I../include -I/usr/include/libevdev-1.0/ -I/usr/include/libwacom-1.0 -I/usr/include/glib-2.0 -I/usr/libx32/glib-2.0/include -fdiagnostics-color=always -pipe -D_FILE_OFFSET_BITS=64 -std=gnu99 -Wno-unused-parameter -g -fvisibility=hidden -Wmissing-prototypes -Wstrict-prototypes -O2 -fwrapv -Wformat -Werror=format-security -gdwarf-4 -fno-debug-types-section -fvar-tracking-assignments -g2 -Wp,-D_FORTIFY_SOURCE=2 -fstack-protector-strong --param=ssp-buffer-size=4 -fPIC -mtune=generic -march=x86-64 -gdwarf-4 -fno-debug-types-section -fvar-tracking-assignments -g2 -pthread '-DLIBINPUT_LT_VERSION="23:0:13"' -MD -MQ 'libinput-test-suite-runner@exe/test_litest-device-mouse-wheel-click-count.c.o' -MF 'libinput-test-suite-runner@exe/test_litest-device-mouse-wheel-click-count.c.o.d' -o 'libinput-test-suite-runner@exe/test_litest-device-mouse-wheel-click-count.c.o' -c ../test/litest-device-mouse-wheel-click-count.c [116/178] x86_64-pld-linux-gnux32-gcc -Ilibinput-test-suite-runner@exe -I. -I.. -I../src -I../include -I/usr/include/libevdev-1.0/ -I/usr/include/libwacom-1.0 -I/usr/include/glib-2.0 -I/usr/libx32/glib-2.0/include -fdiagnostics-color=always -pipe -D_FILE_OFFSET_BITS=64 -std=gnu99 -Wno-unused-parameter -g -fvisibility=hidden -Wmissing-prototypes -Wstrict-prototypes -O2 -fwrapv -Wformat -Werror=format-security -gdwarf-4 -fno-debug-types-section -fvar-tracking-assignments -g2 -Wp,-D_FORTIFY_SOURCE=2 -fstack-protector-strong --param=ssp-buffer-size=4 -fPIC -mtune=generic -march=x86-64 -gdwarf-4 -fno-debug-types-section -fvar-tracking-assignments -g2 -pthread '-DLIBINPUT_LT_VERSION="23:0:13"' -MD -MQ 'libinput-test-suite-runner@exe/test_litest-device-protocol-a-touch-screen.c.o' -MF 'libinput-test-suite-runner@exe/test_litest-device-protocol-a-touch-screen.c.o.d' -o 'libinput-test-suite-runner@exe/test_litest-device-protocol-a-touch-screen.c.o' -c ../test/litest-device-protocol-a-touch-screen.c [117/178] x86_64-pld-linux-gnux32-gcc -Ilibinput-test-suite-runner@exe -I. -I.. -I../src -I../include -I/usr/include/libevdev-1.0/ -I/usr/include/libwacom-1.0 -I/usr/include/glib-2.0 -I/usr/libx32/glib-2.0/include -fdiagnostics-color=always -pipe -D_FILE_OFFSET_BITS=64 -std=gnu99 -Wno-unused-parameter -g -fvisibility=hidden -Wmissing-prototypes -Wstrict-prototypes -O2 -fwrapv -Wformat -Werror=format-security -gdwarf-4 -fno-debug-types-section -fvar-tracking-assignments -g2 -Wp,-D_FORTIFY_SOURCE=2 -fstack-protector-strong --param=ssp-buffer-size=4 -fPIC -mtune=generic -march=x86-64 -gdwarf-4 -fno-debug-types-section -fvar-tracking-assignments -g2 -pthread '-DLIBINPUT_LT_VERSION="23:0:13"' -MD -MQ 'libinput-test-suite-runner@exe/test_litest-device-qemu-usb-tablet.c.o' -MF 'libinput-test-suite-runner@exe/test_litest-device-qemu-usb-tablet.c.o.d' -o 'libinput-test-suite-runner@exe/test_litest-device-qemu-usb-tablet.c.o' -c ../test/litest-device-qemu-usb-tablet.c [118/178] x86_64-pld-linux-gnux32-gcc -Ilibinput-test-suite-runner@exe -I. -I.. -I../src -I../include -I/usr/include/libevdev-1.0/ -I/usr/include/libwacom-1.0 -I/usr/include/glib-2.0 -I/usr/libx32/glib-2.0/include -fdiagnostics-color=always -pipe -D_FILE_OFFSET_BITS=64 -std=gnu99 -Wno-unused-parameter -g -fvisibility=hidden -Wmissing-prototypes -Wstrict-prototypes -O2 -fwrapv -Wformat -Werror=format-security -gdwarf-4 -fno-debug-types-section -fvar-tracking-assignments -g2 -Wp,-D_FORTIFY_SOURCE=2 -fstack-protector-strong --param=ssp-buffer-size=4 -fPIC -mtune=generic -march=x86-64 -gdwarf-4 -fno-debug-types-section -fvar-tracking-assignments -g2 -pthread '-DLIBINPUT_LT_VERSION="23:0:13"' -MD -MQ 'libinput-test-suite-runner@exe/test_litest-device-synaptics-rmi4.c.o' -MF 'libinput-test-suite-runner@exe/test_litest-device-synaptics-rmi4.c.o.d' -o 'libinput-test-suite-runner@exe/test_litest-device-synaptics-rmi4.c.o' -c ../test/litest-device-synaptics-rmi4.c [119/178] x86_64-pld-linux-gnux32-gcc -Ilibinput-test-suite-runner@exe -I. -I.. -I../src -I../include -I/usr/include/libevdev-1.0/ -I/usr/include/libwacom-1.0 -I/usr/include/glib-2.0 -I/usr/libx32/glib-2.0/include -fdiagnostics-color=always -pipe -D_FILE_OFFSET_BITS=64 -std=gnu99 -Wno-unused-parameter -g -fvisibility=hidden -Wmissing-prototypes -Wstrict-prototypes -O2 -fwrapv -Wformat -Werror=format-security -gdwarf-4 -fno-debug-types-section -fvar-tracking-assignments -g2 -Wp,-D_FORTIFY_SOURCE=2 -fstack-protector-strong --param=ssp-buffer-size=4 -fPIC -mtune=generic -march=x86-64 -gdwarf-4 -fno-debug-types-section -fvar-tracking-assignments -g2 -pthread '-DLIBINPUT_LT_VERSION="23:0:13"' -MD -MQ 'libinput-test-suite-runner@exe/test_litest-device-synaptics-i2c.c.o' -MF 'libinput-test-suite-runner@exe/test_litest-device-synaptics-i2c.c.o.d' -o 'libinput-test-suite-runner@exe/test_litest-device-synaptics-i2c.c.o' -c ../test/litest-device-synaptics-i2c.c [120/178] x86_64-pld-linux-gnux32-gcc -Ilibinput-test-suite-runner@exe -I. -I.. -I../src -I../include -I/usr/include/libevdev-1.0/ -I/usr/include/libwacom-1.0 -I/usr/include/glib-2.0 -I/usr/libx32/glib-2.0/include -fdiagnostics-color=always -pipe -D_FILE_OFFSET_BITS=64 -std=gnu99 -Wno-unused-parameter -g -fvisibility=hidden -Wmissing-prototypes -Wstrict-prototypes -O2 -fwrapv -Wformat -Werror=format-security -gdwarf-4 -fno-debug-types-section -fvar-tracking-assignments -g2 -Wp,-D_FORTIFY_SOURCE=2 -fstack-protector-strong --param=ssp-buffer-size=4 -fPIC -mtune=generic -march=x86-64 -gdwarf-4 -fno-debug-types-section -fvar-tracking-assignments -g2 -pthread '-DLIBINPUT_LT_VERSION="23:0:13"' -MD -MQ 'libinput-test-suite-runner@exe/test_litest-device-synaptics-st.c.o' -MF 'libinput-test-suite-runner@exe/test_litest-device-synaptics-st.c.o.d' -o 'libinput-test-suite-runner@exe/test_litest-device-synaptics-st.c.o' -c ../test/litest-device-synaptics-st.c [121/178] x86_64-pld-linux-gnux32-gcc -o libinput-debug-gui 'libinput-debug-gui@exe/tools_libinput-debug-gui.c.o' -Wl,--no-undefined -Wl,--as-needed -O2 -fwrapv -pipe -Wformat -Werror=format-security -gdwarf-4 -fno-debug-types-section -fvar-tracking-assignments -g2 -Wp,-D_FORTIFY_SOURCE=2 -fstack-protector-strong --param=ssp-buffer-size=4 -fPIC -mtune=generic -march=x86-64 -gdwarf-4 -fno-debug-types-section -fvar-tracking-assignments -g2 -Wl,--as-needed -Wl,--no-copy-dt-needed-entries -Wl,-z,relro -Wl,-z,combreloc -Wl,--start-group libtools_shared.a libinput.so.10.13.0 liblibinput-util.a libquirks.a /usr/libx32/libgtk-3.so /usr/libx32/libgdk-3.so /usr/libx32/libpangocairo-1.0.so /usr/libx32/libpango-1.0.so /usr/libx32/libatk-1.0.so /usr/libx32/libcairo-gobject.so /usr/libx32/libcairo.so /usr/libx32/libgdk_pixbuf-2.0.so /usr/libx32/libgio-2.0.so /usr/libx32/libgobject-2.0.so /usr/libx32/libglib-2.0.so /usr/libx32/libmtdev.so /libx32/libudev.so /usr/libx32/libevdev.so -lm -lrt -Wl,--end-group /usr/libx32/libwacom.so -lm -lrt -lm -lrt '-Wl,-rpath,$ORIGIN/' -Wl,-rpath-link,/tmp/B.AoR4Oe/BUILD/libinput-1.12.0/build/ [122/178] x86_64-pld-linux-gnux32-gcc -Ilibinput-test-suite-runner@exe -I. -I.. -I../src -I../include -I/usr/include/libevdev-1.0/ -I/usr/include/libwacom-1.0 -I/usr/include/glib-2.0 -I/usr/libx32/glib-2.0/include -fdiagnostics-color=always -pipe -D_FILE_OFFSET_BITS=64 -std=gnu99 -Wno-unused-parameter -g -fvisibility=hidden -Wmissing-prototypes -Wstrict-prototypes -O2 -fwrapv -Wformat -Werror=format-security -gdwarf-4 -fno-debug-types-section -fvar-tracking-assignments -g2 -Wp,-D_FORTIFY_SOURCE=2 -fstack-protector-strong --param=ssp-buffer-size=4 -fPIC -mtune=generic -march=x86-64 -gdwarf-4 -fno-debug-types-section -fvar-tracking-assignments -g2 -pthread '-DLIBINPUT_LT_VERSION="23:0:13"' -MD -MQ 'libinput-test-suite-runner@exe/test_litest-device-synaptics-t440.c.o' -MF 'libinput-test-suite-runner@exe/test_litest-device-synaptics-t440.c.o.d' -o 'libinput-test-suite-runner@exe/test_litest-device-synaptics-t440.c.o' -c ../test/litest-device-synaptics-t440.c [123/178] x86_64-pld-linux-gnux32-gcc -Ilibinput-test-suite-runner@exe -I. -I.. -I../src -I../include -I/usr/include/libevdev-1.0/ -I/usr/include/libwacom-1.0 -I/usr/include/glib-2.0 -I/usr/libx32/glib-2.0/include -fdiagnostics-color=always -pipe -D_FILE_OFFSET_BITS=64 -std=gnu99 -Wno-unused-parameter -g -fvisibility=hidden -Wmissing-prototypes -Wstrict-prototypes -O2 -fwrapv -Wformat -Werror=format-security -gdwarf-4 -fno-debug-types-section -fvar-tracking-assignments -g2 -Wp,-D_FORTIFY_SOURCE=2 -fstack-protector-strong --param=ssp-buffer-size=4 -fPIC -mtune=generic -march=x86-64 -gdwarf-4 -fno-debug-types-section -fvar-tracking-assignments -g2 -pthread '-DLIBINPUT_LT_VERSION="23:0:13"' -MD -MQ 'libinput-test-suite-runner@exe/test_litest-device-trackpoint.c.o' -MF 'libinput-test-suite-runner@exe/test_litest-device-trackpoint.c.o.d' -o 'libinput-test-suite-runner@exe/test_litest-device-trackpoint.c.o' -c ../test/litest-device-trackpoint.c [124/178] x86_64-pld-linux-gnux32-gcc -Ilibinput-test-suite-runner@exe -I. -I.. -I../src -I../include -I/usr/include/libevdev-1.0/ -I/usr/include/libwacom-1.0 -I/usr/include/glib-2.0 -I/usr/libx32/glib-2.0/include -fdiagnostics-color=always -pipe -D_FILE_OFFSET_BITS=64 -std=gnu99 -Wno-unused-parameter -g -fvisibility=hidden -Wmissing-prototypes -Wstrict-prototypes -O2 -fwrapv -Wformat -Werror=format-security -gdwarf-4 -fno-debug-types-section -fvar-tracking-assignments -g2 -Wp,-D_FORTIFY_SOURCE=2 -fstack-protector-strong --param=ssp-buffer-size=4 -fPIC -mtune=generic -march=x86-64 -gdwarf-4 -fno-debug-types-section -fvar-tracking-assignments -g2 -pthread '-DLIBINPUT_LT_VERSION="23:0:13"' -MD -MQ 'libinput-test-suite-runner@exe/test_litest-device-thinkpad-extrabuttons.c.o' -MF 'libinput-test-suite-runner@exe/test_litest-device-thinkpad-extrabuttons.c.o.d' -o 'libinput-test-suite-runner@exe/test_litest-device-thinkpad-extrabuttons.c.o' -c ../test/litest-device-thinkpad-extrabuttons.c [125/178] x86_64-pld-linux-gnux32-gcc -Ilibinput-test-suite-runner@exe -I. -I.. -I../src -I../include -I/usr/include/libevdev-1.0/ -I/usr/include/libwacom-1.0 -I/usr/include/glib-2.0 -I/usr/libx32/glib-2.0/include -fdiagnostics-color=always -pipe -D_FILE_OFFSET_BITS=64 -std=gnu99 -Wno-unused-parameter -g -fvisibility=hidden -Wmissing-prototypes -Wstrict-prototypes -O2 -fwrapv -Wformat -Werror=format-security -gdwarf-4 -fno-debug-types-section -fvar-tracking-assignments -g2 -Wp,-D_FORTIFY_SOURCE=2 -fstack-protector-strong --param=ssp-buffer-size=4 -fPIC -mtune=generic -march=x86-64 -gdwarf-4 -fno-debug-types-section -fvar-tracking-assignments -g2 -pthread '-DLIBINPUT_LT_VERSION="23:0:13"' -MD -MQ 'libinput-test-suite-runner@exe/test_litest-device-synaptics-x1-carbon-3rd.c.o' -MF 'libinput-test-suite-runner@exe/test_litest-device-synaptics-x1-carbon-3rd.c.o.d' -o 'libinput-test-suite-runner@exe/test_litest-device-synaptics-x1-carbon-3rd.c.o' -c ../test/litest-device-synaptics-x1-carbon-3rd.c [126/178] x86_64-pld-linux-gnux32-gcc -Ilibinput-test-suite-runner@exe -I. -I.. -I../src -I../include -I/usr/include/libevdev-1.0/ -I/usr/include/libwacom-1.0 -I/usr/include/glib-2.0 -I/usr/libx32/glib-2.0/include -fdiagnostics-color=always -pipe -D_FILE_OFFSET_BITS=64 -std=gnu99 -Wno-unused-parameter -g -fvisibility=hidden -Wmissing-prototypes -Wstrict-prototypes -O2 -fwrapv -Wformat -Werror=format-security -gdwarf-4 -fno-debug-types-section -fvar-tracking-assignments -g2 -Wp,-D_FORTIFY_SOURCE=2 -fstack-protector-strong --param=ssp-buffer-size=4 -fPIC -mtune=generic -march=x86-64 -gdwarf-4 -fno-debug-types-section -fvar-tracking-assignments -g2 -pthread '-DLIBINPUT_LT_VERSION="23:0:13"' -MD -MQ 'libinput-test-suite-runner@exe/test_litest-device-touchscreen-fuzz.c.o' -MF 'libinput-test-suite-runner@exe/test_litest-device-touchscreen-fuzz.c.o.d' -o 'libinput-test-suite-runner@exe/test_litest-device-touchscreen-fuzz.c.o' -c ../test/litest-device-touchscreen-fuzz.c [127/178] x86_64-pld-linux-gnux32-gcc -Ilibinput-test-suite-runner@exe -I. -I.. -I../src -I../include -I/usr/include/libevdev-1.0/ -I/usr/include/libwacom-1.0 -I/usr/include/glib-2.0 -I/usr/libx32/glib-2.0/include -fdiagnostics-color=always -pipe -D_FILE_OFFSET_BITS=64 -std=gnu99 -Wno-unused-parameter -g -fvisibility=hidden -Wmissing-prototypes -Wstrict-prototypes -O2 -fwrapv -Wformat -Werror=format-security -gdwarf-4 -fno-debug-types-section -fvar-tracking-assignments -g2 -Wp,-D_FORTIFY_SOURCE=2 -fstack-protector-strong --param=ssp-buffer-size=4 -fPIC -mtune=generic -march=x86-64 -gdwarf-4 -fno-debug-types-section -fvar-tracking-assignments -g2 -pthread '-DLIBINPUT_LT_VERSION="23:0:13"' -MD -MQ 'libinput-test-suite-runner@exe/test_litest-device-touch-screen.c.o' -MF 'libinput-test-suite-runner@exe/test_litest-device-touch-screen.c.o.d' -o 'libinput-test-suite-runner@exe/test_litest-device-touch-screen.c.o' -c ../test/litest-device-touch-screen.c [128/178] x86_64-pld-linux-gnux32-gcc -Ilibinput-test-suite-runner@exe -I. -I.. -I../src -I../include -I/usr/include/libevdev-1.0/ -I/usr/include/libwacom-1.0 -I/usr/include/glib-2.0 -I/usr/libx32/glib-2.0/include -fdiagnostics-color=always -pipe -D_FILE_OFFSET_BITS=64 -std=gnu99 -Wno-unused-parameter -g -fvisibility=hidden -Wmissing-prototypes -Wstrict-prototypes -O2 -fwrapv -Wformat -Werror=format-security -gdwarf-4 -fno-debug-types-section -fvar-tracking-assignments -g2 -Wp,-D_FORTIFY_SOURCE=2 -fstack-protector-strong --param=ssp-buffer-size=4 -fPIC -mtune=generic -march=x86-64 -gdwarf-4 -fno-debug-types-section -fvar-tracking-assignments -g2 -pthread '-DLIBINPUT_LT_VERSION="23:0:13"' -MD -MQ 'libinput-test-suite-runner@exe/test_litest-device-touchscreen-invalid-range.c.o' -MF 'libinput-test-suite-runner@exe/test_litest-device-touchscreen-invalid-range.c.o.d' -o 'libinput-test-suite-runner@exe/test_litest-device-touchscreen-invalid-range.c.o' -c ../test/litest-device-touchscreen-invalid-range.c [129/178] x86_64-pld-linux-gnux32-gcc -Ilibinput-test-suite-runner@exe -I. -I.. -I../src -I../include -I/usr/include/libevdev-1.0/ -I/usr/include/libwacom-1.0 -I/usr/include/glib-2.0 -I/usr/libx32/glib-2.0/include -fdiagnostics-color=always -pipe -D_FILE_OFFSET_BITS=64 -std=gnu99 -Wno-unused-parameter -g -fvisibility=hidden -Wmissing-prototypes -Wstrict-prototypes -O2 -fwrapv -Wformat -Werror=format-security -gdwarf-4 -fno-debug-types-section -fvar-tracking-assignments -g2 -Wp,-D_FORTIFY_SOURCE=2 -fstack-protector-strong --param=ssp-buffer-size=4 -fPIC -mtune=generic -march=x86-64 -gdwarf-4 -fno-debug-types-section -fvar-tracking-assignments -g2 -pthread '-DLIBINPUT_LT_VERSION="23:0:13"' -MD -MQ 'libinput-test-suite-runner@exe/test_litest-device-wacom-bamboo-2fg-finger.c.o' -MF 'libinput-test-suite-runner@exe/test_litest-device-wacom-bamboo-2fg-finger.c.o.d' -o 'libinput-test-suite-runner@exe/test_litest-device-wacom-bamboo-2fg-finger.c.o' -c ../test/litest-device-wacom-bamboo-2fg-finger.c [130/178] x86_64-pld-linux-gnux32-gcc -Ilibinput-test-suite-runner@exe -I. -I.. -I../src -I../include -I/usr/include/libevdev-1.0/ -I/usr/include/libwacom-1.0 -I/usr/include/glib-2.0 -I/usr/libx32/glib-2.0/include -fdiagnostics-color=always -pipe -D_FILE_OFFSET_BITS=64 -std=gnu99 -Wno-unused-parameter -g -fvisibility=hidden -Wmissing-prototypes -Wstrict-prototypes -O2 -fwrapv -Wformat -Werror=format-security -gdwarf-4 -fno-debug-types-section -fvar-tracking-assignments -g2 -Wp,-D_FORTIFY_SOURCE=2 -fstack-protector-strong --param=ssp-buffer-size=4 -fPIC -mtune=generic -march=x86-64 -gdwarf-4 -fno-debug-types-section -fvar-tracking-assignments -g2 -pthread '-DLIBINPUT_LT_VERSION="23:0:13"' -MD -MQ 'libinput-test-suite-runner@exe/test_litest-device-uclogic-tablet.c.o' -MF 'libinput-test-suite-runner@exe/test_litest-device-uclogic-tablet.c.o.d' -o 'libinput-test-suite-runner@exe/test_litest-device-uclogic-tablet.c.o' -c ../test/litest-device-uclogic-tablet.c [131/178] x86_64-pld-linux-gnux32-gcc -Ilibinput-test-suite-runner@exe -I. -I.. -I../src -I../include -I/usr/include/libevdev-1.0/ -I/usr/include/libwacom-1.0 -I/usr/include/glib-2.0 -I/usr/libx32/glib-2.0/include -fdiagnostics-color=always -pipe -D_FILE_OFFSET_BITS=64 -std=gnu99 -Wno-unused-parameter -g -fvisibility=hidden -Wmissing-prototypes -Wstrict-prototypes -O2 -fwrapv -Wformat -Werror=format-security -gdwarf-4 -fno-debug-types-section -fvar-tracking-assignments -g2 -Wp,-D_FORTIFY_SOURCE=2 -fstack-protector-strong --param=ssp-buffer-size=4 -fPIC -mtune=generic -march=x86-64 -gdwarf-4 -fno-debug-types-section -fvar-tracking-assignments -g2 -pthread '-DLIBINPUT_LT_VERSION="23:0:13"' -MD -MQ 'libinput-test-suite-runner@exe/test_litest-device-touchscreen-mt-tool.c.o' -MF 'libinput-test-suite-runner@exe/test_litest-device-touchscreen-mt-tool.c.o.d' -o 'libinput-test-suite-runner@exe/test_litest-device-touchscreen-mt-tool.c.o' -c ../test/litest-device-touchscreen-mt-tool.c [132/178] x86_64-pld-linux-gnux32-gcc -Ilibinput-test-suite-runner@exe -I. -I.. -I../src -I../include -I/usr/include/libevdev-1.0/ -I/usr/include/libwacom-1.0 -I/usr/include/glib-2.0 -I/usr/libx32/glib-2.0/include -fdiagnostics-color=always -pipe -D_FILE_OFFSET_BITS=64 -std=gnu99 -Wno-unused-parameter -g -fvisibility=hidden -Wmissing-prototypes -Wstrict-prototypes -O2 -fwrapv -Wformat -Werror=format-security -gdwarf-4 -fno-debug-types-section -fvar-tracking-assignments -g2 -Wp,-D_FORTIFY_SOURCE=2 -fstack-protector-strong --param=ssp-buffer-size=4 -fPIC -mtune=generic -march=x86-64 -gdwarf-4 -fno-debug-types-section -fvar-tracking-assignments -g2 -pthread '-DLIBINPUT_LT_VERSION="23:0:13"' -MD -MQ 'libinput-test-suite-runner@exe/test_litest-device-wacom-bamboo-2fg-pad.c.o' -MF 'libinput-test-suite-runner@exe/test_litest-device-wacom-bamboo-2fg-pad.c.o.d' -o 'libinput-test-suite-runner@exe/test_litest-device-wacom-bamboo-2fg-pad.c.o' -c ../test/litest-device-wacom-bamboo-2fg-pad.c [133/178] x86_64-pld-linux-gnux32-gcc -Itest-litest-selftest@exe -I. -I.. -I../src -I../include -I/usr/include/libevdev-1.0/ -I/usr/include/libwacom-1.0 -I/usr/include/glib-2.0 -I/usr/libx32/glib-2.0/include -fdiagnostics-color=always -pipe -D_FILE_OFFSET_BITS=64 -std=gnu99 -Wno-unused-parameter -g -fvisibility=hidden -Wmissing-prototypes -Wstrict-prototypes -O2 -fwrapv -Wformat -Werror=format-security -gdwarf-4 -fno-debug-types-section -fvar-tracking-assignments -g2 -Wp,-D_FORTIFY_SOURCE=2 -fstack-protector-strong --param=ssp-buffer-size=4 -fPIC -mtune=generic -march=x86-64 -gdwarf-4 -fno-debug-types-section -fvar-tracking-assignments -g2 -pthread -DLITEST_NO_MAIN -DLITEST_DISABLE_BACKTRACE_LOGGING -MD -MQ 'test-litest-selftest@exe/test_litest.c.o' -MF 'test-litest-selftest@exe/test_litest.c.o.d' -o 'test-litest-selftest@exe/test_litest.c.o' -c ../test/litest.c [134/178] x86_64-pld-linux-gnux32-gcc -Ilibinput-test-suite-runner@exe -I. -I.. -I../src -I../include -I/usr/include/libevdev-1.0/ -I/usr/include/libwacom-1.0 -I/usr/include/glib-2.0 -I/usr/libx32/glib-2.0/include -fdiagnostics-color=always -pipe -D_FILE_OFFSET_BITS=64 -std=gnu99 -Wno-unused-parameter -g -fvisibility=hidden -Wmissing-prototypes -Wstrict-prototypes -O2 -fwrapv -Wformat -Werror=format-security -gdwarf-4 -fno-debug-types-section -fvar-tracking-assignments -g2 -Wp,-D_FORTIFY_SOURCE=2 -fstack-protector-strong --param=ssp-buffer-size=4 -fPIC -mtune=generic -march=x86-64 -gdwarf-4 -fno-debug-types-section -fvar-tracking-assignments -g2 -pthread '-DLIBINPUT_LT_VERSION="23:0:13"' -MD -MQ 'libinput-test-suite-runner@exe/test_litest-device-wacom-cintiq-12wx-pen.c.o' -MF 'libinput-test-suite-runner@exe/test_litest-device-wacom-cintiq-12wx-pen.c.o.d' -o 'libinput-test-suite-runner@exe/test_litest-device-wacom-cintiq-12wx-pen.c.o' -c ../test/litest-device-wacom-cintiq-12wx-pen.c [135/178] x86_64-pld-linux-gnux32-gcc -Ilibinput-test-suite-runner@exe -I. -I.. -I../src -I../include -I/usr/include/libevdev-1.0/ -I/usr/include/libwacom-1.0 -I/usr/include/glib-2.0 -I/usr/libx32/glib-2.0/include -fdiagnostics-color=always -pipe -D_FILE_OFFSET_BITS=64 -std=gnu99 -Wno-unused-parameter -g -fvisibility=hidden -Wmissing-prototypes -Wstrict-prototypes -O2 -fwrapv -Wformat -Werror=format-security -gdwarf-4 -fno-debug-types-section -fvar-tracking-assignments -g2 -Wp,-D_FORTIFY_SOURCE=2 -fstack-protector-strong --param=ssp-buffer-size=4 -fPIC -mtune=generic -march=x86-64 -gdwarf-4 -fno-debug-types-section -fvar-tracking-assignments -g2 -pthread '-DLIBINPUT_LT_VERSION="23:0:13"' -MD -MQ 'libinput-test-suite-runner@exe/test_litest-device-wacom-bamboo-2fg-pen.c.o' -MF 'libinput-test-suite-runner@exe/test_litest-device-wacom-bamboo-2fg-pen.c.o.d' -o 'libinput-test-suite-runner@exe/test_litest-device-wacom-bamboo-2fg-pen.c.o' -c ../test/litest-device-wacom-bamboo-2fg-pen.c [136/178] x86_64-pld-linux-gnux32-gcc -Ilibinput-test-suite-runner@exe -I. -I.. -I../src -I../include -I/usr/include/libevdev-1.0/ -I/usr/include/libwacom-1.0 -I/usr/include/glib-2.0 -I/usr/libx32/glib-2.0/include -fdiagnostics-color=always -pipe -D_FILE_OFFSET_BITS=64 -std=gnu99 -Wno-unused-parameter -g -fvisibility=hidden -Wmissing-prototypes -Wstrict-prototypes -O2 -fwrapv -Wformat -Werror=format-security -gdwarf-4 -fno-debug-types-section -fvar-tracking-assignments -g2 -Wp,-D_FORTIFY_SOURCE=2 -fstack-protector-strong --param=ssp-buffer-size=4 -fPIC -mtune=generic -march=x86-64 -gdwarf-4 -fno-debug-types-section -fvar-tracking-assignments -g2 -pthread '-DLIBINPUT_LT_VERSION="23:0:13"' -MD -MQ 'libinput-test-suite-runner@exe/test_litest-device-wacom-bamboo-16fg-pen.c.o' -MF 'libinput-test-suite-runner@exe/test_litest-device-wacom-bamboo-16fg-pen.c.o.d' -o 'libinput-test-suite-runner@exe/test_litest-device-wacom-bamboo-16fg-pen.c.o' -c ../test/litest-device-wacom-bamboo-16fg-pen.c [137/178] x86_64-pld-linux-gnux32-gcc -Ilibinput-test-suite-runner@exe -I. -I.. -I../src -I../include -I/usr/include/libevdev-1.0/ -I/usr/include/libwacom-1.0 -I/usr/include/glib-2.0 -I/usr/libx32/glib-2.0/include -fdiagnostics-color=always -pipe -D_FILE_OFFSET_BITS=64 -std=gnu99 -Wno-unused-parameter -g -fvisibility=hidden -Wmissing-prototypes -Wstrict-prototypes -O2 -fwrapv -Wformat -Werror=format-security -gdwarf-4 -fno-debug-types-section -fvar-tracking-assignments -g2 -Wp,-D_FORTIFY_SOURCE=2 -fstack-protector-strong --param=ssp-buffer-size=4 -fPIC -mtune=generic -march=x86-64 -gdwarf-4 -fno-debug-types-section -fvar-tracking-assignments -g2 -pthread '-DLIBINPUT_LT_VERSION="23:0:13"' -MD -MQ 'libinput-test-suite-runner@exe/test_litest-device-wacom-cintiq-13hdt-pen.c.o' -MF 'libinput-test-suite-runner@exe/test_litest-device-wacom-cintiq-13hdt-pen.c.o.d' -o 'libinput-test-suite-runner@exe/test_litest-device-wacom-cintiq-13hdt-pen.c.o' -c ../test/litest-device-wacom-cintiq-13hdt-pen.c [138/178] x86_64-pld-linux-gnux32-gcc -Ilibinput-test-suite-runner@exe -I. -I.. -I../src -I../include -I/usr/include/libevdev-1.0/ -I/usr/include/libwacom-1.0 -I/usr/include/glib-2.0 -I/usr/libx32/glib-2.0/include -fdiagnostics-color=always -pipe -D_FILE_OFFSET_BITS=64 -std=gnu99 -Wno-unused-parameter -g -fvisibility=hidden -Wmissing-prototypes -Wstrict-prototypes -O2 -fwrapv -Wformat -Werror=format-security -gdwarf-4 -fno-debug-types-section -fvar-tracking-assignments -g2 -Wp,-D_FORTIFY_SOURCE=2 -fstack-protector-strong --param=ssp-buffer-size=4 -fPIC -mtune=generic -march=x86-64 -gdwarf-4 -fno-debug-types-section -fvar-tracking-assignments -g2 -pthread '-DLIBINPUT_LT_VERSION="23:0:13"' -MD -MQ 'libinput-test-suite-runner@exe/test_litest-device-wacom-cintiq-13hdt-finger.c.o' -MF 'libinput-test-suite-runner@exe/test_litest-device-wacom-cintiq-13hdt-finger.c.o.d' -o 'libinput-test-suite-runner@exe/test_litest-device-wacom-cintiq-13hdt-finger.c.o' -c ../test/litest-device-wacom-cintiq-13hdt-finger.c [139/178] x86_64-pld-linux-gnux32-gcc -Ilibinput-test-suite-runner@exe -I. -I.. -I../src -I../include -I/usr/include/libevdev-1.0/ -I/usr/include/libwacom-1.0 -I/usr/include/glib-2.0 -I/usr/libx32/glib-2.0/include -fdiagnostics-color=always -pipe -D_FILE_OFFSET_BITS=64 -std=gnu99 -Wno-unused-parameter -g -fvisibility=hidden -Wmissing-prototypes -Wstrict-prototypes -O2 -fwrapv -Wformat -Werror=format-security -gdwarf-4 -fno-debug-types-section -fvar-tracking-assignments -g2 -Wp,-D_FORTIFY_SOURCE=2 -fstack-protector-strong --param=ssp-buffer-size=4 -fPIC -mtune=generic -march=x86-64 -gdwarf-4 -fno-debug-types-section -fvar-tracking-assignments -g2 -pthread '-DLIBINPUT_LT_VERSION="23:0:13"' -MD -MQ 'libinput-test-suite-runner@exe/test_litest-device-wacom-cintiq-13hdt-pad.c.o' -MF 'libinput-test-suite-runner@exe/test_litest-device-wacom-cintiq-13hdt-pad.c.o.d' -o 'libinput-test-suite-runner@exe/test_litest-device-wacom-cintiq-13hdt-pad.c.o' -c ../test/litest-device-wacom-cintiq-13hdt-pad.c [140/178] x86_64-pld-linux-gnux32-gcc -o test-litest-selftest 'test-litest-selftest@exe/test_litest-selftest.c.o' 'test-litest-selftest@exe/test_litest.c.o' -Wl,--no-undefined -Wl,--as-needed -O2 -fwrapv -pipe -Wformat -Werror=format-security -gdwarf-4 -fno-debug-types-section -fvar-tracking-assignments -g2 -Wp,-D_FORTIFY_SOURCE=2 -fstack-protector-strong --param=ssp-buffer-size=4 -fPIC -mtune=generic -march=x86-64 -gdwarf-4 -fno-debug-types-section -fvar-tracking-assignments -g2 -Wl,--as-needed -Wl,--no-copy-dt-needed-entries -Wl,-z,relro -Wl,-z,combreloc -Wl,--start-group libinput.so.10.13.0 liblibinput-util.a libquirks.a /usr/libx32/libmtdev.so /libx32/libudev.so /usr/libx32/libevdev.so -lm -lrt /usr/libx32/libwacom.so /usr/libx32/libcheck.so -ldl -lm /libx32/libsystemd.so -Wl,--end-group '-Wl,-rpath,$ORIGIN/' -Wl,-rpath-link,/tmp/B.AoR4Oe/BUILD/libinput-1.12.0/build/ [141/178] x86_64-pld-linux-gnux32-gcc -Ilibinput-test-suite-runner@exe -I. -I.. -I../src -I../include -I/usr/include/libevdev-1.0/ -I/usr/include/libwacom-1.0 -I/usr/include/glib-2.0 -I/usr/libx32/glib-2.0/include -fdiagnostics-color=always -pipe -D_FILE_OFFSET_BITS=64 -std=gnu99 -Wno-unused-parameter -g -fvisibility=hidden -Wmissing-prototypes -Wstrict-prototypes -O2 -fwrapv -Wformat -Werror=format-security -gdwarf-4 -fno-debug-types-section -fvar-tracking-assignments -g2 -Wp,-D_FORTIFY_SOURCE=2 -fstack-protector-strong --param=ssp-buffer-size=4 -fPIC -mtune=generic -march=x86-64 -gdwarf-4 -fno-debug-types-section -fvar-tracking-assignments -g2 -pthread '-DLIBINPUT_LT_VERSION="23:0:13"' -MD -MQ 'libinput-test-suite-runner@exe/test_litest-device-wacom-cintiq-24hd-pen.c.o' -MF 'libinput-test-suite-runner@exe/test_litest-device-wacom-cintiq-24hd-pen.c.o.d' -o 'libinput-test-suite-runner@exe/test_litest-device-wacom-cintiq-24hd-pen.c.o' -c ../test/litest-device-wacom-cintiq-24hd-pen.c [142/178] x86_64-pld-linux-gnux32-gcc -Ilibinput-test-suite-runner@exe -I. -I.. -I../src -I../include -I/usr/include/libevdev-1.0/ -I/usr/include/libwacom-1.0 -I/usr/include/glib-2.0 -I/usr/libx32/glib-2.0/include -fdiagnostics-color=always -pipe -D_FILE_OFFSET_BITS=64 -std=gnu99 -Wno-unused-parameter -g -fvisibility=hidden -Wmissing-prototypes -Wstrict-prototypes -O2 -fwrapv -Wformat -Werror=format-security -gdwarf-4 -fno-debug-types-section -fvar-tracking-assignments -g2 -Wp,-D_FORTIFY_SOURCE=2 -fstack-protector-strong --param=ssp-buffer-size=4 -fPIC -mtune=generic -march=x86-64 -gdwarf-4 -fno-debug-types-section -fvar-tracking-assignments -g2 -pthread '-DLIBINPUT_LT_VERSION="23:0:13"' -MD -MQ 'libinput-test-suite-runner@exe/test_litest-device-wacom-ekr.c.o' -MF 'libinput-test-suite-runner@exe/test_litest-device-wacom-ekr.c.o.d' -o 'libinput-test-suite-runner@exe/test_litest-device-wacom-ekr.c.o' -c ../test/litest-device-wacom-ekr.c [143/178] x86_64-pld-linux-gnux32-gcc -Ilibinput-test-suite-runner@exe -I. -I.. -I../src -I../include -I/usr/include/libevdev-1.0/ -I/usr/include/libwacom-1.0 -I/usr/include/glib-2.0 -I/usr/libx32/glib-2.0/include -fdiagnostics-color=always -pipe -D_FILE_OFFSET_BITS=64 -std=gnu99 -Wno-unused-parameter -g -fvisibility=hidden -Wmissing-prototypes -Wstrict-prototypes -O2 -fwrapv -Wformat -Werror=format-security -gdwarf-4 -fno-debug-types-section -fvar-tracking-assignments -g2 -Wp,-D_FORTIFY_SOURCE=2 -fstack-protector-strong --param=ssp-buffer-size=4 -fPIC -mtune=generic -march=x86-64 -gdwarf-4 -fno-debug-types-section -fvar-tracking-assignments -g2 -pthread '-DLIBINPUT_LT_VERSION="23:0:13"' -MD -MQ 'libinput-test-suite-runner@exe/test_litest-device-wacom-hid4800-pen.c.o' -MF 'libinput-test-suite-runner@exe/test_litest-device-wacom-hid4800-pen.c.o.d' -o 'libinput-test-suite-runner@exe/test_litest-device-wacom-hid4800-pen.c.o' -c ../test/litest-device-wacom-hid4800-pen.c [144/178] x86_64-pld-linux-gnux32-gcc -Ilibinput-test-suite-runner@exe -I. -I.. -I../src -I../include -I/usr/include/libevdev-1.0/ -I/usr/include/libwacom-1.0 -I/usr/include/glib-2.0 -I/usr/libx32/glib-2.0/include -fdiagnostics-color=always -pipe -D_FILE_OFFSET_BITS=64 -std=gnu99 -Wno-unused-parameter -g -fvisibility=hidden -Wmissing-prototypes -Wstrict-prototypes -O2 -fwrapv -Wformat -Werror=format-security -gdwarf-4 -fno-debug-types-section -fvar-tracking-assignments -g2 -Wp,-D_FORTIFY_SOURCE=2 -fstack-protector-strong --param=ssp-buffer-size=4 -fPIC -mtune=generic -march=x86-64 -gdwarf-4 -fno-debug-types-section -fvar-tracking-assignments -g2 -pthread '-DLIBINPUT_LT_VERSION="23:0:13"' -MD -MQ 'libinput-test-suite-runner@exe/test_litest-device-wacom-intuos3-pad.c.o' -MF 'libinput-test-suite-runner@exe/test_litest-device-wacom-intuos3-pad.c.o.d' -o 'libinput-test-suite-runner@exe/test_litest-device-wacom-intuos3-pad.c.o' -c ../test/litest-device-wacom-intuos3-pad.c [145/178] x86_64-pld-linux-gnux32-gcc -Ilibinput-test-suite-runner@exe -I. -I.. -I../src -I../include -I/usr/include/libevdev-1.0/ -I/usr/include/libwacom-1.0 -I/usr/include/glib-2.0 -I/usr/libx32/glib-2.0/include -fdiagnostics-color=always -pipe -D_FILE_OFFSET_BITS=64 -std=gnu99 -Wno-unused-parameter -g -fvisibility=hidden -Wmissing-prototypes -Wstrict-prototypes -O2 -fwrapv -Wformat -Werror=format-security -gdwarf-4 -fno-debug-types-section -fvar-tracking-assignments -g2 -Wp,-D_FORTIFY_SOURCE=2 -fstack-protector-strong --param=ssp-buffer-size=4 -fPIC -mtune=generic -march=x86-64 -gdwarf-4 -fno-debug-types-section -fvar-tracking-assignments -g2 -pthread '-DLIBINPUT_LT_VERSION="23:0:13"' -MD -MQ 'libinput-test-suite-runner@exe/test_litest-device-wacom-cintiq-24hdt-pad.c.o' -MF 'libinput-test-suite-runner@exe/test_litest-device-wacom-cintiq-24hdt-pad.c.o.d' -o 'libinput-test-suite-runner@exe/test_litest-device-wacom-cintiq-24hdt-pad.c.o' -c ../test/litest-device-wacom-cintiq-24hdt-pad.c [146/178] x86_64-pld-linux-gnux32-gcc -Ilibinput-test-suite-runner@exe -I. -I.. -I../src -I../include -I/usr/include/libevdev-1.0/ -I/usr/include/libwacom-1.0 -I/usr/include/glib-2.0 -I/usr/libx32/glib-2.0/include -fdiagnostics-color=always -pipe -D_FILE_OFFSET_BITS=64 -std=gnu99 -Wno-unused-parameter -g -fvisibility=hidden -Wmissing-prototypes -Wstrict-prototypes -O2 -fwrapv -Wformat -Werror=format-security -gdwarf-4 -fno-debug-types-section -fvar-tracking-assignments -g2 -Wp,-D_FORTIFY_SOURCE=2 -fstack-protector-strong --param=ssp-buffer-size=4 -fPIC -mtune=generic -march=x86-64 -gdwarf-4 -fno-debug-types-section -fvar-tracking-assignments -g2 -pthread '-DLIBINPUT_LT_VERSION="23:0:13"' -MD -MQ 'libinput-test-suite-runner@exe/test_litest-device-wacom-intuos5-finger.c.o' -MF 'libinput-test-suite-runner@exe/test_litest-device-wacom-intuos5-finger.c.o.d' -o 'libinput-test-suite-runner@exe/test_litest-device-wacom-intuos5-finger.c.o' -c ../test/litest-device-wacom-intuos5-finger.c [147/178] x86_64-pld-linux-gnux32-gcc -Ilibinput-test-suite-runner@exe -I. -I.. -I../src -I../include -I/usr/include/libevdev-1.0/ -I/usr/include/libwacom-1.0 -I/usr/include/glib-2.0 -I/usr/libx32/glib-2.0/include -fdiagnostics-color=always -pipe -D_FILE_OFFSET_BITS=64 -std=gnu99 -Wno-unused-parameter -g -fvisibility=hidden -Wmissing-prototypes -Wstrict-prototypes -O2 -fwrapv -Wformat -Werror=format-security -gdwarf-4 -fno-debug-types-section -fvar-tracking-assignments -g2 -Wp,-D_FORTIFY_SOURCE=2 -fstack-protector-strong --param=ssp-buffer-size=4 -fPIC -mtune=generic -march=x86-64 -gdwarf-4 -fno-debug-types-section -fvar-tracking-assignments -g2 -pthread '-DLIBINPUT_LT_VERSION="23:0:13"' -MD -MQ 'libinput-test-suite-runner@exe/test_litest-device-wacom-intuos5-pad.c.o' -MF 'libinput-test-suite-runner@exe/test_litest-device-wacom-intuos5-pad.c.o.d' -o 'libinput-test-suite-runner@exe/test_litest-device-wacom-intuos5-pad.c.o' -c ../test/litest-device-wacom-intuos5-pad.c [148/178] x86_64-pld-linux-gnux32-gcc -Ilibinput-test-suite-runner@exe -I. -I.. -I../src -I../include -I/usr/include/libevdev-1.0/ -I/usr/include/libwacom-1.0 -I/usr/include/glib-2.0 -I/usr/libx32/glib-2.0/include -fdiagnostics-color=always -pipe -D_FILE_OFFSET_BITS=64 -std=gnu99 -Wno-unused-parameter -g -fvisibility=hidden -Wmissing-prototypes -Wstrict-prototypes -O2 -fwrapv -Wformat -Werror=format-security -gdwarf-4 -fno-debug-types-section -fvar-tracking-assignments -g2 -Wp,-D_FORTIFY_SOURCE=2 -fstack-protector-strong --param=ssp-buffer-size=4 -fPIC -mtune=generic -march=x86-64 -gdwarf-4 -fno-debug-types-section -fvar-tracking-assignments -g2 -pthread '-DLIBINPUT_LT_VERSION="23:0:13"' -MD -MQ 'libinput-test-suite-runner@exe/test_litest-device-wacom-isdv4-e6-pen.c.o' -MF 'libinput-test-suite-runner@exe/test_litest-device-wacom-isdv4-e6-pen.c.o.d' -o 'libinput-test-suite-runner@exe/test_litest-device-wacom-isdv4-e6-pen.c.o' -c ../test/litest-device-wacom-isdv4-e6-pen.c [149/178] x86_64-pld-linux-gnux32-gcc -Ilibinput-test-suite-runner@exe -I. -I.. -I../src -I../include -I/usr/include/libevdev-1.0/ -I/usr/include/libwacom-1.0 -I/usr/include/glib-2.0 -I/usr/libx32/glib-2.0/include -fdiagnostics-color=always -pipe -D_FILE_OFFSET_BITS=64 -std=gnu99 -Wno-unused-parameter -g -fvisibility=hidden -Wmissing-prototypes -Wstrict-prototypes -O2 -fwrapv -Wformat -Werror=format-security -gdwarf-4 -fno-debug-types-section -fvar-tracking-assignments -g2 -Wp,-D_FORTIFY_SOURCE=2 -fstack-protector-strong --param=ssp-buffer-size=4 -fPIC -mtune=generic -march=x86-64 -gdwarf-4 -fno-debug-types-section -fvar-tracking-assignments -g2 -pthread '-DLIBINPUT_LT_VERSION="23:0:13"' -MD -MQ 'libinput-test-suite-runner@exe/test_litest-device-wheel-only.c.o' -MF 'libinput-test-suite-runner@exe/test_litest-device-wheel-only.c.o.d' -o 'libinput-test-suite-runner@exe/test_litest-device-wheel-only.c.o' -c ../test/litest-device-wheel-only.c [150/178] x86_64-pld-linux-gnux32-gcc -Ilibinput-test-suite-runner@exe -I. -I.. -I../src -I../include -I/usr/include/libevdev-1.0/ -I/usr/include/libwacom-1.0 -I/usr/include/glib-2.0 -I/usr/libx32/glib-2.0/include -fdiagnostics-color=always -pipe -D_FILE_OFFSET_BITS=64 -std=gnu99 -Wno-unused-parameter -g -fvisibility=hidden -Wmissing-prototypes -Wstrict-prototypes -O2 -fwrapv -Wformat -Werror=format-security -gdwarf-4 -fno-debug-types-section -fvar-tracking-assignments -g2 -Wp,-D_FORTIFY_SOURCE=2 -fstack-protector-strong --param=ssp-buffer-size=4 -fPIC -mtune=generic -march=x86-64 -gdwarf-4 -fno-debug-types-section -fvar-tracking-assignments -g2 -pthread '-DLIBINPUT_LT_VERSION="23:0:13"' -MD -MQ 'libinput-test-suite-runner@exe/test_litest-device-wacom-intuos5-pen.c.o' -MF 'libinput-test-suite-runner@exe/test_litest-device-wacom-intuos5-pen.c.o.d' -o 'libinput-test-suite-runner@exe/test_litest-device-wacom-intuos5-pen.c.o' -c ../test/litest-device-wacom-intuos5-pen.c [151/178] x86_64-pld-linux-gnux32-gcc -Ilibinput-test-suite-runner@exe -I. -I.. -I../src -I../include -I/usr/include/libevdev-1.0/ -I/usr/include/libwacom-1.0 -I/usr/include/glib-2.0 -I/usr/libx32/glib-2.0/include -fdiagnostics-color=always -pipe -D_FILE_OFFSET_BITS=64 -std=gnu99 -Wno-unused-parameter -g -fvisibility=hidden -Wmissing-prototypes -Wstrict-prototypes -O2 -fwrapv -Wformat -Werror=format-security -gdwarf-4 -fno-debug-types-section -fvar-tracking-assignments -g2 -Wp,-D_FORTIFY_SOURCE=2 -fstack-protector-strong --param=ssp-buffer-size=4 -fPIC -mtune=generic -march=x86-64 -gdwarf-4 -fno-debug-types-section -fvar-tracking-assignments -g2 -pthread '-DLIBINPUT_LT_VERSION="23:0:13"' -MD -MQ 'libinput-test-suite-runner@exe/test_litest-device-wacom-isdv4-e6-finger.c.o' -MF 'libinput-test-suite-runner@exe/test_litest-device-wacom-isdv4-e6-finger.c.o.d' -o 'libinput-test-suite-runner@exe/test_litest-device-wacom-isdv4-e6-finger.c.o' -c ../test/litest-device-wacom-isdv4-e6-finger.c [152/178] x86_64-pld-linux-gnux32-gcc -Ilibinput-test-suite-runner@exe -I. -I.. -I../src -I../include -I/usr/include/libevdev-1.0/ -I/usr/include/libwacom-1.0 -I/usr/include/glib-2.0 -I/usr/libx32/glib-2.0/include -fdiagnostics-color=always -pipe -D_FILE_OFFSET_BITS=64 -std=gnu99 -Wno-unused-parameter -g -fvisibility=hidden -Wmissing-prototypes -Wstrict-prototypes -O2 -fwrapv -Wformat -Werror=format-security -gdwarf-4 -fno-debug-types-section -fvar-tracking-assignments -g2 -Wp,-D_FORTIFY_SOURCE=2 -fstack-protector-strong --param=ssp-buffer-size=4 -fPIC -mtune=generic -march=x86-64 -gdwarf-4 -fno-debug-types-section -fvar-tracking-assignments -g2 -pthread '-DLIBINPUT_LT_VERSION="23:0:13"' -MD -MQ 'libinput-test-suite-runner@exe/test_litest-device-wacom-mobilestudio-pro-pad.c.o' -MF 'libinput-test-suite-runner@exe/test_litest-device-wacom-mobilestudio-pro-pad.c.o.d' -o 'libinput-test-suite-runner@exe/test_litest-device-wacom-mobilestudio-pro-pad.c.o' -c ../test/litest-device-wacom-mobilestudio-pro-pad.c [153/178] x86_64-pld-linux-gnux32-gcc -Ilibinput-test-suite-runner@exe -I. -I.. -I../src -I../include -I/usr/include/libevdev-1.0/ -I/usr/include/libwacom-1.0 -I/usr/include/glib-2.0 -I/usr/libx32/glib-2.0/include -fdiagnostics-color=always -pipe -D_FILE_OFFSET_BITS=64 -std=gnu99 -Wno-unused-parameter -g -fvisibility=hidden -Wmissing-prototypes -Wstrict-prototypes -O2 -fwrapv -Wformat -Werror=format-security -gdwarf-4 -fno-debug-types-section -fvar-tracking-assignments -g2 -Wp,-D_FORTIFY_SOURCE=2 -fstack-protector-strong --param=ssp-buffer-size=4 -fPIC -mtune=generic -march=x86-64 -gdwarf-4 -fno-debug-types-section -fvar-tracking-assignments -g2 -pthread '-DLIBINPUT_LT_VERSION="23:0:13"' -MD -MQ 'libinput-test-suite-runner@exe/test_litest-device-waltop-tablet.c.o' -MF 'libinput-test-suite-runner@exe/test_litest-device-waltop-tablet.c.o.d' -o 'libinput-test-suite-runner@exe/test_litest-device-waltop-tablet.c.o' -c ../test/litest-device-waltop-tablet.c [154/178] x86_64-pld-linux-gnux32-gcc -Ilibinput-test-suite-runner@exe -I. -I.. -I../src -I../include -I/usr/include/libevdev-1.0/ -I/usr/include/libwacom-1.0 -I/usr/include/glib-2.0 -I/usr/libx32/glib-2.0/include -fdiagnostics-color=always -pipe -D_FILE_OFFSET_BITS=64 -std=gnu99 -Wno-unused-parameter -g -fvisibility=hidden -Wmissing-prototypes -Wstrict-prototypes -O2 -fwrapv -Wformat -Werror=format-security -gdwarf-4 -fno-debug-types-section -fvar-tracking-assignments -g2 -Wp,-D_FORTIFY_SOURCE=2 -fstack-protector-strong --param=ssp-buffer-size=4 -fPIC -mtune=generic -march=x86-64 -gdwarf-4 -fno-debug-types-section -fvar-tracking-assignments -g2 -pthread '-DLIBINPUT_LT_VERSION="23:0:13"' -MD -MQ 'libinput-test-suite-runner@exe/test_litest-device-yubikey.c.o' -MF 'libinput-test-suite-runner@exe/test_litest-device-yubikey.c.o.d' -o 'libinput-test-suite-runner@exe/test_litest-device-yubikey.c.o' -c ../test/litest-device-yubikey.c [155/178] x86_64-pld-linux-gnux32-gcc -Ilibinput-test-suite-runner@exe -I. -I.. -I../src -I../include -I/usr/include/libevdev-1.0/ -I/usr/include/libwacom-1.0 -I/usr/include/glib-2.0 -I/usr/libx32/glib-2.0/include -fdiagnostics-color=always -pipe -D_FILE_OFFSET_BITS=64 -std=gnu99 -Wno-unused-parameter -g -fvisibility=hidden -Wmissing-prototypes -Wstrict-prototypes -O2 -fwrapv -Wformat -Werror=format-security -gdwarf-4 -fno-debug-types-section -fvar-tracking-assignments -g2 -Wp,-D_FORTIFY_SOURCE=2 -fstack-protector-strong --param=ssp-buffer-size=4 -fPIC -mtune=generic -march=x86-64 -gdwarf-4 -fno-debug-types-section -fvar-tracking-assignments -g2 -pthread '-DLIBINPUT_LT_VERSION="23:0:13"' -MD -MQ 'libinput-test-suite-runner@exe/test_litest-device-xen-virtual-pointer.c.o' -MF 'libinput-test-suite-runner@exe/test_litest-device-xen-virtual-pointer.c.o.d' -o 'libinput-test-suite-runner@exe/test_litest-device-xen-virtual-pointer.c.o' -c ../test/litest-device-xen-virtual-pointer.c [156/178] x86_64-pld-linux-gnux32-gcc -Ilibinput-test-suite-runner@exe -I. -I.. -I../src -I../include -I/usr/include/libevdev-1.0/ -I/usr/include/libwacom-1.0 -I/usr/include/glib-2.0 -I/usr/libx32/glib-2.0/include -fdiagnostics-color=always -pipe -D_FILE_OFFSET_BITS=64 -std=gnu99 -Wno-unused-parameter -g -fvisibility=hidden -Wmissing-prototypes -Wstrict-prototypes -O2 -fwrapv -Wformat -Werror=format-security -gdwarf-4 -fno-debug-types-section -fvar-tracking-assignments -g2 -Wp,-D_FORTIFY_SOURCE=2 -fstack-protector-strong --param=ssp-buffer-size=4 -fPIC -mtune=generic -march=x86-64 -gdwarf-4 -fno-debug-types-section -fvar-tracking-assignments -g2 -pthread '-DLIBINPUT_LT_VERSION="23:0:13"' -MD -MQ 'libinput-test-suite-runner@exe/test_litest-device-vmware-virtual-usb-mouse.c.o' -MF 'libinput-test-suite-runner@exe/test_litest-device-vmware-virtual-usb-mouse.c.o.d' -o 'libinput-test-suite-runner@exe/test_litest-device-vmware-virtual-usb-mouse.c.o' -c ../test/litest-device-vmware-virtual-usb-mouse.c [157/178] x86_64-pld-linux-gnux32-gcc -Ilibinput-test-suite-runner@exe -I. -I.. -I../src -I../include -I/usr/include/libevdev-1.0/ -I/usr/include/libwacom-1.0 -I/usr/include/glib-2.0 -I/usr/libx32/glib-2.0/include -fdiagnostics-color=always -pipe -D_FILE_OFFSET_BITS=64 -std=gnu99 -Wno-unused-parameter -g -fvisibility=hidden -Wmissing-prototypes -Wstrict-prototypes -O2 -fwrapv -Wformat -Werror=format-security -gdwarf-4 -fno-debug-types-section -fvar-tracking-assignments -g2 -Wp,-D_FORTIFY_SOURCE=2 -fstack-protector-strong --param=ssp-buffer-size=4 -fPIC -mtune=generic -march=x86-64 -gdwarf-4 -fno-debug-types-section -fvar-tracking-assignments -g2 -pthread '-DLIBINPUT_LT_VERSION="23:0:13"' -MD -MQ 'libinput-test-suite-runner@exe/test_test-log.c.o' -MF 'libinput-test-suite-runner@exe/test_test-log.c.o.d' -o 'libinput-test-suite-runner@exe/test_test-log.c.o' -c ../test/test-log.c [158/178] x86_64-pld-linux-gnux32-gcc -Ilibinput-test-suite-runner@exe -I. -I.. -I../src -I../include -I/usr/include/libevdev-1.0/ -I/usr/include/libwacom-1.0 -I/usr/include/glib-2.0 -I/usr/libx32/glib-2.0/include -fdiagnostics-color=always -pipe -D_FILE_OFFSET_BITS=64 -std=gnu99 -Wno-unused-parameter -g -fvisibility=hidden -Wmissing-prototypes -Wstrict-prototypes -O2 -fwrapv -Wformat -Werror=format-security -gdwarf-4 -fno-debug-types-section -fvar-tracking-assignments -g2 -Wp,-D_FORTIFY_SOURCE=2 -fstack-protector-strong --param=ssp-buffer-size=4 -fPIC -mtune=generic -march=x86-64 -gdwarf-4 -fno-debug-types-section -fvar-tracking-assignments -g2 -pthread '-DLIBINPUT_LT_VERSION="23:0:13"' -MD -MQ 'libinput-test-suite-runner@exe/src_libinput-util.c.o' -MF 'libinput-test-suite-runner@exe/src_libinput-util.c.o.d' -o 'libinput-test-suite-runner@exe/src_libinput-util.c.o' -c ../src/libinput-util.c [159/178] x86_64-pld-linux-gnux32-gcc -Ilibinput-test-suite-runner@exe -I. -I.. -I../src -I../include -I/usr/include/libevdev-1.0/ -I/usr/include/libwacom-1.0 -I/usr/include/glib-2.0 -I/usr/libx32/glib-2.0/include -fdiagnostics-color=always -pipe -D_FILE_OFFSET_BITS=64 -std=gnu99 -Wno-unused-parameter -g -fvisibility=hidden -Wmissing-prototypes -Wstrict-prototypes -O2 -fwrapv -Wformat -Werror=format-security -gdwarf-4 -fno-debug-types-section -fvar-tracking-assignments -g2 -Wp,-D_FORTIFY_SOURCE=2 -fstack-protector-strong --param=ssp-buffer-size=4 -fPIC -mtune=generic -march=x86-64 -gdwarf-4 -fno-debug-types-section -fvar-tracking-assignments -g2 -pthread '-DLIBINPUT_LT_VERSION="23:0:13"' -MD -MQ 'libinput-test-suite-runner@exe/test_test-udev.c.o' -MF 'libinput-test-suite-runner@exe/test_test-udev.c.o.d' -o 'libinput-test-suite-runner@exe/test_test-udev.c.o' -c ../test/test-udev.c [160/178] x86_64-pld-linux-gnux32-gcc -Ilibinput-test-suite-runner@exe -I. -I.. -I../src -I../include -I/usr/include/libevdev-1.0/ -I/usr/include/libwacom-1.0 -I/usr/include/glib-2.0 -I/usr/libx32/glib-2.0/include -fdiagnostics-color=always -pipe -D_FILE_OFFSET_BITS=64 -std=gnu99 -Wno-unused-parameter -g -fvisibility=hidden -Wmissing-prototypes -Wstrict-prototypes -O2 -fwrapv -Wformat -Werror=format-security -gdwarf-4 -fno-debug-types-section -fvar-tracking-assignments -g2 -Wp,-D_FORTIFY_SOURCE=2 -fstack-protector-strong --param=ssp-buffer-size=4 -fPIC -mtune=generic -march=x86-64 -gdwarf-4 -fno-debug-types-section -fvar-tracking-assignments -g2 -pthread '-DLIBINPUT_LT_VERSION="23:0:13"' -MD -MQ 'libinput-test-suite-runner@exe/test_test-path.c.o' -MF 'libinput-test-suite-runner@exe/test_test-path.c.o.d' -o 'libinput-test-suite-runner@exe/test_test-path.c.o' -c ../test/test-path.c ../test/test-path.c: In function ‘path_ignore_device’: ../test/test-path.c:973:2: warning: initialization discards ‘const’ qualifier from pointer target type [-Wdiscarded-qualifiers] ck_assert_notnull(path); ^~~~~~~~~~~~~~~~~ [161/178] x86_64-pld-linux-gnux32-gcc -Ilibinput-test-suite-runner@exe -I. -I.. -I../src -I../include -I/usr/include/libevdev-1.0/ -I/usr/include/libwacom-1.0 -I/usr/include/glib-2.0 -I/usr/libx32/glib-2.0/include -fdiagnostics-color=always -pipe -D_FILE_OFFSET_BITS=64 -std=gnu99 -Wno-unused-parameter -g -fvisibility=hidden -Wmissing-prototypes -Wstrict-prototypes -O2 -fwrapv -Wformat -Werror=format-security -gdwarf-4 -fno-debug-types-section -fvar-tracking-assignments -g2 -Wp,-D_FORTIFY_SOURCE=2 -fstack-protector-strong --param=ssp-buffer-size=4 -fPIC -mtune=generic -march=x86-64 -gdwarf-4 -fno-debug-types-section -fvar-tracking-assignments -g2 -pthread '-DLIBINPUT_LT_VERSION="23:0:13"' -MD -MQ 'libinput-test-suite-runner@exe/test_test-pad.c.o' -MF 'libinput-test-suite-runner@exe/test_test-pad.c.o.d' -o 'libinput-test-suite-runner@exe/test_test-pad.c.o' -c ../test/test-pad.c [162/178] x86_64-pld-linux-gnux32-gcc -Ilibinput-test-suite-runner@exe -I. -I.. -I../src -I../include -I/usr/include/libevdev-1.0/ -I/usr/include/libwacom-1.0 -I/usr/include/glib-2.0 -I/usr/libx32/glib-2.0/include -fdiagnostics-color=always -pipe -D_FILE_OFFSET_BITS=64 -std=gnu99 -Wno-unused-parameter -g -fvisibility=hidden -Wmissing-prototypes -Wstrict-prototypes -O2 -fwrapv -Wformat -Werror=format-security -gdwarf-4 -fno-debug-types-section -fvar-tracking-assignments -g2 -Wp,-D_FORTIFY_SOURCE=2 -fstack-protector-strong --param=ssp-buffer-size=4 -fPIC -mtune=generic -march=x86-64 -gdwarf-4 -fno-debug-types-section -fvar-tracking-assignments -g2 -pthread '-DLIBINPUT_LT_VERSION="23:0:13"' -MD -MQ 'libinput-test-suite-runner@exe/test_test-touch.c.o' -MF 'libinput-test-suite-runner@exe/test_test-touch.c.o.d' -o 'libinput-test-suite-runner@exe/test_test-touch.c.o' -c ../test/test-touch.c ../test/test-touch.c: In function ‘touch_fuzz_property’: ../test/test-touch.c:926:2: warning: initialization discards ‘const’ qualifier from pointer target type [-Wdiscarded-qualifiers] ck_assert_notnull(prop); ^~~~~~~~~~~~~~~~~ ../test/test-touch.c:931:2: warning: initialization discards ‘const’ qualifier from pointer target type [-Wdiscarded-qualifiers] ck_assert_notnull(prop); ^~~~~~~~~~~~~~~~~ [163/178] x86_64-pld-linux-gnux32-gcc -Ilibinput-test-suite-runner@exe -I. -I.. -I../src -I../include -I/usr/include/libevdev-1.0/ -I/usr/include/libwacom-1.0 -I/usr/include/glib-2.0 -I/usr/libx32/glib-2.0/include -fdiagnostics-color=always -pipe -D_FILE_OFFSET_BITS=64 -std=gnu99 -Wno-unused-parameter -g -fvisibility=hidden -Wmissing-prototypes -Wstrict-prototypes -O2 -fwrapv -Wformat -Werror=format-security -gdwarf-4 -fno-debug-types-section -fvar-tracking-assignments -g2 -Wp,-D_FORTIFY_SOURCE=2 -fstack-protector-strong --param=ssp-buffer-size=4 -fPIC -mtune=generic -march=x86-64 -gdwarf-4 -fno-debug-types-section -fvar-tracking-assignments -g2 -pthread '-DLIBINPUT_LT_VERSION="23:0:13"' -MD -MQ 'libinput-test-suite-runner@exe/test_test-trackpoint.c.o' -MF 'libinput-test-suite-runner@exe/test_test-trackpoint.c.o.d' -o 'libinput-test-suite-runner@exe/test_test-trackpoint.c.o' -c ../test/test-trackpoint.c [164/178] x86_64-pld-linux-gnux32-gcc -Ilibinput-test-suite-runner@exe -I. -I.. -I../src -I../include -I/usr/include/libevdev-1.0/ -I/usr/include/libwacom-1.0 -I/usr/include/glib-2.0 -I/usr/libx32/glib-2.0/include -fdiagnostics-color=always -pipe -D_FILE_OFFSET_BITS=64 -std=gnu99 -Wno-unused-parameter -g -fvisibility=hidden -Wmissing-prototypes -Wstrict-prototypes -O2 -fwrapv -Wformat -Werror=format-security -gdwarf-4 -fno-debug-types-section -fvar-tracking-assignments -g2 -Wp,-D_FORTIFY_SOURCE=2 -fstack-protector-strong --param=ssp-buffer-size=4 -fPIC -mtune=generic -march=x86-64 -gdwarf-4 -fno-debug-types-section -fvar-tracking-assignments -g2 -pthread '-DLIBINPUT_LT_VERSION="23:0:13"' -MD -MQ 'libinput-test-suite-runner@exe/test_test-trackball.c.o' -MF 'libinput-test-suite-runner@exe/test_test-trackball.c.o.d' -o 'libinput-test-suite-runner@exe/test_test-trackball.c.o' -c ../test/test-trackball.c [165/178] x86_64-pld-linux-gnux32-gcc -Ilibinput-test-suite-runner@exe -I. -I.. -I../src -I../include -I/usr/include/libevdev-1.0/ -I/usr/include/libwacom-1.0 -I/usr/include/glib-2.0 -I/usr/libx32/glib-2.0/include -fdiagnostics-color=always -pipe -D_FILE_OFFSET_BITS=64 -std=gnu99 -Wno-unused-parameter -g -fvisibility=hidden -Wmissing-prototypes -Wstrict-prototypes -O2 -fwrapv -Wformat -Werror=format-security -gdwarf-4 -fno-debug-types-section -fvar-tracking-assignments -g2 -Wp,-D_FORTIFY_SOURCE=2 -fstack-protector-strong --param=ssp-buffer-size=4 -fPIC -mtune=generic -march=x86-64 -gdwarf-4 -fno-debug-types-section -fvar-tracking-assignments -g2 -pthread '-DLIBINPUT_LT_VERSION="23:0:13"' -MD -MQ 'libinput-test-suite-runner@exe/test_test-pointer.c.o' -MF 'libinput-test-suite-runner@exe/test_test-pointer.c.o.d' -o 'libinput-test-suite-runner@exe/test_test-pointer.c.o' -c ../test/test-pointer.c [166/178] x86_64-pld-linux-gnux32-gcc -Ilibinput-test-suite-runner@exe -I. -I.. -I../src -I../include -I/usr/include/libevdev-1.0/ -I/usr/include/libwacom-1.0 -I/usr/include/glib-2.0 -I/usr/libx32/glib-2.0/include -fdiagnostics-color=always -pipe -D_FILE_OFFSET_BITS=64 -std=gnu99 -Wno-unused-parameter -g -fvisibility=hidden -Wmissing-prototypes -Wstrict-prototypes -O2 -fwrapv -Wformat -Werror=format-security -gdwarf-4 -fno-debug-types-section -fvar-tracking-assignments -g2 -Wp,-D_FORTIFY_SOURCE=2 -fstack-protector-strong --param=ssp-buffer-size=4 -fPIC -mtune=generic -march=x86-64 -gdwarf-4 -fno-debug-types-section -fvar-tracking-assignments -g2 -pthread '-DLIBINPUT_LT_VERSION="23:0:13"' -MD -MQ 'libinput-test-suite-runner@exe/test_test-keyboard.c.o' -MF 'libinput-test-suite-runner@exe/test_test-keyboard.c.o.d' -o 'libinput-test-suite-runner@exe/test_test-keyboard.c.o' -c ../test/test-keyboard.c [167/178] x86_64-pld-linux-gnux32-gcc -Ilibinput-test-suite-runner@exe -I. -I.. -I../src -I../include -I/usr/include/libevdev-1.0/ -I/usr/include/libwacom-1.0 -I/usr/include/glib-2.0 -I/usr/libx32/glib-2.0/include -fdiagnostics-color=always -pipe -D_FILE_OFFSET_BITS=64 -std=gnu99 -Wno-unused-parameter -g -fvisibility=hidden -Wmissing-prototypes -Wstrict-prototypes -O2 -fwrapv -Wformat -Werror=format-security -gdwarf-4 -fno-debug-types-section -fvar-tracking-assignments -g2 -Wp,-D_FORTIFY_SOURCE=2 -fstack-protector-strong --param=ssp-buffer-size=4 -fPIC -mtune=generic -march=x86-64 -gdwarf-4 -fno-debug-types-section -fvar-tracking-assignments -g2 -pthread '-DLIBINPUT_LT_VERSION="23:0:13"' -MD -MQ 'libinput-test-suite-runner@exe/test_test-touchpad-buttons.c.o' -MF 'libinput-test-suite-runner@exe/test_test-touchpad-buttons.c.o.d' -o 'libinput-test-suite-runner@exe/test_test-touchpad-buttons.c.o' -c ../test/test-touchpad-buttons.c ../test/test-touchpad-buttons.c: In function ‘clickpad_finger_pin’: ../test/test-touchpad-buttons.c:1025:2: warning: initialization discards ‘const’ qualifier from pointer target type [-Wdiscarded-qualifiers] ck_assert_notnull(abs); ^~~~~~~~~~~~~~~~~ [168/178] x86_64-pld-linux-gnux32-gcc -Ilibinput-test-suite-runner@exe -I. -I.. -I../src -I../include -I/usr/include/libevdev-1.0/ -I/usr/include/libwacom-1.0 -I/usr/include/glib-2.0 -I/usr/libx32/glib-2.0/include -fdiagnostics-color=always -pipe -D_FILE_OFFSET_BITS=64 -std=gnu99 -Wno-unused-parameter -g -fvisibility=hidden -Wmissing-prototypes -Wstrict-prototypes -O2 -fwrapv -Wformat -Werror=format-security -gdwarf-4 -fno-debug-types-section -fvar-tracking-assignments -g2 -Wp,-D_FORTIFY_SOURCE=2 -fstack-protector-strong --param=ssp-buffer-size=4 -fPIC -mtune=generic -march=x86-64 -gdwarf-4 -fno-debug-types-section -fvar-tracking-assignments -g2 -pthread '-DLIBINPUT_LT_VERSION="23:0:13"' -MD -MQ 'libinput-test-suite-runner@exe/test_test-gestures.c.o' -MF 'libinput-test-suite-runner@exe/test_test-gestures.c.o.d' -o 'libinput-test-suite-runner@exe/test_test-gestures.c.o' -c ../test/test-gestures.c [169/178] x86_64-pld-linux-gnux32-gcc -Ilibinput-test-suite-runner@exe -I. -I.. -I../src -I../include -I/usr/include/libevdev-1.0/ -I/usr/include/libwacom-1.0 -I/usr/include/glib-2.0 -I/usr/libx32/glib-2.0/include -fdiagnostics-color=always -pipe -D_FILE_OFFSET_BITS=64 -std=gnu99 -Wno-unused-parameter -g -fvisibility=hidden -Wmissing-prototypes -Wstrict-prototypes -O2 -fwrapv -Wformat -Werror=format-security -gdwarf-4 -fno-debug-types-section -fvar-tracking-assignments -g2 -Wp,-D_FORTIFY_SOURCE=2 -fstack-protector-strong --param=ssp-buffer-size=4 -fPIC -mtune=generic -march=x86-64 -gdwarf-4 -fno-debug-types-section -fvar-tracking-assignments -g2 -pthread '-DLIBINPUT_LT_VERSION="23:0:13"' -MD -MQ 'libinput-test-suite-runner@exe/test_test-device.c.o' -MF 'libinput-test-suite-runner@exe/test_test-device.c.o.d' -o 'libinput-test-suite-runner@exe/test_test-device.c.o' -c ../test/test-device.c ../test/test-device.c: In function ‘device_udev_tag_wacom_tablet’: ../test/test-device.c:1155:2: warning: initialization discards ‘const’ qualifier from pointer target type [-Wdiscarded-qualifiers] ck_assert_notnull(prop); ^~~~~~~~~~~~~~~~~ [170/178] x86_64-pld-linux-gnux32-gcc -Ilibinput-test-suite-runner@exe -I. -I.. -I../src -I../include -I/usr/include/libevdev-1.0/ -I/usr/include/libwacom-1.0 -I/usr/include/glib-2.0 -I/usr/libx32/glib-2.0/include -fdiagnostics-color=always -pipe -D_FILE_OFFSET_BITS=64 -std=gnu99 -Wno-unused-parameter -g -fvisibility=hidden -Wmissing-prototypes -Wstrict-prototypes -O2 -fwrapv -Wformat -Werror=format-security -gdwarf-4 -fno-debug-types-section -fvar-tracking-assignments -g2 -Wp,-D_FORTIFY_SOURCE=2 -fstack-protector-strong --param=ssp-buffer-size=4 -fPIC -mtune=generic -march=x86-64 -gdwarf-4 -fno-debug-types-section -fvar-tracking-assignments -g2 -pthread '-DLIBINPUT_LT_VERSION="23:0:13"' -MD -MQ 'libinput-test-suite-runner@exe/test_test-switch.c.o' -MF 'libinput-test-suite-runner@exe/test_test-switch.c.o.d' -o 'libinput-test-suite-runner@exe/test_test-switch.c.o' -c ../test/test-switch.c [171/178] x86_64-pld-linux-gnux32-gcc -Ilibinput-test-suite-runner@exe -I. -I.. -I../src -I../include -I/usr/include/libevdev-1.0/ -I/usr/include/libwacom-1.0 -I/usr/include/glib-2.0 -I/usr/libx32/glib-2.0/include -fdiagnostics-color=always -pipe -D_FILE_OFFSET_BITS=64 -std=gnu99 -Wno-unused-parameter -g -fvisibility=hidden -Wmissing-prototypes -Wstrict-prototypes -O2 -fwrapv -Wformat -Werror=format-security -gdwarf-4 -fno-debug-types-section -fvar-tracking-assignments -g2 -Wp,-D_FORTIFY_SOURCE=2 -fstack-protector-strong --param=ssp-buffer-size=4 -fPIC -mtune=generic -march=x86-64 -gdwarf-4 -fno-debug-types-section -fvar-tracking-assignments -g2 -pthread '-DLIBINPUT_LT_VERSION="23:0:13"' -MD -MQ 'libinput-test-suite-runner@exe/test_litest.c.o' -MF 'libinput-test-suite-runner@exe/test_litest.c.o.d' -o 'libinput-test-suite-runner@exe/test_litest.c.o' -c ../test/litest.c [172/178] x86_64-pld-linux-gnux32-gcc -Ilibinput-test-suite-runner@exe -I. -I.. -I../src -I../include -I/usr/include/libevdev-1.0/ -I/usr/include/libwacom-1.0 -I/usr/include/glib-2.0 -I/usr/libx32/glib-2.0/include -fdiagnostics-color=always -pipe -D_FILE_OFFSET_BITS=64 -std=gnu99 -Wno-unused-parameter -g -fvisibility=hidden -Wmissing-prototypes -Wstrict-prototypes -O2 -fwrapv -Wformat -Werror=format-security -gdwarf-4 -fno-debug-types-section -fvar-tracking-assignments -g2 -Wp,-D_FORTIFY_SOURCE=2 -fstack-protector-strong --param=ssp-buffer-size=4 -fPIC -mtune=generic -march=x86-64 -gdwarf-4 -fno-debug-types-section -fvar-tracking-assignments -g2 -pthread '-DLIBINPUT_LT_VERSION="23:0:13"' -MD -MQ 'libinput-test-suite-runner@exe/test_test-misc.c.o' -MF 'libinput-test-suite-runner@exe/test_test-misc.c.o.d' -o 'libinput-test-suite-runner@exe/test_test-misc.c.o' -c ../test/test-misc.c [173/178] x86_64-pld-linux-gnux32-gcc -Ilibinput-test-suite-runner@exe -I. -I.. -I../src -I../include -I/usr/include/libevdev-1.0/ -I/usr/include/libwacom-1.0 -I/usr/include/glib-2.0 -I/usr/libx32/glib-2.0/include -fdiagnostics-color=always -pipe -D_FILE_OFFSET_BITS=64 -std=gnu99 -Wno-unused-parameter -g -fvisibility=hidden -Wmissing-prototypes -Wstrict-prototypes -O2 -fwrapv -Wformat -Werror=format-security -gdwarf-4 -fno-debug-types-section -fvar-tracking-assignments -g2 -Wp,-D_FORTIFY_SOURCE=2 -fstack-protector-strong --param=ssp-buffer-size=4 -fPIC -mtune=generic -march=x86-64 -gdwarf-4 -fno-debug-types-section -fvar-tracking-assignments -g2 -pthread '-DLIBINPUT_LT_VERSION="23:0:13"' -MD -MQ 'libinput-test-suite-runner@exe/test_test-touchpad-tap.c.o' -MF 'libinput-test-suite-runner@exe/test_test-touchpad-tap.c.o.d' -o 'libinput-test-suite-runner@exe/test_test-touchpad-tap.c.o' -c ../test/test-touchpad-tap.c [174/178] x86_64-pld-linux-gnux32-gcc -Ilibinput-test-suite-runner@exe -I. -I.. -I../src -I../include -I/usr/include/libevdev-1.0/ -I/usr/include/libwacom-1.0 -I/usr/include/glib-2.0 -I/usr/libx32/glib-2.0/include -fdiagnostics-color=always -pipe -D_FILE_OFFSET_BITS=64 -std=gnu99 -Wno-unused-parameter -g -fvisibility=hidden -Wmissing-prototypes -Wstrict-prototypes -O2 -fwrapv -Wformat -Werror=format-security -gdwarf-4 -fno-debug-types-section -fvar-tracking-assignments -g2 -Wp,-D_FORTIFY_SOURCE=2 -fstack-protector-strong --param=ssp-buffer-size=4 -fPIC -mtune=generic -march=x86-64 -gdwarf-4 -fno-debug-types-section -fvar-tracking-assignments -g2 -pthread '-DLIBINPUT_LT_VERSION="23:0:13"' -MD -MQ 'libinput-test-suite-runner@exe/test_test-tablet.c.o' -MF 'libinput-test-suite-runner@exe/test_test-tablet.c.o.d' -o 'libinput-test-suite-runner@exe/test_test-tablet.c.o' -c ../test/test-tablet.c ../test/test-tablet.c: In function ‘rotate_event’: ../test/test-tablet.c:1750:2: warning: initialization discards ‘const’ qualifier from pointer target type [-Wdiscarded-qualifiers] ck_assert_notnull(abs); ^~~~~~~~~~~~~~~~~ ../test/test-tablet.c:1754:2: warning: initialization discards ‘const’ qualifier from pointer target type [-Wdiscarded-qualifiers] ck_assert_notnull(abs); ^~~~~~~~~~~~~~~~~ ../test/test-tablet.c: In function ‘left_handed_artpen_rotation’: ../test/test-tablet.c:1848:2: warning: initialization discards ‘const’ qualifier from pointer target type [-Wdiscarded-qualifiers] ck_assert_notnull(abs); ^~~~~~~~~~~~~~~~~ ../test/test-tablet.c: In function ‘airbrush_slider’: ../test/test-tablet.c:2962:2: warning: initialization discards ‘const’ qualifier from pointer target type [-Wdiscarded-qualifiers] ck_assert_notnull(abs); ^~~~~~~~~~~~~~~~~ ../test/test-tablet.c: In function ‘artpen_rotation’: ../test/test-tablet.c:3047:2: warning: initialization discards ‘const’ qualifier from pointer target type [-Wdiscarded-qualifiers] ck_assert_notnull(abs); ^~~~~~~~~~~~~~~~~ [175/178] x86_64-pld-linux-gnux32-gcc -Ilibinput-test-suite-runner@exe -I. -I.. -I../src -I../include -I/usr/include/libevdev-1.0/ -I/usr/include/libwacom-1.0 -I/usr/include/glib-2.0 -I/usr/libx32/glib-2.0/include -fdiagnostics-color=always -pipe -D_FILE_OFFSET_BITS=64 -std=gnu99 -Wno-unused-parameter -g -fvisibility=hidden -Wmissing-prototypes -Wstrict-prototypes -O2 -fwrapv -Wformat -Werror=format-security -gdwarf-4 -fno-debug-types-section -fvar-tracking-assignments -g2 -Wp,-D_FORTIFY_SOURCE=2 -fstack-protector-strong --param=ssp-buffer-size=4 -fPIC -mtune=generic -march=x86-64 -gdwarf-4 -fno-debug-types-section -fvar-tracking-assignments -g2 -pthread '-DLIBINPUT_LT_VERSION="23:0:13"' -MD -MQ 'libinput-test-suite-runner@exe/test_test-quirks.c.o' -MF 'libinput-test-suite-runner@exe/test_test-quirks.c.o.d' -o 'libinput-test-suite-runner@exe/test_test-quirks.c.o' -c ../test/test-quirks.c [176/178] x86_64-pld-linux-gnux32-gcc -Ilibinput-test-suite-runner@exe -I. -I.. -I../src -I../include -I/usr/include/libevdev-1.0/ -I/usr/include/libwacom-1.0 -I/usr/include/glib-2.0 -I/usr/libx32/glib-2.0/include -fdiagnostics-color=always -pipe -D_FILE_OFFSET_BITS=64 -std=gnu99 -Wno-unused-parameter -g -fvisibility=hidden -Wmissing-prototypes -Wstrict-prototypes -O2 -fwrapv -Wformat -Werror=format-security -gdwarf-4 -fno-debug-types-section -fvar-tracking-assignments -g2 -Wp,-D_FORTIFY_SOURCE=2 -fstack-protector-strong --param=ssp-buffer-size=4 -fPIC -mtune=generic -march=x86-64 -gdwarf-4 -fno-debug-types-section -fvar-tracking-assignments -g2 -pthread '-DLIBINPUT_LT_VERSION="23:0:13"' -MD -MQ 'libinput-test-suite-runner@exe/test_test-touchpad.c.o' -MF 'libinput-test-suite-runner@exe/test_test-touchpad.c.o.d' -o 'libinput-test-suite-runner@exe/test_test-touchpad.c.o' -c ../test/test-touchpad.c [177/178] x86_64-pld-linux-gnux32-gcc -o libinput-test-suite-runner 'libinput-test-suite-runner@exe/test_litest-device-acer-hawaii-keyboard.c.o' 'libinput-test-suite-runner@exe/test_litest-device-acer-hawaii-touchpad.c.o' 'libinput-test-suite-runner@exe/test_litest-device-aiptek-tablet.c.o' 'libinput-test-suite-runner@exe/test_litest-device-alps-semi-mt.c.o' 'libinput-test-suite-runner@exe/test_litest-device-alps-dualpoint.c.o' 'libinput-test-suite-runner@exe/test_litest-device-anker-mouse-kbd.c.o' 'libinput-test-suite-runner@exe/test_litest-device-apple-appletouch.c.o' 'libinput-test-suite-runner@exe/test_litest-device-apple-internal-keyboard.c.o' 'libinput-test-suite-runner@exe/test_litest-device-apple-magicmouse.c.o' 'libinput-test-suite-runner@exe/test_litest-device-asus-rog-gladius.c.o' 'libinput-test-suite-runner@exe/test_litest-device-atmel-hover.c.o' 'libinput-test-suite-runner@exe/test_litest-device-bcm5974.c.o' 'libinput-test-suite-runner@exe/test_litest-device-calibrated-touchscreen.c.o' 'libinput-test-suite-runner@exe/test_litest-device-cyborg-rat-5.c.o' 'libinput-test-suite-runner@exe/test_litest-device-elantech-touchpad.c.o' 'libinput-test-suite-runner@exe/test_litest-device-generic-singletouch.c.o' 'libinput-test-suite-runner@exe/test_litest-device-gpio-keys.c.o' 'libinput-test-suite-runner@exe/test_litest-device-huion-pentablet.c.o' 'libinput-test-suite-runner@exe/test_litest-device-hp-wmi-hotkeys.c.o' 'libinput-test-suite-runner@exe/test_litest-device-ignored-mouse.c.o' 'libinput-test-suite-runner@exe/test_litest-device-keyboard.c.o' 'libinput-test-suite-runner@exe/test_litest-device-keyboard-all-codes.c.o' 'libinput-test-suite-runner@exe/test_litest-device-keyboard-razer-blackwidow.c.o' 'libinput-test-suite-runner@exe/test_litest-device-keyboard-razer-blade-stealth.c.o' 'libinput-test-suite-runner@exe/test_litest-device-keyboard-razer-blade-stealth-videoswitch.c.o' 'libinput-test-suite-runner@exe/test_litest-device-lid-switch.c.o' 'libinput-test-suite-runner@exe/test_litest-device-lid-switch-surface3.c.o' 'libinput-test-suite-runner@exe/test_litest-device-logitech-trackball.c.o' 'libinput-test-suite-runner@exe/test_litest-device-nexus4-touch-screen.c.o' 'libinput-test-suite-runner@exe/test_litest-device-magic-trackpad.c.o' 'libinput-test-suite-runner@exe/test_litest-device-mouse.c.o' 'libinput-test-suite-runner@exe/test_litest-device-mouse-wheel-tilt.c.o' 'libinput-test-suite-runner@exe/test_litest-device-mouse-roccat.c.o' 'libinput-test-suite-runner@exe/test_litest-device-mouse-low-dpi.c.o' 'libinput-test-suite-runner@exe/test_litest-device-mouse-wheel-click-angle.c.o' 'libinput-test-suite-runner@exe/test_litest-device-mouse-wheel-click-count.c.o' 'libinput-test-suite-runner@exe/test_litest-device-ms-nano-transceiver-mouse.c.o' 'libinput-test-suite-runner@exe/test_litest-device-ms-surface-cover.c.o' 'libinput-test-suite-runner@exe/test_litest-device-protocol-a-touch-screen.c.o' 'libinput-test-suite-runner@exe/test_litest-device-qemu-usb-tablet.c.o' 'libinput-test-suite-runner@exe/test_litest-device-synaptics-x220.c.o' 'libinput-test-suite-runner@exe/test_litest-device-synaptics-hover.c.o' 'libinput-test-suite-runner@exe/test_litest-device-synaptics-i2c.c.o' 'libinput-test-suite-runner@exe/test_litest-device-synaptics-rmi4.c.o' 'libinput-test-suite-runner@exe/test_litest-device-synaptics-st.c.o' 'libinput-test-suite-runner@exe/test_litest-device-synaptics-t440.c.o' 'libinput-test-suite-runner@exe/test_litest-device-synaptics-x1-carbon-3rd.c.o' 'libinput-test-suite-runner@exe/test_litest-device-thinkpad-extrabuttons.c.o' 'libinput-test-suite-runner@exe/test_litest-device-trackpoint.c.o' 'libinput-test-suite-runner@exe/test_litest-device-touch-screen.c.o' 'libinput-test-suite-runner@exe/test_litest-device-touchscreen-invalid-range.c.o' 'libinput-test-suite-runner@exe/test_litest-device-touchscreen-fuzz.c.o' 'libinput-test-suite-runner@exe/test_litest-device-touchscreen-mt-tool.c.o' 'libinput-test-suite-runner@exe/test_litest-device-uclogic-tablet.c.o' 'libinput-test-suite-runner@exe/test_litest-device-wacom-bamboo-2fg-finger.c.o' 'libinput-test-suite-runner@exe/test_litest-device-wacom-bamboo-2fg-pad.c.o' 'libinput-test-suite-runner@exe/test_litest-device-wacom-bamboo-2fg-pen.c.o' 'libinput-test-suite-runner@exe/test_litest-device-wacom-bamboo-16fg-pen.c.o' 'libinput-test-suite-runner@exe/test_litest-device-wacom-cintiq-12wx-pen.c.o' 'libinput-test-suite-runner@exe/test_litest-device-wacom-cintiq-13hdt-finger.c.o' 'libinput-test-suite-runner@exe/test_litest-device-wacom-cintiq-13hdt-pad.c.o' 'libinput-test-suite-runner@exe/test_litest-device-wacom-cintiq-13hdt-pen.c.o' 'libinput-test-suite-runner@exe/test_litest-device-wacom-cintiq-24hd-pen.c.o' 'libinput-test-suite-runner@exe/test_litest-device-wacom-cintiq-24hdt-pad.c.o' 'libinput-test-suite-runner@exe/test_litest-device-wacom-ekr.c.o' 'libinput-test-suite-runner@exe/test_litest-device-wacom-hid4800-pen.c.o' 'libinput-test-suite-runner@exe/test_litest-device-wacom-intuos3-pad.c.o' 'libinput-test-suite-runner@exe/test_litest-device-wacom-intuos5-finger.c.o' 'libinput-test-suite-runner@exe/test_litest-device-wacom-intuos5-pad.c.o' 'libinput-test-suite-runner@exe/test_litest-device-wacom-intuos5-pen.c.o' 'libinput-test-suite-runner@exe/test_litest-device-wacom-isdv4-e6-pen.c.o' 'libinput-test-suite-runner@exe/test_litest-device-wacom-isdv4-e6-finger.c.o' 'libinput-test-suite-runner@exe/test_litest-device-wacom-mobilestudio-pro-pad.c.o' 'libinput-test-suite-runner@exe/test_litest-device-waltop-tablet.c.o' 'libinput-test-suite-runner@exe/test_litest-device-wheel-only.c.o' 'libinput-test-suite-runner@exe/test_litest-device-xen-virtual-pointer.c.o' 'libinput-test-suite-runner@exe/test_litest-device-vmware-virtual-usb-mouse.c.o' 'libinput-test-suite-runner@exe/test_litest-device-yubikey.c.o' 'libinput-test-suite-runner@exe/test_litest.c.o' 'libinput-test-suite-runner@exe/src_libinput-util.c.o' 'libinput-test-suite-runner@exe/test_test-udev.c.o' 'libinput-test-suite-runner@exe/test_test-path.c.o' 'libinput-test-suite-runner@exe/test_test-pointer.c.o' 'libinput-test-suite-runner@exe/test_test-touch.c.o' 'libinput-test-suite-runner@exe/test_test-log.c.o' 'libinput-test-suite-runner@exe/test_test-tablet.c.o' 'libinput-test-suite-runner@exe/test_test-pad.c.o' 'libinput-test-suite-runner@exe/test_test-touchpad.c.o' 'libinput-test-suite-runner@exe/test_test-touchpad-tap.c.o' 'libinput-test-suite-runner@exe/test_test-touchpad-buttons.c.o' 'libinput-test-suite-runner@exe/test_test-trackpoint.c.o' 'libinput-test-suite-runner@exe/test_test-trackball.c.o' 'libinput-test-suite-runner@exe/test_test-misc.c.o' 'libinput-test-suite-runner@exe/test_test-keyboard.c.o' 'libinput-test-suite-runner@exe/test_test-device.c.o' 'libinput-test-suite-runner@exe/test_test-gestures.c.o' 'libinput-test-suite-runner@exe/test_test-switch.c.o' 'libinput-test-suite-runner@exe/test_test-quirks.c.o' -Wl,--no-undefined -Wl,--as-needed -O2 -fwrapv -pipe -Wformat -Werror=format-security -gdwarf-4 -fno-debug-types-section -fvar-tracking-assignments -g2 -Wp,-D_FORTIFY_SOURCE=2 -fstack-protector-strong --param=ssp-buffer-size=4 -fPIC -mtune=generic -march=x86-64 -gdwarf-4 -fno-debug-types-section -fvar-tracking-assignments -g2 -Wl,--as-needed -Wl,--no-copy-dt-needed-entries -Wl,-z,relro -Wl,-z,combreloc -Wl,--start-group libinput.so.10.13.0 liblibinput-util.a libquirks.a /usr/libx32/libmtdev.so /libx32/libudev.so /usr/libx32/libevdev.so -lm -lrt /usr/libx32/libwacom.so /usr/libx32/libcheck.so -ldl -lm /libx32/libsystemd.so -Wl,--end-group '-Wl,-rpath,$ORIGIN/' -Wl,-rpath-link,/tmp/B.AoR4Oe/BUILD/libinput-1.12.0/build/ [178/178] /usr/bin/sphinx-build-3 -q -b html /tmp/B.AoR4Oe/BUILD/libinput-1.12.0/build/doc/user Documentation + LC_ALL=C.UTF-8 /usr/bin/ninja test -v -j9 -C build ninja: Entering directory `build' [1/8] /usr/bin/python3 /usr/bin/meson --internal vcstagger ../doc/api/mainpage.dox doc/api/mainpage.dox unknown /tmp/B.AoR4Oe/BUILD/libinput-1.12.0/doc/api __GIT_VERSION__ '(.*)' /usr/bin/git log -1 --format=%h fatal: not a git repository (or any of the parent directories): .git [2/7] /usr/bin/python3 /usr/bin/meson --internal vcstagger ../src/libinput-git-version.h.in libinput-git-version.h unknown /tmp/B.AoR4Oe/BUILD/libinput-1.12.0 @VCS_TAG@ '(.*)' /usr/bin/git describe fatal: not a git repository (or any of the parent directories): .git [3/5] /usr/bin/python3 /usr/bin/meson --internal vcstagger ../doc/user/git_version.py.in doc/user/git_version.py unknown /tmp/B.AoR4Oe/BUILD/libinput-1.12.0/doc/user __GIT_VERSION__ '(.*)' /usr/bin/git log -1 --format=%H fatal: not a git repository (or any of the parent directories): .git [4/5] /usr/bin/sphinx-build-3 -q -b html /tmp/B.AoR4Oe/BUILD/libinput-1.12.0/build/doc/user Documentation [4/5] /usr/bin/python3 -u /usr/bin/meson test --no-rebuild --print-errorlogs 1/9 validate-quirks OK 0.15 s 2/9 list-devices OK 0.20 s 3/9 tools-builddir-lookup OK 0.18 s 4/9 tools-builddir-lookup-installed OK 0.18 s 5/9 symbols-leak-test OK 0.20 s 6/9 leftover-rules OK 0.05 s 7/9 test-litest-selftest OK 3.06 s 8/9 libinput-test-suite-runner SKIP 0.08 s 9/9 libinput-test-deviceless FAIL 1.77 s (exit status 3) OK: 7 FAIL: 1 SKIP: 1 TIMEOUT: 0 The output from the failed tests: 9/9 libinput-test-deviceless FAIL 1.77 s (exit status 3) --- command --- _='/usr/bin/python3' HISTFILESIZE='1000' GNUSTEP_USER_ROOT='/home/users/builder/GNUstep' HOME='/home/users/builder' GNUSTEP_HOST_VENDOR='pld' RPM_ARCH='x32' HISTSIZE='1000' PWD='/tmp/B.AoR4Oe/BUILD/libinput-1.12.0/build' GNUSTEP_IS_FLATTENED='yes' GNUSTEP_NETWORK_ROOT='/usr/Network' JAVA_HOME='/usr/libx32/jvm/java' RPM_DOC_DIR='/usr/share/doc' HISTCONTROL='ignoredups' GUILE_LOAD_PATH='/home/users/builder/GNUstep/Library/Libraries/Guile:/usr/local/libx32/GNUstep/Libraries/Guile:/usr/libx32/GNUstep/Libraries/Guile' LIBRARY_COMBO='gnu-gnu-gnu' RPM_BUILD_ROOT='/tmp/B.AoR4Oe/BUILD/tmp/libinput-1.12.0-root-builder' RPM_PACKAGE_VERSION='1.12.0' RPM_PACKAGE_NAME='libinput' USER='builder' GNUSTEP_HOST_OS='linux-gnux32' GNUSTEP_FLATTENED='yes' INFOPATH='/usr/share/info::/usr/local/share/info::/home/users/builder/GNUstep/Library/Documentation/info:' RPM_BUILD_DIR='/tmp/B.AoR4Oe/BUILD' PATH='/home/users/builder/GNUstep/Tools:/usr/local/bin:/usr/bin:/bin' TMPDIR='/tmp/B.AoR4Oe/BUILD/tmp' GNUSTEP_SYSTEM_ROOT='/usr/System' LOGNAME='builder' GNUSTEP_MAKEFILES='/usr/share/GNUstep/Makefiles' LANG='C' GNUSTEP_HOST='x86_64-pld-linux-gnux32' LESSOPEN='|lesspipe.sh %s' LC_ALL='C.UTF-8' TERM='linux' RPM_OPT_FLAGS='-O2 -fwrapv -pipe -Wformat -Werror=format-security -gdwarf-4 -fno-debug-types-section -fvar-tracking-assignments -g2 -Wp,-D_FORTIFY_SOURCE=2 -fstack-protector-strong --param=ssp-buffer-size=4 -fPIC -mtune=generic -march=x86-64 ' SHELL='/bin/bash' RPM_PACKAGE_RELEASE='1' CLASSPATH='/home/users/builder/GNUstep/Library/Libraries/Java:/usr/local/libx32/GNUstep/Libraries/Java:/usr/libx32/GNUstep/Libraries/Java' HOSTNAME='naiad-pld' RPM_SOURCE_DIR='/tmp/B.AoR4Oe' GNUSTEP_LOCAL_ROOT='/usr/Local' GNUSTEP_HOST_CPU='x86_64' RPM_OS='linux' LD_LIBRARY_PATH='/home/users/builder/GNUstep/Library/Libraries:/usr/local/libx32:/usr/libx32' XDG_MENU_PREFIX='applnk-' GNUSTEP_PATHLIST='/usr/System:/usr/Network:/usr/Local:/home/users/builder/GNUstep' SHLVL='0' /tmp/B.AoR4Oe/BUILD/libinput-1.12.0/build/libinput-test-suite-runner --filter-deviceless --- stdout --- Running suite(s): quirks:misc:quirks_ctx_ref:deviceless quirks:misc:quirks_call_NULL:deviceless quirks:parsing:quirks_parse_dmi_invalid:deviceless quirks:parsing:quirks_parse_dmi:deviceless quirks:parsing:quirks_parse_udev_invalid:deviceless quirks:parsing:quirks_parse_udev:deviceless quirks:parsing:quirks_parse_name_invalid:deviceless quirks:parsing:quirks_parse_name:deviceless quirks:parsing:quirks_parse_version_invalid:deviceless quirks:parsing:quirks_parse_version:deviceless quirks:parsing:quirks_parse_product_invalid:deviceless quirks:parsing:quirks_parse_product:deviceless quirks:parsing:quirks_parse_vendor_invalid:deviceless quirks:parsing:quirks_parse_vendor:deviceless quirks:parsing:quirks_parse_bustype_invalid:deviceless quirks:parsing:quirks_parse_bustype:deviceless quirks:parsing:quirks_parse_string_quotes_double:deviceless quirks:parsing:quirks_parse_string_quotes_single:deviceless quirks:parsing:quirks_parse_comment_empty:deviceless quirks:parsing:quirks_parse_comment_inline:deviceless quirks:parsing:quirks_parse_error_model_not_one:deviceless quirks:parsing:quirks_parse_error_unknown_prefix:deviceless quirks:parsing:quirks_parse_error_unknown_model:deviceless quirks:parsing:quirks_parse_error_unknown_attr:deviceless quirks:parsing:quirks_parse_error_unknown_match:deviceless quirks:parsing:quirks_parse_error_trailing_whitespace:deviceless quirks:parsing:quirks_parse_error_section:deviceless quirks:structure:quirks_section_duplicate_attr:deviceless quirks:structure:quirks_section_duplicate_match:deviceless quirks:structure:quirks_section_match_after_attr:deviceless quirks:structure:quirks_section_missing_attr:deviceless quirks:structure:quirks_section_missing_match:deviceless quirks:structure:quirks_section_double:deviceless quirks:structure:quirks_section_empty:deviceless quirks:datadir:quirks_empty_dir:deviceless quirks:datadir:quirks_invalid_dir:deviceless misc:versionsort:strverscmp_test:deviceless misc:list:list_test_append:deviceless misc:list:list_test_insert:deviceless misc:library_version:library_version:deviceless misc:time:time_conversion:deviceless misc:parser:strjoin_test:deviceless misc:parser:kvsplit_double_test:deviceless misc:parser:strsplit_test:deviceless misc:parser:safe_atod_test:deviceless misc:parser:safe_atou_base_8_test:deviceless misc:parser:safe_atou_base_16_test:deviceless misc:parser:safe_atou_test:deviceless misc:parser:safe_atoi_base_8_test:deviceless misc:parser:safe_atoi_base_16_test:deviceless misc:parser:safe_atoi_test:deviceless misc:parser:range_prop_parser:deviceless misc:parser:calibration_prop_parser:deviceless misc:parser:reliability_prop_parser:deviceless misc:parser:dimension_prop_parser:deviceless misc:parser:wheel_click_count_parser:deviceless misc:parser:wheel_click_parser:deviceless misc:parser:dpi_parser:deviceless misc:ratelimit:ratelimit_helpers:deviceless misc:matrix:matrix_helpers:deviceless config:status string:config_status_string:deviceless context:refcount:context_ref_counting:deviceless misc:bitfield_helpers:bitfield_helpers:deviceless log:logging:log_handler_NULL:deviceless log:logging:log_handler_invoked:deviceless log:defaults:log_default_priority:deviceless 95%: Checks: 66, Failures: 3, Errors: 0 ../test/test-misc.c:1249:F:safe_atou_base_8_test:deviceless:t->func:0: Assertion 'success == tests[i].success' failed ../test/test-misc.c:1212:F:safe_atou_base_16_test:deviceless:t->func:0: Assertion 'success == tests[i].success' failed ../test/test-misc.c:1178:F:safe_atou_test:deviceless:t->func:0: Assertion 'success == tests[i].success' failed --- stderr --- :: Failure: ../test/test-misc.c:1249:safe_atou_base_8_test:deviceless :: Failure: ../test/test-misc.c:1212:safe_atou_base_16_test:deviceless :: Failure: ../test/test-misc.c:1178:safe_atou_test:deviceless ------- Full log written to /tmp/B.AoR4Oe/BUILD/libinput-1.12.0/build/meson-logs/testlog.txt FAILED: meson-test /usr/bin/python3 -u /usr/bin/meson test --no-rebuild --print-errorlogs ninja: build stopped: subcommand failed. error: Bad exit status from /tmp/B.AoR4Oe/BUILD/tmp/rpm-tmp.77239 (%build) RPM build errors: Bad exit status from /tmp/B.AoR4Oe/BUILD/tmp/rpm-tmp.77239 (%build) ended at: Wed Sep 12 23:10:05 2018, done in 0:00:59.528957 error: No files produced. + chmod -R u+rwX /tmp/B.AoR4Oe/BUILD + rm -rf /tmp/B.AoR4Oe/tmp /tmp/B.AoR4Oe/BUILD + rm -rf /tmp/B.AoR4Oe Begin-PLD-Builder-Info Build-Time: user:222.22s sys:78.99s real:89.43s (faults io:151 non-io:1422992) End-PLD-Builder-Info
[Back to list of logs] [View rpm -qa of builder]