FailedOk

th/SRPMS[OK]
th/x32[OK]
th/i686[OK]
th/x86_64[OK]

ac/SRPMS[OK]
ac/i386[OK]
ac/i586[OK]
ac/i686[OK]
ac/alpha[OK]
ac/amd64[OK]
ac/athlon[OK]
ac/ppc[OK]
ac/sparc[OK]
ac/sparc64[OK]

Advanced Search
main()
Powered by PLD Linux
(c) 2002-2018 PLD Team
$Revision: 1.37 $
Powered by Microsoft Windows 2003.
Your IP: 54.82.93.116

libjingle b2c87afa-a0a4-48ee-9a8e-3b6c6e836812

Status:Failed
Source URL:ftp://buildlogs.pld-linux.org/th/x32/FAIL/libjingle,b2c87afa-a0a4-48ee-9a8e-3b6c6e836812.bz2
text/plain URL:View!
rpm -qa of builder:View!
Date:2018/09/14 20:39:58
Runtime:0:00:46.304160

Toc:

  • prep
  • Executing(%prep): /bin/sh -e /tmp/B.nfrc1a/BUILD/tmp/rpm-tmp.42744
  • build
  • Executing(%build): /bin/sh -e /tmp/B.nfrc1a/BUILD/tmp/rpm-tmp.42744
  • error 1
  • openssladapter.cc:87:19: error: variable 'BIO_METHOD methods_socket' has initializer but incomplete type
  • error 2
  • openssladapter.cc:107:6: error: invalid use of incomplete type 'BIO' {aka 'struct bio_st'}
  • error 3
  • openssladapter.cc:112:4: error: invalid use of incomplete type 'BIO' {aka 'struct bio_st'}
  • error 4
  • openssladapter.cc:113:4: error: invalid use of incomplete type 'BIO' {aka 'struct bio_st'}
  • error 5
  • openssladapter.cc:114:4: error: invalid use of incomplete type 'BIO' {aka 'struct bio_st'}
  • error 6
  • openssladapter.cc:115:4: error: invalid use of incomplete type 'BIO' {aka 'struct bio_st'}
  • error 7
  • openssladapter.cc:128:74: error: invalid use of incomplete type 'BIO' {aka 'struct bio_st'}
  • error 8
  • openssladapter.cc:134:6: error: invalid use of incomplete type 'BIO' {aka 'struct bio_st'}
  • error 9
  • openssladapter.cc:144:74: error: invalid use of incomplete type 'BIO' {aka 'struct bio_st'}
  • error 10
  • openssladapter.cc:167:13: error: invalid use of incomplete type 'BIO' {aka 'struct bio_st'}
  • error 11
  • openssladapter.cc:699:48: error: invalid use of incomplete type 'X509_EXTENSION' {aka 'struct X509_extension_st'}
  • error 12
  • openssladapter.cc:710:42: error: invalid use of incomplete type 'X509_EXTENSION' {aka 'struct X509_extension_st'}
  • error 13
  • openssladapter.cc:713:64: error: invalid use of incomplete type 'X509_EXTENSION' {aka 'struct X509_extension_st'}
  • error 14
  • make[3]: *** [Makefile:847: openssladapter.lo] Error 1
  • error 15
  • opensslidentity.cc:171:20: error: invalid use of incomplete type 'EVP_PKEY' {aka 'struct evp_pkey_st'}
  • error 16
  • opensslidentity.cc:171:37: error: 'CRYPTO_LOCK_EVP_PKEY' was not declared in this scope
  • error 17
  • opensslidentity.cc:171:3: error: 'CRYPTO_add' was not declared in this scope
  • error 18
  • opensslidentity.cc:317:20: error: invalid use of incomplete type 'X509' {aka 'struct x509_st'}
  • error 19
  • opensslidentity.cc:317:37: error: 'CRYPTO_LOCK_X509' was not declared in this scope
  • error 20
  • opensslidentity.cc:317:3: error: 'CRYPTO_add' was not declared in this scope
  • error 21
  • make[3]: *** [Makefile:847: opensslidentity.lo] Error 1
  • error 22
  • opensslstreamadapter.cc:89:19: error: variable 'BIO_METHOD talk_base::methods_stream' has initializer but incomplete type
  • error 23
  • opensslstreamadapter.cc:108:6: error: invalid use of incomplete type 'BIO' {aka 'struct bio_st'}
  • error 24
  • opensslstreamadapter.cc:115:4: error: invalid use of incomplete type 'BIO' {aka 'struct bio_st'}
  • error 25
  • opensslstreamadapter.cc:116:4: error: invalid use of incomplete type 'BIO' {aka 'struct bio_st'}
  • error 26
  • opensslstreamadapter.cc:117:4: error: invalid use of incomplete type 'BIO' {aka 'struct bio_st'}
  • error 27
  • opensslstreamadapter.cc:118:4: error: invalid use of incomplete type 'BIO' {aka 'struct bio_st'}
  • error 28
  • opensslstreamadapter.cc:131:60: error: invalid use of incomplete type 'BIO' {aka 'struct bio_st'}
  • error 29
  • opensslstreamadapter.cc:139:6: error: invalid use of incomplete type 'BIO' {aka 'struct bio_st'}
  • error 30
  • opensslstreamadapter.cc:149:60: error: invalid use of incomplete type 'BIO' {aka 'struct bio_st'}
  • error 31
  • opensslstreamadapter.cc:174:15: error: invalid use of incomplete type 'BIO' {aka 'struct bio_st'}
  • error 32
  • make[3]: *** [Makefile:847: opensslstreamadapter.lo] Error 1
  • error 33
  • make[2]: *** [Makefile:371: all-recursive] Error 1
  • error 34
  • make[1]: *** [Makefile:470: all-recursive] Error 1
  • error 35
  • error: Bad exit status from /tmp/B.nfrc1a/BUILD/tmp/rpm-tmp.42744 (%build)
  • error 36
  • RPM build errors:
  • error 37
  • error: No files produced.

Content:

request from: arekm
checking if we should skip the build
started at: Fri Sep 14 20:39:07 2018
killing old processes on a builder
sending signal 9 to pid -1
Killed
cleaning up /tmp
fetching https://srcbuilder.pld-linux.org/th//srpms/b2c87afa-a0a4-48ee-9a8e-3b6c6e836812/libjingle-0.6.14-5.src.rpm
fetched 8610886 bytes, 6572.1 K/s
installing srpm: libjingle-0.6.14-5.src.rpm
+ install -d /tmp/B.nfrc1a/BUILD /tmp/B.nfrc1a/RPMS
+ LC_ALL=en_US.UTF-8
+ rpm -qp --changelog libjingle-0.6.14-5.src.rpm
* Fri Sep 14 2018 PLD Linux Team <feedback@pld-linux.org>
- For complete changelog see: http://git.pld-linux.org/?p=packages/libjingle.git;a=log;h=master
* Fri Sep 14 2018 Arkadiusz Miƛkiewicz <arekm@maven.pl> dcac2da
- release 5 (by relup.sh) + rpm -Uhv --nodeps --define '_topdir /tmp/B.nfrc1a' --define '_specdir %{_topdir}' --define '_sourcedir %{_specdir}' --define '_rpmdir %{_topdir}/RPMS' --define '_builddir %{_topdir}/BUILD' libjingle-0.6.14-5.src.rpm Preparing... ################################################## libjingle ################################################## + rm -f libjingle-0.6.14-5.src.rpm + install -m 700 -d /tmp/B.nfrc1a/BUILD/tmp + TMPDIR=/tmp/B.nfrc1a/BUILD/tmp + exec nice -n 0 rpmbuild -bp --short-circuit --nodeps --define '_topdir /tmp/B.nfrc1a' --define '_specdir %{_topdir}' --define '_sourcedir %{_specdir}' --define '_rpmdir %{_topdir}/RPMS' --define '_builddir %{_topdir}/BUILD' --target x32-pld-linux --define 'prep exit 0' /tmp/B.nfrc1a/libjingle.spec Building target platforms: x32-pld-linux checking BuildConflict-ing packages no BuildConflicts found checking BR rpm: Building target platforms: x32-pld-linux no BR needed building RPM using: set -ex; : build-id: b2c87afa-a0a4-48ee-9a8e-3b6c6e836812; TMPDIR=/tmp/B.nfrc1a/BUILD/tmp exec nice -n 0 rpmbuild -bb --define '_smp_mflags -j9' --define '_make_opts -Otarget' --define '_pld_builder 1' --define '_topdir /tmp/B.nfrc1a' --define '_specdir %{_topdir}' --define '_sourcedir %{_specdir}' --define '_rpmdir %{_topdir}/RPMS' --define '_builddir %{_topdir}/BUILD' --target x32-pld-linux /tmp/B.nfrc1a/libjingle.spec + : build-id: b2c87afa-a0a4-48ee-9a8e-3b6c6e836812 + TMPDIR=/tmp/B.nfrc1a/BUILD/tmp + exec nice -n 0 rpmbuild -bb --define '_smp_mflags -j9' --define '_make_opts -Otarget' --define '_pld_builder 1' --define '_topdir /tmp/B.nfrc1a' --define '_specdir %{_topdir}' --define '_sourcedir %{_specdir}' --define '_rpmdir %{_topdir}/RPMS' --define '_builddir %{_topdir}/BUILD' --target x32-pld-linux /tmp/B.nfrc1a/libjingle.spec Building target platforms: x32-pld-linux Executing(%prep): /bin/sh -e /tmp/B.nfrc1a/BUILD/tmp/rpm-tmp.42744 + umask 022 + cd /tmp/B.nfrc1a/BUILD + cd /tmp/B.nfrc1a/BUILD + rm -rf libjingle-0.6.14 + /usr/bin/unzip -qq /tmp/B.nfrc1a/libjingle-0.6.14.zip + STATUS=0 + '[' 0 -ne 0 ']' + cd libjingle-0.6.14 + /bin/id -u + '[' 1000 '=' 0 ']' + /bin/id -u + '[' 1000 '=' 0 ']' + /bin/chmod -Rf a+rX,u+w,g-w,o-w . + echo 'Patch #0 (build-sanity.patch):' Patch #0 (build-sanity.patch): + '[' -f /tmp/B.nfrc1a/build-sanity.patch ']' + /bin/cat /tmp/B.nfrc1a/build-sanity.patch + /usr/bin/patch -s -p1 + echo 'Patch #1 (C-linkage-fix.patch):' Patch #1 (C-linkage-fix.patch): + '[' -f /tmp/B.nfrc1a/C-linkage-fix.patch ']' + /bin/cat /tmp/B.nfrc1a/C-linkage-fix.patch + /usr/bin/patch -s -p1 + echo 'Patch #2 (NULL-fix.patch):' Patch #2 (NULL-fix.patch): + '[' -f /tmp/B.nfrc1a/NULL-fix.patch ']' + /bin/cat /tmp/B.nfrc1a/NULL-fix.patch + /usr/bin/patch -s -p1 + echo 'Patch #3 (statfix.patch):' Patch #3 (statfix.patch): + '[' -f /tmp/B.nfrc1a/statfix.patch ']' + /bin/cat /tmp/B.nfrc1a/statfix.patch + /usr/bin/patch -s -p1 + echo 'Patch #4 (uint32-fix.patch):' Patch #4 (uint32-fix.patch): + '[' -f /tmp/B.nfrc1a/uint32-fix.patch ']' + /bin/cat /tmp/B.nfrc1a/uint32-fix.patch + /usr/bin/patch -s -p1 + echo 'Patch #5 (timefix.patch):' Patch #5 (timefix.patch): + '[' -f /tmp/B.nfrc1a/timefix.patch ']' + /bin/cat /tmp/B.nfrc1a/timefix.patch + /usr/bin/patch -s -p1 + echo 'Patch #6 (unixfilesystemfix.patch):' Patch #6 (unixfilesystemfix.patch): + '[' -f /tmp/B.nfrc1a/unixfilesystemfix.patch ']' + /bin/cat /tmp/B.nfrc1a/unixfilesystemfix.patch + /usr/bin/patch -s -p1 + echo 'Patch #7 (system-expat.patch):' Patch #7 (system-expat.patch): + '[' -f /tmp/B.nfrc1a/system-expat.patch ']' + /bin/cat /tmp/B.nfrc1a/system-expat.patch + /usr/bin/patch -s -p1 + echo 'Patch #8 (system-srtp.patch):' Patch #8 (system-srtp.patch): + '[' -f /tmp/B.nfrc1a/system-srtp.patch ']' + /bin/cat /tmp/B.nfrc1a/system-srtp.patch + /usr/bin/patch -s -p1 + echo 'Patch #9 (devicemanager-fix.patch):' Patch #9 (devicemanager-fix.patch): + '[' -f /tmp/B.nfrc1a/devicemanager-fix.patch ']' + /bin/cat /tmp/B.nfrc1a/devicemanager-fix.patch + /usr/bin/patch -s -p1 + echo 'Patch #10 (v4llookup-fix.patch):' Patch #10 (v4llookup-fix.patch): + '[' -f /tmp/B.nfrc1a/v4llookup-fix.patch ']' + /bin/cat /tmp/B.nfrc1a/v4llookup-fix.patch + /usr/bin/patch -s -p1 + echo 'Patch #11 (fixconflict.patch):' Patch #11 (fixconflict.patch): + '[' -f /tmp/B.nfrc1a/fixconflict.patch ']' + /bin/cat /tmp/B.nfrc1a/fixconflict.patch + /usr/bin/patch -s -p1 + echo 'Patch #14 (config-linux.patch):' Patch #14 (config-linux.patch): + '[' -f /tmp/B.nfrc1a/config-linux.patch ']' + /bin/cat /tmp/B.nfrc1a/config-linux.patch + /usr/bin/patch -s -p1 + echo 'Patch #16 (compilefix.patch):' Patch #16 (compilefix.patch): + '[' -f /tmp/B.nfrc1a/compilefix.patch ']' + /bin/cat /tmp/B.nfrc1a/compilefix.patch + /usr/bin/patch -s -p1 + echo 'Patch #17 (size_t.patch):' Patch #17 (size_t.patch): + '[' -f /tmp/B.nfrc1a/size_t.patch ']' + /bin/cat /tmp/B.nfrc1a/size_t.patch + /usr/bin/patch -s -p1 + echo 'Patch #18 (fixmacro.patch):' Patch #18 (fixmacro.patch): + '[' -f /tmp/B.nfrc1a/fixmacro.patch ']' + /bin/cat /tmp/B.nfrc1a/fixmacro.patch + /usr/bin/patch -s -p1 + echo 'Patch #20 (unistd.patch):' Patch #20 (unistd.patch): + '[' -f /tmp/B.nfrc1a/unistd.patch ']' + /bin/cat /tmp/B.nfrc1a/unistd.patch + /usr/bin/patch -s -p1 + echo 'Patch #100 (bashism.patch):' Patch #100 (bashism.patch): + '[' -f /tmp/B.nfrc1a/bashism.patch ']' + /bin/cat /tmp/B.nfrc1a/bashism.patch + /usr/bin/patch -s -p1 + echo 'Patch #101 (time-timeutils.patch):' Patch #101 (time-timeutils.patch): + '[' -f /tmp/B.nfrc1a/time-timeutils.patch ']' + /bin/cat /tmp/B.nfrc1a/time-timeutils.patch + /usr/bin/patch -s -p1 + /bin/rm '--interactive=never' talk/base/time.h + exit 0 Executing(%build): /bin/sh -e /tmp/B.nfrc1a/BUILD/tmp/rpm-tmp.42744 HOME=/home/users/builder PATH=/home/users/builder/GNUstep/Tools:/usr/local/bin:/usr/bin:/bin TMPDIR=/tmp/B.nfrc1a/BUILD/tmp + umask 022 + cd /tmp/B.nfrc1a/BUILD + cd libjingle-0.6.14 + libtoolize --copy --force --install libtoolize: putting auxiliary files in '.'. libtoolize: copying file './config.guess' libtoolize: copying file './config.sub' libtoolize: copying file './install-sh' libtoolize: copying file './ltmain.sh' libtoolize: You should add the contents of the following files to 'aclocal.m4': libtoolize: '/usr/share/aclocal/libtool.m4' libtoolize: '/usr/share/aclocal/ltoptions.m4' libtoolize: '/usr/share/aclocal/ltsugar.m4' libtoolize: '/usr/share/aclocal/ltversion.m4' libtoolize: '/usr/share/aclocal/lt~obsolete.m4' libtoolize: Consider adding 'AC_CONFIG_MACRO_DIRS([m4])' to configure.ac, libtoolize: and rerunning libtoolize and aclocal. libtoolize: Consider adding '-I m4' to ACLOCAL_AMFLAGS in Makefile.am. + aclocal + autoconf + autoheader + automake -a -c -f --foreign configure.ac:5: installing './compile' configure.ac:4: installing './missing' talk/base/Makefile.am: installing './depcomp' + ./configure 'LDFLAGS=-Wl,--as-needed -Wl,--no-copy-dt-needed-entries -Wl,-z,relro -Wl,-z,combreloc ' 'CFLAGS=-O2 -fwrapv -pipe -Wformat -Werror=format-security -gdwarf-4 -fno-debug-types-section -fvar-tracking-assignments -g2 -Wp,-D_FORTIFY_SOURCE=2 -fstack-protector-strong --param=ssp-buffer-size=4 -fPIC -mtune=generic -march=x86-64 -gdwarf-4 -fno-debug-types-section -fvar-tracking-assignments -g2 ' 'CXXFLAGS=-O2 -fwrapv -pipe -Wformat -Werror=format-security -gdwarf-4 -fno-debug-types-section -fvar-tracking-assignments -g2 -Wp,-D_FORTIFY_SOURCE=2 -fstack-protector-strong --param=ssp-buffer-size=4 -fPIC -mtune=generic -march=x86-64 -gdwarf-4 -fno-debug-types-section -fvar-tracking-assignments -g2 ' 'FFLAGS=-O2 -fwrapv -pipe -Wformat -Werror=format-security -gdwarf-4 -fno-debug-types-section -fvar-tracking-assignments -g2 -Wp,-D_FORTIFY_SOURCE=2 -fstack-protector-strong --param=ssp-buffer-size=4 -fPIC -mtune=generic -march=x86-64 -gdwarf-4 -fno-debug-types-section -fvar-tracking-assignments -g2 ' 'FCFLAGS=-O2 -fwrapv -pipe -Wformat -Werror=format-security -gdwarf-4 -fno-debug-types-section -fvar-tracking-assignments -g2 -Wp,-D_FORTIFY_SOURCE=2 -fstack-protector-strong --param=ssp-buffer-size=4 -fPIC -mtune=generic -march=x86-64 -gdwarf-4 -fno-debug-types-section -fvar-tracking-assignments -g2 ' 'CPPFLAGS=' 'CC=x86_64-pld-linux-gnux32-gcc' 'CXX=x86_64-pld-linux-gnux32-g++' '--host=x86_64-pld-linux-gnux32' '--build=x86_64-pld-linux-gnux32' '--prefix=/usr' '--exec-prefix=/usr' '--bindir=/usr/bin' '--sbindir=/usr/sbin' '--sysconfdir=/etc' '--datadir=/usr/share' '--includedir=/usr/include' '--libdir=/usr/libx32' '--libexecdir=/usr/libexec' '--localstatedir=/var' '--sharedstatedir=/var/lib' '--mandir=/usr/share/man' '--infodir=/usr/share/info' '--x-libraries=/usr/libx32' --disable-static checking build system type... x86_64-pld-linux-gnux32 checking host system type... x86_64-pld-linux-gnux32 checking target system type... x86_64-pld-linux-gnux32 checking for a BSD-compatible install... /usr/bin/install -c checking whether build environment is sane... yes checking for a thread-safe mkdir -p... /bin/mkdir -p checking for mawk... mawk checking whether make sets $(MAKE)... yes checking whether make supports nested variables... yes checking for x86_64-pld-linux-gnux32-gcc... x86_64-pld-linux-gnux32-gcc checking whether the C compiler works... yes checking for C compiler default output file name... a.out checking for suffix of executables... checking whether we are cross compiling... no checking for suffix of object files... o checking whether we are using the GNU C compiler... yes checking whether x86_64-pld-linux-gnux32-gcc accepts -g... yes checking for x86_64-pld-linux-gnux32-gcc option to accept ISO C89... none needed checking whether x86_64-pld-linux-gnux32-gcc understands -c and -o together... yes checking whether make supports the include directive... yes (GNU style) checking dependency style of x86_64-pld-linux-gnux32-gcc... gcc3 checking whether we are using the GNU C++ compiler... yes checking whether x86_64-pld-linux-gnux32-g++ accepts -g... yes checking dependency style of x86_64-pld-linux-gnux32-g++... gcc3 checking how to print strings... print -r checking for a sed that does not truncate output... /bin/sed checking for grep that handles long lines and -e... /bin/grep checking for egrep... /bin/grep -E checking for fgrep... /bin/grep -F checking for ld used by x86_64-pld-linux-gnux32-gcc... /usr/bin/ld checking if the linker (/usr/bin/ld) is GNU ld... yes checking for BSD- or MS-compatible name lister (nm)... /usr/bin/nm -B checking the name lister (/usr/bin/nm -B) interface... BSD nm checking whether ln -s works... yes checking the maximum length of command line arguments... 1572864 checking how to convert x86_64-pld-linux-gnux32 file names to x86_64-pld-linux-gnux32 format... func_convert_file_noop checking how to convert x86_64-pld-linux-gnux32 file names to toolchain format... func_convert_file_noop checking for /usr/bin/ld option to reload object files... -r checking for x86_64-pld-linux-gnux32-objdump... no checking for objdump... objdump checking how to recognize dependent libraries... pass_all checking for x86_64-pld-linux-gnux32-dlltool... no checking for dlltool... no checking how to associate runtime and link libraries... print -r -- checking for x86_64-pld-linux-gnux32-ar... no checking for ar... ar checking for archiver @FILE support... @ checking for x86_64-pld-linux-gnux32-strip... no checking for strip... strip checking for x86_64-pld-linux-gnux32-ranlib... no checking for ranlib... ranlib checking command to parse /usr/bin/nm -B output from x86_64-pld-linux-gnux32-gcc object... ok checking for sysroot... no checking for a working dd... /bin/dd checking how to truncate binary pipes... /bin/dd bs=4096 count=1 checking for x86_64-pld-linux-gnux32-mt... no checking for mt... no checking if : is a manifest tool... no checking how to run the C preprocessor... x86_64-pld-linux-gnux32-gcc -E checking for ANSI C header files... yes checking for sys/types.h... yes checking for sys/stat.h... yes checking for stdlib.h... yes checking for string.h... yes checking for memory.h... yes checking for strings.h... yes checking for inttypes.h... yes checking for stdint.h... yes checking for unistd.h... yes checking for dlfcn.h... yes checking for objdir... .libs checking if x86_64-pld-linux-gnux32-gcc supports -fno-rtti -fno-exceptions... no checking for x86_64-pld-linux-gnux32-gcc option to produce PIC... -fPIC -DPIC checking if x86_64-pld-linux-gnux32-gcc PIC flag -fPIC -DPIC works... yes checking if x86_64-pld-linux-gnux32-gcc static flag -static works... yes checking if x86_64-pld-linux-gnux32-gcc supports -c -o file.o... yes checking if x86_64-pld-linux-gnux32-gcc supports -c -o file.o... (cached) yes checking whether the x86_64-pld-linux-gnux32-gcc linker (/usr/bin/ld -m elf32_x86_64) supports shared libraries... yes checking whether -lc should be explicitly linked in... no checking dynamic linker characteristics... GNU/Linux ld.so checking how to hardcode library paths into programs... immediate checking whether stripping libraries is possible... yes checking if libtool supports shared libraries... yes checking whether to build shared libraries... yes checking whether to build static libraries... no checking how to run the C++ preprocessor... x86_64-pld-linux-gnux32-g++ -E checking for ld used by x86_64-pld-linux-gnux32-g++... /usr/bin/ld -m elf32_x86_64 checking if the linker (/usr/bin/ld -m elf32_x86_64) is GNU ld... yes checking whether the x86_64-pld-linux-gnux32-g++ linker (/usr/bin/ld -m elf32_x86_64) supports shared libraries... yes checking for x86_64-pld-linux-gnux32-g++ option to produce PIC... -fPIC -DPIC checking if x86_64-pld-linux-gnux32-g++ PIC flag -fPIC -DPIC works... yes checking if x86_64-pld-linux-gnux32-g++ static flag -static works... yes checking if x86_64-pld-linux-gnux32-g++ supports -c -o file.o... yes checking if x86_64-pld-linux-gnux32-g++ supports -c -o file.o... (cached) yes checking whether the x86_64-pld-linux-gnux32-g++ linker (/usr/bin/ld -m elf32_x86_64) supports shared libraries... yes checking dynamic linker characteristics... (cached) GNU/Linux ld.so checking how to hardcode library paths into programs... immediate checking for XML_ParserCreate in -lexpat... yes checking for snd_pcm_open in -lasound... yes checking openssl/ssl.h usability... yes checking openssl/ssl.h presence... yes checking for openssl/ssl.h... yes checking for x86_64-pld-linux-gnux32-pkg-config... /usr/bin/x86_64-pld-linux-gnux32-pkg-config checking pkg-config is at least version 0.9.0... yes checking for openssl >= 0.9.7g... yes checking for gtk+-2.0... yes checking for libsrtp >= 1.4.4... yes checking for xrender... yes checking for xcomposite... yes checking that generated files are newer than configure... done configure: creating ./config.status config.status: creating Makefile config.status: creating talk/Makefile config.status: creating talk/base/Makefile config.status: creating talk/examples/Makefile config.status: creating talk/examples/login/Makefile config.status: creating talk/examples/call/Makefile config.status: creating talk/p2p/Makefile config.status: creating talk/p2p/base/Makefile config.status: creating talk/p2p/client/Makefile config.status: creating talk/session/Makefile config.status: creating talk/session/tunnel/Makefile config.status: creating talk/session/phone/Makefile config.status: creating talk/sound/Makefile config.status: creating talk/xmllite/Makefile config.status: creating talk/xmpp/Makefile config.status: creating pkgconfig/Makefile config.status: creating pkgconfig/jinglebase.pc config.status: creating pkgconfig/jinglep2p.pc config.status: creating pkgconfig/jinglesessiontunnel.pc config.status: creating pkgconfig/jinglesessionphone.pc config.status: creating config.h config.status: executing depfiles commands config.status: executing libtool commands + /usr/bin/make -Otarget -j9 /usr/bin/make all-recursive Making all in talk Making all in base make[3]: Entering directory '/tmp/B.nfrc1a/BUILD/libjingle-0.6.14/talk/base' /bin/sh ../../libtool --silent --tag=CXX --mode=compile x86_64-pld-linux-gnux32-g++ -DHAVE_CONFIG_H -I. -I../.. -DPOSIX -DLINUX -DFEATURE_ENABLE_VOICEMAIL -O2 -fwrapv -pipe -Wformat -Werror=format-security -gdwarf-4 -fno-debug-types-section -fvar-tracking-assignments -g2 -Wp,-D_FORTIFY_SOURCE=2 -fstack-protector-strong --param=ssp-buffer-size=4 -fPIC -mtune=generic -march=x86-64 -gdwarf-4 -fno-debug-types-section -fvar-tracking-assignments -g2 -MT bandwidthsmoother.lo -MD -MP -MF .deps/bandwidthsmoother.Tpo -c -o bandwidthsmoother.lo bandwidthsmoother.cc mv -f .deps/bandwidthsmoother.Tpo .deps/bandwidthsmoother.Plo make[3]: Leaving directory '/tmp/B.nfrc1a/BUILD/libjingle-0.6.14/talk/base' make[3]: Entering directory '/tmp/B.nfrc1a/BUILD/libjingle-0.6.14/talk/base' /bin/sh ../../libtool --silent --tag=CXX --mode=compile x86_64-pld-linux-gnux32-g++ -DHAVE_CONFIG_H -I. -I../.. -DPOSIX -DLINUX -DFEATURE_ENABLE_VOICEMAIL -O2 -fwrapv -pipe -Wformat -Werror=format-security -gdwarf-4 -fno-debug-types-section -fvar-tracking-assignments -g2 -Wp,-D_FORTIFY_SOURCE=2 -fstack-protector-strong --param=ssp-buffer-size=4 -fPIC -mtune=generic -march=x86-64 -gdwarf-4 -fno-debug-types-section -fvar-tracking-assignments -g2 -MT base64.lo -MD -MP -MF .deps/base64.Tpo -c -o base64.lo base64.cc mv -f .deps/base64.Tpo .deps/base64.Plo make[3]: Leaving directory '/tmp/B.nfrc1a/BUILD/libjingle-0.6.14/talk/base' make[3]: Entering directory '/tmp/B.nfrc1a/BUILD/libjingle-0.6.14/talk/base' /bin/sh ../../libtool --silent --tag=CXX --mode=compile x86_64-pld-linux-gnux32-g++ -DHAVE_CONFIG_H -I. -I../.. -DPOSIX -DLINUX -DFEATURE_ENABLE_VOICEMAIL -O2 -fwrapv -pipe -Wformat -Werror=format-security -gdwarf-4 -fno-debug-types-section -fvar-tracking-assignments -g2 -Wp,-D_FORTIFY_SOURCE=2 -fstack-protector-strong --param=ssp-buffer-size=4 -fPIC -mtune=generic -march=x86-64 -gdwarf-4 -fno-debug-types-section -fvar-tracking-assignments -g2 -MT asyncfile.lo -MD -MP -MF .deps/asyncfile.Tpo -c -o asyncfile.lo asyncfile.cc mv -f .deps/asyncfile.Tpo .deps/asyncfile.Plo make[3]: Leaving directory '/tmp/B.nfrc1a/BUILD/libjingle-0.6.14/talk/base' make[3]: Entering directory '/tmp/B.nfrc1a/BUILD/libjingle-0.6.14/talk/base' /bin/sh ../../libtool --silent --tag=CXX --mode=compile x86_64-pld-linux-gnux32-g++ -DHAVE_CONFIG_H -I. -I../.. -DPOSIX -DLINUX -DFEATURE_ENABLE_VOICEMAIL -O2 -fwrapv -pipe -Wformat -Werror=format-security -gdwarf-4 -fno-debug-types-section -fvar-tracking-assignments -g2 -Wp,-D_FORTIFY_SOURCE=2 -fstack-protector-strong --param=ssp-buffer-size=4 -fPIC -mtune=generic -march=x86-64 -gdwarf-4 -fno-debug-types-section -fvar-tracking-assignments -g2 -MT bytebuffer.lo -MD -MP -MF .deps/bytebuffer.Tpo -c -o bytebuffer.lo bytebuffer.cc mv -f .deps/bytebuffer.Tpo .deps/bytebuffer.Plo make[3]: Leaving directory '/tmp/B.nfrc1a/BUILD/libjingle-0.6.14/talk/base' make[3]: Entering directory '/tmp/B.nfrc1a/BUILD/libjingle-0.6.14/talk/base' /bin/sh ../../libtool --silent --tag=CXX --mode=compile x86_64-pld-linux-gnux32-g++ -DHAVE_CONFIG_H -I. -I../.. -DPOSIX -DLINUX -DFEATURE_ENABLE_VOICEMAIL -O2 -fwrapv -pipe -Wformat -Werror=format-security -gdwarf-4 -fno-debug-types-section -fvar-tracking-assignments -g2 -Wp,-D_FORTIFY_SOURCE=2 -fstack-protector-strong --param=ssp-buffer-size=4 -fPIC -mtune=generic -march=x86-64 -gdwarf-4 -fno-debug-types-section -fvar-tracking-assignments -g2 -MT basicpacketsocketfactory.lo -MD -MP -MF .deps/basicpacketsocketfactory.Tpo -c -o basicpacketsocketfactory.lo basicpacketsocketfactory.cc mv -f .deps/basicpacketsocketfactory.Tpo .deps/basicpacketsocketfactory.Plo make[3]: Leaving directory '/tmp/B.nfrc1a/BUILD/libjingle-0.6.14/talk/base' make[3]: Entering directory '/tmp/B.nfrc1a/BUILD/libjingle-0.6.14/talk/base' /bin/sh ../../libtool --silent --tag=CXX --mode=compile x86_64-pld-linux-gnux32-g++ -DHAVE_CONFIG_H -I. -I../.. -DPOSIX -DLINUX -DFEATURE_ENABLE_VOICEMAIL -O2 -fwrapv -pipe -Wformat -Werror=format-security -gdwarf-4 -fno-debug-types-section -fvar-tracking-assignments -g2 -Wp,-D_FORTIFY_SOURCE=2 -fstack-protector-strong --param=ssp-buffer-size=4 -fPIC -mtune=generic -march=x86-64 -gdwarf-4 -fno-debug-types-section -fvar-tracking-assignments -g2 -MT checks.lo -MD -MP -MF .deps/checks.Tpo -c -o checks.lo checks.cc mv -f .deps/checks.Tpo .deps/checks.Plo make[3]: Leaving directory '/tmp/B.nfrc1a/BUILD/libjingle-0.6.14/talk/base' make[3]: Entering directory '/tmp/B.nfrc1a/BUILD/libjingle-0.6.14/talk/base' /bin/sh ../../libtool --silent --tag=CXX --mode=compile x86_64-pld-linux-gnux32-g++ -DHAVE_CONFIG_H -I. -I../.. -DPOSIX -DLINUX -DFEATURE_ENABLE_VOICEMAIL -O2 -fwrapv -pipe -Wformat -Werror=format-security -gdwarf-4 -fno-debug-types-section -fvar-tracking-assignments -g2 -Wp,-D_FORTIFY_SOURCE=2 -fstack-protector-strong --param=ssp-buffer-size=4 -fPIC -mtune=generic -march=x86-64 -gdwarf-4 -fno-debug-types-section -fvar-tracking-assignments -g2 -MT common.lo -MD -MP -MF .deps/common.Tpo -c -o common.lo common.cc mv -f .deps/common.Tpo .deps/common.Plo make[3]: Leaving directory '/tmp/B.nfrc1a/BUILD/libjingle-0.6.14/talk/base' make[3]: Entering directory '/tmp/B.nfrc1a/BUILD/libjingle-0.6.14/talk/base' /bin/sh ../../libtool --silent --tag=CXX --mode=compile x86_64-pld-linux-gnux32-g++ -DHAVE_CONFIG_H -I. -I../.. -DPOSIX -DLINUX -DFEATURE_ENABLE_VOICEMAIL -O2 -fwrapv -pipe -Wformat -Werror=format-security -gdwarf-4 -fno-debug-types-section -fvar-tracking-assignments -g2 -Wp,-D_FORTIFY_SOURCE=2 -fstack-protector-strong --param=ssp-buffer-size=4 -fPIC -mtune=generic -march=x86-64 -gdwarf-4 -fno-debug-types-section -fvar-tracking-assignments -g2 -MT dbus.lo -MD -MP -MF .deps/dbus.Tpo -c -o dbus.lo dbus.cc mv -f .deps/dbus.Tpo .deps/dbus.Plo make[3]: Leaving directory '/tmp/B.nfrc1a/BUILD/libjingle-0.6.14/talk/base' make[3]: Entering directory '/tmp/B.nfrc1a/BUILD/libjingle-0.6.14/talk/base' /bin/sh ../../libtool --silent --tag=CXX --mode=compile x86_64-pld-linux-gnux32-g++ -DHAVE_CONFIG_H -I. -I../.. -DPOSIX -DLINUX -DFEATURE_ENABLE_VOICEMAIL -O2 -fwrapv -pipe -Wformat -Werror=format-security -gdwarf-4 -fno-debug-types-section -fvar-tracking-assignments -g2 -Wp,-D_FORTIFY_SOURCE=2 -fstack-protector-strong --param=ssp-buffer-size=4 -fPIC -mtune=generic -march=x86-64 -gdwarf-4 -fno-debug-types-section -fvar-tracking-assignments -g2 -MT asynchttprequest.lo -MD -MP -MF .deps/asynchttprequest.Tpo -c -o asynchttprequest.lo asynchttprequest.cc mv -f .deps/asynchttprequest.Tpo .deps/asynchttprequest.Plo make[3]: Leaving directory '/tmp/B.nfrc1a/BUILD/libjingle-0.6.14/talk/base' make[3]: Entering directory '/tmp/B.nfrc1a/BUILD/libjingle-0.6.14/talk/base' /bin/sh ../../libtool --silent --tag=CXX --mode=compile x86_64-pld-linux-gnux32-g++ -DHAVE_CONFIG_H -I. -I../.. -DPOSIX -DLINUX -DFEATURE_ENABLE_VOICEMAIL -O2 -fwrapv -pipe -Wformat -Werror=format-security -gdwarf-4 -fno-debug-types-section -fvar-tracking-assignments -g2 -Wp,-D_FORTIFY_SOURCE=2 -fstack-protector-strong --param=ssp-buffer-size=4 -fPIC -mtune=generic -march=x86-64 -gdwarf-4 -fno-debug-types-section -fvar-tracking-assignments -g2 -MT asyncsocket.lo -MD -MP -MF .deps/asyncsocket.Tpo -c -o asyncsocket.lo asyncsocket.cc mv -f .deps/asyncsocket.Tpo .deps/asyncsocket.Plo make[3]: Leaving directory '/tmp/B.nfrc1a/BUILD/libjingle-0.6.14/talk/base' make[3]: Entering directory '/tmp/B.nfrc1a/BUILD/libjingle-0.6.14/talk/base' /bin/sh ../../libtool --silent --tag=CXX --mode=compile x86_64-pld-linux-gnux32-g++ -DHAVE_CONFIG_H -I. -I../.. -DPOSIX -DLINUX -DFEATURE_ENABLE_VOICEMAIL -O2 -fwrapv -pipe -Wformat -Werror=format-security -gdwarf-4 -fno-debug-types-section -fvar-tracking-assignments -g2 -Wp,-D_FORTIFY_SOURCE=2 -fstack-protector-strong --param=ssp-buffer-size=4 -fPIC -mtune=generic -march=x86-64 -gdwarf-4 -fno-debug-types-section -fvar-tracking-assignments -g2 -MT event.lo -MD -MP -MF .deps/event.Tpo -c -o event.lo event.cc mv -f .deps/event.Tpo .deps/event.Plo make[3]: Leaving directory '/tmp/B.nfrc1a/BUILD/libjingle-0.6.14/talk/base' make[3]: Entering directory '/tmp/B.nfrc1a/BUILD/libjingle-0.6.14/talk/base' /bin/sh ../../libtool --silent --tag=CXX --mode=compile x86_64-pld-linux-gnux32-g++ -DHAVE_CONFIG_H -I. -I../.. -DPOSIX -DLINUX -DFEATURE_ENABLE_VOICEMAIL -O2 -fwrapv -pipe -Wformat -Werror=format-security -gdwarf-4 -fno-debug-types-section -fvar-tracking-assignments -g2 -Wp,-D_FORTIFY_SOURCE=2 -fstack-protector-strong --param=ssp-buffer-size=4 -fPIC -mtune=generic -march=x86-64 -gdwarf-4 -fno-debug-types-section -fvar-tracking-assignments -g2 -MT cpuid.lo -MD -MP -MF .deps/cpuid.Tpo -c -o cpuid.lo cpuid.cc mv -f .deps/cpuid.Tpo .deps/cpuid.Plo make[3]: Leaving directory '/tmp/B.nfrc1a/BUILD/libjingle-0.6.14/talk/base' make[3]: Entering directory '/tmp/B.nfrc1a/BUILD/libjingle-0.6.14/talk/base' /bin/sh ../../libtool --silent --tag=CXX --mode=compile x86_64-pld-linux-gnux32-g++ -DHAVE_CONFIG_H -I. -I../.. -DPOSIX -DLINUX -DFEATURE_ENABLE_VOICEMAIL -O2 -fwrapv -pipe -Wformat -Werror=format-security -gdwarf-4 -fno-debug-types-section -fvar-tracking-assignments -g2 -Wp,-D_FORTIFY_SOURCE=2 -fstack-protector-strong --param=ssp-buffer-size=4 -fPIC -mtune=generic -march=x86-64 -gdwarf-4 -fno-debug-types-section -fvar-tracking-assignments -g2 -MT autodetectproxy.lo -MD -MP -MF .deps/autodetectproxy.Tpo -c -o autodetectproxy.lo autodetectproxy.cc mv -f .deps/autodetectproxy.Tpo .deps/autodetectproxy.Plo make[3]: Leaving directory '/tmp/B.nfrc1a/BUILD/libjingle-0.6.14/talk/base' make[3]: Entering directory '/tmp/B.nfrc1a/BUILD/libjingle-0.6.14/talk/base' /bin/sh ../../libtool --silent --tag=CXX --mode=compile x86_64-pld-linux-gnux32-g++ -DHAVE_CONFIG_H -I. -I../.. -DPOSIX -DLINUX -DFEATURE_ENABLE_VOICEMAIL -O2 -fwrapv -pipe -Wformat -Werror=format-security -gdwarf-4 -fno-debug-types-section -fvar-tracking-assignments -g2 -Wp,-D_FORTIFY_SOURCE=2 -fstack-protector-strong --param=ssp-buffer-size=4 -fPIC -mtune=generic -march=x86-64 -gdwarf-4 -fno-debug-types-section -fvar-tracking-assignments -g2 -MT flags.lo -MD -MP -MF .deps/flags.Tpo -c -o flags.lo flags.cc mv -f .deps/flags.Tpo .deps/flags.Plo make[3]: Leaving directory '/tmp/B.nfrc1a/BUILD/libjingle-0.6.14/talk/base' make[3]: Entering directory '/tmp/B.nfrc1a/BUILD/libjingle-0.6.14/talk/base' /bin/sh ../../libtool --silent --tag=CXX --mode=compile x86_64-pld-linux-gnux32-g++ -DHAVE_CONFIG_H -I. -I../.. -DPOSIX -DLINUX -DFEATURE_ENABLE_VOICEMAIL -O2 -fwrapv -pipe -Wformat -Werror=format-security -gdwarf-4 -fno-debug-types-section -fvar-tracking-assignments -g2 -Wp,-D_FORTIFY_SOURCE=2 -fstack-protector-strong --param=ssp-buffer-size=4 -fPIC -mtune=generic -march=x86-64 -gdwarf-4 -fno-debug-types-section -fvar-tracking-assignments -g2 -MT filelock.lo -MD -MP -MF .deps/filelock.Tpo -c -o filelock.lo filelock.cc mv -f .deps/filelock.Tpo .deps/filelock.Plo make[3]: Leaving directory '/tmp/B.nfrc1a/BUILD/libjingle-0.6.14/talk/base' make[3]: Entering directory '/tmp/B.nfrc1a/BUILD/libjingle-0.6.14/talk/base' /bin/sh ../../libtool --silent --tag=CXX --mode=compile x86_64-pld-linux-gnux32-g++ -DHAVE_CONFIG_H -I. -I../.. -DPOSIX -DLINUX -DFEATURE_ENABLE_VOICEMAIL -O2 -fwrapv -pipe -Wformat -Werror=format-security -gdwarf-4 -fno-debug-types-section -fvar-tracking-assignments -g2 -Wp,-D_FORTIFY_SOURCE=2 -fstack-protector-strong --param=ssp-buffer-size=4 -fPIC -mtune=generic -march=x86-64 -gdwarf-4 -fno-debug-types-section -fvar-tracking-assignments -g2 -MT host.lo -MD -MP -MF .deps/host.Tpo -c -o host.lo host.cc mv -f .deps/host.Tpo .deps/host.Plo make[3]: Leaving directory '/tmp/B.nfrc1a/BUILD/libjingle-0.6.14/talk/base' make[3]: Entering directory '/tmp/B.nfrc1a/BUILD/libjingle-0.6.14/talk/base' /bin/sh ../../libtool --silent --tag=CXX --mode=compile x86_64-pld-linux-gnux32-g++ -DHAVE_CONFIG_H -I. -I../.. -DPOSIX -DLINUX -DFEATURE_ENABLE_VOICEMAIL -O2 -fwrapv -pipe -Wformat -Werror=format-security -gdwarf-4 -fno-debug-types-section -fvar-tracking-assignments -g2 -Wp,-D_FORTIFY_SOURCE=2 -fstack-protector-strong --param=ssp-buffer-size=4 -fPIC -mtune=generic -march=x86-64 -gdwarf-4 -fno-debug-types-section -fvar-tracking-assignments -g2 -MT helpers.lo -MD -MP -MF .deps/helpers.Tpo -c -o helpers.lo helpers.cc mv -f .deps/helpers.Tpo .deps/helpers.Plo make[3]: Leaving directory '/tmp/B.nfrc1a/BUILD/libjingle-0.6.14/talk/base' make[3]: Entering directory '/tmp/B.nfrc1a/BUILD/libjingle-0.6.14/talk/base' /bin/sh ../../libtool --silent --tag=CXX --mode=compile x86_64-pld-linux-gnux32-g++ -DHAVE_CONFIG_H -I. -I../.. -DPOSIX -DLINUX -DFEATURE_ENABLE_VOICEMAIL -O2 -fwrapv -pipe -Wformat -Werror=format-security -gdwarf-4 -fno-debug-types-section -fvar-tracking-assignments -g2 -Wp,-D_FORTIFY_SOURCE=2 -fstack-protector-strong --param=ssp-buffer-size=4 -fPIC -mtune=generic -march=x86-64 -gdwarf-4 -fno-debug-types-section -fvar-tracking-assignments -g2 -MT asyncudpsocket.lo -MD -MP -MF .deps/asyncudpsocket.Tpo -c -o asyncudpsocket.lo asyncudpsocket.cc mv -f .deps/asyncudpsocket.Tpo .deps/asyncudpsocket.Plo make[3]: Leaving directory '/tmp/B.nfrc1a/BUILD/libjingle-0.6.14/talk/base' make[3]: Entering directory '/tmp/B.nfrc1a/BUILD/libjingle-0.6.14/talk/base' /bin/sh ../../libtool --silent --tag=CXX --mode=compile x86_64-pld-linux-gnux32-g++ -DHAVE_CONFIG_H -I. -I../.. -DPOSIX -DLINUX -DFEATURE_ENABLE_VOICEMAIL -O2 -fwrapv -pipe -Wformat -Werror=format-security -gdwarf-4 -fno-debug-types-section -fvar-tracking-assignments -g2 -Wp,-D_FORTIFY_SOURCE=2 -fstack-protector-strong --param=ssp-buffer-size=4 -fPIC -mtune=generic -march=x86-64 -gdwarf-4 -fno-debug-types-section -fvar-tracking-assignments -g2 -MT fileutils.lo -MD -MP -MF .deps/fileutils.Tpo -c -o fileutils.lo fileutils.cc mv -f .deps/fileutils.Tpo .deps/fileutils.Plo make[3]: Leaving directory '/tmp/B.nfrc1a/BUILD/libjingle-0.6.14/talk/base' make[3]: Entering directory '/tmp/B.nfrc1a/BUILD/libjingle-0.6.14/talk/base' /bin/sh ../../libtool --silent --tag=CXX --mode=compile x86_64-pld-linux-gnux32-g++ -DHAVE_CONFIG_H -I. -I../.. -DPOSIX -DLINUX -DFEATURE_ENABLE_VOICEMAIL -O2 -fwrapv -pipe -Wformat -Werror=format-security -gdwarf-4 -fno-debug-types-section -fvar-tracking-assignments -g2 -Wp,-D_FORTIFY_SOURCE=2 -fstack-protector-strong --param=ssp-buffer-size=4 -fPIC -mtune=generic -march=x86-64 -gdwarf-4 -fno-debug-types-section -fvar-tracking-assignments -g2 -MT diskcache.lo -MD -MP -MF .deps/diskcache.Tpo -c -o diskcache.lo diskcache.cc mv -f .deps/diskcache.Tpo .deps/diskcache.Plo make[3]: Leaving directory '/tmp/B.nfrc1a/BUILD/libjingle-0.6.14/talk/base' make[3]: Entering directory '/tmp/B.nfrc1a/BUILD/libjingle-0.6.14/talk/base' /bin/sh ../../libtool --silent --tag=CXX --mode=compile x86_64-pld-linux-gnux32-g++ -DHAVE_CONFIG_H -I. -I../.. -DPOSIX -DLINUX -DFEATURE_ENABLE_VOICEMAIL -O2 -fwrapv -pipe -Wformat -Werror=format-security -gdwarf-4 -fno-debug-types-section -fvar-tracking-assignments -g2 -Wp,-D_FORTIFY_SOURCE=2 -fstack-protector-strong --param=ssp-buffer-size=4 -fPIC -mtune=generic -march=x86-64 -gdwarf-4 -fno-debug-types-section -fvar-tracking-assignments -g2 -MT asynctcpsocket.lo -MD -MP -MF .deps/asynctcpsocket.Tpo -c -o asynctcpsocket.lo asynctcpsocket.cc mv -f .deps/asynctcpsocket.Tpo .deps/asynctcpsocket.Plo make[3]: Leaving directory '/tmp/B.nfrc1a/BUILD/libjingle-0.6.14/talk/base' make[3]: Entering directory '/tmp/B.nfrc1a/BUILD/libjingle-0.6.14/talk/base' /bin/sh ../../libtool --silent --tag=CXX --mode=compile x86_64-pld-linux-gnux32-g++ -DHAVE_CONFIG_H -I. -I../.. -DPOSIX -DLINUX -DFEATURE_ENABLE_VOICEMAIL -O2 -fwrapv -pipe -Wformat -Werror=format-security -gdwarf-4 -fno-debug-types-section -fvar-tracking-assignments -g2 -Wp,-D_FORTIFY_SOURCE=2 -fstack-protector-strong --param=ssp-buffer-size=4 -fPIC -mtune=generic -march=x86-64 -gdwarf-4 -fno-debug-types-section -fvar-tracking-assignments -g2 -MT cpumonitor.lo -MD -MP -MF .deps/cpumonitor.Tpo -c -o cpumonitor.lo cpumonitor.cc mv -f .deps/cpumonitor.Tpo .deps/cpumonitor.Plo make[3]: Leaving directory '/tmp/B.nfrc1a/BUILD/libjingle-0.6.14/talk/base' make[3]: Entering directory '/tmp/B.nfrc1a/BUILD/libjingle-0.6.14/talk/base' /bin/sh ../../libtool --silent --tag=CXX --mode=compile x86_64-pld-linux-gnux32-g++ -DHAVE_CONFIG_H -I. -I../.. -DPOSIX -DLINUX -DFEATURE_ENABLE_VOICEMAIL -O2 -fwrapv -pipe -Wformat -Werror=format-security -gdwarf-4 -fno-debug-types-section -fvar-tracking-assignments -g2 -Wp,-D_FORTIFY_SOURCE=2 -fstack-protector-strong --param=ssp-buffer-size=4 -fPIC -mtune=generic -march=x86-64 -gdwarf-4 -fno-debug-types-section -fvar-tracking-assignments -g2 -MT firewallsocketserver.lo -MD -MP -MF .deps/firewallsocketserver.Tpo -c -o firewallsocketserver.lo firewallsocketserver.cc mv -f .deps/firewallsocketserver.Tpo .deps/firewallsocketserver.Plo make[3]: Leaving directory '/tmp/B.nfrc1a/BUILD/libjingle-0.6.14/talk/base' make[3]: Entering directory '/tmp/B.nfrc1a/BUILD/libjingle-0.6.14/talk/base' /bin/sh ../../libtool --silent --tag=CXX --mode=compile x86_64-pld-linux-gnux32-g++ -DHAVE_CONFIG_H -I. -I../.. -DPOSIX -DLINUX -DFEATURE_ENABLE_VOICEMAIL -O2 -fwrapv -pipe -Wformat -Werror=format-security -gdwarf-4 -fno-debug-types-section -fvar-tracking-assignments -g2 -Wp,-D_FORTIFY_SOURCE=2 -fstack-protector-strong --param=ssp-buffer-size=4 -fPIC -mtune=generic -march=x86-64 -gdwarf-4 -fno-debug-types-section -fvar-tracking-assignments -g2 -MT latebindingsymboltable.lo -MD -MP -MF .deps/latebindingsymboltable.Tpo -c -o latebindingsymboltable.lo latebindingsymboltable.cc mv -f .deps/latebindingsymboltable.Tpo .deps/latebindingsymboltable.Plo make[3]: Leaving directory '/tmp/B.nfrc1a/BUILD/libjingle-0.6.14/talk/base' make[3]: Entering directory '/tmp/B.nfrc1a/BUILD/libjingle-0.6.14/talk/base' /bin/sh ../../libtool --silent --tag=CXX --mode=compile x86_64-pld-linux-gnux32-g++ -DHAVE_CONFIG_H -I. -I../.. -DPOSIX -DLINUX -DFEATURE_ENABLE_VOICEMAIL -O2 -fwrapv -pipe -Wformat -Werror=format-security -gdwarf-4 -fno-debug-types-section -fvar-tracking-assignments -g2 -Wp,-D_FORTIFY_SOURCE=2 -fstack-protector-strong --param=ssp-buffer-size=4 -fPIC -mtune=generic -march=x86-64 -gdwarf-4 -fno-debug-types-section -fvar-tracking-assignments -g2 -MT libdbusglibsymboltable.lo -MD -MP -MF .deps/libdbusglibsymboltable.Tpo -c -o libdbusglibsymboltable.lo libdbusglibsymboltable.cc mv -f .deps/libdbusglibsymboltable.Tpo .deps/libdbusglibsymboltable.Plo make[3]: Leaving directory '/tmp/B.nfrc1a/BUILD/libjingle-0.6.14/talk/base' make[3]: Entering directory '/tmp/B.nfrc1a/BUILD/libjingle-0.6.14/talk/base' /bin/sh ../../libtool --silent --tag=CC --mode=compile x86_64-pld-linux-gnux32-gcc -DHAVE_CONFIG_H -I. -I../.. -O2 -fwrapv -pipe -Wformat -Werror=format-security -gdwarf-4 -fno-debug-types-section -fvar-tracking-assignments -g2 -Wp,-D_FORTIFY_SOURCE=2 -fstack-protector-strong --param=ssp-buffer-size=4 -fPIC -mtune=generic -march=x86-64 -gdwarf-4 -fno-debug-types-section -fvar-tracking-assignments -g2 -MT linuxfdwalk.lo -MD -MP -MF .deps/linuxfdwalk.Tpo -c -o linuxfdwalk.lo linuxfdwalk.c mv -f .deps/linuxfdwalk.Tpo .deps/linuxfdwalk.Plo make[3]: Leaving directory '/tmp/B.nfrc1a/BUILD/libjingle-0.6.14/talk/base' make[3]: Entering directory '/tmp/B.nfrc1a/BUILD/libjingle-0.6.14/talk/base' /bin/sh ../../libtool --silent --tag=CXX --mode=compile x86_64-pld-linux-gnux32-g++ -DHAVE_CONFIG_H -I. -I../.. -DPOSIX -DLINUX -DFEATURE_ENABLE_VOICEMAIL -O2 -fwrapv -pipe -Wformat -Werror=format-security -gdwarf-4 -fno-debug-types-section -fvar-tracking-assignments -g2 -Wp,-D_FORTIFY_SOURCE=2 -fstack-protector-strong --param=ssp-buffer-size=4 -fPIC -mtune=generic -march=x86-64 -gdwarf-4 -fno-debug-types-section -fvar-tracking-assignments -g2 -MT ipaddress.lo -MD -MP -MF .deps/ipaddress.Tpo -c -o ipaddress.lo ipaddress.cc mv -f .deps/ipaddress.Tpo .deps/ipaddress.Plo make[3]: Leaving directory '/tmp/B.nfrc1a/BUILD/libjingle-0.6.14/talk/base' make[3]: Entering directory '/tmp/B.nfrc1a/BUILD/libjingle-0.6.14/talk/base' /bin/sh ../../libtool --silent --tag=CC --mode=compile x86_64-pld-linux-gnux32-gcc -DHAVE_CONFIG_H -I. -I../.. -O2 -fwrapv -pipe -Wformat -Werror=format-security -gdwarf-4 -fno-debug-types-section -fvar-tracking-assignments -g2 -Wp,-D_FORTIFY_SOURCE=2 -fstack-protector-strong --param=ssp-buffer-size=4 -fPIC -mtune=generic -march=x86-64 -gdwarf-4 -fno-debug-types-section -fvar-tracking-assignments -g2 -MT md5c.lo -MD -MP -MF .deps/md5c.Tpo -c -o md5c.lo md5c.c mv -f .deps/md5c.Tpo .deps/md5c.Plo make[3]: Leaving directory '/tmp/B.nfrc1a/BUILD/libjingle-0.6.14/talk/base' make[3]: Entering directory '/tmp/B.nfrc1a/BUILD/libjingle-0.6.14/talk/base' /bin/sh ../../libtool --silent --tag=CXX --mode=compile x86_64-pld-linux-gnux32-g++ -DHAVE_CONFIG_H -I. -I../.. -DPOSIX -DLINUX -DFEATURE_ENABLE_VOICEMAIL -O2 -fwrapv -pipe -Wformat -Werror=format-security -gdwarf-4 -fno-debug-types-section -fvar-tracking-assignments -g2 -Wp,-D_FORTIFY_SOURCE=2 -fstack-protector-strong --param=ssp-buffer-size=4 -fPIC -mtune=generic -march=x86-64 -gdwarf-4 -fno-debug-types-section -fvar-tracking-assignments -g2 -MT httpbase.lo -MD -MP -MF .deps/httpbase.Tpo -c -o httpbase.lo httpbase.cc mv -f .deps/httpbase.Tpo .deps/httpbase.Plo make[3]: Leaving directory '/tmp/B.nfrc1a/BUILD/libjingle-0.6.14/talk/base' make[3]: Entering directory '/tmp/B.nfrc1a/BUILD/libjingle-0.6.14/talk/base' /bin/sh ../../libtool --silent --tag=CXX --mode=compile x86_64-pld-linux-gnux32-g++ -DHAVE_CONFIG_H -I. -I../.. -DPOSIX -DLINUX -DFEATURE_ENABLE_VOICEMAIL -O2 -fwrapv -pipe -Wformat -Werror=format-security -gdwarf-4 -fno-debug-types-section -fvar-tracking-assignments -g2 -Wp,-D_FORTIFY_SOURCE=2 -fstack-protector-strong --param=ssp-buffer-size=4 -fPIC -mtune=generic -march=x86-64 -gdwarf-4 -fno-debug-types-section -fvar-tracking-assignments -g2 -MT messagehandler.lo -MD -MP -MF .deps/messagehandler.Tpo -c -o messagehandler.lo messagehandler.cc mv -f .deps/messagehandler.Tpo .deps/messagehandler.Plo make[3]: Leaving directory '/tmp/B.nfrc1a/BUILD/libjingle-0.6.14/talk/base' make[3]: Entering directory '/tmp/B.nfrc1a/BUILD/libjingle-0.6.14/talk/base' /bin/sh ../../libtool --silent --tag=CXX --mode=compile x86_64-pld-linux-gnux32-g++ -DHAVE_CONFIG_H -I. -I../.. -DPOSIX -DLINUX -DFEATURE_ENABLE_VOICEMAIL -O2 -fwrapv -pipe -Wformat -Werror=format-security -gdwarf-4 -fno-debug-types-section -fvar-tracking-assignments -g2 -Wp,-D_FORTIFY_SOURCE=2 -fstack-protector-strong --param=ssp-buffer-size=4 -fPIC -mtune=generic -march=x86-64 -gdwarf-4 -fno-debug-types-section -fvar-tracking-assignments -g2 -MT httprequest.lo -MD -MP -MF .deps/httprequest.Tpo -c -o httprequest.lo httprequest.cc mv -f .deps/httprequest.Tpo .deps/httprequest.Plo make[3]: Leaving directory '/tmp/B.nfrc1a/BUILD/libjingle-0.6.14/talk/base' make[3]: Entering directory '/tmp/B.nfrc1a/BUILD/libjingle-0.6.14/talk/base' /bin/sh ../../libtool --silent --tag=CXX --mode=compile x86_64-pld-linux-gnux32-g++ -DHAVE_CONFIG_H -I. -I../.. -DPOSIX -DLINUX -DFEATURE_ENABLE_VOICEMAIL -O2 -fwrapv -pipe -Wformat -Werror=format-security -gdwarf-4 -fno-debug-types-section -fvar-tracking-assignments -g2 -Wp,-D_FORTIFY_SOURCE=2 -fstack-protector-strong --param=ssp-buffer-size=4 -fPIC -mtune=generic -march=x86-64 -gdwarf-4 -fno-debug-types-section -fvar-tracking-assignments -g2 -MT logging.lo -MD -MP -MF .deps/logging.Tpo -c -o logging.lo logging.cc mv -f .deps/logging.Tpo .deps/logging.Plo make[3]: Leaving directory '/tmp/B.nfrc1a/BUILD/libjingle-0.6.14/talk/base' make[3]: Entering directory '/tmp/B.nfrc1a/BUILD/libjingle-0.6.14/talk/base' /bin/sh ../../libtool --silent --tag=CXX --mode=compile x86_64-pld-linux-gnux32-g++ -DHAVE_CONFIG_H -I. -I../.. -DPOSIX -DLINUX -DFEATURE_ENABLE_VOICEMAIL -O2 -fwrapv -pipe -Wformat -Werror=format-security -gdwarf-4 -fno-debug-types-section -fvar-tracking-assignments -g2 -Wp,-D_FORTIFY_SOURCE=2 -fstack-protector-strong --param=ssp-buffer-size=4 -fPIC -mtune=generic -march=x86-64 -gdwarf-4 -fno-debug-types-section -fvar-tracking-assignments -g2 -MT linuxwindowpicker.lo -MD -MP -MF .deps/linuxwindowpicker.Tpo -c -o linuxwindowpicker.lo linuxwindowpicker.cc mv -f .deps/linuxwindowpicker.Tpo .deps/linuxwindowpicker.Plo make[3]: Leaving directory '/tmp/B.nfrc1a/BUILD/libjingle-0.6.14/talk/base' make[3]: Entering directory '/tmp/B.nfrc1a/BUILD/libjingle-0.6.14/talk/base' /bin/sh ../../libtool --silent --tag=CXX --mode=compile x86_64-pld-linux-gnux32-g++ -DHAVE_CONFIG_H -I. -I../.. -DPOSIX -DLINUX -DFEATURE_ENABLE_VOICEMAIL -O2 -fwrapv -pipe -Wformat -Werror=format-security -gdwarf-4 -fno-debug-types-section -fvar-tracking-assignments -g2 -Wp,-D_FORTIFY_SOURCE=2 -fstack-protector-strong --param=ssp-buffer-size=4 -fPIC -mtune=generic -march=x86-64 -gdwarf-4 -fno-debug-types-section -fvar-tracking-assignments -g2 -MT linux.lo -MD -MP -MF .deps/linux.Tpo -c -o linux.lo linux.cc mv -f .deps/linux.Tpo .deps/linux.Plo make[3]: Leaving directory '/tmp/B.nfrc1a/BUILD/libjingle-0.6.14/talk/base' make[3]: Entering directory '/tmp/B.nfrc1a/BUILD/libjingle-0.6.14/talk/base' /bin/sh ../../libtool --silent --tag=CXX --mode=compile x86_64-pld-linux-gnux32-g++ -DHAVE_CONFIG_H -I. -I../.. -DPOSIX -DLINUX -DFEATURE_ENABLE_VOICEMAIL -O2 -fwrapv -pipe -Wformat -Werror=format-security -gdwarf-4 -fno-debug-types-section -fvar-tracking-assignments -g2 -Wp,-D_FORTIFY_SOURCE=2 -fstack-protector-strong --param=ssp-buffer-size=4 -fPIC -mtune=generic -march=x86-64 -gdwarf-4 -fno-debug-types-section -fvar-tracking-assignments -g2 -MT nattypes.lo -MD -MP -MF .deps/nattypes.Tpo -c -o nattypes.lo nattypes.cc mv -f .deps/nattypes.Tpo .deps/nattypes.Plo make[3]: Leaving directory '/tmp/B.nfrc1a/BUILD/libjingle-0.6.14/talk/base' make[3]: Entering directory '/tmp/B.nfrc1a/BUILD/libjingle-0.6.14/talk/base' /bin/sh ../../libtool --silent --tag=CXX --mode=compile x86_64-pld-linux-gnux32-g++ -DHAVE_CONFIG_H -I. -I../.. -DPOSIX -DLINUX -DFEATURE_ENABLE_VOICEMAIL -O2 -fwrapv -pipe -Wformat -Werror=format-security -gdwarf-4 -fno-debug-types-section -fvar-tracking-assignments -g2 -Wp,-D_FORTIFY_SOURCE=2 -fstack-protector-strong --param=ssp-buffer-size=4 -fPIC -mtune=generic -march=x86-64 -gdwarf-4 -fno-debug-types-section -fvar-tracking-assignments -g2 -MT httpclient.lo -MD -MP -MF .deps/httpclient.Tpo -c -o httpclient.lo httpclient.cc mv -f .deps/httpclient.Tpo .deps/httpclient.Plo make[3]: Leaving directory '/tmp/B.nfrc1a/BUILD/libjingle-0.6.14/talk/base' make[3]: Entering directory '/tmp/B.nfrc1a/BUILD/libjingle-0.6.14/talk/base' /bin/sh ../../libtool --silent --tag=CXX --mode=compile x86_64-pld-linux-gnux32-g++ -DHAVE_CONFIG_H -I. -I../.. -DPOSIX -DLINUX -DFEATURE_ENABLE_VOICEMAIL -O2 -fwrapv -pipe -Wformat -Werror=format-security -gdwarf-4 -fno-debug-types-section -fvar-tracking-assignments -g2 -Wp,-D_FORTIFY_SOURCE=2 -fstack-protector-strong --param=ssp-buffer-size=4 -fPIC -mtune=generic -march=x86-64 -gdwarf-4 -fno-debug-types-section -fvar-tracking-assignments -g2 -MT nethelpers.lo -MD -MP -MF .deps/nethelpers.Tpo -c -o nethelpers.lo nethelpers.cc mv -f .deps/nethelpers.Tpo .deps/nethelpers.Plo make[3]: Leaving directory '/tmp/B.nfrc1a/BUILD/libjingle-0.6.14/talk/base' make[3]: Entering directory '/tmp/B.nfrc1a/BUILD/libjingle-0.6.14/talk/base' /bin/sh ../../libtool --silent --tag=CXX --mode=compile x86_64-pld-linux-gnux32-g++ -DHAVE_CONFIG_H -I. -I../.. -DPOSIX -DLINUX -DFEATURE_ENABLE_VOICEMAIL -O2 -fwrapv -pipe -Wformat -Werror=format-security -gdwarf-4 -fno-debug-types-section -fvar-tracking-assignments -g2 -Wp,-D_FORTIFY_SOURCE=2 -fstack-protector-strong --param=ssp-buffer-size=4 -fPIC -mtune=generic -march=x86-64 -gdwarf-4 -fno-debug-types-section -fvar-tracking-assignments -g2 -MT httpcommon.lo -MD -MP -MF .deps/httpcommon.Tpo -c -o httpcommon.lo httpcommon.cc mv -f .deps/httpcommon.Tpo .deps/httpcommon.Plo make[3]: Leaving directory '/tmp/B.nfrc1a/BUILD/libjingle-0.6.14/talk/base' make[3]: Entering directory '/tmp/B.nfrc1a/BUILD/libjingle-0.6.14/talk/base' /bin/sh ../../libtool --silent --tag=CXX --mode=compile x86_64-pld-linux-gnux32-g++ -DHAVE_CONFIG_H -I. -I../.. -DPOSIX -DLINUX -DFEATURE_ENABLE_VOICEMAIL -O2 -fwrapv -pipe -Wformat -Werror=format-security -gdwarf-4 -fno-debug-types-section -fvar-tracking-assignments -g2 -Wp,-D_FORTIFY_SOURCE=2 -fstack-protector-strong --param=ssp-buffer-size=4 -fPIC -mtune=generic -march=x86-64 -gdwarf-4 -fno-debug-types-section -fvar-tracking-assignments -g2 -MT messagequeue.lo -MD -MP -MF .deps/messagequeue.Tpo -c -o messagequeue.lo messagequeue.cc mv -f .deps/messagequeue.Tpo .deps/messagequeue.Plo make[3]: Leaving directory '/tmp/B.nfrc1a/BUILD/libjingle-0.6.14/talk/base' make[3]: Entering directory '/tmp/B.nfrc1a/BUILD/libjingle-0.6.14/talk/base' /bin/sh ../../libtool --silent --tag=CXX --mode=compile x86_64-pld-linux-gnux32-g++ -DHAVE_CONFIG_H -I. -I../.. -DPOSIX -DLINUX -DFEATURE_ENABLE_VOICEMAIL -O2 -fwrapv -pipe -Wformat -Werror=format-security -gdwarf-4 -fno-debug-types-section -fvar-tracking-assignments -g2 -Wp,-D_FORTIFY_SOURCE=2 -fstack-protector-strong --param=ssp-buffer-size=4 -fPIC -mtune=generic -march=x86-64 -gdwarf-4 -fno-debug-types-section -fvar-tracking-assignments -g2 -MT httpserver.lo -MD -MP -MF .deps/httpserver.Tpo -c -o httpserver.lo httpserver.cc mv -f .deps/httpserver.Tpo .deps/httpserver.Plo make[3]: Leaving directory '/tmp/B.nfrc1a/BUILD/libjingle-0.6.14/talk/base' make[3]: Entering directory '/tmp/B.nfrc1a/BUILD/libjingle-0.6.14/talk/base' /bin/sh ../../libtool --silent --tag=CXX --mode=compile x86_64-pld-linux-gnux32-g++ -DHAVE_CONFIG_H -I. -I../.. -DPOSIX -DLINUX -DFEATURE_ENABLE_VOICEMAIL -O2 -fwrapv -pipe -Wformat -Werror=format-security -gdwarf-4 -fno-debug-types-section -fvar-tracking-assignments -g2 -Wp,-D_FORTIFY_SOURCE=2 -fstack-protector-strong --param=ssp-buffer-size=4 -fPIC -mtune=generic -march=x86-64 -gdwarf-4 -fno-debug-types-section -fvar-tracking-assignments -g2 -MT multipart.lo -MD -MP -MF .deps/multipart.Tpo -c -o multipart.lo multipart.cc mv -f .deps/multipart.Tpo .deps/multipart.Plo make[3]: Leaving directory '/tmp/B.nfrc1a/BUILD/libjingle-0.6.14/talk/base' make[3]: Entering directory '/tmp/B.nfrc1a/BUILD/libjingle-0.6.14/talk/base' /bin/sh ../../libtool --silent --tag=CXX --mode=compile x86_64-pld-linux-gnux32-g++ -DHAVE_CONFIG_H -I. -I../.. -DPOSIX -DLINUX -DFEATURE_ENABLE_VOICEMAIL -O2 -fwrapv -pipe -Wformat -Werror=format-security -gdwarf-4 -fno-debug-types-section -fvar-tracking-assignments -g2 -Wp,-D_FORTIFY_SOURCE=2 -fstack-protector-strong --param=ssp-buffer-size=4 -fPIC -mtune=generic -march=x86-64 -gdwarf-4 -fno-debug-types-section -fvar-tracking-assignments -g2 -MT openssladapter.lo -MD -MP -MF .deps/openssladapter.Tpo -c -o openssladapter.lo openssladapter.cc openssladapter.cc:87:19: error: variable 'BIO_METHOD methods_socket' has initializer but incomplete type static BIO_METHOD methods_socket = { ^~~~~~~~~~~~~~ openssladapter.cc: In function 'BIO* BIO_new_socket(talk_base::AsyncSocket*)': openssladapter.cc:107:6: error: invalid use of incomplete type 'BIO' {aka 'struct bio_st'} ret->ptr = socket; ^~ In file included from /usr/include/openssl/crypto.h:25, from /usr/include/openssl/bio.h:20, from openssladapter.cc:34: /usr/include/openssl/ossl_typ.h:79:16: note: forward declaration of 'BIO' {aka 'struct bio_st'} typedef struct bio_st BIO; ^~~~~~ openssladapter.cc: In function 'int socket_new(BIO*)': openssladapter.cc:112:4: error: invalid use of incomplete type 'BIO' {aka 'struct bio_st'} b->shutdown = 0; ^~ In file included from /usr/include/openssl/crypto.h:25, from /usr/include/openssl/bio.h:20, from openssladapter.cc:34: /usr/include/openssl/ossl_typ.h:79:16: note: forward declaration of 'BIO' {aka 'struct bio_st'} typedef struct bio_st BIO; ^~~~~~ openssladapter.cc:113:4: error: invalid use of incomplete type 'BIO' {aka 'struct bio_st'} b->init = 1; ^~ In file included from /usr/include/openssl/crypto.h:25, from /usr/include/openssl/bio.h:20, from openssladapter.cc:34: /usr/include/openssl/ossl_typ.h:79:16: note: forward declaration of 'BIO' {aka 'struct bio_st'} typedef struct bio_st BIO; ^~~~~~ openssladapter.cc:114:4: error: invalid use of incomplete type 'BIO' {aka 'struct bio_st'} b->num = 0; // 1 means socket closed ^~ In file included from /usr/include/openssl/crypto.h:25, from /usr/include/openssl/bio.h:20, from openssladapter.cc:34: /usr/include/openssl/ossl_typ.h:79:16: note: forward declaration of 'BIO' {aka 'struct bio_st'} typedef struct bio_st BIO; ^~~~~~ openssladapter.cc:115:4: error: invalid use of incomplete type 'BIO' {aka 'struct bio_st'} b->ptr = 0; ^~ In file included from /usr/include/openssl/crypto.h:25, from /usr/include/openssl/bio.h:20, from openssladapter.cc:34: /usr/include/openssl/ossl_typ.h:79:16: note: forward declaration of 'BIO' {aka 'struct bio_st'} typedef struct bio_st BIO; ^~~~~~ openssladapter.cc: In function 'int socket_read(BIO*, char*, int)': openssladapter.cc:128:74: error: invalid use of incomplete type 'BIO' {aka 'struct bio_st'} talk_base::AsyncSocket* socket = static_cast<talk_base::AsyncSocket*>(b->ptr); ^~ In file included from /usr/include/openssl/crypto.h:25, from /usr/include/openssl/bio.h:20, from openssladapter.cc:34: /usr/include/openssl/ossl_typ.h:79:16: note: forward declaration of 'BIO' {aka 'struct bio_st'} typedef struct bio_st BIO; ^~~~~~ openssladapter.cc:134:6: error: invalid use of incomplete type 'BIO' {aka 'struct bio_st'} b->num = 1; ^~ In file included from /usr/include/openssl/crypto.h:25, from /usr/include/openssl/bio.h:20, from openssladapter.cc:34: /usr/include/openssl/ossl_typ.h:79:16: note: forward declaration of 'BIO' {aka 'struct bio_st'} typedef struct bio_st BIO; ^~~~~~ openssladapter.cc: In function 'int socket_write(BIO*, const char*, int)': openssladapter.cc:144:74: error: invalid use of incomplete type 'BIO' {aka 'struct bio_st'} talk_base::AsyncSocket* socket = static_cast<talk_base::AsyncSocket*>(b->ptr); ^~ In file included from /usr/include/openssl/crypto.h:25, from /usr/include/openssl/bio.h:20, from openssladapter.cc:34: /usr/include/openssl/ossl_typ.h:79:16: note: forward declaration of 'BIO' {aka 'struct bio_st'} typedef struct bio_st BIO; ^~~~~~ openssladapter.cc: In function 'long int socket_ctrl(BIO*, int, long int, void*)': openssladapter.cc:167:13: error: invalid use of incomplete type 'BIO' {aka 'struct bio_st'} return b->num; ^~ In file included from /usr/include/openssl/crypto.h:25, from /usr/include/openssl/bio.h:20, from openssladapter.cc:34: /usr/include/openssl/ossl_typ.h:79:16: note: forward declaration of 'BIO' {aka 'struct bio_st'} typedef struct bio_st BIO; ^~~~~~ openssladapter.cc: In static member function 'static bool talk_base::OpenSSLAdapter::VerifyServerName(SSL*, const char*, bool)': openssladapter.cc:699:48: error: invalid use of incomplete type 'X509_EXTENSION' {aka 'struct X509_extension_st'} unsigned char* ext_value_data = extension->value->data; ^~ In file included from /usr/include/openssl/ssl.h:20, from openssladapter.cc:39: /usr/include/openssl/x509.h:81:16: note: forward declaration of 'X509_EXTENSION' {aka 'struct X509_extension_st'} typedef struct X509_extension_st X509_EXTENSION; ^~~~~~~~~~~~~~~~~ openssladapter.cc:710:42: error: invalid use of incomplete type 'X509_EXTENSION' {aka 'struct X509_extension_st'} extension->value->length, ^~ In file included from /usr/include/openssl/ssl.h:20, from openssladapter.cc:39: /usr/include/openssl/x509.h:81:16: note: forward declaration of 'X509_EXTENSION' {aka 'struct X509_extension_st'} typedef struct X509_extension_st X509_EXTENSION; ^~~~~~~~~~~~~~~~~ openssladapter.cc:713:64: error: invalid use of incomplete type 'X509_EXTENSION' {aka 'struct X509_extension_st'} ext_str = meth->d2i(NULL, ext_value_data_ptr, extension->value->length); ^~ In file included from /usr/include/openssl/ssl.h:20, from openssladapter.cc:39: /usr/include/openssl/x509.h:81:16: note: forward declaration of 'X509_EXTENSION' {aka 'struct X509_extension_st'} typedef struct X509_extension_st X509_EXTENSION; ^~~~~~~~~~~~~~~~~ openssladapter.cc: In static member function 'static SSL_CTX* talk_base::OpenSSLAdapter::SetupSSLContext()': openssladapter.cc:875:50: warning: 'const SSL_METHOD* TLSv1_client_method()' is deprecated [-Wdeprecated-declarations] SSL_CTX* ctx = SSL_CTX_new(TLSv1_client_method()); ^ In file included from /usr/include/openssl/e_os2.h:13, from /usr/include/openssl/bio.h:13, from openssladapter.cc:34: /usr/include/openssl/ssl.h:1854:1: note: declared here DEPRECATEDIN_1_1_0(__owur const SSL_METHOD *TLSv1_client_method(void)) ^~~~~~~~~~~~~~~~~~ openssladapter.cc:875:50: warning: 'const SSL_METHOD* TLSv1_client_method()' is deprecated [-Wdeprecated-declarations] SSL_CTX* ctx = SSL_CTX_new(TLSv1_client_method()); ^ In file included from /usr/include/openssl/e_os2.h:13, from /usr/include/openssl/bio.h:13, from openssladapter.cc:34: /usr/include/openssl/ssl.h:1854:1: note: declared here DEPRECATEDIN_1_1_0(__owur const SSL_METHOD *TLSv1_client_method(void)) ^~~~~~~~~~~~~~~~~~ make[3]: *** [Makefile:847: openssladapter.lo] Error 1 make[3]: Leaving directory '/tmp/B.nfrc1a/BUILD/libjingle-0.6.14/talk/base' make[3]: *** Waiting for unfinished jobs.... make[3]: Entering directory '/tmp/B.nfrc1a/BUILD/libjingle-0.6.14/talk/base' /bin/sh ../../libtool --silent --tag=CXX --mode=compile x86_64-pld-linux-gnux32-g++ -DHAVE_CONFIG_H -I. -I../.. -DPOSIX -DLINUX -DFEATURE_ENABLE_VOICEMAIL -O2 -fwrapv -pipe -Wformat -Werror=format-security -gdwarf-4 -fno-debug-types-section -fvar-tracking-assignments -g2 -Wp,-D_FORTIFY_SOURCE=2 -fstack-protector-strong --param=ssp-buffer-size=4 -fPIC -mtune=generic -march=x86-64 -gdwarf-4 -fno-debug-types-section -fvar-tracking-assignments -g2 -MT opensslidentity.lo -MD -MP -MF .deps/opensslidentity.Tpo -c -o opensslidentity.lo opensslidentity.cc opensslidentity.cc: In member function 'void talk_base::OpenSSLKeyPair::AddReference()': opensslidentity.cc:171:20: error: invalid use of incomplete type 'EVP_PKEY' {aka 'struct evp_pkey_st'} CRYPTO_add(&pkey_->references, 1, CRYPTO_LOCK_EVP_PKEY); ^~ In file included from /usr/include/openssl/evp.h:14, from ../../talk/base/opensslidentity.h:31, from opensslidentity.cc:28: /usr/include/openssl/ossl_typ.h:93:16: note: forward declaration of 'EVP_PKEY' {aka 'struct evp_pkey_st'} typedef struct evp_pkey_st EVP_PKEY; ^~~~~~~~~~~ opensslidentity.cc:171:37: error: 'CRYPTO_LOCK_EVP_PKEY' was not declared in this scope CRYPTO_add(&pkey_->references, 1, CRYPTO_LOCK_EVP_PKEY); ^~~~~~~~~~~~~~~~~~~~ opensslidentity.cc:171:37: note: suggested alternative: 'CRYPTO_LOCK' CRYPTO_add(&pkey_->references, 1, CRYPTO_LOCK_EVP_PKEY); ^~~~~~~~~~~~~~~~~~~~ CRYPTO_LOCK opensslidentity.cc:171:3: error: 'CRYPTO_add' was not declared in this scope CRYPTO_add(&pkey_->references, 1, CRYPTO_LOCK_EVP_PKEY); ^~~~~~~~~~ opensslidentity.cc:171:3: note: suggested alternative: 'CRYPTO_ONCE' CRYPTO_add(&pkey_->references, 1, CRYPTO_LOCK_EVP_PKEY); ^~~~~~~~~~ CRYPTO_ONCE opensslidentity.cc: In member function 'void talk_base::OpenSSLCertificate::AddReference()': opensslidentity.cc:317:20: error: invalid use of incomplete type 'X509' {aka 'struct x509_st'} CRYPTO_add(&x509_->references, 1, CRYPTO_LOCK_X509); ^~ In file included from /usr/include/openssl/evp.h:14, from ../../talk/base/opensslidentity.h:31, from opensslidentity.cc:28: /usr/include/openssl/ossl_typ.h:120:16: note: forward declaration of 'X509' {aka 'struct x509_st'} typedef struct x509_st X509; ^~~~~~~ opensslidentity.cc:317:37: error: 'CRYPTO_LOCK_X509' was not declared in this scope CRYPTO_add(&x509_->references, 1, CRYPTO_LOCK_X509); ^~~~~~~~~~~~~~~~ opensslidentity.cc:317:37: note: suggested alternative: 'CRYPTO_LOCK' CRYPTO_add(&x509_->references, 1, CRYPTO_LOCK_X509); ^~~~~~~~~~~~~~~~ CRYPTO_LOCK opensslidentity.cc:317:3: error: 'CRYPTO_add' was not declared in this scope CRYPTO_add(&x509_->references, 1, CRYPTO_LOCK_X509); ^~~~~~~~~~ opensslidentity.cc:317:3: note: suggested alternative: 'CRYPTO_ONCE' CRYPTO_add(&x509_->references, 1, CRYPTO_LOCK_X509); ^~~~~~~~~~ CRYPTO_ONCE make[3]: *** [Makefile:847: opensslidentity.lo] Error 1 make[3]: Leaving directory '/tmp/B.nfrc1a/BUILD/libjingle-0.6.14/talk/base' make[3]: Entering directory '/tmp/B.nfrc1a/BUILD/libjingle-0.6.14/talk/base' /bin/sh ../../libtool --silent --tag=CXX --mode=compile x86_64-pld-linux-gnux32-g++ -DHAVE_CONFIG_H -I. -I../.. -DPOSIX -DLINUX -DFEATURE_ENABLE_VOICEMAIL -O2 -fwrapv -pipe -Wformat -Werror=format-security -gdwarf-4 -fno-debug-types-section -fvar-tracking-assignments -g2 -Wp,-D_FORTIFY_SOURCE=2 -fstack-protector-strong --param=ssp-buffer-size=4 -fPIC -mtune=generic -march=x86-64 -gdwarf-4 -fno-debug-types-section -fvar-tracking-assignments -g2 -MT opensslstreamadapter.lo -MD -MP -MF .deps/opensslstreamadapter.Tpo -c -o opensslstreamadapter.lo opensslstreamadapter.cc opensslstreamadapter.cc:89:19: error: variable 'BIO_METHOD talk_base::methods_stream' has initializer but incomplete type static BIO_METHOD methods_stream = { ^~~~~~~~~~~~~~ opensslstreamadapter.cc: In function 'BIO* talk_base::BIO_new_stream(talk_base::StreamInterface*)': opensslstreamadapter.cc:108:6: error: invalid use of incomplete type 'BIO' {aka 'struct bio_st'} ret->ptr = stream; ^~ In file included from /usr/include/openssl/evp.h:14, from ../../talk/base/opensslidentity.h:31, from ../../talk/base/opensslstreamadapter.h:36, from opensslstreamadapter.cc:34: /usr/include/openssl/ossl_typ.h:79:16: note: forward declaration of 'BIO' {aka 'struct bio_st'} typedef struct bio_st BIO; ^~~~~~ opensslstreamadapter.cc: In function 'int talk_base::stream_new(BIO*)': opensslstreamadapter.cc:115:4: error: invalid use of incomplete type 'BIO' {aka 'struct bio_st'} b->shutdown = 0; ^~ In file included from /usr/include/openssl/evp.h:14, from ../../talk/base/opensslidentity.h:31, from ../../talk/base/opensslstreamadapter.h:36, from opensslstreamadapter.cc:34: /usr/include/openssl/ossl_typ.h:79:16: note: forward declaration of 'BIO' {aka 'struct bio_st'} typedef struct bio_st BIO; ^~~~~~ opensslstreamadapter.cc:116:4: error: invalid use of incomplete type 'BIO' {aka 'struct bio_st'} b->init = 1; ^~ In file included from /usr/include/openssl/evp.h:14, from ../../talk/base/opensslidentity.h:31, from ../../talk/base/opensslstreamadapter.h:36, from opensslstreamadapter.cc:34: /usr/include/openssl/ossl_typ.h:79:16: note: forward declaration of 'BIO' {aka 'struct bio_st'} typedef struct bio_st BIO; ^~~~~~ opensslstreamadapter.cc:117:4: error: invalid use of incomplete type 'BIO' {aka 'struct bio_st'} b->num = 0; // 1 means end-of-stream ^~ In file included from /usr/include/openssl/evp.h:14, from ../../talk/base/opensslidentity.h:31, from ../../talk/base/opensslstreamadapter.h:36, from opensslstreamadapter.cc:34: /usr/include/openssl/ossl_typ.h:79:16: note: forward declaration of 'BIO' {aka 'struct bio_st'} typedef struct bio_st BIO; ^~~~~~ opensslstreamadapter.cc:118:4: error: invalid use of incomplete type 'BIO' {aka 'struct bio_st'} b->ptr = 0; ^~ In file included from /usr/include/openssl/evp.h:14, from ../../talk/base/opensslidentity.h:31, from ../../talk/base/opensslstreamadapter.h:36, from opensslstreamadapter.cc:34: /usr/include/openssl/ossl_typ.h:79:16: note: forward declaration of 'BIO' {aka 'struct bio_st'} typedef struct bio_st BIO; ^~~~~~ opensslstreamadapter.cc: In function 'int talk_base::stream_read(BIO*, char*, int)': opensslstreamadapter.cc:131:60: error: invalid use of incomplete type 'BIO' {aka 'struct bio_st'} StreamInterface* stream = static_cast<StreamInterface*>(b->ptr); ^~ In file included from /usr/include/openssl/evp.h:14, from ../../talk/base/opensslidentity.h:31, from ../../talk/base/opensslstreamadapter.h:36, from opensslstreamadapter.cc:34: /usr/include/openssl/ossl_typ.h:79:16: note: forward declaration of 'BIO' {aka 'struct bio_st'} typedef struct bio_st BIO; ^~~~~~ opensslstreamadapter.cc:139:6: error: invalid use of incomplete type 'BIO' {aka 'struct bio_st'} b->num = 1; ^~ In file included from /usr/include/openssl/evp.h:14, from ../../talk/base/opensslidentity.h:31, from ../../talk/base/opensslstreamadapter.h:36, from opensslstreamadapter.cc:34: /usr/include/openssl/ossl_typ.h:79:16: note: forward declaration of 'BIO' {aka 'struct bio_st'} typedef struct bio_st BIO; ^~~~~~ opensslstreamadapter.cc: In function 'int talk_base::stream_write(BIO*, const char*, int)': opensslstreamadapter.cc:149:60: error: invalid use of incomplete type 'BIO' {aka 'struct bio_st'} StreamInterface* stream = static_cast<StreamInterface*>(b->ptr); ^~ In file included from /usr/include/openssl/evp.h:14, from ../../talk/base/opensslidentity.h:31, from ../../talk/base/opensslstreamadapter.h:36, from opensslstreamadapter.cc:34: /usr/include/openssl/ossl_typ.h:79:16: note: forward declaration of 'BIO' {aka 'struct bio_st'} typedef struct bio_st BIO; ^~~~~~ opensslstreamadapter.cc: In function 'long int talk_base::stream_ctrl(BIO*, int, long int, void*)': opensslstreamadapter.cc:174:15: error: invalid use of incomplete type 'BIO' {aka 'struct bio_st'} return b->num; ^~ In file included from /usr/include/openssl/evp.h:14, from ../../talk/base/opensslidentity.h:31, from ../../talk/base/opensslstreamadapter.h:36, from opensslstreamadapter.cc:34: /usr/include/openssl/ossl_typ.h:79:16: note: forward declaration of 'BIO' {aka 'struct bio_st'} typedef struct bio_st BIO; ^~~~~~ opensslstreamadapter.cc: In member function 'SSL_CTX* talk_base::OpenSSLStreamAdapter::SetupSSLContext()': opensslstreamadapter.cc:745:30: warning: 'const SSL_METHOD* DTLSv1_client_method()' is deprecated [-Wdeprecated-declarations] DTLSv1_client_method() : TLSv1_client_method()); ^ In file included from /usr/include/openssl/evp.h:13, from ../../talk/base/opensslidentity.h:31, from ../../talk/base/opensslstreamadapter.h:36, from opensslstreamadapter.cc:34: /usr/include/openssl/ssl.h:1872:1: note: declared here DEPRECATEDIN_1_1_0(__owur const SSL_METHOD *DTLSv1_client_method(void)) ^~~~~~~~~~~~~~~~~~ opensslstreamadapter.cc:745:30: warning: 'const SSL_METHOD* DTLSv1_client_method()' is deprecated [-Wdeprecated-declarations] DTLSv1_client_method() : TLSv1_client_method()); ^ In file included from /usr/include/openssl/evp.h:13, from ../../talk/base/opensslidentity.h:31, from ../../talk/base/opensslstreamadapter.h:36, from opensslstreamadapter.cc:34: /usr/include/openssl/ssl.h:1872:1: note: declared here DEPRECATEDIN_1_1_0(__owur const SSL_METHOD *DTLSv1_client_method(void)) ^~~~~~~~~~~~~~~~~~ opensslstreamadapter.cc:745:54: warning: 'const SSL_METHOD* TLSv1_client_method()' is deprecated [-Wdeprecated-declarations] DTLSv1_client_method() : TLSv1_client_method()); ^ In file included from /usr/include/openssl/evp.h:13, from ../../talk/base/opensslidentity.h:31, from ../../talk/base/opensslstreamadapter.h:36, from opensslstreamadapter.cc:34: /usr/include/openssl/ssl.h:1854:1: note: declared here DEPRECATEDIN_1_1_0(__owur const SSL_METHOD *TLSv1_client_method(void)) ^~~~~~~~~~~~~~~~~~ opensslstreamadapter.cc:745:54: warning: 'const SSL_METHOD* TLSv1_client_method()' is deprecated [-Wdeprecated-declarations] DTLSv1_client_method() : TLSv1_client_method()); ^ In file included from /usr/include/openssl/evp.h:13, from ../../talk/base/opensslidentity.h:31, from ../../talk/base/opensslstreamadapter.h:36, from opensslstreamadapter.cc:34: /usr/include/openssl/ssl.h:1854:1: note: declared here DEPRECATEDIN_1_1_0(__owur const SSL_METHOD *TLSv1_client_method(void)) ^~~~~~~~~~~~~~~~~~ opensslstreamadapter.cc:752:30: warning: 'const SSL_METHOD* DTLSv1_server_method()' is deprecated [-Wdeprecated-declarations] DTLSv1_server_method() : TLSv1_server_method()); ^ In file included from /usr/include/openssl/evp.h:13, from ../../talk/base/opensslidentity.h:31, from ../../talk/base/opensslstreamadapter.h:36, from opensslstreamadapter.cc:34: /usr/include/openssl/ssl.h:1871:1: note: declared here DEPRECATEDIN_1_1_0(__owur const SSL_METHOD *DTLSv1_server_method(void)) ^~~~~~~~~~~~~~~~~~ opensslstreamadapter.cc:752:30: warning: 'const SSL_METHOD* DTLSv1_server_method()' is deprecated [-Wdeprecated-declarations] DTLSv1_server_method() : TLSv1_server_method()); ^ In file included from /usr/include/openssl/evp.h:13, from ../../talk/base/opensslidentity.h:31, from ../../talk/base/opensslstreamadapter.h:36, from opensslstreamadapter.cc:34: /usr/include/openssl/ssl.h:1871:1: note: declared here DEPRECATEDIN_1_1_0(__owur const SSL_METHOD *DTLSv1_server_method(void)) ^~~~~~~~~~~~~~~~~~ opensslstreamadapter.cc:752:54: warning: 'const SSL_METHOD* TLSv1_server_method()' is deprecated [-Wdeprecated-declarations] DTLSv1_server_method() : TLSv1_server_method()); ^ In file included from /usr/include/openssl/evp.h:13, from ../../talk/base/opensslidentity.h:31, from ../../talk/base/opensslstreamadapter.h:36, from opensslstreamadapter.cc:34: /usr/include/openssl/ssl.h:1853:1: note: declared here DEPRECATEDIN_1_1_0(__owur const SSL_METHOD *TLSv1_server_method(void)) ^~~~~~~~~~~~~~~~~~ opensslstreamadapter.cc:752:54: warning: 'const SSL_METHOD* TLSv1_server_method()' is deprecated [-Wdeprecated-declarations] DTLSv1_server_method() : TLSv1_server_method()); ^ In file included from /usr/include/openssl/evp.h:13, from ../../talk/base/opensslidentity.h:31, from ../../talk/base/opensslstreamadapter.h:36, from opensslstreamadapter.cc:34: /usr/include/openssl/ssl.h:1853:1: note: declared here DEPRECATEDIN_1_1_0(__owur const SSL_METHOD *TLSv1_server_method(void)) ^~~~~~~~~~~~~~~~~~ make[3]: *** [Makefile:847: opensslstreamadapter.lo] Error 1 make[3]: Leaving directory '/tmp/B.nfrc1a/BUILD/libjingle-0.6.14/talk/base' make[3]: Entering directory '/tmp/B.nfrc1a/BUILD/libjingle-0.6.14/talk/base' /bin/sh ../../libtool --silent --tag=CXX --mode=compile x86_64-pld-linux-gnux32-g++ -DHAVE_CONFIG_H -I. -I../.. -DPOSIX -DLINUX -DFEATURE_ENABLE_VOICEMAIL -O2 -fwrapv -pipe -Wformat -Werror=format-security -gdwarf-4 -fno-debug-types-section -fvar-tracking-assignments -g2 -Wp,-D_FORTIFY_SOURCE=2 -fstack-protector-strong --param=ssp-buffer-size=4 -fPIC -mtune=generic -march=x86-64 -gdwarf-4 -fno-debug-types-section -fvar-tracking-assignments -g2 -MT pathutils.lo -MD -MP -MF .deps/pathutils.Tpo -c -o pathutils.lo pathutils.cc mv -f .deps/pathutils.Tpo .deps/pathutils.Plo make[3]: Leaving directory '/tmp/B.nfrc1a/BUILD/libjingle-0.6.14/talk/base' make[3]: Entering directory '/tmp/B.nfrc1a/BUILD/libjingle-0.6.14/talk/base' /bin/sh ../../libtool --silent --tag=CXX --mode=compile x86_64-pld-linux-gnux32-g++ -DHAVE_CONFIG_H -I. -I../.. -DPOSIX -DLINUX -DFEATURE_ENABLE_VOICEMAIL -O2 -fwrapv -pipe -Wformat -Werror=format-security -gdwarf-4 -fno-debug-types-section -fvar-tracking-assignments -g2 -Wp,-D_FORTIFY_SOURCE=2 -fstack-protector-strong --param=ssp-buffer-size=4 -fPIC -mtune=generic -march=x86-64 -gdwarf-4 -fno-debug-types-section -fvar-tracking-assignments -g2 -MT natserver.lo -MD -MP -MF .deps/natserver.Tpo -c -o natserver.lo natserver.cc mv -f .deps/natserver.Tpo .deps/natserver.Plo make[3]: Leaving directory '/tmp/B.nfrc1a/BUILD/libjingle-0.6.14/talk/base' make[3]: Entering directory '/tmp/B.nfrc1a/BUILD/libjingle-0.6.14/talk/base' /bin/sh ../../libtool --silent --tag=CXX --mode=compile x86_64-pld-linux-gnux32-g++ -DHAVE_CONFIG_H -I. -I../.. -DPOSIX -DLINUX -DFEATURE_ENABLE_VOICEMAIL -O2 -fwrapv -pipe -Wformat -Werror=format-security -gdwarf-4 -fno-debug-types-section -fvar-tracking-assignments -g2 -Wp,-D_FORTIFY_SOURCE=2 -fstack-protector-strong --param=ssp-buffer-size=4 -fPIC -mtune=generic -march=x86-64 -gdwarf-4 -fno-debug-types-section -fvar-tracking-assignments -g2 -MT optionsfile.lo -MD -MP -MF .deps/optionsfile.Tpo -c -o optionsfile.lo optionsfile.cc mv -f .deps/optionsfile.Tpo .deps/optionsfile.Plo make[3]: Leaving directory '/tmp/B.nfrc1a/BUILD/libjingle-0.6.14/talk/base' make[3]: Entering directory '/tmp/B.nfrc1a/BUILD/libjingle-0.6.14/talk/base' /bin/sh ../../libtool --silent --tag=CXX --mode=compile x86_64-pld-linux-gnux32-g++ -DHAVE_CONFIG_H -I. -I../.. -DPOSIX -DLINUX -DFEATURE_ENABLE_VOICEMAIL -O2 -fwrapv -pipe -Wformat -Werror=format-security -gdwarf-4 -fno-debug-types-section -fvar-tracking-assignments -g2 -Wp,-D_FORTIFY_SOURCE=2 -fstack-protector-strong --param=ssp-buffer-size=4 -fPIC -mtune=generic -march=x86-64 -gdwarf-4 -fno-debug-types-section -fvar-tracking-assignments -g2 -MT natsocketfactory.lo -MD -MP -MF .deps/natsocketfactory.Tpo -c -o natsocketfactory.lo natsocketfactory.cc mv -f .deps/natsocketfactory.Tpo .deps/natsocketfactory.Plo make[3]: Leaving directory '/tmp/B.nfrc1a/BUILD/libjingle-0.6.14/talk/base' make[3]: Entering directory '/tmp/B.nfrc1a/BUILD/libjingle-0.6.14/talk/base' /bin/sh ../../libtool --silent --tag=CXX --mode=compile x86_64-pld-linux-gnux32-g++ -DHAVE_CONFIG_H -I. -I../.. -DPOSIX -DLINUX -DFEATURE_ENABLE_VOICEMAIL -O2 -fwrapv -pipe -Wformat -Werror=format-security -gdwarf-4 -fno-debug-types-section -fvar-tracking-assignments -g2 -Wp,-D_FORTIFY_SOURCE=2 -fstack-protector-strong --param=ssp-buffer-size=4 -fPIC -mtune=generic -march=x86-64 -gdwarf-4 -fno-debug-types-section -fvar-tracking-assignments -g2 -MT network.lo -MD -MP -MF .deps/network.Tpo -c -o network.lo network.cc mv -f .deps/network.Tpo .deps/network.Plo make[3]: Leaving directory '/tmp/B.nfrc1a/BUILD/libjingle-0.6.14/talk/base' make[3]: Entering directory '/tmp/B.nfrc1a/BUILD/libjingle-0.6.14/talk/base' /bin/sh ../../libtool --silent --tag=CXX --mode=compile x86_64-pld-linux-gnux32-g++ -DHAVE_CONFIG_H -I. -I../.. -DPOSIX -DLINUX -DFEATURE_ENABLE_VOICEMAIL -O2 -fwrapv -pipe -Wformat -Werror=format-security -gdwarf-4 -fno-debug-types-section -fvar-tracking-assignments -g2 -Wp,-D_FORTIFY_SOURCE=2 -fstack-protector-strong --param=ssp-buffer-size=4 -fPIC -mtune=generic -march=x86-64 -gdwarf-4 -fno-debug-types-section -fvar-tracking-assignments -g2 -MT physicalsocketserver.lo -MD -MP -MF .deps/physicalsocketserver.Tpo -c -o physicalsocketserver.lo physicalsocketserver.cc mv -f .deps/physicalsocketserver.Tpo .deps/physicalsocketserver.Plo make[3]: Leaving directory '/tmp/B.nfrc1a/BUILD/libjingle-0.6.14/talk/base' make[2]: *** [Makefile:371: all-recursive] Error 1 make[1]: *** [Makefile:470: all-recursive] Error 1 make: *** [Makefile:381: all] Error 2 error: Bad exit status from /tmp/B.nfrc1a/BUILD/tmp/rpm-tmp.42744 (%build) RPM build errors: Bad exit status from /tmp/B.nfrc1a/BUILD/tmp/rpm-tmp.42744 (%build) ended at: Fri Sep 14 20:39:57 2018, done in 0:00:46.304160 error: No files produced. + chmod -R u+rwX /tmp/B.nfrc1a/BUILD + rm -rf /tmp/B.nfrc1a/tmp /tmp/B.nfrc1a/BUILD + rm -rf /tmp/B.nfrc1a Begin-PLD-Builder-Info Build-Time: user:216.81s sys:38.63s real:51.11s (faults io:0 non-io:1628799) End-PLD-Builder-Info
[Back to list of logs] [View rpm -qa of builder]