FailedOk

th/SRPMS[OK]
th/x32[OK]
th/i686[OK]
th/x86_64[OK]

ac/SRPMS[OK]
ac/i386[OK]
ac/i586[OK]
ac/i686[OK]
ac/alpha[OK]
ac/amd64[OK]
ac/athlon[OK]
ac/ppc[OK]
ac/sparc[OK]
ac/sparc64[OK]

Advanced Search
main()
Powered by PLD Linux
(c) 2002-2020 PLD Team
$Revision: 1.37 $
Powered by x-files.
Your IP: 3.89.87.12

libopenraw 78c72b39-1110-415b-8e47-29a0e7d3ad3d

Status:Failed
Source URL:https://buildlogs.pld-linux.org/pld/th/x32/FAIL/libopenraw,78c72b39-1110-415b-8e47-29a0e7d3ad3d.bz2
text/plain URL:View!
rpm -qa of builder:View!
Date:2020/10/18 18:07:37
Runtime:0:00:27.957952

Toc:

  • prep
  • Executing(%prep): /bin/sh -e /tmp/B.Fb9BX2/BUILD/tmp/rpm-tmp.77613
  • build
  • Executing(%build): /bin/sh -e /tmp/B.Fb9BX2/BUILD/tmp/rpm-tmp.77613
  • error 1
  • error: failed to get `byteorder` as a dependency of package `mp4parse_capi v0.11.2 (/tmp/B.Fb9BX2/BUILD/libopenraw-0.2.3/lib/mp4/mp4parse_capi)`
  • error 2
  • make[2]: *** [Makefile:1585: /tmp/B.Fb9BX2/BUILD/libopenraw-0.2.3/lib/mp4/target/release/libmp4.a] Error 101
  • error 3
  • make[1]: *** [Makefile:435: all-recursive] Error 1
  • error 4
  • error: Bad exit status from /tmp/B.Fb9BX2/BUILD/tmp/rpm-tmp.77613 (%build)
  • error 5
  • RPM build errors:
  • error 6
  • error: No files produced.

Content:

request from: qboosh
checking if we should skip the build
started at: Sun Oct 18 18:07:07 2020
killing old processes on a builder
sending signal 9 to pid -1
Killed
cleaning up /tmp
fetching https://srcbuilder.pld-linux.org/th//srpms/78c72b39-1110-415b-8e47-29a0e7d3ad3d/libopenraw-0.2.3-1.src.rpm
fetched 530941 bytes, 1264.9 K/s
installing srpm: libopenraw-0.2.3-1.src.rpm
+ install -d /tmp/B.Fb9BX2/BUILD /tmp/B.Fb9BX2/RPMS
+ LC_ALL=en_US.UTF-8
+ rpm -qp --changelog libopenraw-0.2.3-1.src.rpm
* Sun Oct 18 2020 PLD Linux Team <feedback@pld-linux.org>
- For complete changelog see: http://git.pld-linux.org/?p=packages/libopenraw.git;a=log;h=master
* Sun Oct 18 2020 Jakub Bogusz <qboosh@pld-linux.org> 40dddec
- updated to 0.2.3 (now includes rust code) - added pc,link patches * Mon Apr 20 2020 Jan Rękorajski <baggins@pld-linux.org> 0846ed2
- rebuild with libffi 3.3 - release 2 (by relup.sh) + rpm -Uhv --nodeps --define '_topdir /tmp/B.Fb9BX2' --define '_specdir %{_topdir}' --define '_sourcedir %{_specdir}' --define '_rpmdir %{_topdir}/RPMS' --define '_builddir %{_topdir}/BUILD' libopenraw-0.2.3-1.src.rpm Preparing... ################################################## libopenraw ################################################## + rm -f libopenraw-0.2.3-1.src.rpm + install -m 700 -d /tmp/B.Fb9BX2/BUILD/tmp + TMPDIR=/tmp/B.Fb9BX2/BUILD/tmp + exec nice -n 0 rpmbuild -bp --short-circuit --nodeps --define '_topdir /tmp/B.Fb9BX2' --define '_specdir %{_topdir}' --define '_sourcedir %{_specdir}' --define '_rpmdir %{_topdir}/RPMS' --define '_builddir %{_topdir}/BUILD' --target x32-pld-linux --define 'prep exit 0' /tmp/B.Fb9BX2/libopenraw.spec Building target platforms: x32-pld-linux checking BuildConflict-ing packages no BuildConflicts found checking BR rpm: Building target platforms: x32-pld-linux no BR needed building RPM using: set -ex; : build-id: 78c72b39-1110-415b-8e47-29a0e7d3ad3d; TMPDIR=/tmp/B.Fb9BX2/BUILD/tmp exec nice -n 0 rpmbuild -bb --define '_smp_mflags -j9' --define '_make_opts -Otarget' --define '_pld_builder 1' --define '_topdir /tmp/B.Fb9BX2' --define '_specdir %{_topdir}' --define '_sourcedir %{_specdir}' --define '_rpmdir %{_topdir}/RPMS' --define '_builddir %{_topdir}/BUILD' --target x32-pld-linux /tmp/B.Fb9BX2/libopenraw.spec + : build-id: 78c72b39-1110-415b-8e47-29a0e7d3ad3d + TMPDIR=/tmp/B.Fb9BX2/BUILD/tmp + exec nice -n 0 rpmbuild -bb --define '_smp_mflags -j9' --define '_make_opts -Otarget' --define '_pld_builder 1' --define '_topdir /tmp/B.Fb9BX2' --define '_specdir %{_topdir}' --define '_sourcedir %{_specdir}' --define '_rpmdir %{_topdir}/RPMS' --define '_builddir %{_topdir}/BUILD' --target x32-pld-linux /tmp/B.Fb9BX2/libopenraw.spec Building target platforms: x32-pld-linux Executing(%prep): /bin/sh -e /tmp/B.Fb9BX2/BUILD/tmp/rpm-tmp.77613 + umask 022 + cd /tmp/B.Fb9BX2/BUILD + cd /tmp/B.Fb9BX2/BUILD + rm -rf libopenraw-0.2.3 + /usr/bin/xz -dc /tmp/B.Fb9BX2/libopenraw-0.2.3.tar.xz + /bin/tar -xf - + STATUS=0 + '[' 0 -ne 0 ']' + cd libopenraw-0.2.3 + /bin/id -u + '[' 1000 '=' 0 ']' + /bin/id -u + '[' 1000 '=' 0 ']' + /bin/chmod -Rf a+rX,u+w,g-w,o-w . + echo 'Patch #0 (libopenraw-pc.patch):' Patch #0 (libopenraw-pc.patch): + '[' -f /tmp/B.Fb9BX2/libopenraw-pc.patch ']' + /bin/cat /tmp/B.Fb9BX2/libopenraw-pc.patch + /usr/bin/patch -s -p1 + echo 'Patch #1 (libopenraw-link.patch):' Patch #1 (libopenraw-link.patch): + '[' -f /tmp/B.Fb9BX2/libopenraw-link.patch ']' + /bin/cat /tmp/B.Fb9BX2/libopenraw-link.patch + /usr/bin/patch -s -p1 + exit 0 Executing(%build): /bin/sh -e /tmp/B.Fb9BX2/BUILD/tmp/rpm-tmp.77613 HOME=/home/users/builder PATH=/home/users/builder/GNUstep/Tools:/bin:/usr/bin:/usr/local/bin TMPDIR=/tmp/B.Fb9BX2/BUILD/tmp + umask 022 + cd /tmp/B.Fb9BX2/BUILD + cd libopenraw-0.2.3 + libtoolize --copy --force --install libtoolize: putting auxiliary files in '.'. libtoolize: copying file './config.guess' libtoolize: copying file './config.sub' libtoolize: copying file './install-sh' libtoolize: copying file './ltmain.sh' libtoolize: putting macros in AC_CONFIG_MACRO_DIRS, 'm4'. libtoolize: copying file 'm4/libtool.m4' libtoolize: copying file 'm4/ltoptions.m4' libtoolize: copying file 'm4/ltsugar.m4' libtoolize: copying file 'm4/ltversion.m4' libtoolize: copying file 'm4/lt~obsolete.m4' + aclocal -I m4 + autoconf + autoheader + automake -a -c -f --foreign configure.ac:75: installing './compile' configure.ac:8: installing './missing' demo/Makefile.am: installing './depcomp' + ./configure 'LDFLAGS=-Wl,--as-needed -Wl,--no-copy-dt-needed-entries -Wl,-z,relro -Wl,-z,combreloc ' 'CFLAGS=-O2 -fwrapv -pipe -Wformat -Werror=format-security -gdwarf-4 -fno-debug-types-section -fvar-tracking-assignments -g2 -Wp,-D_FORTIFY_SOURCE=2 -fstack-protector-strong --param=ssp-buffer-size=4 -Werror=trampolines -fPIC -mtune=generic -march=x86-64 -gdwarf-4 -fno-debug-types-section -fvar-tracking-assignments -g2 ' 'CXXFLAGS=-O2 -fwrapv -pipe -Wformat -Werror=format-security -gdwarf-4 -fno-debug-types-section -fvar-tracking-assignments -g2 -Wp,-D_FORTIFY_SOURCE=2 -fstack-protector-strong --param=ssp-buffer-size=4 -Werror=trampolines -fPIC -mtune=generic -march=x86-64 -gdwarf-4 -fno-debug-types-section -fvar-tracking-assignments -g2 ' 'FFLAGS=-O2 -fwrapv -pipe -Wformat -Werror=format-security -gdwarf-4 -fno-debug-types-section -fvar-tracking-assignments -g2 -Wp,-D_FORTIFY_SOURCE=2 -fstack-protector-strong --param=ssp-buffer-size=4 -Werror=trampolines -fPIC -mtune=generic -march=x86-64 -gdwarf-4 -fno-debug-types-section -fvar-tracking-assignments -g2 ' 'FCFLAGS=-O2 -fwrapv -pipe -Wformat -Werror=format-security -gdwarf-4 -fno-debug-types-section -fvar-tracking-assignments -g2 -Wp,-D_FORTIFY_SOURCE=2 -fstack-protector-strong --param=ssp-buffer-size=4 -Werror=trampolines -fPIC -mtune=generic -march=x86-64 -gdwarf-4 -fno-debug-types-section -fvar-tracking-assignments -g2 ' 'CPPFLAGS=' 'CC=x86_64-pld-linux-gnux32-gcc' 'CXX=x86_64-pld-linux-gnux32-g++' '--host=x86_64-pld-linux-gnux32' '--build=x86_64-pld-linux-gnux32' '--prefix=/usr' '--exec-prefix=/usr' '--bindir=/usr/bin' '--sbindir=/usr/sbin' '--sysconfdir=/etc' '--datadir=/usr/share' '--includedir=/usr/include' '--libdir=/usr/libx32' '--libexecdir=/usr/libexec' '--localstatedir=/var' '--sharedstatedir=/var/lib' '--mandir=/usr/share/man' '--infodir=/usr/share/info' '--x-libraries=/usr/libx32' --disable-silent-rules checking for a BSD-compatible install... /usr/bin/install -c checking whether build environment is sane... yes checking for a thread-safe mkdir -p... /bin/mkdir -p checking for mawk... mawk checking whether make sets $(MAKE)... yes checking whether make supports nested variables... yes checking whether to enable maintainer-specific portions of Makefiles... no checking whether make supports nested variables... (cached) yes checking for x86_64-pld-linux-gnux32-gcc... x86_64-pld-linux-gnux32-gcc checking whether the C compiler works... yes checking for C compiler default output file name... a.out checking for suffix of executables... checking whether we are cross compiling... no checking for suffix of object files... o checking whether we are using the GNU C compiler... yes checking whether x86_64-pld-linux-gnux32-gcc accepts -g... yes checking for x86_64-pld-linux-gnux32-gcc option to accept ISO C89... none needed checking whether x86_64-pld-linux-gnux32-gcc understands -c and -o together... yes checking whether make supports the include directive... yes (GNU style) checking dependency style of x86_64-pld-linux-gnux32-gcc... gcc3 checking how to run the C preprocessor... x86_64-pld-linux-gnux32-gcc -E checking whether we are using the GNU C++ compiler... yes checking whether x86_64-pld-linux-gnux32-g++ accepts -g... yes checking dependency style of x86_64-pld-linux-gnux32-g++... gcc3 checking build system type... x86_64-pld-linux-gnux32 checking host system type... x86_64-pld-linux-gnux32 checking how to print strings... print -r checking for a sed that does not truncate output... /bin/sed checking for grep that handles long lines and -e... /bin/grep checking for egrep... /bin/grep -E checking for fgrep... /bin/grep -F checking for ld used by x86_64-pld-linux-gnux32-gcc... /usr/bin/ld checking if the linker (/usr/bin/ld) is GNU ld... yes checking for BSD- or MS-compatible name lister (nm)... /usr/bin/nm -B checking the name lister (/usr/bin/nm -B) interface... BSD nm checking whether ln -s works... yes checking the maximum length of command line arguments... 1572864 checking how to convert x86_64-pld-linux-gnux32 file names to x86_64-pld-linux-gnux32 format... func_convert_file_noop checking how to convert x86_64-pld-linux-gnux32 file names to toolchain format... func_convert_file_noop checking for /usr/bin/ld option to reload object files... -r checking for x86_64-pld-linux-gnux32-objdump... no checking for objdump... objdump checking how to recognize dependent libraries... pass_all checking for x86_64-pld-linux-gnux32-dlltool... no checking for dlltool... no checking how to associate runtime and link libraries... print -r -- checking for x86_64-pld-linux-gnux32-ar... no checking for ar... ar checking for archiver @FILE support... @ checking for x86_64-pld-linux-gnux32-strip... no checking for strip... strip checking for x86_64-pld-linux-gnux32-ranlib... no checking for ranlib... ranlib checking command to parse /usr/bin/nm -B output from x86_64-pld-linux-gnux32-gcc object... ok checking for sysroot... no checking for a working dd... /bin/dd checking how to truncate binary pipes... /bin/dd bs=4096 count=1 checking for x86_64-pld-linux-gnux32-mt... no checking for mt... no checking if : is a manifest tool... no checking for ANSI C header files... yes checking for sys/types.h... yes checking for sys/stat.h... yes checking for stdlib.h... yes checking for string.h... yes checking for memory.h... yes checking for strings.h... yes checking for inttypes.h... yes checking for stdint.h... yes checking for unistd.h... yes checking for dlfcn.h... yes checking for objdir... .libs checking if x86_64-pld-linux-gnux32-gcc supports -fno-rtti -fno-exceptions... no checking for x86_64-pld-linux-gnux32-gcc option to produce PIC... -fPIC -DPIC checking if x86_64-pld-linux-gnux32-gcc PIC flag -fPIC -DPIC works... yes checking if x86_64-pld-linux-gnux32-gcc static flag -static works... yes checking if x86_64-pld-linux-gnux32-gcc supports -c -o file.o... yes checking if x86_64-pld-linux-gnux32-gcc supports -c -o file.o... (cached) yes checking whether the x86_64-pld-linux-gnux32-gcc linker (/usr/bin/ld -m elf32_x86_64) supports shared libraries... yes checking whether -lc should be explicitly linked in... no checking dynamic linker characteristics... GNU/Linux ld.so checking how to hardcode library paths into programs... immediate checking whether stripping libraries is possible... yes checking if libtool supports shared libraries... yes checking whether to build shared libraries... yes checking whether to build static libraries... yes checking how to run the C++ preprocessor... x86_64-pld-linux-gnux32-g++ -E checking for ld used by x86_64-pld-linux-gnux32-g++... /usr/bin/ld -m elf32_x86_64 checking if the linker (/usr/bin/ld -m elf32_x86_64) is GNU ld... yes checking whether the x86_64-pld-linux-gnux32-g++ linker (/usr/bin/ld -m elf32_x86_64) supports shared libraries... yes checking for x86_64-pld-linux-gnux32-g++ option to produce PIC... -fPIC -DPIC checking if x86_64-pld-linux-gnux32-g++ PIC flag -fPIC -DPIC works... yes checking if x86_64-pld-linux-gnux32-g++ static flag -static works... no checking if x86_64-pld-linux-gnux32-g++ supports -c -o file.o... yes checking if x86_64-pld-linux-gnux32-g++ supports -c -o file.o... (cached) yes checking whether the x86_64-pld-linux-gnux32-g++ linker (/usr/bin/ld -m elf32_x86_64) supports shared libraries... yes checking dynamic linker characteristics... (cached) GNU/Linux ld.so checking how to hardcode library paths into programs... immediate checking whether x86_64-pld-linux-gnux32-g++ supports C++11 features by default... yes checking for Boost headers version >= 1.33.0... yes checking for Boost's header version... 1_73 checking for the toolset name used by Boost for x86_64-pld-linux-gnux32-g++... configure: WARNING: could not figure out which toolset name to use for x86_64-pld-linux-gnux32-g++ checking boost/test/unit_test.hpp usability... yes checking boost/test/unit_test.hpp presence... yes checking for boost/test/unit_test.hpp... yes checking for the Boost unit_test_framework library... yes checking boost/algorithm/string.hpp usability... yes checking boost/algorithm/string.hpp presence... yes checking for boost/algorithm/string.hpp... yes checking boost/variant/variant_fwd.hpp usability... yes checking boost/variant/variant_fwd.hpp presence... yes checking for boost/variant/variant_fwd.hpp... yes checking boost/variant.hpp usability... yes checking boost/variant.hpp presence... yes checking for boost/variant.hpp... yes checking jpeglib.h usability... yes checking jpeglib.h presence... yes checking for jpeglib.h... yes checking for x86_64-pld-linux-gnux32-pkg-config... /usr/bin/x86_64-pld-linux-gnux32-pkg-config checking pkg-config is at least version 0.9.0... yes checking for libxml-2.0 >= 2.5.0... yes checking for libcurl... yes checking for get_current_dir_name... yes checking for glib-2.0 >= 2.0.0... yes checking for gdk-pixbuf-2.0 >= 2.0.0... yes checking whether C++ compiler accepts -fvisibility=hidden... yes checking whether C++ compiler accepts -Werror=unknown-warning-option... no checking whether C++ compiler accepts -Wchar-subscripts... yes checking whether C++ compiler accepts -Wcast-align... yes checking whether C++ compiler accepts -Wextra... yes checking whether C++ compiler accepts -Wexceptions... no checking whether C++ compiler accepts -Wheader-guard... no checking whether C++ compiler accepts -Wformat... yes checking whether C++ compiler accepts -Wformat-nonliteral... yes checking whether C++ compiler accepts -Wformat-security... yes checking whether C++ compiler accepts -Wno-gnu-zero-variadic-macro-arguments... yes checking whether C++ compiler accepts -Wlogical-not-parentheses... yes checking whether C++ compiler accepts -Wmisleading-indentation... yes checking whether C++ compiler accepts -Wmissing-noreturn... yes checking whether C++ compiler accepts -Woverloaded-virtual... yes checking whether C++ compiler accepts -Wpointer-arith... yes checking whether C++ compiler accepts -Wredundant-decls... yes checking whether C++ compiler accepts -Wpointer-bool-conversion... no checking whether C++ compiler accepts -Wshadow... yes checking whether C++ compiler accepts -Wsign-compare... yes checking whether C++ compiler accepts -Wno-suggest-attribute=noreturn... yes checking whether C++ compiler accepts -Wsuggest-override... yes checking whether C++ compiler accepts -Wnull-conversion... no checking whether C++ compiler accepts -Wunreachable-code... yes checking whether C++ compiler accepts -Wunused... yes checking whether C++ compiler accepts -Wwrite-strings... yes checking for cargo... yes checking for rustc... yes checking that generated files are newer than configure... done configure: creating ./config.status config.status: creating Makefile config.status: creating include/Makefile config.status: creating include/libopenraw/Makefile config.status: creating include/libopenraw++/Makefile config.status: creating lib/Makefile config.status: creating lib/libopenraw-0.2.pc config.status: creating gnome/Makefile config.status: creating gnome/libopenraw-gnome-0.2.pc config.status: creating gnome/include/Makefile config.status: creating gnome/include/libopenraw-gnome/Makefile config.status: creating doc/Makefile config.status: creating doc/Doxyfile config.status: creating doc/doxygen/Makefile config.status: creating test/Makefile config.status: creating testsuite/Makefile config.status: creating tools/Makefile config.status: creating demo/Makefile config.status: creating config.h config.status: executing depfiles commands config.status: executing libtool commands Options: Gnome support: yes Testsuite booststrap: yes + /usr/bin/make -Otarget -j9 /usr/bin/make all-recursive Making all in lib make[2]: Entering directory '/tmp/B.Fb9BX2/BUILD/libopenraw-0.2.3/lib' cd ./mp4 && \ CARGO_TARGET_DIR=/tmp/B.Fb9BX2/BUILD/libopenraw-0.2.3/lib/mp4/target cargo build --release Updating crates.io index warning: spurious network error (2 tries remaining): failed to resolve address for github.com: Temporary failure in name resolution; class=Net (12) warning: spurious network error (1 tries remaining): failed to resolve address for github.com: Temporary failure in name resolution; class=Net (12) error: failed to get `byteorder` as a dependency of package `mp4parse_capi v0.11.2 (/tmp/B.Fb9BX2/BUILD/libopenraw-0.2.3/lib/mp4/mp4parse_capi)` ... which is depended on by `mp4 v0.1.0 (/tmp/B.Fb9BX2/BUILD/libopenraw-0.2.3/lib/mp4)` Caused by: failed to fetch `https://github.com/rust-lang/crates.io-index` Caused by: failed to resolve address for github.com: Temporary failure in name resolution; class=Net (12) make[2]: *** [Makefile:1585: /tmp/B.Fb9BX2/BUILD/libopenraw-0.2.3/lib/mp4/target/release/libmp4.a] Error 101 make[2]: Leaving directory '/tmp/B.Fb9BX2/BUILD/libopenraw-0.2.3/lib' make[1]: *** [Makefile:435: all-recursive] Error 1 make: *** [Makefile:367: all] Error 2 error: Bad exit status from /tmp/B.Fb9BX2/BUILD/tmp/rpm-tmp.77613 (%build) RPM build errors: Bad exit status from /tmp/B.Fb9BX2/BUILD/tmp/rpm-tmp.77613 (%build) ended at: Sun Oct 18 18:07:37 2020, done in 0:00:27.957952 error: No files produced. + chmod -R u+rwX /tmp/B.Fb9BX2/BUILD + rm -rf /tmp/B.Fb9BX2/tmp /tmp/B.Fb9BX2/BUILD + rm -rf /tmp/B.Fb9BX2 Begin-PLD-Builder-Info Build-Time: user:21.15s sys:3.26s real:30.43s (faults io:624 non-io:1422794) End-PLD-Builder-Info
[Back to list of logs] [View rpm -qa of builder]