FailedOk

th/SRPMS[OK]
th/x32[OK]
th/i686[OK]
th/x86_64[OK]

ac/SRPMS[OK]
ac/i386[OK]
ac/i586[OK]
ac/i686[OK]
ac/alpha[OK]
ac/amd64[OK]
ac/athlon[OK]
ac/ppc[OK]
ac/sparc[OK]
ac/sparc64[OK]

Advanced Search
main()
Powered by PLD Linux
(c) 2002-2018 PLD Team
$Revision: 1.37 $
Powered by achelon.
Your IP: 54.162.15.31

libpreludedb 6caa016f-1899-4cd2-bf06-e426be18014c

Status:Failed
Source URL:ftp://buildlogs.pld-linux.org/th/x32/FAIL/libpreludedb,6caa016f-1899-4cd2-bf06-e426be18014c.bz2
text/plain URL:View!
full text:View!
rpm -qa of builder:View!
Date:2018/03/07 10:49:33
Runtime:0:01:03.869489

Toc:

  • error 1
  • make[3]: *** [Makefile:1331: tmpl-build.stamp] Error 127
  • error 2
  • make[2]: *** [Makefile:1080: all-recursive] Error 1
  • error 3
  • make[1]: *** [Makefile:1348: all-recursive] Error 1
  • error 4
  • error: Bad exit status from /tmp/B.HYgsQY/BUILD/tmp/rpm-tmp.23520 (%build)
  • error 5
  • RPM build errors:
  • error 6
  • error: No files produced.

Content:

libtool: link: ranlib .libs/classic.a
libtool: link: ( cd ".libs" && rm -f "classic.la" && ln -s "../classic.la" "classic.la" )
make[5]: Leaving directory '/tmp/B.HYgsQY/BUILD/libpreludedb-3.1.0/plugins/format/classic'
make[4]: Nothing to be done for 'all-am'.
make[3]: Nothing to be done for 'all-am'.
Making all in bindings
Making all in c++
Making all in include
make[4]: Nothing to be done for 'all'.
make[4]: Entering directory '/tmp/B.HYgsQY/BUILD/libpreludedb-3.1.0/bindings/c++'
/bin/sh ../../libtool  --tag=CXX   --mode=compile x86_64-pld-linux-gnux32-g++ -DHAVE_CONFIG_H -I. -I../..  -I../.. -I../../src/include -I../../src/include -I../../bindings/c++/include -I../../bindings/c++/include  -fPIC  -O2 -fwrapv -pipe -Wformat -Werror=format-security -gdwarf-4 -fno-debug-types-section -fvar-tracking-assignments -g2 -Wp,-D_FORTIFY_SOURCE=2 -fstack-protector-strong --param=ssp-buffer-size=4 -fPIC -mtune=generic -march=x86-64 -gdwarf-4 -fno-debug-types-section -fvar-tracking-assignments -g2  -MT libpreludedbcpp_la-preludedb-error.lo -MD -MP -MF .deps/libpreludedbcpp_la-preludedb-error.Tpo -c -o libpreludedbcpp_la-preludedb-error.lo `test -f 'preludedb-error.cxx' || echo './'`preludedb-error.cxx
libtool: compile:  x86_64-pld-linux-gnux32-g++ -DHAVE_CONFIG_H -I. -I../.. -I../.. -I../../src/include -I../../src/include -I../../bindings/c++/include -I../../bindings/c++/include -fPIC -O2 -fwrapv -pipe -Wformat -Werror=format-security -gdwarf-4 -fno-debug-types-section -fvar-tracking-assignments -g2 -Wp,-D_FORTIFY_SOURCE=2 -fstack-protector-strong --param=ssp-buffer-size=4 -fPIC -mtune=generic -march=x86-64 -gdwarf-4 -fno-debug-types-section -fvar-tracking-assignments -g2 -MT libpreludedbcpp_la-preludedb-error.lo -MD -MP -MF .deps/libpreludedbcpp_la-preludedb-error.Tpo -c preludedb-error.cxx  -fPIC -DPIC -o .libs/libpreludedbcpp_la-preludedb-error.o
libtool: compile:  x86_64-pld-linux-gnux32-g++ -DHAVE_CONFIG_H -I. -I../.. -I../.. -I../../src/include -I../../src/include -I../../bindings/c++/include -I../../bindings/c++/include -fPIC -O2 -fwrapv -pipe -Wformat -Werror=format-security -gdwarf-4 -fno-debug-types-section -fvar-tracking-assignments -g2 -Wp,-D_FORTIFY_SOURCE=2 -fstack-protector-strong --param=ssp-buffer-size=4 -fPIC -mtune=generic -march=x86-64 -gdwarf-4 -fno-debug-types-section -fvar-tracking-assignments -g2 -MT libpreludedbcpp_la-preludedb-error.lo -MD -MP -MF .deps/libpreludedbcpp_la-preludedb-error.Tpo -c preludedb-error.cxx -o libpreludedbcpp_la-preludedb-error.o >/dev/null 2>&1
mv -f .deps/libpreludedbcpp_la-preludedb-error.Tpo .deps/libpreludedbcpp_la-preludedb-error.Plo
make[4]: Leaving directory '/tmp/B.HYgsQY/BUILD/libpreludedb-3.1.0/bindings/c++'
make[4]: Entering directory '/tmp/B.HYgsQY/BUILD/libpreludedb-3.1.0/bindings/c++'
/bin/sh ../../libtool  --tag=CXX   --mode=compile x86_64-pld-linux-gnux32-g++ -DHAVE_CONFIG_H -I. -I../..  -I../.. -I../../src/include -I../../src/include -I../../bindings/c++/include -I../../bindings/c++/include  -fPIC  -O2 -fwrapv -pipe -Wformat -Werror=format-security -gdwarf-4 -fno-debug-types-section -fvar-tracking-assignments -g2 -Wp,-D_FORTIFY_SOURCE=2 -fstack-protector-strong --param=ssp-buffer-size=4 -fPIC -mtune=generic -march=x86-64 -gdwarf-4 -fno-debug-types-section -fvar-tracking-assignments -g2  -MT libpreludedbcpp_la-preludedb-sql.lo -MD -MP -MF .deps/libpreludedbcpp_la-preludedb-sql.Tpo -c -o libpreludedbcpp_la-preludedb-sql.lo `test -f 'preludedb-sql.cxx' || echo './'`preludedb-sql.cxx
libtool: compile:  x86_64-pld-linux-gnux32-g++ -DHAVE_CONFIG_H -I. -I../.. -I../.. -I../../src/include -I../../src/include -I../../bindings/c++/include -I../../bindings/c++/include -fPIC -O2 -fwrapv -pipe -Wformat -Werror=format-security -gdwarf-4 -fno-debug-types-section -fvar-tracking-assignments -g2 -Wp,-D_FORTIFY_SOURCE=2 -fstack-protector-strong --param=ssp-buffer-size=4 -fPIC -mtune=generic -march=x86-64 -gdwarf-4 -fno-debug-types-section -fvar-tracking-assignments -g2 -MT libpreludedbcpp_la-preludedb-sql.lo -MD -MP -MF .deps/libpreludedbcpp_la-preludedb-sql.Tpo -c preludedb-sql.cxx  -fPIC -DPIC -o .libs/libpreludedbcpp_la-preludedb-sql.o
libtool: compile:  x86_64-pld-linux-gnux32-g++ -DHAVE_CONFIG_H -I. -I../.. -I../.. -I../../src/include -I../../src/include -I../../bindings/c++/include -I../../bindings/c++/include -fPIC -O2 -fwrapv -pipe -Wformat -Werror=format-security -gdwarf-4 -fno-debug-types-section -fvar-tracking-assignments -g2 -Wp,-D_FORTIFY_SOURCE=2 -fstack-protector-strong --param=ssp-buffer-size=4 -fPIC -mtune=generic -march=x86-64 -gdwarf-4 -fno-debug-types-section -fvar-tracking-assignments -g2 -MT libpreludedbcpp_la-preludedb-sql.lo -MD -MP -MF .deps/libpreludedbcpp_la-preludedb-sql.Tpo -c preludedb-sql.cxx -o libpreludedbcpp_la-preludedb-sql.o >/dev/null 2>&1
mv -f .deps/libpreludedbcpp_la-preludedb-sql.Tpo .deps/libpreludedbcpp_la-preludedb-sql.Plo
make[4]: Leaving directory '/tmp/B.HYgsQY/BUILD/libpreludedb-3.1.0/bindings/c++'
make[4]: Entering directory '/tmp/B.HYgsQY/BUILD/libpreludedb-3.1.0/bindings/c++'
/bin/sh ../../libtool  --tag=CXX   --mode=compile x86_64-pld-linux-gnux32-g++ -DHAVE_CONFIG_H -I. -I../..  -I../.. -I../../src/include -I../../src/include -I../../bindings/c++/include -I../../bindings/c++/include  -fPIC  -O2 -fwrapv -pipe -Wformat -Werror=format-security -gdwarf-4 -fno-debug-types-section -fvar-tracking-assignments -g2 -Wp,-D_FORTIFY_SOURCE=2 -fstack-protector-strong --param=ssp-buffer-size=4 -fPIC -mtune=generic -march=x86-64 -gdwarf-4 -fno-debug-types-section -fvar-tracking-assignments -g2  -MT libpreludedbcpp_la-preludedb.lo -MD -MP -MF .deps/libpreludedbcpp_la-preludedb.Tpo -c -o libpreludedbcpp_la-preludedb.lo `test -f 'preludedb.cxx' || echo './'`preludedb.cxx
libtool: compile:  x86_64-pld-linux-gnux32-g++ -DHAVE_CONFIG_H -I. -I../.. -I../.. -I../../src/include -I../../src/include -I../../bindings/c++/include -I../../bindings/c++/include -fPIC -O2 -fwrapv -pipe -Wformat -Werror=format-security -gdwarf-4 -fno-debug-types-section -fvar-tracking-assignments -g2 -Wp,-D_FORTIFY_SOURCE=2 -fstack-protector-strong --param=ssp-buffer-size=4 -fPIC -mtune=generic -march=x86-64 -gdwarf-4 -fno-debug-types-section -fvar-tracking-assignments -g2 -MT libpreludedbcpp_la-preludedb.lo -MD -MP -MF .deps/libpreludedbcpp_la-preludedb.Tpo -c preludedb.cxx  -fPIC -DPIC -o .libs/libpreludedbcpp_la-preludedb.o
libtool: compile:  x86_64-pld-linux-gnux32-g++ -DHAVE_CONFIG_H -I. -I../.. -I../.. -I../../src/include -I../../src/include -I../../bindings/c++/include -I../../bindings/c++/include -fPIC -O2 -fwrapv -pipe -Wformat -Werror=format-security -gdwarf-4 -fno-debug-types-section -fvar-tracking-assignments -g2 -Wp,-D_FORTIFY_SOURCE=2 -fstack-protector-strong --param=ssp-buffer-size=4 -fPIC -mtune=generic -march=x86-64 -gdwarf-4 -fno-debug-types-section -fvar-tracking-assignments -g2 -MT libpreludedbcpp_la-preludedb.lo -MD -MP -MF .deps/libpreludedbcpp_la-preludedb.Tpo -c preludedb.cxx -o libpreludedbcpp_la-preludedb.o >/dev/null 2>&1
mv -f .deps/libpreludedbcpp_la-preludedb.Tpo .deps/libpreludedbcpp_la-preludedb.Plo
make[4]: Leaving directory '/tmp/B.HYgsQY/BUILD/libpreludedb-3.1.0/bindings/c++'
make[4]: Entering directory '/tmp/B.HYgsQY/BUILD/libpreludedb-3.1.0/bindings/c++'
/bin/sh ../../libtool  --tag=CXX   --mode=link x86_64-pld-linux-gnux32-g++  -O2 -fwrapv -pipe -Wformat -Werror=format-security -gdwarf-4 -fno-debug-types-section -fvar-tracking-assignments -g2 -Wp,-D_FORTIFY_SOURCE=2 -fstack-protector-strong --param=ssp-buffer-size=4 -fPIC -mtune=generic -march=x86-64 -gdwarf-4 -fno-debug-types-section -fvar-tracking-assignments -g2  -no-undefined -version-info 3:0:1 -Wl,--as-needed -Wl,--no-copy-dt-needed-entries -Wl,-z,relro -Wl,-z,combreloc  -z relro -z now -o libpreludedbcpp.la -rpath /usr/libx32 libpreludedbcpp_la-preludedb.lo libpreludedbcpp_la-preludedb-sql.lo libpreludedbcpp_la-preludedb-error.lo ../../src/libpreludedb.la -lpreludecpp 
libtool: link: x86_64-pld-linux-gnux32-g++  -fPIC -DPIC -shared -nostdlib  -O2 -gdwarf-4 -g2 -fstack-protector-strong -mtune=generic -march=x86-64 -gdwarf-4 -g2 -Wl,--as-needed -Wl,--no-copy-dt-needed-entries -Wl,-z -Wl,relro -Wl,-z -Wl,combreloc   -pthread /usr/libx32/gcc/x86_64-pld-linux-gnux32/7.3.0/../../../../libx32/crti.o /usr/libx32/gcc/x86_64-pld-linux-gnux32/7.3.0/crtbeginS.o  .libs/libpreludedbcpp_la-preludedb.o .libs/libpreludedbcpp_la-preludedb-sql.o .libs/libpreludedbcpp_la-preludedb-error.o   -Wl,-rpath -Wl,/tmp/B.HYgsQY/BUILD/libpreludedb-3.1.0/src/.libs -Wl,-rpath -Wl,/usr/libx32 ../../src/.libs/libpreludedb.so -L/usr/libx32 /usr/libx32/libpreludecpp.so /usr/libx32/libprelude.so /usr/libx32/libgnutls.so -lz -lp11-kit /usr/libx32/libidn2.so /usr/libx32/libunistring.so /usr/libx32/libtasn1.so -lnettle -lhogweed /usr/libx32/libgmp.so /usr/libx32/libgcrypt.so /usr/libx32/libgpg-error.so /usr/libx32/libltdl.so -ldl -L/usr/libx32/gcc/x86_64-pld-linux-gnux32/7.3.0 -L/usr/libx32/gcc/x86_64-pld-linux-gnux32/7.3.0/../../../../libx32 -L/lib/../libx32 -L/usr/lib/../libx32 -L/usr/libx32/gcc/x86_64-pld-linux-gnux32/7.3.0/../../.. /usr/libx32/libstdc++.so -lm -lc -lgcc_s /usr/libx32/gcc/x86_64-pld-linux-gnux32/7.3.0/crtendS.o /usr/libx32/gcc/x86_64-pld-linux-gnux32/7.3.0/../../../../libx32/crtn.o -Wl,-soname -Wl,libpreludedbcpp.so.2 -o .libs/libpreludedbcpp.so.2.1.0
libtool: link: (cd ".libs" && rm -f "libpreludedbcpp.so.2" && ln -s "libpreludedbcpp.so.2.1.0" "libpreludedbcpp.so.2")
libtool: link: (cd ".libs" && rm -f "libpreludedbcpp.so" && ln -s "libpreludedbcpp.so.2.1.0" "libpreludedbcpp.so")
libtool: link: ar cru .libs/libpreludedbcpp.a  libpreludedbcpp_la-preludedb.o libpreludedbcpp_la-preludedb-sql.o libpreludedbcpp_la-preludedb-error.o
libtool: link: ranlib .libs/libpreludedbcpp.a
libtool: link: ( cd ".libs" && rm -f "libpreludedbcpp.la" && ln -s "../libpreludedbcpp.la" "libpreludedbcpp.la" )
make[4]: Leaving directory '/tmp/B.HYgsQY/BUILD/libpreludedb-3.1.0/bindings/c++'
Making all in python
make[3]: Entering directory '/tmp/B.HYgsQY/BUILD/libpreludedb-3.1.0/bindings/python'
/usr/bin/swig -c++  -I/usr/include -I../../bindings -I../../bindings/python -I/usr/share/libprelude/swig -I../../bindings/c++/include -python -threads -O -builtin -o _preludedb.cxx ../libpreludedbcpp.i
../../bindings/c++/include/preludedb.hxx:33: Warning 511: Can't use keyword arguments with overloaded functions (PreludeDB::DB::ResultIdents::get(unsigned int)).
../../bindings/c++/include/preludedb.hxx:72: Warning 511: Can't use keyword arguments with overloaded functions (PreludeDB::DB::ResultValues::get(unsigned int)).
make[3]: Leaving directory '/tmp/B.HYgsQY/BUILD/libpreludedb-3.1.0/bindings/python'
make[3]: Entering directory '/tmp/B.HYgsQY/BUILD/libpreludedb-3.1.0/bindings/python'
CC="x86_64-pld-linux-gnux32-g++" /usr/bin/python2 setup.py build --build-base=build-2
running build
running build_py
creating build-2
creating build-2/lib.linux-x86_64-2.7
copying preludedb.py -> build-2/lib.linux-x86_64-2.7
running build_ext
building '_preludedb' extension
creating build-2/temp.linux-x86_64-2.7
x86_64-pld-linux-gnux32-g++ -fno-strict-aliasing -O2 -fwrapv -pipe -Wformat -Werror=format-security -gdwarf-4 -fno-debug-types-section -fvar-tracking-assignments -g2 -Wp,-D_FORTIFY_SOURCE=2 -fstack-protector-strong --param=ssp-buffer-size=4 -fPIC -mtune=generic -march=x86-64 -gdwarf-4 -fno-debug-types-section -fvar-tracking-assignments -g2 -DNDEBUG -O2 -fwrapv -pipe -Wformat -Werror=format-security -gdwarf-4 -fno-debug-types-section -fvar-tracking-assignments -g2 -Wp,-D_FORTIFY_SOURCE=2 -fstack-protector-strong --param=ssp-buffer-size=4 -fPIC -mtune=generic -march=x86-64 -gdwarf-4 -fno-debug-types-section -fvar-tracking-assignments -g2 -fPIC -I/usr/include/python2.7 -c _preludedb.cxx -o build-2/temp.linux-x86_64-2.7/_preludedb.o -I../.. -I../../src/include -I../../src/include -I../../bindings/c++/include
x86_64-pld-linux-gnux32-g++ -pthread -shared -Wl,--as-needed -Wl,--no-copy-dt-needed-entries -Wl,-z,relro -Wl,-z,combreloc build-2/temp.linux-x86_64-2.7/_preludedb.o -L../../src/.libs/ -L../../bindings/c++/.libs/ -L/usr/libx32 -lpython2.7 -o build-2/lib.linux-x86_64-2.7/_preludedb.so -lpreludedbcpp -lpreludecpp -lpreludedb -L/usr/libx32 -lprelude -lgnutls -lgcrypt -L/usr/libx32 -lgpg-error -lltdl -ldl
CC="x86_64-pld-linux-gnux32-g++" /usr/bin/python3 setup.py build --build-base=build-3
running build
running build_py
creating build-3
creating build-3/lib.linux-x86_64-3.6
copying preludedb.py -> build-3/lib.linux-x86_64-3.6
running build_ext
building '_preludedb' extension
creating build-3/temp.linux-x86_64-3.6
x86_64-pld-linux-gnux32-g++ -Wno-unused-result -Wsign-compare -DNDEBUG -O2 -fwrapv -pipe -Wformat -Werror=format-security -gdwarf-4 -fno-debug-types-section -fvar-tracking-assignments -g2 -Wp,-D_FORTIFY_SOURCE=2 -fstack-protector-strong --param=ssp-buffer-size=4 -fPIC -mtune=generic -march=x86-64 -gdwarf-4 -fno-debug-types-section -fvar-tracking-assignments -g2 -fno-caller-saves -O2 -fwrapv -pipe -Wformat -Werror=format-security -gdwarf-4 -fno-debug-types-section -fvar-tracking-assignments -g2 -Wp,-D_FORTIFY_SOURCE=2 -fstack-protector-strong --param=ssp-buffer-size=4 -fPIC -mtune=generic -march=x86-64 -gdwarf-4 -fno-debug-types-section -fvar-tracking-assignments -g2 -fPIC -I/usr/include/python3.6m -c _preludedb.cxx -o build-3/temp.linux-x86_64-3.6/_preludedb.o -I../.. -I../../src/include -I../../src/include -I../../bindings/c++/include
_preludedb.cxx: In function 'PyObject* _wrap_DB_updateFromList__SWIG_0(PyObject*, int, PyObject**)':
_preludedb.cxx:9807:33: warning: comparison between signed and unsigned integer expressions [-Wsign-compare]
     for ( unsigned int i = 0; i < PyObject_Length(swig_obj[1]); i++ ) {
                               ~~^~~~~~~~~~~~~~~~~~~~~~~~~~~~~~
_preludedb.cxx: In function 'PyObject* _wrap_DB_updateFromList__SWIG_1(PyObject*, int, PyObject**)':
_preludedb.cxx:9900:33: warning: comparison between signed and unsigned integer expressions [-Wsign-compare]
     for ( unsigned int i = 0; i < PyObject_Length(swig_obj[1]); i++ ) {
                               ~~^~~~~~~~~~~~~~~~~~~~~~~~~~~~~~
_preludedb.cxx: In function 'PyObject* _wrap_DB_update(PyObject*, PyObject*, PyObject*)':
_preludedb.cxx:10045:33: warning: comparison between signed and unsigned integer expressions [-Wsign-compare]
     for ( unsigned int i = 0; i < PyObject_Length(obj1); i++ ) {
                               ~~^~~~~~~~~~~~~~~~~~~~~~~
x86_64-pld-linux-gnux32-g++ -pthread -shared -Wl,--as-needed -Wl,--no-copy-dt-needed-entries -Wl,-z,relro -Wl,-z,combreloc build-3/temp.linux-x86_64-3.6/_preludedb.o -L../../src/.libs/ -L../../bindings/c++/.libs/ -L/usr/libx32 -lpython3.6m -o build-3/lib.linux-x86_64-3.6/_preludedb.cpython-36m-x86_64-linux-gnux32.so -lpreludedbcpp -lpreludecpp -lpreludedb -L/usr/libx32 -lprelude -lgnutls -lgcrypt -L/usr/libx32 -lgpg-error -lltdl -ldl
make[3]: Leaving directory '/tmp/B.HYgsQY/BUILD/libpreludedb-3.1.0/bindings/python'
make[3]: Nothing to be done for 'all-am'.
Making all in docs
Making all in api
make[3]: Entering directory '/tmp/B.HYgsQY/BUILD/libpreludedb-3.1.0/docs/api'
gtk-doc: Scanning header files
cd . && \
  gtkdoc-scan --module=libpreludedb --source-dir=../../src --ignore-headers=""  
if grep -l '^..*$' ./libpreludedb.types > /dev/null 2>&1 ; then \
    CC="/bin/sh ../../libtool --mode=compile x86_64-pld-linux-gnux32-gcc   -fPIC  -O2 -fwrapv -pipe -Wformat -Werror=format-security -gdwarf-4 -fno-debug-types-section -fvar-tracking-assignments -g2 -Wp,-D_FORTIFY_SOURCE=2 -fstack-protector-strong --param=ssp-buffer-size=4 -fPIC -mtune=generic -march=x86-64 -gdwarf-4 -fno-debug-types-section -fvar-tracking-assignments -g2 " LD="/bin/sh ../../libtool --mode=link x86_64-pld-linux-gnux32-gcc  -O2 -fwrapv -pipe -Wformat -Werror=format-security -gdwarf-4 -fno-debug-types-section -fvar-tracking-assignments -g2 -Wp,-D_FORTIFY_SOURCE=2 -fstack-protector-strong --param=ssp-buffer-size=4 -fPIC -mtune=generic -march=x86-64 -gdwarf-4 -fno-debug-types-section -fvar-tracking-assignments -g2   -Wl,--as-needed -Wl,--no-copy-dt-needed-entries -Wl,-z,relro -Wl,-z,combreloc  -z relro -z now" RUN="/bin/sh ../../libtool --mode=execute" CFLAGS=" -O2 -fwrapv -pipe -Wformat -Werror=format-security -gdwarf-4 -fno-debug-types-section -fvar-tracking-assignments -g2 -Wp,-D_FORTIFY_SOURCE=2 -fstack-protector-strong --param=ssp-buffer-size=4 -fPIC -mtune=generic -march=x86-64 -gdwarf-4 -fno-debug-types-section -fvar-tracking-assignments -g2 " LDFLAGS=" -Wl,--as-needed -Wl,--no-copy-dt-needed-entries -Wl,-z,relro -Wl,-z,combreloc  -z relro -z now" gtkdoc-scangobj  --module=libpreludedb --output-dir=. ; \
else \
    cd . ; \
    for i in libpreludedb.args libpreludedb.hierarchy libpreludedb.interfaces libpreludedb.prerequisites libpreludedb.signals ; do \
               test -f $i || touch $i ; \
    done \
fi
touch scan-build.stamp
make[3]: Leaving directory '/tmp/B.HYgsQY/BUILD/libpreludedb-3.1.0/docs/api'
make[3]: Entering directory '/tmp/B.HYgsQY/BUILD/libpreludedb-3.1.0/docs/api'
gtk-doc: Rebuilding template files
cd . && gtkdoc-mktmpl --module=libpreludedb 
/bin/sh: gtkdoc-mktmpl: not found
make[3]: *** [Makefile:1331: tmpl-build.stamp] Error 127
make[3]: Leaving directory '/tmp/B.HYgsQY/BUILD/libpreludedb-3.1.0/docs/api'
make[2]: *** [Makefile:1080: all-recursive] Error 1
make[1]: *** [Makefile:1348: all-recursive] Error 1
make: *** [Makefile:1154: all] Error 2
error: Bad exit status from /tmp/B.HYgsQY/BUILD/tmp/rpm-tmp.23520 (%build)


RPM build errors:
    Bad exit status from /tmp/B.HYgsQY/BUILD/tmp/rpm-tmp.23520 (%build)
ended at: Wed Mar  7 10:49:33 2018, done in 0:01:03.869489
error: No files produced.
+ chmod -R u+rwX /tmp/B.HYgsQY/BUILD
+ rm -rf /tmp/B.HYgsQY/tmp /tmp/B.HYgsQY/BUILD
+ rm -rf /tmp/B.HYgsQY
Begin-PLD-Builder-Info
Build-Time: user:61.97s sys:6.40s real:66.84s (faults io:5 non-io:3215184)

End-PLD-Builder-Info
[Back to list of logs] [View rpm -qa of builder]