FailedOk

th/SRPMS[OK]
th/x32[OK]
th/i686[OK]
th/x86_64[OK]

ac/SRPMS[OK]
ac/i386[OK]
ac/i586[OK]
ac/i686[OK]
ac/alpha[OK]
ac/amd64[OK]
ac/athlon[OK]
ac/ppc[OK]
ac/sparc[OK]
ac/sparc64[OK]

Advanced Search
main()
Powered by PLD Linux
(c) 2002-2018 PLD Team
$Revision: 1.37 $
Powered by foobar.
Your IP: 54.198.103.13

libssh 757a5e64-20c8-4f31-a437-14fab16cf678

Status:Failed
Source URL:ftp://buildlogs.pld-linux.org/th/x32/FAIL/libssh,757a5e64-20c8-4f31-a437-14fab16cf678.bz2
text/plain URL:View!
full text:View!
rpm -qa of builder:View!
Date:2018/09/14 20:48:19
Runtime:0:00:14.092680

Toc:

  • error 1
  • /tmp/B.aszTC5/BUILD/libssh-0.7.5/src/libcrypto.c:136:16: error: storage size of 'md' isn't known
  • error 2
  • /tmp/B.aszTC5/BUILD/libssh-0.7.5/src/libcrypto.c:147:32: error: invalid application of 'sizeof' to incomplete type 'EVP_MD_CTX' {aka 'struct evp_md_ctx_st'}
  • error 3
  • /tmp/B.aszTC5/BUILD/libssh-0.7.5/src/libcrypto.c:325:23: error: dereferencing pointer to incomplete type 'HMAC_CTX' {aka 'struct hmac_ctx_st'}
  • error 4
  • /tmp/B.aszTC5/BUILD/libssh-0.7.5/src/libcrypto.c:331:3: error: implicit declaration of function 'HMAC_CTX_init'; did you mean 'HMAC_CTX_new'? [-Wimplicit-function-declaration]
  • error 5
  • /tmp/B.aszTC5/BUILD/libssh-0.7.5/src/libcrypto.c:366:3: error: implicit declaration of function 'HMAC_CTX_cleanup'; did you mean 'HMAC_CTX_get_md'? [-Wimplicit-function-declaration]
  • error 6
  • /tmp/B.aszTC5/BUILD/libssh-0.7.5/src/libcrypto.c:458:3: error: implicit declaration of function 'AES_ctr128_encrypt'; did you mean 'AES_cfb128_encrypt'? [-Wimplicit-function-declaration]
  • error 7
  • make[2]: *** [src/CMakeFiles/ssh_shared.dir/build.make:313: src/CMakeFiles/ssh_shared.dir/libcrypto.c.o] Error 1
  • error 8
  • make[1]: *** [CMakeFiles/Makefile2:210: src/CMakeFiles/ssh_shared.dir/all] Error 2
  • error 9
  • error: Bad exit status from /tmp/B.aszTC5/BUILD/tmp/rpm-tmp.96429 (%build)
  • error 10
  • RPM build errors:
  • error 11
  • error: No files produced.

Content:

    CMAKE_INSTALL_INFODIR
    CMAKE_INSTALL_LIBDIR
    CMAKE_INSTALL_LIBEXECDIR
    CMAKE_INSTALL_LOCALEDIR
    CMAKE_INSTALL_LOCALSTATEDIRPATH
    CMAKE_INSTALL_MANDIR
    CMAKE_INSTALL_OLDINCLUDEDIR
    CMAKE_INSTALL_SBINDIR
    CMAKE_INSTALL_SHAREDSTATEDIRPATH
    CMAKE_INSTALL_SYSCONFDIR


-- Build files have been written to: /tmp/B.aszTC5/BUILD/libssh-0.7.5/build
+ /usr/bin/make -Otarget -j9
/usr/bin/cmake -H/tmp/B.aszTC5/BUILD/libssh-0.7.5 -B/tmp/B.aszTC5/BUILD/libssh-0.7.5/build --check-build-system CMakeFiles/Makefile.cmake 0
/usr/bin/cmake -E cmake_progress_start /tmp/B.aszTC5/BUILD/libssh-0.7.5/build/CMakeFiles /tmp/B.aszTC5/BUILD/libssh-0.7.5/build/CMakeFiles/progress.marks
/usr/bin/make -f CMakeFiles/Makefile2 all
/usr/bin/make -f src/CMakeFiles/ssh_shared.dir/build.make src/CMakeFiles/ssh_shared.dir/depend
make[2]: Entering directory '/tmp/B.aszTC5/BUILD/libssh-0.7.5/build'
cd /tmp/B.aszTC5/BUILD/libssh-0.7.5/build && /usr/bin/cmake -E cmake_depends "Unix Makefiles" /tmp/B.aszTC5/BUILD/libssh-0.7.5 /tmp/B.aszTC5/BUILD/libssh-0.7.5/src /tmp/B.aszTC5/BUILD/libssh-0.7.5/build /tmp/B.aszTC5/BUILD/libssh-0.7.5/build/src /tmp/B.aszTC5/BUILD/libssh-0.7.5/build/src/CMakeFiles/ssh_shared.dir/DependInfo.cmake --color=
Scanning dependencies of target ssh_shared
make[2]: Leaving directory '/tmp/B.aszTC5/BUILD/libssh-0.7.5/build'
/usr/bin/make -f src/CMakeFiles/ssh_shared.dir/build.make src/CMakeFiles/ssh_shared.dir/build
make[2]: Entering directory '/tmp/B.aszTC5/BUILD/libssh-0.7.5/build'
[  4%] Building C object src/CMakeFiles/ssh_shared.dir/base64.c.o
cd /tmp/B.aszTC5/BUILD/libssh-0.7.5/build/src && /usr/bin/x86_64-pld-linux-gnux32-gcc -DLIBSSH_EXPORTS -I/tmp/B.aszTC5/BUILD/libssh-0.7.5/build/src -I/tmp/B.aszTC5/BUILD/libssh-0.7.5/src -I/tmp/B.aszTC5/BUILD/libssh-0.7.5/include -I/tmp/B.aszTC5/BUILD/libssh-0.7.5/build  -std=gnu99 -pedantic -pedantic-errors -Wall -Wextra -Wshadow -Wmissing-prototypes -Wdeclaration-after-statement -Wunused -Wfloat-equal -Wpointer-arith -Wwrite-strings -Wformat-security -Wmissing-format-attribute -fPIC -fstack-protector -O2 -fwrapv -pipe -Wformat -Werror=format-security -gdwarf-4 -fno-debug-types-section -fvar-tracking-assignments -g2 -Wp,-D_FORTIFY_SOURCE=2 -fstack-protector-strong --param=ssp-buffer-size=4 -fPIC -mtune=generic -march=x86-64 -gdwarf-4 -fno-debug-types-section -fvar-tracking-assignments -g2  -DNDEBUG -DQT_NO_DEBUG -fPIC   -fvisibility=hidden -o CMakeFiles/ssh_shared.dir/base64.c.o   -c /tmp/B.aszTC5/BUILD/libssh-0.7.5/src/base64.c
make[2]: Leaving directory '/tmp/B.aszTC5/BUILD/libssh-0.7.5/build'
make[2]: Entering directory '/tmp/B.aszTC5/BUILD/libssh-0.7.5/build'
[  8%] Building C object src/CMakeFiles/ssh_shared.dir/callbacks.c.o
cd /tmp/B.aszTC5/BUILD/libssh-0.7.5/build/src && /usr/bin/x86_64-pld-linux-gnux32-gcc -DLIBSSH_EXPORTS -I/tmp/B.aszTC5/BUILD/libssh-0.7.5/build/src -I/tmp/B.aszTC5/BUILD/libssh-0.7.5/src -I/tmp/B.aszTC5/BUILD/libssh-0.7.5/include -I/tmp/B.aszTC5/BUILD/libssh-0.7.5/build  -std=gnu99 -pedantic -pedantic-errors -Wall -Wextra -Wshadow -Wmissing-prototypes -Wdeclaration-after-statement -Wunused -Wfloat-equal -Wpointer-arith -Wwrite-strings -Wformat-security -Wmissing-format-attribute -fPIC -fstack-protector -O2 -fwrapv -pipe -Wformat -Werror=format-security -gdwarf-4 -fno-debug-types-section -fvar-tracking-assignments -g2 -Wp,-D_FORTIFY_SOURCE=2 -fstack-protector-strong --param=ssp-buffer-size=4 -fPIC -mtune=generic -march=x86-64 -gdwarf-4 -fno-debug-types-section -fvar-tracking-assignments -g2  -DNDEBUG -DQT_NO_DEBUG -fPIC   -fvisibility=hidden -o CMakeFiles/ssh_shared.dir/callbacks.c.o   -c /tmp/B.aszTC5/BUILD/libssh-0.7.5/src/callbacks.c
make[2]: Leaving directory '/tmp/B.aszTC5/BUILD/libssh-0.7.5/build'
make[2]: Entering directory '/tmp/B.aszTC5/BUILD/libssh-0.7.5/build'
[  5%] Building C object src/CMakeFiles/ssh_shared.dir/bignum.c.o
cd /tmp/B.aszTC5/BUILD/libssh-0.7.5/build/src && /usr/bin/x86_64-pld-linux-gnux32-gcc -DLIBSSH_EXPORTS -I/tmp/B.aszTC5/BUILD/libssh-0.7.5/build/src -I/tmp/B.aszTC5/BUILD/libssh-0.7.5/src -I/tmp/B.aszTC5/BUILD/libssh-0.7.5/include -I/tmp/B.aszTC5/BUILD/libssh-0.7.5/build  -std=gnu99 -pedantic -pedantic-errors -Wall -Wextra -Wshadow -Wmissing-prototypes -Wdeclaration-after-statement -Wunused -Wfloat-equal -Wpointer-arith -Wwrite-strings -Wformat-security -Wmissing-format-attribute -fPIC -fstack-protector -O2 -fwrapv -pipe -Wformat -Werror=format-security -gdwarf-4 -fno-debug-types-section -fvar-tracking-assignments -g2 -Wp,-D_FORTIFY_SOURCE=2 -fstack-protector-strong --param=ssp-buffer-size=4 -fPIC -mtune=generic -march=x86-64 -gdwarf-4 -fno-debug-types-section -fvar-tracking-assignments -g2  -DNDEBUG -DQT_NO_DEBUG -fPIC   -fvisibility=hidden -o CMakeFiles/ssh_shared.dir/bignum.c.o   -c /tmp/B.aszTC5/BUILD/libssh-0.7.5/src/bignum.c
make[2]: Leaving directory '/tmp/B.aszTC5/BUILD/libssh-0.7.5/build'
make[2]: Entering directory '/tmp/B.aszTC5/BUILD/libssh-0.7.5/build'
[  8%] Building C object src/CMakeFiles/ssh_shared.dir/config.c.o
cd /tmp/B.aszTC5/BUILD/libssh-0.7.5/build/src && /usr/bin/x86_64-pld-linux-gnux32-gcc -DLIBSSH_EXPORTS -I/tmp/B.aszTC5/BUILD/libssh-0.7.5/build/src -I/tmp/B.aszTC5/BUILD/libssh-0.7.5/src -I/tmp/B.aszTC5/BUILD/libssh-0.7.5/include -I/tmp/B.aszTC5/BUILD/libssh-0.7.5/build  -std=gnu99 -pedantic -pedantic-errors -Wall -Wextra -Wshadow -Wmissing-prototypes -Wdeclaration-after-statement -Wunused -Wfloat-equal -Wpointer-arith -Wwrite-strings -Wformat-security -Wmissing-format-attribute -fPIC -fstack-protector -O2 -fwrapv -pipe -Wformat -Werror=format-security -gdwarf-4 -fno-debug-types-section -fvar-tracking-assignments -g2 -Wp,-D_FORTIFY_SOURCE=2 -fstack-protector-strong --param=ssp-buffer-size=4 -fPIC -mtune=generic -march=x86-64 -gdwarf-4 -fno-debug-types-section -fvar-tracking-assignments -g2  -DNDEBUG -DQT_NO_DEBUG -fPIC   -fvisibility=hidden -o CMakeFiles/ssh_shared.dir/config.c.o   -c /tmp/B.aszTC5/BUILD/libssh-0.7.5/src/config.c
make[2]: Leaving directory '/tmp/B.aszTC5/BUILD/libssh-0.7.5/build'
make[2]: Entering directory '/tmp/B.aszTC5/BUILD/libssh-0.7.5/build'
[  2%] Building C object src/CMakeFiles/ssh_shared.dir/agent.c.o
cd /tmp/B.aszTC5/BUILD/libssh-0.7.5/build/src && /usr/bin/x86_64-pld-linux-gnux32-gcc -DLIBSSH_EXPORTS -I/tmp/B.aszTC5/BUILD/libssh-0.7.5/build/src -I/tmp/B.aszTC5/BUILD/libssh-0.7.5/src -I/tmp/B.aszTC5/BUILD/libssh-0.7.5/include -I/tmp/B.aszTC5/BUILD/libssh-0.7.5/build  -std=gnu99 -pedantic -pedantic-errors -Wall -Wextra -Wshadow -Wmissing-prototypes -Wdeclaration-after-statement -Wunused -Wfloat-equal -Wpointer-arith -Wwrite-strings -Wformat-security -Wmissing-format-attribute -fPIC -fstack-protector -O2 -fwrapv -pipe -Wformat -Werror=format-security -gdwarf-4 -fno-debug-types-section -fvar-tracking-assignments -g2 -Wp,-D_FORTIFY_SOURCE=2 -fstack-protector-strong --param=ssp-buffer-size=4 -fPIC -mtune=generic -march=x86-64 -gdwarf-4 -fno-debug-types-section -fvar-tracking-assignments -g2  -DNDEBUG -DQT_NO_DEBUG -fPIC   -fvisibility=hidden -o CMakeFiles/ssh_shared.dir/agent.c.o   -c /tmp/B.aszTC5/BUILD/libssh-0.7.5/src/agent.c
make[2]: Leaving directory '/tmp/B.aszTC5/BUILD/libssh-0.7.5/build'
make[2]: Entering directory '/tmp/B.aszTC5/BUILD/libssh-0.7.5/build'
[  8%] Building C object src/CMakeFiles/ssh_shared.dir/client.c.o
cd /tmp/B.aszTC5/BUILD/libssh-0.7.5/build/src && /usr/bin/x86_64-pld-linux-gnux32-gcc -DLIBSSH_EXPORTS -I/tmp/B.aszTC5/BUILD/libssh-0.7.5/build/src -I/tmp/B.aszTC5/BUILD/libssh-0.7.5/src -I/tmp/B.aszTC5/BUILD/libssh-0.7.5/include -I/tmp/B.aszTC5/BUILD/libssh-0.7.5/build  -std=gnu99 -pedantic -pedantic-errors -Wall -Wextra -Wshadow -Wmissing-prototypes -Wdeclaration-after-statement -Wunused -Wfloat-equal -Wpointer-arith -Wwrite-strings -Wformat-security -Wmissing-format-attribute -fPIC -fstack-protector -O2 -fwrapv -pipe -Wformat -Werror=format-security -gdwarf-4 -fno-debug-types-section -fvar-tracking-assignments -g2 -Wp,-D_FORTIFY_SOURCE=2 -fstack-protector-strong --param=ssp-buffer-size=4 -fPIC -mtune=generic -march=x86-64 -gdwarf-4 -fno-debug-types-section -fvar-tracking-assignments -g2  -DNDEBUG -DQT_NO_DEBUG -fPIC   -fvisibility=hidden -o CMakeFiles/ssh_shared.dir/client.c.o   -c /tmp/B.aszTC5/BUILD/libssh-0.7.5/src/client.c
make[2]: Leaving directory '/tmp/B.aszTC5/BUILD/libssh-0.7.5/build'
make[2]: Entering directory '/tmp/B.aszTC5/BUILD/libssh-0.7.5/build'
[ 10%] Building C object src/CMakeFiles/ssh_shared.dir/curve25519.c.o
cd /tmp/B.aszTC5/BUILD/libssh-0.7.5/build/src && /usr/bin/x86_64-pld-linux-gnux32-gcc -DLIBSSH_EXPORTS -I/tmp/B.aszTC5/BUILD/libssh-0.7.5/build/src -I/tmp/B.aszTC5/BUILD/libssh-0.7.5/src -I/tmp/B.aszTC5/BUILD/libssh-0.7.5/include -I/tmp/B.aszTC5/BUILD/libssh-0.7.5/build  -std=gnu99 -pedantic -pedantic-errors -Wall -Wextra -Wshadow -Wmissing-prototypes -Wdeclaration-after-statement -Wunused -Wfloat-equal -Wpointer-arith -Wwrite-strings -Wformat-security -Wmissing-format-attribute -fPIC -fstack-protector -O2 -fwrapv -pipe -Wformat -Werror=format-security -gdwarf-4 -fno-debug-types-section -fvar-tracking-assignments -g2 -Wp,-D_FORTIFY_SOURCE=2 -fstack-protector-strong --param=ssp-buffer-size=4 -fPIC -mtune=generic -march=x86-64 -gdwarf-4 -fno-debug-types-section -fvar-tracking-assignments -g2  -DNDEBUG -DQT_NO_DEBUG -fPIC   -fvisibility=hidden -o CMakeFiles/ssh_shared.dir/curve25519.c.o   -c /tmp/B.aszTC5/BUILD/libssh-0.7.5/src/curve25519.c
make[2]: Leaving directory '/tmp/B.aszTC5/BUILD/libssh-0.7.5/build'
make[2]: Entering directory '/tmp/B.aszTC5/BUILD/libssh-0.7.5/build'
[  4%] Building C object src/CMakeFiles/ssh_shared.dir/buffer.c.o
cd /tmp/B.aszTC5/BUILD/libssh-0.7.5/build/src && /usr/bin/x86_64-pld-linux-gnux32-gcc -DLIBSSH_EXPORTS -I/tmp/B.aszTC5/BUILD/libssh-0.7.5/build/src -I/tmp/B.aszTC5/BUILD/libssh-0.7.5/src -I/tmp/B.aszTC5/BUILD/libssh-0.7.5/include -I/tmp/B.aszTC5/BUILD/libssh-0.7.5/build  -std=gnu99 -pedantic -pedantic-errors -Wall -Wextra -Wshadow -Wmissing-prototypes -Wdeclaration-after-statement -Wunused -Wfloat-equal -Wpointer-arith -Wwrite-strings -Wformat-security -Wmissing-format-attribute -fPIC -fstack-protector -O2 -fwrapv -pipe -Wformat -Werror=format-security -gdwarf-4 -fno-debug-types-section -fvar-tracking-assignments -g2 -Wp,-D_FORTIFY_SOURCE=2 -fstack-protector-strong --param=ssp-buffer-size=4 -fPIC -mtune=generic -march=x86-64 -gdwarf-4 -fno-debug-types-section -fvar-tracking-assignments -g2  -DNDEBUG -DQT_NO_DEBUG -fPIC   -fvisibility=hidden -o CMakeFiles/ssh_shared.dir/buffer.c.o   -c /tmp/B.aszTC5/BUILD/libssh-0.7.5/src/buffer.c
make[2]: Leaving directory '/tmp/B.aszTC5/BUILD/libssh-0.7.5/build'
make[2]: Entering directory '/tmp/B.aszTC5/BUILD/libssh-0.7.5/build'
[  9%] Building C object src/CMakeFiles/ssh_shared.dir/connect.c.o
cd /tmp/B.aszTC5/BUILD/libssh-0.7.5/build/src && /usr/bin/x86_64-pld-linux-gnux32-gcc -DLIBSSH_EXPORTS -I/tmp/B.aszTC5/BUILD/libssh-0.7.5/build/src -I/tmp/B.aszTC5/BUILD/libssh-0.7.5/src -I/tmp/B.aszTC5/BUILD/libssh-0.7.5/include -I/tmp/B.aszTC5/BUILD/libssh-0.7.5/build  -std=gnu99 -pedantic -pedantic-errors -Wall -Wextra -Wshadow -Wmissing-prototypes -Wdeclaration-after-statement -Wunused -Wfloat-equal -Wpointer-arith -Wwrite-strings -Wformat-security -Wmissing-format-attribute -fPIC -fstack-protector -O2 -fwrapv -pipe -Wformat -Werror=format-security -gdwarf-4 -fno-debug-types-section -fvar-tracking-assignments -g2 -Wp,-D_FORTIFY_SOURCE=2 -fstack-protector-strong --param=ssp-buffer-size=4 -fPIC -mtune=generic -march=x86-64 -gdwarf-4 -fno-debug-types-section -fvar-tracking-assignments -g2  -DNDEBUG -DQT_NO_DEBUG -fPIC   -fvisibility=hidden -o CMakeFiles/ssh_shared.dir/connect.c.o   -c /tmp/B.aszTC5/BUILD/libssh-0.7.5/src/connect.c
make[2]: Leaving directory '/tmp/B.aszTC5/BUILD/libssh-0.7.5/build'
make[2]: Entering directory '/tmp/B.aszTC5/BUILD/libssh-0.7.5/build'
[  1%] Building C object src/CMakeFiles/ssh_shared.dir/auth.c.o
cd /tmp/B.aszTC5/BUILD/libssh-0.7.5/build/src && /usr/bin/x86_64-pld-linux-gnux32-gcc -DLIBSSH_EXPORTS -I/tmp/B.aszTC5/BUILD/libssh-0.7.5/build/src -I/tmp/B.aszTC5/BUILD/libssh-0.7.5/src -I/tmp/B.aszTC5/BUILD/libssh-0.7.5/include -I/tmp/B.aszTC5/BUILD/libssh-0.7.5/build  -std=gnu99 -pedantic -pedantic-errors -Wall -Wextra -Wshadow -Wmissing-prototypes -Wdeclaration-after-statement -Wunused -Wfloat-equal -Wpointer-arith -Wwrite-strings -Wformat-security -Wmissing-format-attribute -fPIC -fstack-protector -O2 -fwrapv -pipe -Wformat -Werror=format-security -gdwarf-4 -fno-debug-types-section -fvar-tracking-assignments -g2 -Wp,-D_FORTIFY_SOURCE=2 -fstack-protector-strong --param=ssp-buffer-size=4 -fPIC -mtune=generic -march=x86-64 -gdwarf-4 -fno-debug-types-section -fvar-tracking-assignments -g2  -DNDEBUG -DQT_NO_DEBUG -fPIC   -fvisibility=hidden -o CMakeFiles/ssh_shared.dir/auth.c.o   -c /tmp/B.aszTC5/BUILD/libssh-0.7.5/src/auth.c
make[2]: Leaving directory '/tmp/B.aszTC5/BUILD/libssh-0.7.5/build'
make[2]: Entering directory '/tmp/B.aszTC5/BUILD/libssh-0.7.5/build'
[ 13%] Building C object src/CMakeFiles/ssh_shared.dir/error.c.o
cd /tmp/B.aszTC5/BUILD/libssh-0.7.5/build/src && /usr/bin/x86_64-pld-linux-gnux32-gcc -DLIBSSH_EXPORTS -I/tmp/B.aszTC5/BUILD/libssh-0.7.5/build/src -I/tmp/B.aszTC5/BUILD/libssh-0.7.5/src -I/tmp/B.aszTC5/BUILD/libssh-0.7.5/include -I/tmp/B.aszTC5/BUILD/libssh-0.7.5/build  -std=gnu99 -pedantic -pedantic-errors -Wall -Wextra -Wshadow -Wmissing-prototypes -Wdeclaration-after-statement -Wunused -Wfloat-equal -Wpointer-arith -Wwrite-strings -Wformat-security -Wmissing-format-attribute -fPIC -fstack-protector -O2 -fwrapv -pipe -Wformat -Werror=format-security -gdwarf-4 -fno-debug-types-section -fvar-tracking-assignments -g2 -Wp,-D_FORTIFY_SOURCE=2 -fstack-protector-strong --param=ssp-buffer-size=4 -fPIC -mtune=generic -march=x86-64 -gdwarf-4 -fno-debug-types-section -fvar-tracking-assignments -g2  -DNDEBUG -DQT_NO_DEBUG -fPIC   -fvisibility=hidden -o CMakeFiles/ssh_shared.dir/error.c.o   -c /tmp/B.aszTC5/BUILD/libssh-0.7.5/src/error.c
make[2]: Leaving directory '/tmp/B.aszTC5/BUILD/libssh-0.7.5/build'
make[2]: Entering directory '/tmp/B.aszTC5/BUILD/libssh-0.7.5/build'
[ 12%] Building C object src/CMakeFiles/ssh_shared.dir/ecdh.c.o
cd /tmp/B.aszTC5/BUILD/libssh-0.7.5/build/src && /usr/bin/x86_64-pld-linux-gnux32-gcc -DLIBSSH_EXPORTS -I/tmp/B.aszTC5/BUILD/libssh-0.7.5/build/src -I/tmp/B.aszTC5/BUILD/libssh-0.7.5/src -I/tmp/B.aszTC5/BUILD/libssh-0.7.5/include -I/tmp/B.aszTC5/BUILD/libssh-0.7.5/build  -std=gnu99 -pedantic -pedantic-errors -Wall -Wextra -Wshadow -Wmissing-prototypes -Wdeclaration-after-statement -Wunused -Wfloat-equal -Wpointer-arith -Wwrite-strings -Wformat-security -Wmissing-format-attribute -fPIC -fstack-protector -O2 -fwrapv -pipe -Wformat -Werror=format-security -gdwarf-4 -fno-debug-types-section -fvar-tracking-assignments -g2 -Wp,-D_FORTIFY_SOURCE=2 -fstack-protector-strong --param=ssp-buffer-size=4 -fPIC -mtune=generic -march=x86-64 -gdwarf-4 -fno-debug-types-section -fvar-tracking-assignments -g2  -DNDEBUG -DQT_NO_DEBUG -fPIC   -fvisibility=hidden -o CMakeFiles/ssh_shared.dir/ecdh.c.o   -c /tmp/B.aszTC5/BUILD/libssh-0.7.5/src/ecdh.c
make[2]: Leaving directory '/tmp/B.aszTC5/BUILD/libssh-0.7.5/build'
make[2]: Entering directory '/tmp/B.aszTC5/BUILD/libssh-0.7.5/build'
[ 14%] Building C object src/CMakeFiles/ssh_shared.dir/getpass.c.o
cd /tmp/B.aszTC5/BUILD/libssh-0.7.5/build/src && /usr/bin/x86_64-pld-linux-gnux32-gcc -DLIBSSH_EXPORTS -I/tmp/B.aszTC5/BUILD/libssh-0.7.5/build/src -I/tmp/B.aszTC5/BUILD/libssh-0.7.5/src -I/tmp/B.aszTC5/BUILD/libssh-0.7.5/include -I/tmp/B.aszTC5/BUILD/libssh-0.7.5/build  -std=gnu99 -pedantic -pedantic-errors -Wall -Wextra -Wshadow -Wmissing-prototypes -Wdeclaration-after-statement -Wunused -Wfloat-equal -Wpointer-arith -Wwrite-strings -Wformat-security -Wmissing-format-attribute -fPIC -fstack-protector -O2 -fwrapv -pipe -Wformat -Werror=format-security -gdwarf-4 -fno-debug-types-section -fvar-tracking-assignments -g2 -Wp,-D_FORTIFY_SOURCE=2 -fstack-protector-strong --param=ssp-buffer-size=4 -fPIC -mtune=generic -march=x86-64 -gdwarf-4 -fno-debug-types-section -fvar-tracking-assignments -g2  -DNDEBUG -DQT_NO_DEBUG -fPIC   -fvisibility=hidden -o CMakeFiles/ssh_shared.dir/getpass.c.o   -c /tmp/B.aszTC5/BUILD/libssh-0.7.5/src/getpass.c
make[2]: Leaving directory '/tmp/B.aszTC5/BUILD/libssh-0.7.5/build'
make[2]: Entering directory '/tmp/B.aszTC5/BUILD/libssh-0.7.5/build'
[ 15%] Building C object src/CMakeFiles/ssh_shared.dir/init.c.o
cd /tmp/B.aszTC5/BUILD/libssh-0.7.5/build/src && /usr/bin/x86_64-pld-linux-gnux32-gcc -DLIBSSH_EXPORTS -I/tmp/B.aszTC5/BUILD/libssh-0.7.5/build/src -I/tmp/B.aszTC5/BUILD/libssh-0.7.5/src -I/tmp/B.aszTC5/BUILD/libssh-0.7.5/include -I/tmp/B.aszTC5/BUILD/libssh-0.7.5/build  -std=gnu99 -pedantic -pedantic-errors -Wall -Wextra -Wshadow -Wmissing-prototypes -Wdeclaration-after-statement -Wunused -Wfloat-equal -Wpointer-arith -Wwrite-strings -Wformat-security -Wmissing-format-attribute -fPIC -fstack-protector -O2 -fwrapv -pipe -Wformat -Werror=format-security -gdwarf-4 -fno-debug-types-section -fvar-tracking-assignments -g2 -Wp,-D_FORTIFY_SOURCE=2 -fstack-protector-strong --param=ssp-buffer-size=4 -fPIC -mtune=generic -march=x86-64 -gdwarf-4 -fno-debug-types-section -fvar-tracking-assignments -g2  -DNDEBUG -DQT_NO_DEBUG -fPIC   -fvisibility=hidden -o CMakeFiles/ssh_shared.dir/init.c.o   -c /tmp/B.aszTC5/BUILD/libssh-0.7.5/src/init.c
make[2]: Leaving directory '/tmp/B.aszTC5/BUILD/libssh-0.7.5/build'
make[2]: Entering directory '/tmp/B.aszTC5/BUILD/libssh-0.7.5/build'
[ 11%] Building C object src/CMakeFiles/ssh_shared.dir/dh.c.o
cd /tmp/B.aszTC5/BUILD/libssh-0.7.5/build/src && /usr/bin/x86_64-pld-linux-gnux32-gcc -DLIBSSH_EXPORTS -I/tmp/B.aszTC5/BUILD/libssh-0.7.5/build/src -I/tmp/B.aszTC5/BUILD/libssh-0.7.5/src -I/tmp/B.aszTC5/BUILD/libssh-0.7.5/include -I/tmp/B.aszTC5/BUILD/libssh-0.7.5/build  -std=gnu99 -pedantic -pedantic-errors -Wall -Wextra -Wshadow -Wmissing-prototypes -Wdeclaration-after-statement -Wunused -Wfloat-equal -Wpointer-arith -Wwrite-strings -Wformat-security -Wmissing-format-attribute -fPIC -fstack-protector -O2 -fwrapv -pipe -Wformat -Werror=format-security -gdwarf-4 -fno-debug-types-section -fvar-tracking-assignments -g2 -Wp,-D_FORTIFY_SOURCE=2 -fstack-protector-strong --param=ssp-buffer-size=4 -fPIC -mtune=generic -march=x86-64 -gdwarf-4 -fno-debug-types-section -fvar-tracking-assignments -g2  -DNDEBUG -DQT_NO_DEBUG -fPIC   -fvisibility=hidden -o CMakeFiles/ssh_shared.dir/dh.c.o   -c /tmp/B.aszTC5/BUILD/libssh-0.7.5/src/dh.c
/tmp/B.aszTC5/BUILD/libssh-0.7.5/src/dh.c: In function 'ssh_get_random':
/tmp/B.aszTC5/BUILD/libssh-0.7.5/src/dh.c:137:5: warning: 'RAND_pseudo_bytes' is deprecated [-Wdeprecated-declarations]
     return RAND_pseudo_bytes(where,len);
     ^~~~~~
In file included from /usr/include/openssl/dsa.h:13,
                 from /tmp/B.aszTC5/BUILD/libssh-0.7.5/include/libssh/libcrypto.h:28,
                 from /tmp/B.aszTC5/BUILD/libssh-0.7.5/include/libssh/wrapper.h:26,
                 from /tmp/B.aszTC5/BUILD/libssh-0.7.5/include/libssh/crypto.h:33,
                 from /tmp/B.aszTC5/BUILD/libssh-0.7.5/src/dh.c:56:
/usr/include/openssl/rand.h:44:1: note: declared here
 DEPRECATEDIN_1_1_0(int RAND_pseudo_bytes(unsigned char *buf, int num))
 ^~~~~~~~~~~~~~~~~~
make[2]: Leaving directory '/tmp/B.aszTC5/BUILD/libssh-0.7.5/build'
make[2]: Entering directory '/tmp/B.aszTC5/BUILD/libssh-0.7.5/build'
[ 18%] Building C object src/CMakeFiles/ssh_shared.dir/libcrypto.c.o
cd /tmp/B.aszTC5/BUILD/libssh-0.7.5/build/src && /usr/bin/x86_64-pld-linux-gnux32-gcc -DLIBSSH_EXPORTS -I/tmp/B.aszTC5/BUILD/libssh-0.7.5/build/src -I/tmp/B.aszTC5/BUILD/libssh-0.7.5/src -I/tmp/B.aszTC5/BUILD/libssh-0.7.5/include -I/tmp/B.aszTC5/BUILD/libssh-0.7.5/build  -std=gnu99 -pedantic -pedantic-errors -Wall -Wextra -Wshadow -Wmissing-prototypes -Wdeclaration-after-statement -Wunused -Wfloat-equal -Wpointer-arith -Wwrite-strings -Wformat-security -Wmissing-format-attribute -fPIC -fstack-protector -O2 -fwrapv -pipe -Wformat -Werror=format-security -gdwarf-4 -fno-debug-types-section -fvar-tracking-assignments -g2 -Wp,-D_FORTIFY_SOURCE=2 -fstack-protector-strong --param=ssp-buffer-size=4 -fPIC -mtune=generic -march=x86-64 -gdwarf-4 -fno-debug-types-section -fvar-tracking-assignments -g2  -DNDEBUG -DQT_NO_DEBUG -fPIC   -fvisibility=hidden -o CMakeFiles/ssh_shared.dir/libcrypto.c.o   -c /tmp/B.aszTC5/BUILD/libssh-0.7.5/src/libcrypto.c
/tmp/B.aszTC5/BUILD/libssh-0.7.5/src/libcrypto.c: In function 'evp':
/tmp/B.aszTC5/BUILD/libssh-0.7.5/src/libcrypto.c:136:16: error: storage size of 'md' isn't known
     EVP_MD_CTX md;
                ^~
/tmp/B.aszTC5/BUILD/libssh-0.7.5/src/libcrypto.c:136:16: warning: unused variable 'md' [-Wunused-variable]
/tmp/B.aszTC5/BUILD/libssh-0.7.5/src/libcrypto.c: In function 'evp_init':
/tmp/B.aszTC5/BUILD/libssh-0.7.5/src/libcrypto.c:147:32: error: invalid application of 'sizeof' to incomplete type 'EVP_MD_CTX' {aka 'struct evp_md_ctx_st'}
     EVPCTX ctx = malloc(sizeof(EVP_MD_CTX));
                                ^~~~~~~~~~
/tmp/B.aszTC5/BUILD/libssh-0.7.5/src/libcrypto.c: In function 'hmac_init':
/tmp/B.aszTC5/BUILD/libssh-0.7.5/src/libcrypto.c:325:23: error: dereferencing pointer to incomplete type 'HMAC_CTX' {aka 'struct hmac_ctx_st'}
   ctx = malloc(sizeof(*ctx));
                       ^~~~
/tmp/B.aszTC5/BUILD/libssh-0.7.5/src/libcrypto.c:331:3: error: implicit declaration of function 'HMAC_CTX_init'; did you mean 'HMAC_CTX_new'? [-Wimplicit-function-declaration]
   HMAC_CTX_init(ctx); // openssl 0.9.7 requires it.
   ^~~~~~~~~~~~~
   HMAC_CTX_new
/tmp/B.aszTC5/BUILD/libssh-0.7.5/src/libcrypto.c:336:7: warning: 'HMAC_Init' is deprecated [-Wdeprecated-declarations]
       HMAC_Init(ctx, key, len, EVP_sha1());
       ^~~~~~~~~
In file included from /usr/include/openssl/dsa.h:13,
                 from /tmp/B.aszTC5/BUILD/libssh-0.7.5/include/libssh/libcrypto.h:28,
                 from /tmp/B.aszTC5/BUILD/libssh-0.7.5/include/libssh/wrapper.h:26,
                 from /tmp/B.aszTC5/BUILD/libssh-0.7.5/include/libssh/packet.h:24,
                 from /tmp/B.aszTC5/BUILD/libssh-0.7.5/include/libssh/session.h:25,
                 from /tmp/B.aszTC5/BUILD/libssh-0.7.5/src/libcrypto.c:32:
/usr/include/openssl/hmac.h:30:1: note: declared here
 DEPRECATEDIN_1_1_0(__owur int HMAC_Init(HMAC_CTX *ctx, const void *key, int len,
 ^~~~~~~~~~~~~~~~~~
/tmp/B.aszTC5/BUILD/libssh-0.7.5/src/libcrypto.c:339:7: warning: 'HMAC_Init' is deprecated [-Wdeprecated-declarations]
       HMAC_Init(ctx, key, len, EVP_sha256());
       ^~~~~~~~~
In file included from /usr/include/openssl/dsa.h:13,
                 from /tmp/B.aszTC5/BUILD/libssh-0.7.5/include/libssh/libcrypto.h:28,
                 from /tmp/B.aszTC5/BUILD/libssh-0.7.5/include/libssh/wrapper.h:26,
                 from /tmp/B.aszTC5/BUILD/libssh-0.7.5/include/libssh/packet.h:24,
                 from /tmp/B.aszTC5/BUILD/libssh-0.7.5/include/libssh/session.h:25,
                 from /tmp/B.aszTC5/BUILD/libssh-0.7.5/src/libcrypto.c:32:
/usr/include/openssl/hmac.h:30:1: note: declared here
 DEPRECATEDIN_1_1_0(__owur int HMAC_Init(HMAC_CTX *ctx, const void *key, int len,
 ^~~~~~~~~~~~~~~~~~
/tmp/B.aszTC5/BUILD/libssh-0.7.5/src/libcrypto.c:342:7: warning: 'HMAC_Init' is deprecated [-Wdeprecated-declarations]
       HMAC_Init(ctx, key, len, EVP_sha384());
       ^~~~~~~~~
In file included from /usr/include/openssl/dsa.h:13,
                 from /tmp/B.aszTC5/BUILD/libssh-0.7.5/include/libssh/libcrypto.h:28,
                 from /tmp/B.aszTC5/BUILD/libssh-0.7.5/include/libssh/wrapper.h:26,
                 from /tmp/B.aszTC5/BUILD/libssh-0.7.5/include/libssh/packet.h:24,
                 from /tmp/B.aszTC5/BUILD/libssh-0.7.5/include/libssh/session.h:25,
                 from /tmp/B.aszTC5/BUILD/libssh-0.7.5/src/libcrypto.c:32:
/usr/include/openssl/hmac.h:30:1: note: declared here
 DEPRECATEDIN_1_1_0(__owur int HMAC_Init(HMAC_CTX *ctx, const void *key, int len,
 ^~~~~~~~~~~~~~~~~~
/tmp/B.aszTC5/BUILD/libssh-0.7.5/src/libcrypto.c:345:7: warning: 'HMAC_Init' is deprecated [-Wdeprecated-declarations]
       HMAC_Init(ctx, key, len, EVP_sha512());
       ^~~~~~~~~
In file included from /usr/include/openssl/dsa.h:13,
                 from /tmp/B.aszTC5/BUILD/libssh-0.7.5/include/libssh/libcrypto.h:28,
                 from /tmp/B.aszTC5/BUILD/libssh-0.7.5/include/libssh/wrapper.h:26,
                 from /tmp/B.aszTC5/BUILD/libssh-0.7.5/include/libssh/packet.h:24,
                 from /tmp/B.aszTC5/BUILD/libssh-0.7.5/include/libssh/session.h:25,
                 from /tmp/B.aszTC5/BUILD/libssh-0.7.5/src/libcrypto.c:32:
/usr/include/openssl/hmac.h:30:1: note: declared here
 DEPRECATEDIN_1_1_0(__owur int HMAC_Init(HMAC_CTX *ctx, const void *key, int len,
 ^~~~~~~~~~~~~~~~~~
/tmp/B.aszTC5/BUILD/libssh-0.7.5/src/libcrypto.c:348:7: warning: 'HMAC_Init' is deprecated [-Wdeprecated-declarations]
       HMAC_Init(ctx, key, len, EVP_md5());
       ^~~~~~~~~
In file included from /usr/include/openssl/dsa.h:13,
                 from /tmp/B.aszTC5/BUILD/libssh-0.7.5/include/libssh/libcrypto.h:28,
                 from /tmp/B.aszTC5/BUILD/libssh-0.7.5/include/libssh/wrapper.h:26,
                 from /tmp/B.aszTC5/BUILD/libssh-0.7.5/include/libssh/packet.h:24,
                 from /tmp/B.aszTC5/BUILD/libssh-0.7.5/include/libssh/session.h:25,
                 from /tmp/B.aszTC5/BUILD/libssh-0.7.5/src/libcrypto.c:32:
/usr/include/openssl/hmac.h:30:1: note: declared here
 DEPRECATEDIN_1_1_0(__owur int HMAC_Init(HMAC_CTX *ctx, const void *key, int len,
 ^~~~~~~~~~~~~~~~~~
/tmp/B.aszTC5/BUILD/libssh-0.7.5/src/libcrypto.c: In function 'hmac_final':
/tmp/B.aszTC5/BUILD/libssh-0.7.5/src/libcrypto.c:366:3: error: implicit declaration of function 'HMAC_CTX_cleanup'; did you mean 'HMAC_CTX_get_md'? [-Wimplicit-function-declaration]
   HMAC_CTX_cleanup(ctx);
   ^~~~~~~~~~~~~~~~
   HMAC_CTX_get_md
/tmp/B.aszTC5/BUILD/libssh-0.7.5/src/libcrypto.c: In function 'aes_ctr128_encrypt':
/tmp/B.aszTC5/BUILD/libssh-0.7.5/src/libcrypto.c:458:3: error: implicit declaration of function 'AES_ctr128_encrypt'; did you mean 'AES_cfb128_encrypt'? [-Wimplicit-function-declaration]
   AES_ctr128_encrypt(in, out, len, cipher->key, cipher->IV, tmp_buffer, &num);
   ^~~~~~~~~~~~~~~~~~
   AES_cfb128_encrypt
make[2]: *** [src/CMakeFiles/ssh_shared.dir/build.make:313: src/CMakeFiles/ssh_shared.dir/libcrypto.c.o] Error 1
make[2]: Leaving directory '/tmp/B.aszTC5/BUILD/libssh-0.7.5/build'
make[2]: *** Waiting for unfinished jobs....
make[2]: Entering directory '/tmp/B.aszTC5/BUILD/libssh-0.7.5/build'
[ 20%] Building C object src/CMakeFiles/ssh_shared.dir/match.c.o
cd /tmp/B.aszTC5/BUILD/libssh-0.7.5/build/src && /usr/bin/x86_64-pld-linux-gnux32-gcc -DLIBSSH_EXPORTS -I/tmp/B.aszTC5/BUILD/libssh-0.7.5/build/src -I/tmp/B.aszTC5/BUILD/libssh-0.7.5/src -I/tmp/B.aszTC5/BUILD/libssh-0.7.5/include -I/tmp/B.aszTC5/BUILD/libssh-0.7.5/build  -std=gnu99 -pedantic -pedantic-errors -Wall -Wextra -Wshadow -Wmissing-prototypes -Wdeclaration-after-statement -Wunused -Wfloat-equal -Wpointer-arith -Wwrite-strings -Wformat-security -Wmissing-format-attribute -fPIC -fstack-protector -O2 -fwrapv -pipe -Wformat -Werror=format-security -gdwarf-4 -fno-debug-types-section -fvar-tracking-assignments -g2 -Wp,-D_FORTIFY_SOURCE=2 -fstack-protector-strong --param=ssp-buffer-size=4 -fPIC -mtune=generic -march=x86-64 -gdwarf-4 -fno-debug-types-section -fvar-tracking-assignments -g2  -DNDEBUG -DQT_NO_DEBUG -fPIC   -fvisibility=hidden -o CMakeFiles/ssh_shared.dir/match.c.o   -c /tmp/B.aszTC5/BUILD/libssh-0.7.5/src/match.c
make[2]: Leaving directory '/tmp/B.aszTC5/BUILD/libssh-0.7.5/build'
make[2]: Entering directory '/tmp/B.aszTC5/BUILD/libssh-0.7.5/build'
[ 19%] Building C object src/CMakeFiles/ssh_shared.dir/log.c.o
cd /tmp/B.aszTC5/BUILD/libssh-0.7.5/build/src && /usr/bin/x86_64-pld-linux-gnux32-gcc -DLIBSSH_EXPORTS -I/tmp/B.aszTC5/BUILD/libssh-0.7.5/build/src -I/tmp/B.aszTC5/BUILD/libssh-0.7.5/src -I/tmp/B.aszTC5/BUILD/libssh-0.7.5/include -I/tmp/B.aszTC5/BUILD/libssh-0.7.5/build  -std=gnu99 -pedantic -pedantic-errors -Wall -Wextra -Wshadow -Wmissing-prototypes -Wdeclaration-after-statement -Wunused -Wfloat-equal -Wpointer-arith -Wwrite-strings -Wformat-security -Wmissing-format-attribute -fPIC -fstack-protector -O2 -fwrapv -pipe -Wformat -Werror=format-security -gdwarf-4 -fno-debug-types-section -fvar-tracking-assignments -g2 -Wp,-D_FORTIFY_SOURCE=2 -fstack-protector-strong --param=ssp-buffer-size=4 -fPIC -mtune=generic -march=x86-64 -gdwarf-4 -fno-debug-types-section -fvar-tracking-assignments -g2  -DNDEBUG -DQT_NO_DEBUG -fPIC   -fvisibility=hidden -o CMakeFiles/ssh_shared.dir/log.c.o   -c /tmp/B.aszTC5/BUILD/libssh-0.7.5/src/log.c
/tmp/B.aszTC5/BUILD/libssh-0.7.5/src/log.c: In function 'ssh_log_function':
/tmp/B.aszTC5/BUILD/libssh-0.7.5/src/log.c:68:32: warning: '%06ld' directive output may be truncated writing between 6 and 11 bytes into a region of size between 0 and 63 [-Wformat-truncation=]
         snprintf(buf, len, "%s.%06ld", tbuf, (long)tv.tv_usec);
                                ^~~~~
/tmp/B.aszTC5/BUILD/libssh-0.7.5/src/log.c:68:28: note: using the range [-2147483648, 2147483647] for directive argument
         snprintf(buf, len, "%s.%06ld", tbuf, (long)tv.tv_usec);
                            ^~~~~~~~~~
In file included from /usr/include/stdio.h:873,
                 from /tmp/B.aszTC5/BUILD/libssh-0.7.5/src/log.c:24:
/usr/include/bits/stdio2.h:67:10: note: '__builtin___snprintf_chk' output between 8 and 76 bytes into a destination of size 64
   return __builtin___snprintf_chk (__s, __n, __USE_FORTIFY_LEVEL - 1,
          ^~~~~~~~~~~~~~~~~~~~~~~~~~~~~~~~~~~~~~~~~~~~~~~~~~~~~~~~~~~~
        __bos (__s), __fmt, __va_arg_pack ());
        ~~~~~~~~~~~~~~~~~~~~~~~~~~~~~~~~~~~~~
make[2]: Leaving directory '/tmp/B.aszTC5/BUILD/libssh-0.7.5/build'
make[2]: Entering directory '/tmp/B.aszTC5/BUILD/libssh-0.7.5/build'
[ 16%] Building C object src/CMakeFiles/ssh_shared.dir/known_hosts.c.o
cd /tmp/B.aszTC5/BUILD/libssh-0.7.5/build/src && /usr/bin/x86_64-pld-linux-gnux32-gcc -DLIBSSH_EXPORTS -I/tmp/B.aszTC5/BUILD/libssh-0.7.5/build/src -I/tmp/B.aszTC5/BUILD/libssh-0.7.5/src -I/tmp/B.aszTC5/BUILD/libssh-0.7.5/include -I/tmp/B.aszTC5/BUILD/libssh-0.7.5/build  -std=gnu99 -pedantic -pedantic-errors -Wall -Wextra -Wshadow -Wmissing-prototypes -Wdeclaration-after-statement -Wunused -Wfloat-equal -Wpointer-arith -Wwrite-strings -Wformat-security -Wmissing-format-attribute -fPIC -fstack-protector -O2 -fwrapv -pipe -Wformat -Werror=format-security -gdwarf-4 -fno-debug-types-section -fvar-tracking-assignments -g2 -Wp,-D_FORTIFY_SOURCE=2 -fstack-protector-strong --param=ssp-buffer-size=4 -fPIC -mtune=generic -march=x86-64 -gdwarf-4 -fno-debug-types-section -fvar-tracking-assignments -g2  -DNDEBUG -DQT_NO_DEBUG -fPIC   -fvisibility=hidden -o CMakeFiles/ssh_shared.dir/known_hosts.c.o   -c /tmp/B.aszTC5/BUILD/libssh-0.7.5/src/known_hosts.c
make[2]: Leaving directory '/tmp/B.aszTC5/BUILD/libssh-0.7.5/build'
make[2]: Entering directory '/tmp/B.aszTC5/BUILD/libssh-0.7.5/build'
[ 17%] Building C object src/CMakeFiles/ssh_shared.dir/legacy.c.o
cd /tmp/B.aszTC5/BUILD/libssh-0.7.5/build/src && /usr/bin/x86_64-pld-linux-gnux32-gcc -DLIBSSH_EXPORTS -I/tmp/B.aszTC5/BUILD/libssh-0.7.5/build/src -I/tmp/B.aszTC5/BUILD/libssh-0.7.5/src -I/tmp/B.aszTC5/BUILD/libssh-0.7.5/include -I/tmp/B.aszTC5/BUILD/libssh-0.7.5/build  -std=gnu99 -pedantic -pedantic-errors -Wall -Wextra -Wshadow -Wmissing-prototypes -Wdeclaration-after-statement -Wunused -Wfloat-equal -Wpointer-arith -Wwrite-strings -Wformat-security -Wmissing-format-attribute -fPIC -fstack-protector -O2 -fwrapv -pipe -Wformat -Werror=format-security -gdwarf-4 -fno-debug-types-section -fvar-tracking-assignments -g2 -Wp,-D_FORTIFY_SOURCE=2 -fstack-protector-strong --param=ssp-buffer-size=4 -fPIC -mtune=generic -march=x86-64 -gdwarf-4 -fno-debug-types-section -fvar-tracking-assignments -g2  -DNDEBUG -DQT_NO_DEBUG -fPIC   -fvisibility=hidden -o CMakeFiles/ssh_shared.dir/legacy.c.o   -c /tmp/B.aszTC5/BUILD/libssh-0.7.5/src/legacy.c
make[2]: Leaving directory '/tmp/B.aszTC5/BUILD/libssh-0.7.5/build'
make[2]: Entering directory '/tmp/B.aszTC5/BUILD/libssh-0.7.5/build'
[ 16%] Building C object src/CMakeFiles/ssh_shared.dir/kex.c.o
cd /tmp/B.aszTC5/BUILD/libssh-0.7.5/build/src && /usr/bin/x86_64-pld-linux-gnux32-gcc -DLIBSSH_EXPORTS -I/tmp/B.aszTC5/BUILD/libssh-0.7.5/build/src -I/tmp/B.aszTC5/BUILD/libssh-0.7.5/src -I/tmp/B.aszTC5/BUILD/libssh-0.7.5/include -I/tmp/B.aszTC5/BUILD/libssh-0.7.5/build  -std=gnu99 -pedantic -pedantic-errors -Wall -Wextra -Wshadow -Wmissing-prototypes -Wdeclaration-after-statement -Wunused -Wfloat-equal -Wpointer-arith -Wwrite-strings -Wformat-security -Wmissing-format-attribute -fPIC -fstack-protector -O2 -fwrapv -pipe -Wformat -Werror=format-security -gdwarf-4 -fno-debug-types-section -fvar-tracking-assignments -g2 -Wp,-D_FORTIFY_SOURCE=2 -fstack-protector-strong --param=ssp-buffer-size=4 -fPIC -mtune=generic -march=x86-64 -gdwarf-4 -fno-debug-types-section -fvar-tracking-assignments -g2  -DNDEBUG -DQT_NO_DEBUG -fPIC   -fvisibility=hidden -o CMakeFiles/ssh_shared.dir/kex.c.o   -c /tmp/B.aszTC5/BUILD/libssh-0.7.5/src/kex.c
make[2]: Leaving directory '/tmp/B.aszTC5/BUILD/libssh-0.7.5/build'
make[2]: Entering directory '/tmp/B.aszTC5/BUILD/libssh-0.7.5/build'
[  6%] Building C object src/CMakeFiles/ssh_shared.dir/channels.c.o
cd /tmp/B.aszTC5/BUILD/libssh-0.7.5/build/src && /usr/bin/x86_64-pld-linux-gnux32-gcc -DLIBSSH_EXPORTS -I/tmp/B.aszTC5/BUILD/libssh-0.7.5/build/src -I/tmp/B.aszTC5/BUILD/libssh-0.7.5/src -I/tmp/B.aszTC5/BUILD/libssh-0.7.5/include -I/tmp/B.aszTC5/BUILD/libssh-0.7.5/build  -std=gnu99 -pedantic -pedantic-errors -Wall -Wextra -Wshadow -Wmissing-prototypes -Wdeclaration-after-statement -Wunused -Wfloat-equal -Wpointer-arith -Wwrite-strings -Wformat-security -Wmissing-format-attribute -fPIC -fstack-protector -O2 -fwrapv -pipe -Wformat -Werror=format-security -gdwarf-4 -fno-debug-types-section -fvar-tracking-assignments -g2 -Wp,-D_FORTIFY_SOURCE=2 -fstack-protector-strong --param=ssp-buffer-size=4 -fPIC -mtune=generic -march=x86-64 -gdwarf-4 -fno-debug-types-section -fvar-tracking-assignments -g2  -DNDEBUG -DQT_NO_DEBUG -fPIC   -fvisibility=hidden -o CMakeFiles/ssh_shared.dir/channels.c.o   -c /tmp/B.aszTC5/BUILD/libssh-0.7.5/src/channels.c
make[2]: Leaving directory '/tmp/B.aszTC5/BUILD/libssh-0.7.5/build'
make[2]: Entering directory '/tmp/B.aszTC5/BUILD/libssh-0.7.5/build'
[ 22%] Building C object src/CMakeFiles/ssh_shared.dir/misc.c.o
cd /tmp/B.aszTC5/BUILD/libssh-0.7.5/build/src && /usr/bin/x86_64-pld-linux-gnux32-gcc -DLIBSSH_EXPORTS -I/tmp/B.aszTC5/BUILD/libssh-0.7.5/build/src -I/tmp/B.aszTC5/BUILD/libssh-0.7.5/src -I/tmp/B.aszTC5/BUILD/libssh-0.7.5/include -I/tmp/B.aszTC5/BUILD/libssh-0.7.5/build  -std=gnu99 -pedantic -pedantic-errors -Wall -Wextra -Wshadow -Wmissing-prototypes -Wdeclaration-after-statement -Wunused -Wfloat-equal -Wpointer-arith -Wwrite-strings -Wformat-security -Wmissing-format-attribute -fPIC -fstack-protector -O2 -fwrapv -pipe -Wformat -Werror=format-security -gdwarf-4 -fno-debug-types-section -fvar-tracking-assignments -g2 -Wp,-D_FORTIFY_SOURCE=2 -fstack-protector-strong --param=ssp-buffer-size=4 -fPIC -mtune=generic -march=x86-64 -gdwarf-4 -fno-debug-types-section -fvar-tracking-assignments -g2  -DNDEBUG -DQT_NO_DEBUG -fPIC   -fvisibility=hidden -o CMakeFiles/ssh_shared.dir/misc.c.o   -c /tmp/B.aszTC5/BUILD/libssh-0.7.5/src/misc.c
/tmp/B.aszTC5/BUILD/libssh-0.7.5/src/misc.c: In function 'ssh_timeout_elapsed':
/tmp/B.aszTC5/BUILD/libssh-0.7.5/src/misc.c:954:13: warning: this statement may fall through [-Wimplicit-fallthrough=]
             fprintf(stderr, "ssh_timeout_elapsed called with -2. this needs to "
             ^~~~~~~~~~~~~~~~~~~~~~~~~~~~~~~~~~~~~~~~~~~~~~~~~~~~~~~~~~~~~~~~~~~~
                             "be fixed. please set a breakpoint on %s:%d and "
                             ~~~~~~~~~~~~~~~~~~~~~~~~~~~~~~~~~~~~~~~~~~~~~~~~~
                             "fix the caller\n", __FILE__, __LINE__);
                             ~~~~~~~~~~~~~~~~~~~~~~~~~~~~~~~~~~~~~~~
/tmp/B.aszTC5/BUILD/libssh-0.7.5/src/misc.c:957:9: note: here
         case -1: /* -1 means infinite timeout */
         ^~~~
make[2]: Leaving directory '/tmp/B.aszTC5/BUILD/libssh-0.7.5/build'
make[2]: Entering directory '/tmp/B.aszTC5/BUILD/libssh-0.7.5/build'
[ 21%] Building C object src/CMakeFiles/ssh_shared.dir/messages.c.o
cd /tmp/B.aszTC5/BUILD/libssh-0.7.5/build/src && /usr/bin/x86_64-pld-linux-gnux32-gcc -DLIBSSH_EXPORTS -I/tmp/B.aszTC5/BUILD/libssh-0.7.5/build/src -I/tmp/B.aszTC5/BUILD/libssh-0.7.5/src -I/tmp/B.aszTC5/BUILD/libssh-0.7.5/include -I/tmp/B.aszTC5/BUILD/libssh-0.7.5/build  -std=gnu99 -pedantic -pedantic-errors -Wall -Wextra -Wshadow -Wmissing-prototypes -Wdeclaration-after-statement -Wunused -Wfloat-equal -Wpointer-arith -Wwrite-strings -Wformat-security -Wmissing-format-attribute -fPIC -fstack-protector -O2 -fwrapv -pipe -Wformat -Werror=format-security -gdwarf-4 -fno-debug-types-section -fvar-tracking-assignments -g2 -Wp,-D_FORTIFY_SOURCE=2 -fstack-protector-strong --param=ssp-buffer-size=4 -fPIC -mtune=generic -march=x86-64 -gdwarf-4 -fno-debug-types-section -fvar-tracking-assignments -g2  -DNDEBUG -DQT_NO_DEBUG -fPIC   -fvisibility=hidden -o CMakeFiles/ssh_shared.dir/messages.c.o   -c /tmp/B.aszTC5/BUILD/libssh-0.7.5/src/messages.c
make[2]: Leaving directory '/tmp/B.aszTC5/BUILD/libssh-0.7.5/build'
make[1]: *** [CMakeFiles/Makefile2:210: src/CMakeFiles/ssh_shared.dir/all] Error 2
make: *** [Makefile:155: all] Error 2
error: Bad exit status from /tmp/B.aszTC5/BUILD/tmp/rpm-tmp.96429 (%build)


RPM build errors:
    Bad exit status from /tmp/B.aszTC5/BUILD/tmp/rpm-tmp.96429 (%build)
ended at: Fri Sep 14 20:48:19 2018, done in 0:00:14.092680
error: No files produced.
+ chmod -R u+rwX /tmp/B.aszTC5/BUILD
+ rm -rf /tmp/B.aszTC5/tmp /tmp/B.aszTC5/BUILD
+ rm -rf /tmp/B.aszTC5
Begin-PLD-Builder-Info
Build-Time: user:24.81s sys:10.62s real:17.38s (faults io:0 non-io:618307)

End-PLD-Builder-Info
[Back to list of logs] [View rpm -qa of builder]