FailedOk

th/SRPMS[OK]
th/x32[OK]
th/i686[OK]
th/x86_64[OK]

ac/SRPMS[OK]
ac/i386[OK]
ac/i586[OK]
ac/i686[OK]
ac/alpha[OK]
ac/amd64[OK]
ac/athlon[OK]
ac/ppc[OK]
ac/sparc[OK]
ac/sparc64[OK]

Advanced Search
main()
Powered by PLD Linux
(c) 2002-2020 PLD Team
$Revision: 1.37 $
Powered by /dev/ill.
Your IP: 34.200.218.187

libtorrent-rasterbar 38da2283-183f-484f-bad0-77fbae588bc7

Status:Failed
Source URL:https://buildlogs.pld-linux.org/pld/th/x32/FAIL/libtorrent-rasterbar,38da2283-183f-484f-bad0-77fbae588bc7.bz2
text/plain URL:View!
rpm -qa of builder:View!
Date:2020/07/31 19:24:10
Runtime:0:00:18.959001

Toc:

  • prep
  • Executing(%prep): /bin/sh -e /tmp/B.fNc1IB/BUILD/tmp/rpm-tmp.23387
  • build
  • Executing(%build): /bin/sh -e /tmp/B.fNc1IB/BUILD/tmp/rpm-tmp.23387
  • error 1
  • ../include/libtorrent/config.hpp:53:10: fatal error: boost/detail/endian.hpp: No such file or directory
  • error 2
  • compilation terminated.
  • error 3
  • make[1]: *** [Makefile:1033: allocator.lo] Error 1
  • error 4
  • ../include/libtorrent/config.hpp:53:10: fatal error: boost/detail/endian.hpp: No such file or directory
  • error 5
  • compilation terminated.
  • error 6
  • make[1]: *** [Makefile:1033: assert.lo] Error 1
  • error 7
  • ../include/libtorrent/config.hpp:53:10: fatal error: boost/detail/endian.hpp: No such file or directory
  • error 8
  • compilation terminated.
  • error 9
  • make[1]: *** [Makefile:1033: bandwidth_limit.lo] Error 1
  • error 10
  • ../include/libtorrent/config.hpp:53:10: fatal error: boost/detail/endian.hpp: No such file or directory
  • error 11
  • compilation terminated.
  • error 12
  • make[1]: *** [Makefile:1033: announce_entry.lo] Error 1
  • error 13
  • ../include/libtorrent/config.hpp:53:10: fatal error: boost/detail/endian.hpp: No such file or directory
  • error 14
  • compilation terminated.
  • error 15
  • make[1]: *** [Makefile:1033: bandwidth_manager.lo] Error 1
  • error 16
  • ../include/libtorrent/config.hpp:53:10: fatal error: boost/detail/endian.hpp: No such file or directory
  • error 17
  • compilation terminated.
  • error 18
  • make[1]: *** [Makefile:1033: alert_manager.lo] Error 1
  • error 19
  • ../include/libtorrent/config.hpp:53:10: fatal error: boost/detail/endian.hpp: No such file or directory
  • error 20
  • compilation terminated.
  • error 21
  • make[1]: *** [Makefile:1033: alert.lo] Error 1
  • error 22
  • ../include/libtorrent/config.hpp:53:10: fatal error: boost/detail/endian.hpp: No such file or directory
  • error 23
  • compilation terminated.
  • error 24
  • make[1]: *** [Makefile:1033: web_connection_base.lo] Error 1
  • error 25
  • ../include/libtorrent/config.hpp:53:10: fatal error: boost/detail/endian.hpp: No such file or directory
  • error 26
  • compilation terminated.
  • error 27
  • make[1]: *** [Makefile:1033: bandwidth_queue_entry.lo] Error 1
  • error 28
  • error: Bad exit status from /tmp/B.fNc1IB/BUILD/tmp/rpm-tmp.23387 (%build)
  • error 29
  • RPM build errors:
  • error 30
  • error: No files produced.

Content:

request from: qboosh
checking if we should skip the build
started at: Fri Jul 31 19:23:48 2020
killing old processes on a builder
sending signal 9 to pid -1
Killed
cleaning up /tmp
fetching https://srcbuilder.pld-linux.org/th//srpms/38da2283-183f-484f-bad0-77fbae588bc7/libtorrent-rasterbar-1.1.11-2.src.rpm
fetched 4064815 bytes, 3041.9 K/s
installing srpm: libtorrent-rasterbar-1.1.11-2.src.rpm
+ install -d /tmp/B.fNc1IB/BUILD /tmp/B.fNc1IB/RPMS
+ LC_ALL=en_US.UTF-8
+ rpm -qp --changelog libtorrent-rasterbar-1.1.11-2.src.rpm
* Fri Jul 31 2020 PLD Linux Team <feedback@pld-linux.org>
- For complete changelog see: http://git.pld-linux.org/?p=packages/libtorrent-rasterbar.git;a=log;h=master
* Wed Oct 09 2019 Jan Rękorajski <baggins@pld-linux.org> bc2b397
- rebuild with boost 1.71 - release 2 (by relup.sh) + rpm -Uhv --nodeps --define '_topdir /tmp/B.fNc1IB' --define '_specdir %{_topdir}' --define '_sourcedir %{_specdir}' --define '_rpmdir %{_topdir}/RPMS' --define '_builddir %{_topdir}/BUILD' libtorrent-rasterbar-1.1.11-2.src.rpm Preparing... ################################################## libtorrent-rasterbar ################################################## + rm -f libtorrent-rasterbar-1.1.11-2.src.rpm + install -m 700 -d /tmp/B.fNc1IB/BUILD/tmp + TMPDIR=/tmp/B.fNc1IB/BUILD/tmp + exec nice -n 0 rpmbuild -bp --short-circuit --nodeps --define '_topdir /tmp/B.fNc1IB' --define '_specdir %{_topdir}' --define '_sourcedir %{_specdir}' --define '_rpmdir %{_topdir}/RPMS' --define '_builddir %{_topdir}/BUILD' --target x32-pld-linux --define 'prep exit 0' /tmp/B.fNc1IB/libtorrent-rasterbar.spec warning: %changelog not in descending chronological order Building target platforms: x32-pld-linux checking BuildConflict-ing packages no BuildConflicts found checking BR rpm: warning: %changelog not in descending chronological order rpm: Building target platforms: x32-pld-linux no BR needed building RPM using: set -ex; : build-id: 38da2283-183f-484f-bad0-77fbae588bc7; TMPDIR=/tmp/B.fNc1IB/BUILD/tmp exec nice -n 0 rpmbuild -bb --define '_smp_mflags -j9' --define '_make_opts -Otarget' --define '_pld_builder 1' --define '_topdir /tmp/B.fNc1IB' --define '_specdir %{_topdir}' --define '_sourcedir %{_specdir}' --define '_rpmdir %{_topdir}/RPMS' --define '_builddir %{_topdir}/BUILD' --target x32-pld-linux /tmp/B.fNc1IB/libtorrent-rasterbar.spec + : build-id: 38da2283-183f-484f-bad0-77fbae588bc7 + TMPDIR=/tmp/B.fNc1IB/BUILD/tmp + exec nice -n 0 rpmbuild -bb --define '_smp_mflags -j9' --define '_make_opts -Otarget' --define '_pld_builder 1' --define '_topdir /tmp/B.fNc1IB' --define '_specdir %{_topdir}' --define '_sourcedir %{_specdir}' --define '_rpmdir %{_topdir}/RPMS' --define '_builddir %{_topdir}/BUILD' --target x32-pld-linux /tmp/B.fNc1IB/libtorrent-rasterbar.spec warning: %changelog not in descending chronological order Building target platforms: x32-pld-linux Executing(%prep): /bin/sh -e /tmp/B.fNc1IB/BUILD/tmp/rpm-tmp.23387 + umask 022 + cd /tmp/B.fNc1IB/BUILD + cd /tmp/B.fNc1IB/BUILD + rm -rf libtorrent-rasterbar-1.1.11 + /bin/gzip -dc /tmp/B.fNc1IB/libtorrent-rasterbar-1.1.11.tar.gz + /bin/tar -xf - + STATUS=0 + '[' 0 -ne 0 ']' + cd libtorrent-rasterbar-1.1.11 + /bin/id -u + '[' 1000 '=' 0 ']' + /bin/id -u + '[' 1000 '=' 0 ']' + /bin/chmod -Rf a+rX,u+w,g-w,o-w . + echo 'Patch #0 (libtorrent-rasterbar-boost.patch):' Patch #0 (libtorrent-rasterbar-boost.patch): + '[' -f /tmp/B.fNc1IB/libtorrent-rasterbar-boost.patch ']' + /bin/cat /tmp/B.fNc1IB/libtorrent-rasterbar-boost.patch + /usr/bin/patch -s -p1 + find src docs -type f + xargs chmod a-x + find -type f -regex '.*\.[hc]pp' + xargs chmod a-x + /bin/rm '--interactive=never' docs/building.rst docs/client_test.rst docs/contributing.rst docs/dht_extensions.rst docs/dht_rss.rst docs/dht_sec.rst docs/dht_store.rst docs/examples.rst docs/extension_protocol.rst docs/features.rst docs/index.rst docs/manual-ref.rst docs/projects.rst docs/python_binding.rst docs/settings.rst docs/stats_counters.rst docs/streaming.rst docs/troubleshooting.rst docs/tuning.rst docs/tutorial.rst docs/udp_tracker_protocol.rst docs/utp.rst + exit 0 Executing(%build): /bin/sh -e /tmp/B.fNc1IB/BUILD/tmp/rpm-tmp.23387 HOME=/home/users/builder PATH=/home/users/builder/GNUstep/Tools:/bin:/usr/bin:/usr/local/bin TMPDIR=/tmp/B.fNc1IB/BUILD/tmp + umask 022 + cd /tmp/B.fNc1IB/BUILD + cd libtorrent-rasterbar-1.1.11 + libtoolize --copy --force --install libtoolize: putting auxiliary files in AC_CONFIG_AUX_DIR, 'build-aux'. libtoolize: copying file 'build-aux/config.guess' libtoolize: copying file 'build-aux/config.sub' libtoolize: copying file 'build-aux/install-sh' libtoolize: copying file 'build-aux/ltmain.sh' libtoolize: putting macros in AC_CONFIG_MACRO_DIRS, 'm4'. libtoolize: copying file 'm4/libtool.m4' libtoolize: copying file 'm4/ltoptions.m4' libtoolize: copying file 'm4/ltsugar.m4' libtoolize: copying file 'm4/ltversion.m4' libtoolize: copying file 'm4/lt~obsolete.m4' + aclocal -I m4 + autoconf + automake -a -c -f --foreign configure.ac:66: installing 'build-aux/compile' configure.ac:81: installing 'build-aux/missing' examples/Makefile.am: installing 'build-aux/depcomp' + ./configure 'LDFLAGS=-Wl,--as-needed -Wl,--no-copy-dt-needed-entries -Wl,-z,relro -Wl,-z,combreloc ' 'CFLAGS=-O2 -fwrapv -pipe -Wformat -Werror=format-security -gdwarf-4 -fno-debug-types-section -fvar-tracking-assignments -g2 -Wp,-D_FORTIFY_SOURCE=2 -fstack-protector-strong --param=ssp-buffer-size=4 -Werror=trampolines -fPIC -mtune=generic -march=x86-64 -gdwarf-4 -fno-debug-types-section -fvar-tracking-assignments -g2 ' 'CXXFLAGS=-O2 -fwrapv -pipe -Wformat -Werror=format-security -gdwarf-4 -fno-debug-types-section -fvar-tracking-assignments -g2 -Wp,-D_FORTIFY_SOURCE=2 -fstack-protector-strong --param=ssp-buffer-size=4 -Werror=trampolines -fPIC -mtune=generic -march=x86-64 -gdwarf-4 -fno-debug-types-section -fvar-tracking-assignments -g2 ' 'FFLAGS=-O2 -fwrapv -pipe -Wformat -Werror=format-security -gdwarf-4 -fno-debug-types-section -fvar-tracking-assignments -g2 -Wp,-D_FORTIFY_SOURCE=2 -fstack-protector-strong --param=ssp-buffer-size=4 -Werror=trampolines -fPIC -mtune=generic -march=x86-64 -gdwarf-4 -fno-debug-types-section -fvar-tracking-assignments -g2 ' 'FCFLAGS=-O2 -fwrapv -pipe -Wformat -Werror=format-security -gdwarf-4 -fno-debug-types-section -fvar-tracking-assignments -g2 -Wp,-D_FORTIFY_SOURCE=2 -fstack-protector-strong --param=ssp-buffer-size=4 -Werror=trampolines -fPIC -mtune=generic -march=x86-64 -gdwarf-4 -fno-debug-types-section -fvar-tracking-assignments -g2 ' 'CPPFLAGS=' 'CC=x86_64-pld-linux-gnux32-gcc' 'CXX=x86_64-pld-linux-gnux32-g++' '--host=x86_64-pld-linux-gnux32' '--build=x86_64-pld-linux-gnux32' '--prefix=/usr' '--exec-prefix=/usr' '--bindir=/usr/bin' '--sbindir=/usr/sbin' '--sysconfdir=/etc' '--datadir=/usr/share' '--includedir=/usr/include' '--libdir=/usr/libx32' '--libexecdir=/usr/libexec' '--localstatedir=/var' '--sharedstatedir=/var/lib' '--mandir=/usr/share/man' '--infodir=/usr/share/info' '--x-libraries=/usr/libx32' 'LIBS=-lpthread -lrt' --disable-silent-rules --enable-python-binding '--with-asio=system' '--with-boost-libdir=/usr/libx32' '--with-boost-filesystem=boost_filesystem' '--with-boost-program-options=boost_program_options' '--with-boost-regex=boost_regex' '--with-boost-system=boost_system' '--with-boost-thread=boost_thread' '--with-libgeoip=system' --with-ssl '--with-zlib=system' configure: WARNING: unrecognized options: --with-asio, --with-boost-filesystem, --with-boost-program-options, --with-boost-regex, --with-boost-thread, --with-libgeoip, --with-ssl, --with-zlib checking whether make supports nested variables... yes Building libtorrent-rasterbar 1.1.11 Checking for a C/C++ compiler to use: checking for x86_64-pld-linux-gnux32-gcc... x86_64-pld-linux-gnux32-gcc checking whether the C compiler works... yes checking for C compiler default output file name... a.out checking for suffix of executables... checking whether we are cross compiling... no checking for suffix of object files... o checking whether we are using the GNU C compiler... yes checking whether x86_64-pld-linux-gnux32-gcc accepts -g... yes checking for x86_64-pld-linux-gnux32-gcc option to accept ISO C89... none needed checking whether x86_64-pld-linux-gnux32-gcc understands -c and -o together... yes checking how to run the C preprocessor... x86_64-pld-linux-gnux32-gcc -E checking whether x86_64-pld-linux-gnux32-gcc and cc understand -c and -o together... yes checking whether we are using the GNU C++ compiler... yes checking whether x86_64-pld-linux-gnux32-g++ accepts -g... yes checking how to run the C++ preprocessor... x86_64-pld-linux-gnux32-g++ -E checking whether x86_64-pld-linux-gnux32-g++ understands -c and -o together... yes Checking system type: checking build system type... x86_64-pld-linux-gnux32 checking host system type... x86_64-pld-linux-gnux32 checking target system type... x86_64-pld-linux-gnux32 Initializing Automake: checking for a BSD-compatible install... /usr/bin/install -c checking whether build environment is sane... yes checking for a thread-safe mkdir -p... /bin/mkdir -p checking for mawk... mawk checking whether make sets $(MAKE)... yes checking whether make supports the include directive... yes (GNU style) checking dependency style of x86_64-pld-linux-gnux32-gcc... gcc3 checking dependency style of x86_64-pld-linux-gnux32-g++... gcc3 checking whether to enable maintainer-specific portions of Makefiles... yes Initializing Libtool: checking how to print strings... print -r checking for a sed that does not truncate output... /bin/sed checking for grep that handles long lines and -e... /bin/grep checking for egrep... /bin/grep -E checking for fgrep... /bin/grep -F checking for ld used by x86_64-pld-linux-gnux32-gcc... /usr/bin/ld checking if the linker (/usr/bin/ld) is GNU ld... yes checking for BSD- or MS-compatible name lister (nm)... /usr/bin/nm -B checking the name lister (/usr/bin/nm -B) interface... BSD nm checking whether ln -s works... yes checking the maximum length of command line arguments... 1572864 checking how to convert x86_64-pld-linux-gnux32 file names to x86_64-pld-linux-gnux32 format... func_convert_file_noop checking how to convert x86_64-pld-linux-gnux32 file names to toolchain format... func_convert_file_noop checking for /usr/bin/ld option to reload object files... -r checking for x86_64-pld-linux-gnux32-objdump... no checking for objdump... objdump checking how to recognize dependent libraries... pass_all checking for x86_64-pld-linux-gnux32-dlltool... no checking for dlltool... no checking how to associate runtime and link libraries... print -r -- checking for x86_64-pld-linux-gnux32-ar... no checking for ar... ar checking for archiver @FILE support... @ checking for x86_64-pld-linux-gnux32-strip... no checking for strip... strip checking for x86_64-pld-linux-gnux32-ranlib... no checking for ranlib... ranlib checking command to parse /usr/bin/nm -B output from x86_64-pld-linux-gnux32-gcc object... ok checking for sysroot... no checking for a working dd... /bin/dd checking how to truncate binary pipes... /bin/dd bs=4096 count=1 checking for x86_64-pld-linux-gnux32-mt... no checking for mt... no checking if : is a manifest tool... no checking for ANSI C header files... yes checking for sys/types.h... yes checking for sys/stat.h... yes checking for stdlib.h... yes checking for string.h... yes checking for memory.h... yes checking for strings.h... yes checking for inttypes.h... yes checking for stdint.h... yes checking for unistd.h... yes checking for dlfcn.h... yes checking for objdir... .libs checking if x86_64-pld-linux-gnux32-gcc supports -fno-rtti -fno-exceptions... no checking for x86_64-pld-linux-gnux32-gcc option to produce PIC... -fPIC -DPIC checking if x86_64-pld-linux-gnux32-gcc PIC flag -fPIC -DPIC works... yes checking if x86_64-pld-linux-gnux32-gcc static flag -static works... yes checking if x86_64-pld-linux-gnux32-gcc supports -c -o file.o... yes checking if x86_64-pld-linux-gnux32-gcc supports -c -o file.o... (cached) yes checking whether the x86_64-pld-linux-gnux32-gcc linker (/usr/bin/ld -m elf32_x86_64) supports shared libraries... yes checking whether -lc should be explicitly linked in... no checking dynamic linker characteristics... GNU/Linux ld.so checking how to hardcode library paths into programs... immediate checking whether stripping libraries is possible... yes checking if libtool supports shared libraries... yes checking whether to build shared libraries... yes checking whether to build static libraries... yes checking how to run the C++ preprocessor... x86_64-pld-linux-gnux32-g++ -E checking for ld used by x86_64-pld-linux-gnux32-g++... /usr/bin/ld -m elf32_x86_64 checking if the linker (/usr/bin/ld -m elf32_x86_64) is GNU ld... yes checking whether the x86_64-pld-linux-gnux32-g++ linker (/usr/bin/ld -m elf32_x86_64) supports shared libraries... yes checking for x86_64-pld-linux-gnux32-g++ option to produce PIC... -fPIC -DPIC checking if x86_64-pld-linux-gnux32-g++ PIC flag -fPIC -DPIC works... yes checking if x86_64-pld-linux-gnux32-g++ static flag -static works... yes checking if x86_64-pld-linux-gnux32-g++ supports -c -o file.o... yes checking if x86_64-pld-linux-gnux32-g++ supports -c -o file.o... (cached) yes checking whether the x86_64-pld-linux-gnux32-g++ linker (/usr/bin/ld -m elf32_x86_64) supports shared libraries... yes checking dynamic linker characteristics... (cached) GNU/Linux ld.so checking how to hardcode library paths into programs... immediate Checking for posix thread support: checking for the pthreads library -lpthreads... no checking whether pthreads work without any flags... yes checking for joinable pthread attribute... PTHREAD_CREATE_JOINABLE checking if more special flags are required for pthreads... no checking whether to check for GCC pthread/shared inconsistencies... yes checking whether -lpthread fixes that... yes Checking for visibility support: checking for __attribute__((visibility("hidden")))... found yes Checking for boost libraries: checking for boostlib >= 1.53... yes checking whether the Boost::System library is available... yes checking for exit in -lboost_system... yes checking whether the Boost::Chrono library is available... yes checking for exit in -lboost_chrono... yes checking whether the Boost::Random library is available... yes checking for exit in -lboost_random... yes Checking for pkg-config: checking for x86_64-pld-linux-gnux32-pkg-config... /usr/bin/x86_64-pld-linux-gnux32-pkg-config checking pkg-config is at least version 0.20... yes Checking for functions and headers: checking for special C compiler options needed for large files... no checking for _FILE_OFFSET_BITS value needed for large files... no checking whether ln -s works... yes checking whether make sets $(MAKE)... (cached) yes checking for clock_gettime... yes Checking build options: checking whether deprecated functions should be enabled... yes checking whether debug build should be enabled... no checking whether invariant check should be enabled... no checking whether logging to disk should be enabled... yes checking whether disk activity logging should be enabled... no Checking features to be enabled: checking whether encryption support should be enabled... yes configure: encryption support: now checking for the OpenSSL library... checking for pkg-config... (cached) /usr/bin/x86_64-pld-linux-gnux32-pkg-config checking whether compiling and linking against OpenSSL works... yes checking whether dht support should be enabled... yes checking whether pool allocators should be enabled... yes Checking for extra build files: checking whether example files should be built... no checking whether test files should be built... no checking whether python bindings should be built... yes checking for a Python interpreter with version >= 2.4... python checking for python... /usr/bin/python checking for python version... 2.7 checking for python platform... linux2 checking for python script directory... ${prefix}/share/python2.7/site-packages checking for python extension module directory... ${exec_prefix}/libx32/python2.7/site-packages checking for python2.7... (cached) /usr/bin/python checking for a version of Python >= '2.1.0'... yes checking for a version of Python >= '2.4'... yes checking for the distutils Python package... grep: Trailing backslash yes checking for Python include path... -I/usr/include/python2.7 checking for Python library path... -L/usr/libx32 -lpython2.7 checking for Python site-packages path... /usr/local/libx32/python2.7/site-packages checking python extra libraries... -lpthread -ldl -lutil -lm checking python extra linking flags... -Xlinker -export-dynamic checking consistency of all components of python development environment... yes checking whether the Boost::Python library is available... yes checking whether boost_python is the correct library... no checking whether boost_python27 is the correct library... yes Checking for external libraries: checking whether to link against system libiconv... checking for shared library run path origin... done Generating Makefiles: checking that generated files are newer than configure... done configure: creating ./config.status config.status: creating Makefile config.status: creating src/Makefile config.status: creating include/libtorrent/Makefile config.status: creating examples/Makefile config.status: creating test/Makefile config.status: creating tools/Makefile config.status: creating bindings/Makefile config.status: creating bindings/python/Makefile config.status: creating bindings/python/link_flags config.status: creating bindings/python/compile_flags config.status: creating libtorrent-rasterbar.pc config.status: executing depfiles commands config.status: executing libtool commands configure: WARNING: unrecognized options: --with-asio, --with-boost-filesystem, --with-boost-program-options, --with-boost-regex, --with-boost-thread, --with-libgeoip, --with-ssl, --with-zlib Configure script has finished system check. Config results: -=-=-=-=-=-=-=-=- Package: name: libtorrent-rasterbar version: 1.1.11 git revision: ed4ca98a1 Build environment: build system: x86_64-pld-linux-gnux32 host system: x86_64-pld-linux-gnux32 target system: x86_64-pld-linux-gnux32 Compiler and linker flags: CPPFlags: -I/usr/include CFlags: -O2 -fwrapv -pipe -Wformat -Werror=format-security -gdwarf-4 -fno-debug-types-section -fvar-tracking-assignments -g2 -Wp,-D_FORTIFY_SOURCE=2 -fstack-protector-strong --param=ssp-buffer-size=4 -Werror=trampolines -fPIC -mtune=generic -march=x86-64 -gdwarf-4 -fno-debug-types-section -fvar-tracking-assignments -g2 -fvisibility=hidden CXXFlags: -O2 -fwrapv -pipe -Wformat -Werror=format-security -gdwarf-4 -fno-debug-types-section -fvar-tracking-assignments -g2 -Wp,-D_FORTIFY_SOURCE=2 -fstack-protector-strong --param=ssp-buffer-size=4 -Werror=trampolines -fPIC -mtune=generic -march=x86-64 -gdwarf-4 -fno-debug-types-section -fvar-tracking-assignments -g2 -ftemplate-depth=120 -Wno-format-zero-length -fvisibility=hidden -fvisibility-inlines-hidden LDFlags: -L/usr/libx32 -Wl,--as-needed -Wl,--no-copy-dt-needed-entries -Wl,-z,relro -Wl,-z,combreloc -fvisibility=hidden -fvisibility-inlines-hidden Libs: -lboost_chrono -lboost_random -lpthread -lpthread -lrt Defs: -DPACKAGE_NAME=\"libtorrent-rasterbar\" -DPACKAGE_TARNAME=\"libtorrent-rasterbar\" -DPACKAGE_VERSION=\"1.1.11\" -DPACKAGE_STRING=\"libtorrent-rasterbar\ 1.1.11\" -DPACKAGE_BUGREPORT=\"arvid@libtorrent.org\" -DPACKAGE_URL=\"http://www.libtorrent.org\" -DPACKAGE=\"libtorrent-rasterbar\" -DVERSION=\"1.1.11\" -DSTDC_HEADERS=1 -DHAVE_SYS_TYPES_H=1 -DHAVE_SYS_STAT_H=1 -DHAVE_STDLIB_H=1 -DHAVE_STRING_H=1 -DHAVE_MEMORY_H=1 -DHAVE_STRINGS_H=1 -DHAVE_INTTYPES_H=1 -DHAVE_STDINT_H=1 -DHAVE_UNISTD_H=1 -DHAVE_DLFCN_H=1 -DLT_OBJDIR=\".libs/\" -DHAVE_PTHREAD=1 -DHAVE_BOOST=/\*\*/ -DHAVE_BOOST_SYSTEM=/\*\*/ -DHAVE_BOOST_CHRONO=/\*\*/ -DHAVE_BOOST_RANDOM=/\*\*/ -DHAVE_CLOCK_GETTIME=1 -DNDEBUG=1 -DTORRENT_USE_OPENSSL=1 -DHAVE_PYTHON=\"2.7\" -DHAVE_BOOST_PYTHON=/\*\*/ -DBOOST_ASIO_HASH_MAP_BUCKETS=1021 -DBOOST_EXCEPTION_DISABLE=1 -DBOOST_ASIO_ENABLE_CANCELIO=1 -DTORRENT_BUILDING_SHARED=1 Build options: deprecated functions: yes debug build: no invariant checks: no logging support: yes disk statistics: no Features: encryption support: yes dht support: yes pool allocators: yes Extra builds: examples: no tests: no python bindings: yes Pthread library: CFlags: Libs: -lpthread Boost libraries: version: CPPFlags: -I/usr/include LDFlags: -L/usr/libx32 boost.system: -lboost_system boost.chrono: -lboost_chrono boost.random: -lboost_random boost.python: -lboost_python27 Python environment: -automake- binary: /usr/bin/python version: 2.7 platform: linux2 prefix: ${prefix} exec_prefix: ${exec_prefix} pythondir: ${prefix}/share/python2.7/site-packages pkgpythondir: ${pythondir}/libtorrent-rasterbar pyexecdir: ${exec_prefix}/libx32/python2.7/site-packages pkgpyexecdir: ${pyexecdir}/libtorrent-rasterbar -m4- cppflags: -I/usr/include/python2.7 ldflags: extra libs: -Xlinker -export-dynamic External libraries: system libiconv: no OpenSSL library: OpenSSL Libs: -lssl -lcrypto OpenSSL LDFlags: OpenSSL Includes: Type 'make' to compile libtorrent-rasterbar 1.1.11 or type 'make V=1' for verbose compiling and then 'make install' to install it into /usr + /usr/bin/make -Otarget -j9 Making all in include/libtorrent make[1]: Nothing to be done for 'all'. Making all in src make[1]: Entering directory '/tmp/B.fNc1IB/BUILD/libtorrent-rasterbar-1.1.11/src' depbase=`echo allocator.lo | sed 's|[^/]*$|.deps/&|;s|\.lo$||'`;\ /bin/sh ../libtool --tag=CXX --mode=compile x86_64-pld-linux-gnux32-g++ -DPACKAGE_NAME=\"libtorrent-rasterbar\" -DPACKAGE_TARNAME=\"libtorrent-rasterbar\" -DPACKAGE_VERSION=\"1.1.11\" -DPACKAGE_STRING=\"libtorrent-rasterbar\ 1.1.11\" -DPACKAGE_BUGREPORT=\"arvid@libtorrent.org\" -DPACKAGE_URL=\"http://www.libtorrent.org\" -DPACKAGE=\"libtorrent-rasterbar\" -DVERSION=\"1.1.11\" -DSTDC_HEADERS=1 -DHAVE_SYS_TYPES_H=1 -DHAVE_SYS_STAT_H=1 -DHAVE_STDLIB_H=1 -DHAVE_STRING_H=1 -DHAVE_MEMORY_H=1 -DHAVE_STRINGS_H=1 -DHAVE_INTTYPES_H=1 -DHAVE_STDINT_H=1 -DHAVE_UNISTD_H=1 -DHAVE_DLFCN_H=1 -DLT_OBJDIR=\".libs/\" -DHAVE_PTHREAD=1 -DHAVE_BOOST=/\*\*/ -DHAVE_BOOST_SYSTEM=/\*\*/ -DHAVE_BOOST_CHRONO=/\*\*/ -DHAVE_BOOST_RANDOM=/\*\*/ -DHAVE_CLOCK_GETTIME=1 -DNDEBUG=1 -DTORRENT_USE_OPENSSL=1 -DHAVE_PYTHON=\"2.7\" -DHAVE_BOOST_PYTHON=/\*\*/ -DBOOST_ASIO_HASH_MAP_BUCKETS=1021 -DBOOST_EXCEPTION_DISABLE=1 -DBOOST_ASIO_ENABLE_CANCELIO=1 -DTORRENT_BUILDING_SHARED=1 -I. -DTORRENT_BUILDING_LIBRARY -I../include -I../ed25519/src -Os -I/usr/include -O2 -fwrapv -pipe -Wformat -Werror=format-security -gdwarf-4 -fno-debug-types-section -fvar-tracking-assignments -g2 -Wp,-D_FORTIFY_SOURCE=2 -fstack-protector-strong --param=ssp-buffer-size=4 -Werror=trampolines -fPIC -mtune=generic -march=x86-64 -gdwarf-4 -fno-debug-types-section -fvar-tracking-assignments -g2 -ftemplate-depth=120 -Wno-format-zero-length -fvisibility=hidden -fvisibility-inlines-hidden -MT allocator.lo -MD -MP -MF $depbase.Tpo -c -o allocator.lo allocator.cpp &&\ mv -f $depbase.Tpo $depbase.Plo libtool: compile: x86_64-pld-linux-gnux32-g++ -DPACKAGE_NAME=\"libtorrent-rasterbar\" -DPACKAGE_TARNAME=\"libtorrent-rasterbar\" -DPACKAGE_VERSION=\"1.1.11\" "-DPACKAGE_STRING=\"libtorrent-rasterbar 1.1.11\"" -DPACKAGE_BUGREPORT=\"arvid@libtorrent.org\" -DPACKAGE_URL=\"http://www.libtorrent.org\" -DPACKAGE=\"libtorrent-rasterbar\" -DVERSION=\"1.1.11\" -DSTDC_HEADERS=1 -DHAVE_SYS_TYPES_H=1 -DHAVE_SYS_STAT_H=1 -DHAVE_STDLIB_H=1 -DHAVE_STRING_H=1 -DHAVE_MEMORY_H=1 -DHAVE_STRINGS_H=1 -DHAVE_INTTYPES_H=1 -DHAVE_STDINT_H=1 -DHAVE_UNISTD_H=1 -DHAVE_DLFCN_H=1 -DLT_OBJDIR=\".libs/\" -DHAVE_PTHREAD=1 "-DHAVE_BOOST=/**/" "-DHAVE_BOOST_SYSTEM=/**/" "-DHAVE_BOOST_CHRONO=/**/" "-DHAVE_BOOST_RANDOM=/**/" -DHAVE_CLOCK_GETTIME=1 -DNDEBUG=1 -DTORRENT_USE_OPENSSL=1 -DHAVE_PYTHON=\"2.7\" "-DHAVE_BOOST_PYTHON=/**/" -DBOOST_ASIO_HASH_MAP_BUCKETS=1021 -DBOOST_EXCEPTION_DISABLE=1 -DBOOST_ASIO_ENABLE_CANCELIO=1 -DTORRENT_BUILDING_SHARED=1 -I. -DTORRENT_BUILDING_LIBRARY -I../include -I../ed25519/src -Os -I/usr/include -O2 -fwrapv -pipe -Wformat -Werror=format-security -gdwarf-4 -fno-debug-types-section -fvar-tracking-assignments -g2 -Wp,-D_FORTIFY_SOURCE=2 -fstack-protector-strong --param=ssp-buffer-size=4 -Werror=trampolines -fPIC -mtune=generic -march=x86-64 -gdwarf-4 -fno-debug-types-section -fvar-tracking-assignments -g2 -ftemplate-depth=120 -Wno-format-zero-length -fvisibility=hidden -fvisibility-inlines-hidden -MT allocator.lo -MD -MP -MF .deps/allocator.Tpo -c allocator.cpp -fPIC -DPIC -o .libs/allocator.o In file included from ../include/libtorrent/allocator.hpp:37, from allocator.cpp:33: ../include/libtorrent/config.hpp:53:10: fatal error: boost/detail/endian.hpp: No such file or directory 53 | #include <boost/detail/endian.hpp> | ^~~~~~~~~~~~~~~~~~~~~~~~~ compilation terminated. make[1]: *** [Makefile:1033: allocator.lo] Error 1 make[1]: Leaving directory '/tmp/B.fNc1IB/BUILD/libtorrent-rasterbar-1.1.11/src' make[1]: *** Waiting for unfinished jobs.... make[1]: Entering directory '/tmp/B.fNc1IB/BUILD/libtorrent-rasterbar-1.1.11/src' depbase=`echo assert.lo | sed 's|[^/]*$|.deps/&|;s|\.lo$||'`;\ /bin/sh ../libtool --tag=CXX --mode=compile x86_64-pld-linux-gnux32-g++ -DPACKAGE_NAME=\"libtorrent-rasterbar\" -DPACKAGE_TARNAME=\"libtorrent-rasterbar\" -DPACKAGE_VERSION=\"1.1.11\" -DPACKAGE_STRING=\"libtorrent-rasterbar\ 1.1.11\" -DPACKAGE_BUGREPORT=\"arvid@libtorrent.org\" -DPACKAGE_URL=\"http://www.libtorrent.org\" -DPACKAGE=\"libtorrent-rasterbar\" -DVERSION=\"1.1.11\" -DSTDC_HEADERS=1 -DHAVE_SYS_TYPES_H=1 -DHAVE_SYS_STAT_H=1 -DHAVE_STDLIB_H=1 -DHAVE_STRING_H=1 -DHAVE_MEMORY_H=1 -DHAVE_STRINGS_H=1 -DHAVE_INTTYPES_H=1 -DHAVE_STDINT_H=1 -DHAVE_UNISTD_H=1 -DHAVE_DLFCN_H=1 -DLT_OBJDIR=\".libs/\" -DHAVE_PTHREAD=1 -DHAVE_BOOST=/\*\*/ -DHAVE_BOOST_SYSTEM=/\*\*/ -DHAVE_BOOST_CHRONO=/\*\*/ -DHAVE_BOOST_RANDOM=/\*\*/ -DHAVE_CLOCK_GETTIME=1 -DNDEBUG=1 -DTORRENT_USE_OPENSSL=1 -DHAVE_PYTHON=\"2.7\" -DHAVE_BOOST_PYTHON=/\*\*/ -DBOOST_ASIO_HASH_MAP_BUCKETS=1021 -DBOOST_EXCEPTION_DISABLE=1 -DBOOST_ASIO_ENABLE_CANCELIO=1 -DTORRENT_BUILDING_SHARED=1 -I. -DTORRENT_BUILDING_LIBRARY -I../include -I../ed25519/src -Os -I/usr/include -O2 -fwrapv -pipe -Wformat -Werror=format-security -gdwarf-4 -fno-debug-types-section -fvar-tracking-assignments -g2 -Wp,-D_FORTIFY_SOURCE=2 -fstack-protector-strong --param=ssp-buffer-size=4 -Werror=trampolines -fPIC -mtune=generic -march=x86-64 -gdwarf-4 -fno-debug-types-section -fvar-tracking-assignments -g2 -ftemplate-depth=120 -Wno-format-zero-length -fvisibility=hidden -fvisibility-inlines-hidden -MT assert.lo -MD -MP -MF $depbase.Tpo -c -o assert.lo assert.cpp &&\ mv -f $depbase.Tpo $depbase.Plo libtool: compile: x86_64-pld-linux-gnux32-g++ -DPACKAGE_NAME=\"libtorrent-rasterbar\" -DPACKAGE_TARNAME=\"libtorrent-rasterbar\" -DPACKAGE_VERSION=\"1.1.11\" "-DPACKAGE_STRING=\"libtorrent-rasterbar 1.1.11\"" -DPACKAGE_BUGREPORT=\"arvid@libtorrent.org\" -DPACKAGE_URL=\"http://www.libtorrent.org\" -DPACKAGE=\"libtorrent-rasterbar\" -DVERSION=\"1.1.11\" -DSTDC_HEADERS=1 -DHAVE_SYS_TYPES_H=1 -DHAVE_SYS_STAT_H=1 -DHAVE_STDLIB_H=1 -DHAVE_STRING_H=1 -DHAVE_MEMORY_H=1 -DHAVE_STRINGS_H=1 -DHAVE_INTTYPES_H=1 -DHAVE_STDINT_H=1 -DHAVE_UNISTD_H=1 -DHAVE_DLFCN_H=1 -DLT_OBJDIR=\".libs/\" -DHAVE_PTHREAD=1 "-DHAVE_BOOST=/**/" "-DHAVE_BOOST_SYSTEM=/**/" "-DHAVE_BOOST_CHRONO=/**/" "-DHAVE_BOOST_RANDOM=/**/" -DHAVE_CLOCK_GETTIME=1 -DNDEBUG=1 -DTORRENT_USE_OPENSSL=1 -DHAVE_PYTHON=\"2.7\" "-DHAVE_BOOST_PYTHON=/**/" -DBOOST_ASIO_HASH_MAP_BUCKETS=1021 -DBOOST_EXCEPTION_DISABLE=1 -DBOOST_ASIO_ENABLE_CANCELIO=1 -DTORRENT_BUILDING_SHARED=1 -I. -DTORRENT_BUILDING_LIBRARY -I../include -I../ed25519/src -Os -I/usr/include -O2 -fwrapv -pipe -Wformat -Werror=format-security -gdwarf-4 -fno-debug-types-section -fvar-tracking-assignments -g2 -Wp,-D_FORTIFY_SOURCE=2 -fstack-protector-strong --param=ssp-buffer-size=4 -Werror=trampolines -fPIC -mtune=generic -march=x86-64 -gdwarf-4 -fno-debug-types-section -fvar-tracking-assignments -g2 -ftemplate-depth=120 -Wno-format-zero-length -fvisibility=hidden -fvisibility-inlines-hidden -MT assert.lo -MD -MP -MF .deps/assert.Tpo -c assert.cpp -fPIC -DPIC -o .libs/assert.o In file included from assert.cpp:33: ../include/libtorrent/config.hpp:53:10: fatal error: boost/detail/endian.hpp: No such file or directory 53 | #include <boost/detail/endian.hpp> | ^~~~~~~~~~~~~~~~~~~~~~~~~ compilation terminated. make[1]: *** [Makefile:1033: assert.lo] Error 1 make[1]: Leaving directory '/tmp/B.fNc1IB/BUILD/libtorrent-rasterbar-1.1.11/src' make[1]: Entering directory '/tmp/B.fNc1IB/BUILD/libtorrent-rasterbar-1.1.11/src' depbase=`echo bandwidth_limit.lo | sed 's|[^/]*$|.deps/&|;s|\.lo$||'`;\ /bin/sh ../libtool --tag=CXX --mode=compile x86_64-pld-linux-gnux32-g++ -DPACKAGE_NAME=\"libtorrent-rasterbar\" -DPACKAGE_TARNAME=\"libtorrent-rasterbar\" -DPACKAGE_VERSION=\"1.1.11\" -DPACKAGE_STRING=\"libtorrent-rasterbar\ 1.1.11\" -DPACKAGE_BUGREPORT=\"arvid@libtorrent.org\" -DPACKAGE_URL=\"http://www.libtorrent.org\" -DPACKAGE=\"libtorrent-rasterbar\" -DVERSION=\"1.1.11\" -DSTDC_HEADERS=1 -DHAVE_SYS_TYPES_H=1 -DHAVE_SYS_STAT_H=1 -DHAVE_STDLIB_H=1 -DHAVE_STRING_H=1 -DHAVE_MEMORY_H=1 -DHAVE_STRINGS_H=1 -DHAVE_INTTYPES_H=1 -DHAVE_STDINT_H=1 -DHAVE_UNISTD_H=1 -DHAVE_DLFCN_H=1 -DLT_OBJDIR=\".libs/\" -DHAVE_PTHREAD=1 -DHAVE_BOOST=/\*\*/ -DHAVE_BOOST_SYSTEM=/\*\*/ -DHAVE_BOOST_CHRONO=/\*\*/ -DHAVE_BOOST_RANDOM=/\*\*/ -DHAVE_CLOCK_GETTIME=1 -DNDEBUG=1 -DTORRENT_USE_OPENSSL=1 -DHAVE_PYTHON=\"2.7\" -DHAVE_BOOST_PYTHON=/\*\*/ -DBOOST_ASIO_HASH_MAP_BUCKETS=1021 -DBOOST_EXCEPTION_DISABLE=1 -DBOOST_ASIO_ENABLE_CANCELIO=1 -DTORRENT_BUILDING_SHARED=1 -I. -DTORRENT_BUILDING_LIBRARY -I../include -I../ed25519/src -Os -I/usr/include -O2 -fwrapv -pipe -Wformat -Werror=format-security -gdwarf-4 -fno-debug-types-section -fvar-tracking-assignments -g2 -Wp,-D_FORTIFY_SOURCE=2 -fstack-protector-strong --param=ssp-buffer-size=4 -Werror=trampolines -fPIC -mtune=generic -march=x86-64 -gdwarf-4 -fno-debug-types-section -fvar-tracking-assignments -g2 -ftemplate-depth=120 -Wno-format-zero-length -fvisibility=hidden -fvisibility-inlines-hidden -MT bandwidth_limit.lo -MD -MP -MF $depbase.Tpo -c -o bandwidth_limit.lo bandwidth_limit.cpp &&\ mv -f $depbase.Tpo $depbase.Plo libtool: compile: x86_64-pld-linux-gnux32-g++ -DPACKAGE_NAME=\"libtorrent-rasterbar\" -DPACKAGE_TARNAME=\"libtorrent-rasterbar\" -DPACKAGE_VERSION=\"1.1.11\" "-DPACKAGE_STRING=\"libtorrent-rasterbar 1.1.11\"" -DPACKAGE_BUGREPORT=\"arvid@libtorrent.org\" -DPACKAGE_URL=\"http://www.libtorrent.org\" -DPACKAGE=\"libtorrent-rasterbar\" -DVERSION=\"1.1.11\" -DSTDC_HEADERS=1 -DHAVE_SYS_TYPES_H=1 -DHAVE_SYS_STAT_H=1 -DHAVE_STDLIB_H=1 -DHAVE_STRING_H=1 -DHAVE_MEMORY_H=1 -DHAVE_STRINGS_H=1 -DHAVE_INTTYPES_H=1 -DHAVE_STDINT_H=1 -DHAVE_UNISTD_H=1 -DHAVE_DLFCN_H=1 -DLT_OBJDIR=\".libs/\" -DHAVE_PTHREAD=1 "-DHAVE_BOOST=/**/" "-DHAVE_BOOST_SYSTEM=/**/" "-DHAVE_BOOST_CHRONO=/**/" "-DHAVE_BOOST_RANDOM=/**/" -DHAVE_CLOCK_GETTIME=1 -DNDEBUG=1 -DTORRENT_USE_OPENSSL=1 -DHAVE_PYTHON=\"2.7\" "-DHAVE_BOOST_PYTHON=/**/" -DBOOST_ASIO_HASH_MAP_BUCKETS=1021 -DBOOST_EXCEPTION_DISABLE=1 -DBOOST_ASIO_ENABLE_CANCELIO=1 -DTORRENT_BUILDING_SHARED=1 -I. -DTORRENT_BUILDING_LIBRARY -I../include -I../ed25519/src -Os -I/usr/include -O2 -fwrapv -pipe -Wformat -Werror=format-security -gdwarf-4 -fno-debug-types-section -fvar-tracking-assignments -g2 -Wp,-D_FORTIFY_SOURCE=2 -fstack-protector-strong --param=ssp-buffer-size=4 -Werror=trampolines -fPIC -mtune=generic -march=x86-64 -gdwarf-4 -fno-debug-types-section -fvar-tracking-assignments -g2 -ftemplate-depth=120 -Wno-format-zero-length -fvisibility=hidden -fvisibility-inlines-hidden -MT bandwidth_limit.lo -MD -MP -MF .deps/bandwidth_limit.Tpo -c bandwidth_limit.cpp -fPIC -DPIC -o .libs/bandwidth_limit.o In file included from ../include/libtorrent/assert.hpp:35, from ../include/libtorrent/bandwidth_limit.hpp:43, from bandwidth_limit.cpp:33: ../include/libtorrent/config.hpp:53:10: fatal error: boost/detail/endian.hpp: No such file or directory 53 | #include <boost/detail/endian.hpp> | ^~~~~~~~~~~~~~~~~~~~~~~~~ compilation terminated. make[1]: *** [Makefile:1033: bandwidth_limit.lo] Error 1 make[1]: Leaving directory '/tmp/B.fNc1IB/BUILD/libtorrent-rasterbar-1.1.11/src' make[1]: Entering directory '/tmp/B.fNc1IB/BUILD/libtorrent-rasterbar-1.1.11/src' depbase=`echo announce_entry.lo | sed 's|[^/]*$|.deps/&|;s|\.lo$||'`;\ /bin/sh ../libtool --tag=CXX --mode=compile x86_64-pld-linux-gnux32-g++ -DPACKAGE_NAME=\"libtorrent-rasterbar\" -DPACKAGE_TARNAME=\"libtorrent-rasterbar\" -DPACKAGE_VERSION=\"1.1.11\" -DPACKAGE_STRING=\"libtorrent-rasterbar\ 1.1.11\" -DPACKAGE_BUGREPORT=\"arvid@libtorrent.org\" -DPACKAGE_URL=\"http://www.libtorrent.org\" -DPACKAGE=\"libtorrent-rasterbar\" -DVERSION=\"1.1.11\" -DSTDC_HEADERS=1 -DHAVE_SYS_TYPES_H=1 -DHAVE_SYS_STAT_H=1 -DHAVE_STDLIB_H=1 -DHAVE_STRING_H=1 -DHAVE_MEMORY_H=1 -DHAVE_STRINGS_H=1 -DHAVE_INTTYPES_H=1 -DHAVE_STDINT_H=1 -DHAVE_UNISTD_H=1 -DHAVE_DLFCN_H=1 -DLT_OBJDIR=\".libs/\" -DHAVE_PTHREAD=1 -DHAVE_BOOST=/\*\*/ -DHAVE_BOOST_SYSTEM=/\*\*/ -DHAVE_BOOST_CHRONO=/\*\*/ -DHAVE_BOOST_RANDOM=/\*\*/ -DHAVE_CLOCK_GETTIME=1 -DNDEBUG=1 -DTORRENT_USE_OPENSSL=1 -DHAVE_PYTHON=\"2.7\" -DHAVE_BOOST_PYTHON=/\*\*/ -DBOOST_ASIO_HASH_MAP_BUCKETS=1021 -DBOOST_EXCEPTION_DISABLE=1 -DBOOST_ASIO_ENABLE_CANCELIO=1 -DTORRENT_BUILDING_SHARED=1 -I. -DTORRENT_BUILDING_LIBRARY -I../include -I../ed25519/src -Os -I/usr/include -O2 -fwrapv -pipe -Wformat -Werror=format-security -gdwarf-4 -fno-debug-types-section -fvar-tracking-assignments -g2 -Wp,-D_FORTIFY_SOURCE=2 -fstack-protector-strong --param=ssp-buffer-size=4 -Werror=trampolines -fPIC -mtune=generic -march=x86-64 -gdwarf-4 -fno-debug-types-section -fvar-tracking-assignments -g2 -ftemplate-depth=120 -Wno-format-zero-length -fvisibility=hidden -fvisibility-inlines-hidden -MT announce_entry.lo -MD -MP -MF $depbase.Tpo -c -o announce_entry.lo announce_entry.cpp &&\ mv -f $depbase.Tpo $depbase.Plo libtool: compile: x86_64-pld-linux-gnux32-g++ -DPACKAGE_NAME=\"libtorrent-rasterbar\" -DPACKAGE_TARNAME=\"libtorrent-rasterbar\" -DPACKAGE_VERSION=\"1.1.11\" "-DPACKAGE_STRING=\"libtorrent-rasterbar 1.1.11\"" -DPACKAGE_BUGREPORT=\"arvid@libtorrent.org\" -DPACKAGE_URL=\"http://www.libtorrent.org\" -DPACKAGE=\"libtorrent-rasterbar\" -DVERSION=\"1.1.11\" -DSTDC_HEADERS=1 -DHAVE_SYS_TYPES_H=1 -DHAVE_SYS_STAT_H=1 -DHAVE_STDLIB_H=1 -DHAVE_STRING_H=1 -DHAVE_MEMORY_H=1 -DHAVE_STRINGS_H=1 -DHAVE_INTTYPES_H=1 -DHAVE_STDINT_H=1 -DHAVE_UNISTD_H=1 -DHAVE_DLFCN_H=1 -DLT_OBJDIR=\".libs/\" -DHAVE_PTHREAD=1 "-DHAVE_BOOST=/**/" "-DHAVE_BOOST_SYSTEM=/**/" "-DHAVE_BOOST_CHRONO=/**/" "-DHAVE_BOOST_RANDOM=/**/" -DHAVE_CLOCK_GETTIME=1 -DNDEBUG=1 -DTORRENT_USE_OPENSSL=1 -DHAVE_PYTHON=\"2.7\" "-DHAVE_BOOST_PYTHON=/**/" -DBOOST_ASIO_HASH_MAP_BUCKETS=1021 -DBOOST_EXCEPTION_DISABLE=1 -DBOOST_ASIO_ENABLE_CANCELIO=1 -DTORRENT_BUILDING_SHARED=1 -I. -DTORRENT_BUILDING_LIBRARY -I../include -I../ed25519/src -Os -I/usr/include -O2 -fwrapv -pipe -Wformat -Werror=format-security -gdwarf-4 -fno-debug-types-section -fvar-tracking-assignments -g2 -Wp,-D_FORTIFY_SOURCE=2 -fstack-protector-strong --param=ssp-buffer-size=4 -Werror=trampolines -fPIC -mtune=generic -march=x86-64 -gdwarf-4 -fno-debug-types-section -fvar-tracking-assignments -g2 -ftemplate-depth=120 -Wno-format-zero-length -fvisibility=hidden -fvisibility-inlines-hidden -MT announce_entry.lo -MD -MP -MF .deps/announce_entry.Tpo -c announce_entry.cpp -fPIC -DPIC -o .libs/announce_entry.o In file included from announce_entry.cpp:33: ../include/libtorrent/config.hpp:53:10: fatal error: boost/detail/endian.hpp: No such file or directory 53 | #include <boost/detail/endian.hpp> | ^~~~~~~~~~~~~~~~~~~~~~~~~ compilation terminated. make[1]: *** [Makefile:1033: announce_entry.lo] Error 1 make[1]: Leaving directory '/tmp/B.fNc1IB/BUILD/libtorrent-rasterbar-1.1.11/src' make[1]: Entering directory '/tmp/B.fNc1IB/BUILD/libtorrent-rasterbar-1.1.11/src' depbase=`echo bandwidth_manager.lo | sed 's|[^/]*$|.deps/&|;s|\.lo$||'`;\ /bin/sh ../libtool --tag=CXX --mode=compile x86_64-pld-linux-gnux32-g++ -DPACKAGE_NAME=\"libtorrent-rasterbar\" -DPACKAGE_TARNAME=\"libtorrent-rasterbar\" -DPACKAGE_VERSION=\"1.1.11\" -DPACKAGE_STRING=\"libtorrent-rasterbar\ 1.1.11\" -DPACKAGE_BUGREPORT=\"arvid@libtorrent.org\" -DPACKAGE_URL=\"http://www.libtorrent.org\" -DPACKAGE=\"libtorrent-rasterbar\" -DVERSION=\"1.1.11\" -DSTDC_HEADERS=1 -DHAVE_SYS_TYPES_H=1 -DHAVE_SYS_STAT_H=1 -DHAVE_STDLIB_H=1 -DHAVE_STRING_H=1 -DHAVE_MEMORY_H=1 -DHAVE_STRINGS_H=1 -DHAVE_INTTYPES_H=1 -DHAVE_STDINT_H=1 -DHAVE_UNISTD_H=1 -DHAVE_DLFCN_H=1 -DLT_OBJDIR=\".libs/\" -DHAVE_PTHREAD=1 -DHAVE_BOOST=/\*\*/ -DHAVE_BOOST_SYSTEM=/\*\*/ -DHAVE_BOOST_CHRONO=/\*\*/ -DHAVE_BOOST_RANDOM=/\*\*/ -DHAVE_CLOCK_GETTIME=1 -DNDEBUG=1 -DTORRENT_USE_OPENSSL=1 -DHAVE_PYTHON=\"2.7\" -DHAVE_BOOST_PYTHON=/\*\*/ -DBOOST_ASIO_HASH_MAP_BUCKETS=1021 -DBOOST_EXCEPTION_DISABLE=1 -DBOOST_ASIO_ENABLE_CANCELIO=1 -DTORRENT_BUILDING_SHARED=1 -I. -DTORRENT_BUILDING_LIBRARY -I../include -I../ed25519/src -Os -I/usr/include -O2 -fwrapv -pipe -Wformat -Werror=format-security -gdwarf-4 -fno-debug-types-section -fvar-tracking-assignments -g2 -Wp,-D_FORTIFY_SOURCE=2 -fstack-protector-strong --param=ssp-buffer-size=4 -Werror=trampolines -fPIC -mtune=generic -march=x86-64 -gdwarf-4 -fno-debug-types-section -fvar-tracking-assignments -g2 -ftemplate-depth=120 -Wno-format-zero-length -fvisibility=hidden -fvisibility-inlines-hidden -MT bandwidth_manager.lo -MD -MP -MF $depbase.Tpo -c -o bandwidth_manager.lo bandwidth_manager.cpp &&\ mv -f $depbase.Tpo $depbase.Plo libtool: compile: x86_64-pld-linux-gnux32-g++ -DPACKAGE_NAME=\"libtorrent-rasterbar\" -DPACKAGE_TARNAME=\"libtorrent-rasterbar\" -DPACKAGE_VERSION=\"1.1.11\" "-DPACKAGE_STRING=\"libtorrent-rasterbar 1.1.11\"" -DPACKAGE_BUGREPORT=\"arvid@libtorrent.org\" -DPACKAGE_URL=\"http://www.libtorrent.org\" -DPACKAGE=\"libtorrent-rasterbar\" -DVERSION=\"1.1.11\" -DSTDC_HEADERS=1 -DHAVE_SYS_TYPES_H=1 -DHAVE_SYS_STAT_H=1 -DHAVE_STDLIB_H=1 -DHAVE_STRING_H=1 -DHAVE_MEMORY_H=1 -DHAVE_STRINGS_H=1 -DHAVE_INTTYPES_H=1 -DHAVE_STDINT_H=1 -DHAVE_UNISTD_H=1 -DHAVE_DLFCN_H=1 -DLT_OBJDIR=\".libs/\" -DHAVE_PTHREAD=1 "-DHAVE_BOOST=/**/" "-DHAVE_BOOST_SYSTEM=/**/" "-DHAVE_BOOST_CHRONO=/**/" "-DHAVE_BOOST_RANDOM=/**/" -DHAVE_CLOCK_GETTIME=1 -DNDEBUG=1 -DTORRENT_USE_OPENSSL=1 -DHAVE_PYTHON=\"2.7\" "-DHAVE_BOOST_PYTHON=/**/" -DBOOST_ASIO_HASH_MAP_BUCKETS=1021 -DBOOST_EXCEPTION_DISABLE=1 -DBOOST_ASIO_ENABLE_CANCELIO=1 -DTORRENT_BUILDING_SHARED=1 -I. -DTORRENT_BUILDING_LIBRARY -I../include -I../ed25519/src -Os -I/usr/include -O2 -fwrapv -pipe -Wformat -Werror=format-security -gdwarf-4 -fno-debug-types-section -fvar-tracking-assignments -g2 -Wp,-D_FORTIFY_SOURCE=2 -fstack-protector-strong --param=ssp-buffer-size=4 -Werror=trampolines -fPIC -mtune=generic -march=x86-64 -gdwarf-4 -fno-debug-types-section -fvar-tracking-assignments -g2 -ftemplate-depth=120 -Wno-format-zero-length -fvisibility=hidden -fvisibility-inlines-hidden -MT bandwidth_manager.lo -MD -MP -MF .deps/bandwidth_manager.Tpo -c bandwidth_manager.cpp -fPIC -DPIC -o .libs/bandwidth_manager.o In file included from ../include/libtorrent/socket.hpp:36, from ../include/libtorrent/bandwidth_manager.hpp:42, from bandwidth_manager.cpp:33: ../include/libtorrent/config.hpp:53:10: fatal error: boost/detail/endian.hpp: No such file or directory 53 | #include <boost/detail/endian.hpp> | ^~~~~~~~~~~~~~~~~~~~~~~~~ compilation terminated. make[1]: *** [Makefile:1033: bandwidth_manager.lo] Error 1 make[1]: Leaving directory '/tmp/B.fNc1IB/BUILD/libtorrent-rasterbar-1.1.11/src' make[1]: Entering directory '/tmp/B.fNc1IB/BUILD/libtorrent-rasterbar-1.1.11/src' depbase=`echo alert_manager.lo | sed 's|[^/]*$|.deps/&|;s|\.lo$||'`;\ /bin/sh ../libtool --tag=CXX --mode=compile x86_64-pld-linux-gnux32-g++ -DPACKAGE_NAME=\"libtorrent-rasterbar\" -DPACKAGE_TARNAME=\"libtorrent-rasterbar\" -DPACKAGE_VERSION=\"1.1.11\" -DPACKAGE_STRING=\"libtorrent-rasterbar\ 1.1.11\" -DPACKAGE_BUGREPORT=\"arvid@libtorrent.org\" -DPACKAGE_URL=\"http://www.libtorrent.org\" -DPACKAGE=\"libtorrent-rasterbar\" -DVERSION=\"1.1.11\" -DSTDC_HEADERS=1 -DHAVE_SYS_TYPES_H=1 -DHAVE_SYS_STAT_H=1 -DHAVE_STDLIB_H=1 -DHAVE_STRING_H=1 -DHAVE_MEMORY_H=1 -DHAVE_STRINGS_H=1 -DHAVE_INTTYPES_H=1 -DHAVE_STDINT_H=1 -DHAVE_UNISTD_H=1 -DHAVE_DLFCN_H=1 -DLT_OBJDIR=\".libs/\" -DHAVE_PTHREAD=1 -DHAVE_BOOST=/\*\*/ -DHAVE_BOOST_SYSTEM=/\*\*/ -DHAVE_BOOST_CHRONO=/\*\*/ -DHAVE_BOOST_RANDOM=/\*\*/ -DHAVE_CLOCK_GETTIME=1 -DNDEBUG=1 -DTORRENT_USE_OPENSSL=1 -DHAVE_PYTHON=\"2.7\" -DHAVE_BOOST_PYTHON=/\*\*/ -DBOOST_ASIO_HASH_MAP_BUCKETS=1021 -DBOOST_EXCEPTION_DISABLE=1 -DBOOST_ASIO_ENABLE_CANCELIO=1 -DTORRENT_BUILDING_SHARED=1 -I. -DTORRENT_BUILDING_LIBRARY -I../include -I../ed25519/src -Os -I/usr/include -O2 -fwrapv -pipe -Wformat -Werror=format-security -gdwarf-4 -fno-debug-types-section -fvar-tracking-assignments -g2 -Wp,-D_FORTIFY_SOURCE=2 -fstack-protector-strong --param=ssp-buffer-size=4 -Werror=trampolines -fPIC -mtune=generic -march=x86-64 -gdwarf-4 -fno-debug-types-section -fvar-tracking-assignments -g2 -ftemplate-depth=120 -Wno-format-zero-length -fvisibility=hidden -fvisibility-inlines-hidden -MT alert_manager.lo -MD -MP -MF $depbase.Tpo -c -o alert_manager.lo alert_manager.cpp &&\ mv -f $depbase.Tpo $depbase.Plo libtool: compile: x86_64-pld-linux-gnux32-g++ -DPACKAGE_NAME=\"libtorrent-rasterbar\" -DPACKAGE_TARNAME=\"libtorrent-rasterbar\" -DPACKAGE_VERSION=\"1.1.11\" "-DPACKAGE_STRING=\"libtorrent-rasterbar 1.1.11\"" -DPACKAGE_BUGREPORT=\"arvid@libtorrent.org\" -DPACKAGE_URL=\"http://www.libtorrent.org\" -DPACKAGE=\"libtorrent-rasterbar\" -DVERSION=\"1.1.11\" -DSTDC_HEADERS=1 -DHAVE_SYS_TYPES_H=1 -DHAVE_SYS_STAT_H=1 -DHAVE_STDLIB_H=1 -DHAVE_STRING_H=1 -DHAVE_MEMORY_H=1 -DHAVE_STRINGS_H=1 -DHAVE_INTTYPES_H=1 -DHAVE_STDINT_H=1 -DHAVE_UNISTD_H=1 -DHAVE_DLFCN_H=1 -DLT_OBJDIR=\".libs/\" -DHAVE_PTHREAD=1 "-DHAVE_BOOST=/**/" "-DHAVE_BOOST_SYSTEM=/**/" "-DHAVE_BOOST_CHRONO=/**/" "-DHAVE_BOOST_RANDOM=/**/" -DHAVE_CLOCK_GETTIME=1 -DNDEBUG=1 -DTORRENT_USE_OPENSSL=1 -DHAVE_PYTHON=\"2.7\" "-DHAVE_BOOST_PYTHON=/**/" -DBOOST_ASIO_HASH_MAP_BUCKETS=1021 -DBOOST_EXCEPTION_DISABLE=1 -DBOOST_ASIO_ENABLE_CANCELIO=1 -DTORRENT_BUILDING_SHARED=1 -I. -DTORRENT_BUILDING_LIBRARY -I../include -I../ed25519/src -Os -I/usr/include -O2 -fwrapv -pipe -Wformat -Werror=format-security -gdwarf-4 -fno-debug-types-section -fvar-tracking-assignments -g2 -Wp,-D_FORTIFY_SOURCE=2 -fstack-protector-strong --param=ssp-buffer-size=4 -Werror=trampolines -fPIC -mtune=generic -march=x86-64 -gdwarf-4 -fno-debug-types-section -fvar-tracking-assignments -g2 -ftemplate-depth=120 -Wno-format-zero-length -fvisibility=hidden -fvisibility-inlines-hidden -MT alert_manager.lo -MD -MP -MF .deps/alert_manager.Tpo -c alert_manager.cpp -fPIC -DPIC -o .libs/alert_manager.o In file included from alert_manager.cpp:33: ../include/libtorrent/config.hpp:53:10: fatal error: boost/detail/endian.hpp: No such file or directory 53 | #include <boost/detail/endian.hpp> | ^~~~~~~~~~~~~~~~~~~~~~~~~ compilation terminated. make[1]: *** [Makefile:1033: alert_manager.lo] Error 1 make[1]: Leaving directory '/tmp/B.fNc1IB/BUILD/libtorrent-rasterbar-1.1.11/src' make[1]: Entering directory '/tmp/B.fNc1IB/BUILD/libtorrent-rasterbar-1.1.11/src' depbase=`echo alert.lo | sed 's|[^/]*$|.deps/&|;s|\.lo$||'`;\ /bin/sh ../libtool --tag=CXX --mode=compile x86_64-pld-linux-gnux32-g++ -DPACKAGE_NAME=\"libtorrent-rasterbar\" -DPACKAGE_TARNAME=\"libtorrent-rasterbar\" -DPACKAGE_VERSION=\"1.1.11\" -DPACKAGE_STRING=\"libtorrent-rasterbar\ 1.1.11\" -DPACKAGE_BUGREPORT=\"arvid@libtorrent.org\" -DPACKAGE_URL=\"http://www.libtorrent.org\" -DPACKAGE=\"libtorrent-rasterbar\" -DVERSION=\"1.1.11\" -DSTDC_HEADERS=1 -DHAVE_SYS_TYPES_H=1 -DHAVE_SYS_STAT_H=1 -DHAVE_STDLIB_H=1 -DHAVE_STRING_H=1 -DHAVE_MEMORY_H=1 -DHAVE_STRINGS_H=1 -DHAVE_INTTYPES_H=1 -DHAVE_STDINT_H=1 -DHAVE_UNISTD_H=1 -DHAVE_DLFCN_H=1 -DLT_OBJDIR=\".libs/\" -DHAVE_PTHREAD=1 -DHAVE_BOOST=/\*\*/ -DHAVE_BOOST_SYSTEM=/\*\*/ -DHAVE_BOOST_CHRONO=/\*\*/ -DHAVE_BOOST_RANDOM=/\*\*/ -DHAVE_CLOCK_GETTIME=1 -DNDEBUG=1 -DTORRENT_USE_OPENSSL=1 -DHAVE_PYTHON=\"2.7\" -DHAVE_BOOST_PYTHON=/\*\*/ -DBOOST_ASIO_HASH_MAP_BUCKETS=1021 -DBOOST_EXCEPTION_DISABLE=1 -DBOOST_ASIO_ENABLE_CANCELIO=1 -DTORRENT_BUILDING_SHARED=1 -I. -DTORRENT_BUILDING_LIBRARY -I../include -I../ed25519/src -Os -I/usr/include -O2 -fwrapv -pipe -Wformat -Werror=format-security -gdwarf-4 -fno-debug-types-section -fvar-tracking-assignments -g2 -Wp,-D_FORTIFY_SOURCE=2 -fstack-protector-strong --param=ssp-buffer-size=4 -Werror=trampolines -fPIC -mtune=generic -march=x86-64 -gdwarf-4 -fno-debug-types-section -fvar-tracking-assignments -g2 -ftemplate-depth=120 -Wno-format-zero-length -fvisibility=hidden -fvisibility-inlines-hidden -MT alert.lo -MD -MP -MF $depbase.Tpo -c -o alert.lo alert.cpp &&\ mv -f $depbase.Tpo $depbase.Plo libtool: compile: x86_64-pld-linux-gnux32-g++ -DPACKAGE_NAME=\"libtorrent-rasterbar\" -DPACKAGE_TARNAME=\"libtorrent-rasterbar\" -DPACKAGE_VERSION=\"1.1.11\" "-DPACKAGE_STRING=\"libtorrent-rasterbar 1.1.11\"" -DPACKAGE_BUGREPORT=\"arvid@libtorrent.org\" -DPACKAGE_URL=\"http://www.libtorrent.org\" -DPACKAGE=\"libtorrent-rasterbar\" -DVERSION=\"1.1.11\" -DSTDC_HEADERS=1 -DHAVE_SYS_TYPES_H=1 -DHAVE_SYS_STAT_H=1 -DHAVE_STDLIB_H=1 -DHAVE_STRING_H=1 -DHAVE_MEMORY_H=1 -DHAVE_STRINGS_H=1 -DHAVE_INTTYPES_H=1 -DHAVE_STDINT_H=1 -DHAVE_UNISTD_H=1 -DHAVE_DLFCN_H=1 -DLT_OBJDIR=\".libs/\" -DHAVE_PTHREAD=1 "-DHAVE_BOOST=/**/" "-DHAVE_BOOST_SYSTEM=/**/" "-DHAVE_BOOST_CHRONO=/**/" "-DHAVE_BOOST_RANDOM=/**/" -DHAVE_CLOCK_GETTIME=1 -DNDEBUG=1 -DTORRENT_USE_OPENSSL=1 -DHAVE_PYTHON=\"2.7\" "-DHAVE_BOOST_PYTHON=/**/" -DBOOST_ASIO_HASH_MAP_BUCKETS=1021 -DBOOST_EXCEPTION_DISABLE=1 -DBOOST_ASIO_ENABLE_CANCELIO=1 -DTORRENT_BUILDING_SHARED=1 -I. -DTORRENT_BUILDING_LIBRARY -I../include -I../ed25519/src -Os -I/usr/include -O2 -fwrapv -pipe -Wformat -Werror=format-security -gdwarf-4 -fno-debug-types-section -fvar-tracking-assignments -g2 -Wp,-D_FORTIFY_SOURCE=2 -fstack-protector-strong --param=ssp-buffer-size=4 -Werror=trampolines -fPIC -mtune=generic -march=x86-64 -gdwarf-4 -fno-debug-types-section -fvar-tracking-assignments -g2 -ftemplate-depth=120 -Wno-format-zero-length -fvisibility=hidden -fvisibility-inlines-hidden -MT alert.lo -MD -MP -MF .deps/alert.Tpo -c alert.cpp -fPIC -DPIC -o .libs/alert.o In file included from alert.cpp:35: ../include/libtorrent/config.hpp:53:10: fatal error: boost/detail/endian.hpp: No such file or directory 53 | #include <boost/detail/endian.hpp> | ^~~~~~~~~~~~~~~~~~~~~~~~~ compilation terminated. make[1]: *** [Makefile:1033: alert.lo] Error 1 make[1]: Leaving directory '/tmp/B.fNc1IB/BUILD/libtorrent-rasterbar-1.1.11/src' make[1]: Entering directory '/tmp/B.fNc1IB/BUILD/libtorrent-rasterbar-1.1.11/src' depbase=`echo web_connection_base.lo | sed 's|[^/]*$|.deps/&|;s|\.lo$||'`;\ /bin/sh ../libtool --tag=CXX --mode=compile x86_64-pld-linux-gnux32-g++ -DPACKAGE_NAME=\"libtorrent-rasterbar\" -DPACKAGE_TARNAME=\"libtorrent-rasterbar\" -DPACKAGE_VERSION=\"1.1.11\" -DPACKAGE_STRING=\"libtorrent-rasterbar\ 1.1.11\" -DPACKAGE_BUGREPORT=\"arvid@libtorrent.org\" -DPACKAGE_URL=\"http://www.libtorrent.org\" -DPACKAGE=\"libtorrent-rasterbar\" -DVERSION=\"1.1.11\" -DSTDC_HEADERS=1 -DHAVE_SYS_TYPES_H=1 -DHAVE_SYS_STAT_H=1 -DHAVE_STDLIB_H=1 -DHAVE_STRING_H=1 -DHAVE_MEMORY_H=1 -DHAVE_STRINGS_H=1 -DHAVE_INTTYPES_H=1 -DHAVE_STDINT_H=1 -DHAVE_UNISTD_H=1 -DHAVE_DLFCN_H=1 -DLT_OBJDIR=\".libs/\" -DHAVE_PTHREAD=1 -DHAVE_BOOST=/\*\*/ -DHAVE_BOOST_SYSTEM=/\*\*/ -DHAVE_BOOST_CHRONO=/\*\*/ -DHAVE_BOOST_RANDOM=/\*\*/ -DHAVE_CLOCK_GETTIME=1 -DNDEBUG=1 -DTORRENT_USE_OPENSSL=1 -DHAVE_PYTHON=\"2.7\" -DHAVE_BOOST_PYTHON=/\*\*/ -DBOOST_ASIO_HASH_MAP_BUCKETS=1021 -DBOOST_EXCEPTION_DISABLE=1 -DBOOST_ASIO_ENABLE_CANCELIO=1 -DTORRENT_BUILDING_SHARED=1 -I. -DTORRENT_BUILDING_LIBRARY -I../include -I../ed25519/src -Os -I/usr/include -O2 -fwrapv -pipe -Wformat -Werror=format-security -gdwarf-4 -fno-debug-types-section -fvar-tracking-assignments -g2 -Wp,-D_FORTIFY_SOURCE=2 -fstack-protector-strong --param=ssp-buffer-size=4 -Werror=trampolines -fPIC -mtune=generic -march=x86-64 -gdwarf-4 -fno-debug-types-section -fvar-tracking-assignments -g2 -ftemplate-depth=120 -Wno-format-zero-length -fvisibility=hidden -fvisibility-inlines-hidden -MT web_connection_base.lo -MD -MP -MF $depbase.Tpo -c -o web_connection_base.lo web_connection_base.cpp &&\ mv -f $depbase.Tpo $depbase.Plo libtool: compile: x86_64-pld-linux-gnux32-g++ -DPACKAGE_NAME=\"libtorrent-rasterbar\" -DPACKAGE_TARNAME=\"libtorrent-rasterbar\" -DPACKAGE_VERSION=\"1.1.11\" "-DPACKAGE_STRING=\"libtorrent-rasterbar 1.1.11\"" -DPACKAGE_BUGREPORT=\"arvid@libtorrent.org\" -DPACKAGE_URL=\"http://www.libtorrent.org\" -DPACKAGE=\"libtorrent-rasterbar\" -DVERSION=\"1.1.11\" -DSTDC_HEADERS=1 -DHAVE_SYS_TYPES_H=1 -DHAVE_SYS_STAT_H=1 -DHAVE_STDLIB_H=1 -DHAVE_STRING_H=1 -DHAVE_MEMORY_H=1 -DHAVE_STRINGS_H=1 -DHAVE_INTTYPES_H=1 -DHAVE_STDINT_H=1 -DHAVE_UNISTD_H=1 -DHAVE_DLFCN_H=1 -DLT_OBJDIR=\".libs/\" -DHAVE_PTHREAD=1 "-DHAVE_BOOST=/**/" "-DHAVE_BOOST_SYSTEM=/**/" "-DHAVE_BOOST_CHRONO=/**/" "-DHAVE_BOOST_RANDOM=/**/" -DHAVE_CLOCK_GETTIME=1 -DNDEBUG=1 -DTORRENT_USE_OPENSSL=1 -DHAVE_PYTHON=\"2.7\" "-DHAVE_BOOST_PYTHON=/**/" -DBOOST_ASIO_HASH_MAP_BUCKETS=1021 -DBOOST_EXCEPTION_DISABLE=1 -DBOOST_ASIO_ENABLE_CANCELIO=1 -DTORRENT_BUILDING_SHARED=1 -I. -DTORRENT_BUILDING_LIBRARY -I../include -I../ed25519/src -Os -I/usr/include -O2 -fwrapv -pipe -Wformat -Werror=format-security -gdwarf-4 -fno-debug-types-section -fvar-tracking-assignments -g2 -Wp,-D_FORTIFY_SOURCE=2 -fstack-protector-strong --param=ssp-buffer-size=4 -Werror=trampolines -fPIC -mtune=generic -march=x86-64 -gdwarf-4 -fno-debug-types-section -fvar-tracking-assignments -g2 -ftemplate-depth=120 -Wno-format-zero-length -fvisibility=hidden -fvisibility-inlines-hidden -MT web_connection_base.lo -MD -MP -MF .deps/web_connection_base.Tpo -c web_connection_base.cpp -fPIC -DPIC -o .libs/web_connection_base.o In file included from web_connection_base.cpp:33: ../include/libtorrent/config.hpp:53:10: fatal error: boost/detail/endian.hpp: No such file or directory 53 | #include <boost/detail/endian.hpp> | ^~~~~~~~~~~~~~~~~~~~~~~~~ compilation terminated. make[1]: *** [Makefile:1033: web_connection_base.lo] Error 1 make[1]: Leaving directory '/tmp/B.fNc1IB/BUILD/libtorrent-rasterbar-1.1.11/src' make[1]: Entering directory '/tmp/B.fNc1IB/BUILD/libtorrent-rasterbar-1.1.11/src' depbase=`echo bandwidth_queue_entry.lo | sed 's|[^/]*$|.deps/&|;s|\.lo$||'`;\ /bin/sh ../libtool --tag=CXX --mode=compile x86_64-pld-linux-gnux32-g++ -DPACKAGE_NAME=\"libtorrent-rasterbar\" -DPACKAGE_TARNAME=\"libtorrent-rasterbar\" -DPACKAGE_VERSION=\"1.1.11\" -DPACKAGE_STRING=\"libtorrent-rasterbar\ 1.1.11\" -DPACKAGE_BUGREPORT=\"arvid@libtorrent.org\" -DPACKAGE_URL=\"http://www.libtorrent.org\" -DPACKAGE=\"libtorrent-rasterbar\" -DVERSION=\"1.1.11\" -DSTDC_HEADERS=1 -DHAVE_SYS_TYPES_H=1 -DHAVE_SYS_STAT_H=1 -DHAVE_STDLIB_H=1 -DHAVE_STRING_H=1 -DHAVE_MEMORY_H=1 -DHAVE_STRINGS_H=1 -DHAVE_INTTYPES_H=1 -DHAVE_STDINT_H=1 -DHAVE_UNISTD_H=1 -DHAVE_DLFCN_H=1 -DLT_OBJDIR=\".libs/\" -DHAVE_PTHREAD=1 -DHAVE_BOOST=/\*\*/ -DHAVE_BOOST_SYSTEM=/\*\*/ -DHAVE_BOOST_CHRONO=/\*\*/ -DHAVE_BOOST_RANDOM=/\*\*/ -DHAVE_CLOCK_GETTIME=1 -DNDEBUG=1 -DTORRENT_USE_OPENSSL=1 -DHAVE_PYTHON=\"2.7\" -DHAVE_BOOST_PYTHON=/\*\*/ -DBOOST_ASIO_HASH_MAP_BUCKETS=1021 -DBOOST_EXCEPTION_DISABLE=1 -DBOOST_ASIO_ENABLE_CANCELIO=1 -DTORRENT_BUILDING_SHARED=1 -I. -DTORRENT_BUILDING_LIBRARY -I../include -I../ed25519/src -Os -I/usr/include -O2 -fwrapv -pipe -Wformat -Werror=format-security -gdwarf-4 -fno-debug-types-section -fvar-tracking-assignments -g2 -Wp,-D_FORTIFY_SOURCE=2 -fstack-protector-strong --param=ssp-buffer-size=4 -Werror=trampolines -fPIC -mtune=generic -march=x86-64 -gdwarf-4 -fno-debug-types-section -fvar-tracking-assignments -g2 -ftemplate-depth=120 -Wno-format-zero-length -fvisibility=hidden -fvisibility-inlines-hidden -MT bandwidth_queue_entry.lo -MD -MP -MF $depbase.Tpo -c -o bandwidth_queue_entry.lo bandwidth_queue_entry.cpp &&\ mv -f $depbase.Tpo $depbase.Plo libtool: compile: x86_64-pld-linux-gnux32-g++ -DPACKAGE_NAME=\"libtorrent-rasterbar\" -DPACKAGE_TARNAME=\"libtorrent-rasterbar\" -DPACKAGE_VERSION=\"1.1.11\" "-DPACKAGE_STRING=\"libtorrent-rasterbar 1.1.11\"" -DPACKAGE_BUGREPORT=\"arvid@libtorrent.org\" -DPACKAGE_URL=\"http://www.libtorrent.org\" -DPACKAGE=\"libtorrent-rasterbar\" -DVERSION=\"1.1.11\" -DSTDC_HEADERS=1 -DHAVE_SYS_TYPES_H=1 -DHAVE_SYS_STAT_H=1 -DHAVE_STDLIB_H=1 -DHAVE_STRING_H=1 -DHAVE_MEMORY_H=1 -DHAVE_STRINGS_H=1 -DHAVE_INTTYPES_H=1 -DHAVE_STDINT_H=1 -DHAVE_UNISTD_H=1 -DHAVE_DLFCN_H=1 -DLT_OBJDIR=\".libs/\" -DHAVE_PTHREAD=1 "-DHAVE_BOOST=/**/" "-DHAVE_BOOST_SYSTEM=/**/" "-DHAVE_BOOST_CHRONO=/**/" "-DHAVE_BOOST_RANDOM=/**/" -DHAVE_CLOCK_GETTIME=1 -DNDEBUG=1 -DTORRENT_USE_OPENSSL=1 -DHAVE_PYTHON=\"2.7\" "-DHAVE_BOOST_PYTHON=/**/" -DBOOST_ASIO_HASH_MAP_BUCKETS=1021 -DBOOST_EXCEPTION_DISABLE=1 -DBOOST_ASIO_ENABLE_CANCELIO=1 -DTORRENT_BUILDING_SHARED=1 -I. -DTORRENT_BUILDING_LIBRARY -I../include -I../ed25519/src -Os -I/usr/include -O2 -fwrapv -pipe -Wformat -Werror=format-security -gdwarf-4 -fno-debug-types-section -fvar-tracking-assignments -g2 -Wp,-D_FORTIFY_SOURCE=2 -fstack-protector-strong --param=ssp-buffer-size=4 -Werror=trampolines -fPIC -mtune=generic -march=x86-64 -gdwarf-4 -fno-debug-types-section -fvar-tracking-assignments -g2 -ftemplate-depth=120 -Wno-format-zero-length -fvisibility=hidden -fvisibility-inlines-hidden -MT bandwidth_queue_entry.lo -MD -MP -MF .deps/bandwidth_queue_entry.Tpo -c bandwidth_queue_entry.cpp -fPIC -DPIC -o .libs/bandwidth_queue_entry.o In file included from ../include/libtorrent/assert.hpp:35, from ../include/libtorrent/bandwidth_limit.hpp:43, from ../include/libtorrent/bandwidth_queue_entry.hpp:42, from bandwidth_queue_entry.cpp:39: ../include/libtorrent/config.hpp:53:10: fatal error: boost/detail/endian.hpp: No such file or directory 53 | #include <boost/detail/endian.hpp> | ^~~~~~~~~~~~~~~~~~~~~~~~~ compilation terminated. make[1]: *** [Makefile:1033: bandwidth_queue_entry.lo] Error 1 make[1]: Leaving directory '/tmp/B.fNc1IB/BUILD/libtorrent-rasterbar-1.1.11/src' make: *** [Makefile:625: all-recursive] Error 1 error: Bad exit status from /tmp/B.fNc1IB/BUILD/tmp/rpm-tmp.23387 (%build) RPM build errors: %changelog not in descending chronological order Bad exit status from /tmp/B.fNc1IB/BUILD/tmp/rpm-tmp.23387 (%build) ended at: Fri Jul 31 19:24:10 2020, done in 0:00:18.959001 error: No files produced. + chmod -R u+rwX /tmp/B.fNc1IB/BUILD + rm -rf /tmp/B.fNc1IB/tmp /tmp/B.fNc1IB/BUILD + rm -rf /tmp/B.fNc1IB Begin-PLD-Builder-Info Build-Time: user:15.64s sys:2.27s real:22.34s (faults io:5 non-io:1242674) End-PLD-Builder-Info
[Back to list of logs] [View rpm -qa of builder]