FailedOk

th/SRPMS[OK]
th/x32[OK]
th/i686[OK]
th/x86_64[OK]

ac/SRPMS[OK]
ac/i386[OK]
ac/i586[OK]
ac/i686[OK]
ac/alpha[OK]
ac/amd64[OK]
ac/athlon[OK]
ac/ppc[OK]
ac/sparc[OK]
ac/sparc64[OK]

Advanced Search
main()
Powered by PLD Linux
(c) 2002-2020 PLD Team
$Revision: 1.37 $
Powered by six Cray XMT Supercomputers.
Your IP: 3.228.220.31

litecoin 180c8379-8da4-4cca-929b-aba69e6f3d12

Status:Failed
Source URL:https://buildlogs.pld-linux.org/pld/th/x32/FAIL/litecoin,180c8379-8da4-4cca-929b-aba69e6f3d12.bz2
text/plain URL:View!
full text:View!
rpm -qa of builder:View!
Date:2020/07/28 20:10:11
Runtime:0:01:35.852416

Toc:

  • error 1
  • httpserver.cpp:74:10: error: 'deque' in namespace 'std' does not name a template type
  • error 2
  • httpserver.cpp:92:13: error: 'queue' was not declared in this scope; did you mean 'Enqueue'?
  • error 3
  • httpserver.cpp:95:9: error: 'queue' was not declared in this scope; did you mean 'Enqueue'?
  • error 4
  • httpserver.cpp:106:35: error: 'queue' was not declared in this scope; did you mean 'Enqueue'?
  • error 5
  • httpserver.cpp:110:31: error: 'queue' was not declared in this scope; did you mean 'Enqueue'?
  • error 6
  • make[2]: *** [Makefile:6346: libbitcoin_server_a-httpserver.o] Error 1
  • error 7
  • make[1]: *** [Makefile:10510: all-recursive] Error 1
  • error 8
  • error: Bad exit status from /tmp/B.Rh9Hq_/BUILD/tmp/rpm-tmp.64931 (%build)
  • error 9
  • RPM build errors:
  • error 10
  • error: No files produced.

Content:

checking if libtool supports shared libraries... yes
checking whether to build shared libraries... no
checking whether to build static libraries... yes
checking whether make supports nested variables... (cached) yes
checking for x86_64-pld-linux-gnux32-pkg-config... /usr/bin/x86_64-pld-linux-gnux32-pkg-config
checking pkg-config is at least version 0.9.0... yes
checking for x86_64-pld-linux-gnux32-ar... no
checking for ar... /usr/bin/ar
checking for x86_64-pld-linux-gnux32-ranlib... no
checking for ranlib... /usr/bin/ranlib
checking for x86_64-pld-linux-gnux32-strip... no
checking for strip... /usr/bin/strip
checking for gcc... gcc
checking whether we are using the GNU C compiler... (cached) yes
checking whether gcc accepts -g... yes
checking for gcc option to accept ISO C89... (cached) none needed
checking whether gcc understands -c and -o together... (cached) yes
checking dependency style of gcc... (cached) gcc3
checking how to run the C preprocessor... gcc -E
checking for x86_64-pld-linux-gnux32-gcc option to accept ISO C89... (cached) none needed
checking dependency style of x86_64-pld-linux-gnux32-gcc... gcc3
checking if x86_64-pld-linux-gnux32-gcc supports -std=c89 -pedantic -Wall -Wextra -Wcast-align -Wnested-externs -Wshadow -Wstrict-prototypes -Wno-unused-function -Wno-long-long -Wno-overlength-strings... yes
checking if x86_64-pld-linux-gnux32-gcc supports -fvisibility=hidden... yes
checking for __int128... yes
checking for __builtin_expect... yes
checking native compiler: gcc... ok
checking for x86_64 assembly availability... yes
checking for libcrypto... yes
checking for main in -lcrypto... yes
checking for EC functions in libcrypto... no
checking whether byte ordering is bigendian... no
configure: Using static precomputation: yes
configure: Using assembly optimizations: x86_64
configure: Using field implementation: 64bit
configure: Using bignum implementation: no
configure: Using scalar implementation: 64bit
configure: Using endomorphism optimizations: no
configure: Building for coverage analysis: no
configure: Building ECDH module: no
configure: Building ECDSA pubkey recovery module: yes
configure: Using jni: no
checking that generated files are newer than configure... done
configure: creating ./config.status
config.status: creating Makefile
config.status: creating libsecp256k1.pc
config.status: creating src/libsecp256k1-config.h
config.status: executing depfiles commands
config.status: executing libtool commands

Options used to compile and link:
  with wallet   = yes
  with gui / qt = yes
    with qr     = yes
  with zmq      = yes
  with test     = yes
  with bench    = yes
  with upnp     = yes
  use asm       = yes
  sanitizers    = 
  scrypt sse2   = no
  debug enabled = no
  gprof enabled = no
  werror        = no

  target os     = linux
  build os      = 

  CC            = x86_64-pld-linux-gnux32-gcc
  CFLAGS        = -O2 -fwrapv -pipe -Wformat -Werror=format-security -gdwarf-4 -fno-debug-types-section -fvar-tracking-assignments -g2 -Wp,-D_FORTIFY_SOURCE=2 -fstack-protector-strong --param=ssp-buffer-size=4 -Werror=trampolines -fPIC -mtune=generic -march=x86-64 -gdwarf-4 -fno-debug-types-section -fvar-tracking-assignments -g2 
  CPPFLAGS      =   -U_FORTIFY_SOURCE -D_FORTIFY_SOURCE=2  -DHAVE_BUILD_INFO -D__STDC_FORMAT_MACROS
  CXX           = x86_64-pld-linux-gnux32-g++ -std=c++11
  CXXFLAGS      =   -Wstack-protector -fstack-protector-all     -O2 -fwrapv -pipe -Wformat -Werror=format-security -gdwarf-4 -fno-debug-types-section -fvar-tracking-assignments -g2 -Wp,-D_FORTIFY_SOURCE=2 -fstack-protector-strong --param=ssp-buffer-size=4 -Werror=trampolines -fPIC -mtune=generic -march=x86-64 -gdwarf-4 -fno-debug-types-section -fvar-tracking-assignments -g2 
  LDFLAGS       = -pthread  -Wl,-z,relro -Wl,-z,now -pie  -Wl,--as-needed -Wl,--no-copy-dt-needed-entries -Wl,-z,relro -Wl,-z,combreloc 
  ARFLAGS       = cr

+ /usr/bin/make -Otarget -j9
Making all in src
make[2]: Entering directory '/tmp/B.Rh9Hq_/BUILD/litecoin-0.17.1/src'
x86_64-pld-linux-gnux32-g++ -std=c++11 -DHAVE_CONFIG_H -I. -I../src/config   -U_FORTIFY_SOURCE -D_FORTIFY_SOURCE=2 -I.  -DBOOST_SP_USE_STD_ATOMIC -DBOOST_AC_USE_STD_ATOMIC -pthread -I/usr/include -I./leveldb/include -I./leveldb/helpers/memenv   -I./secp256k1/include    -pthread -DHAVE_BUILD_INFO -D__STDC_FORMAT_MACROS  -Wstack-protector -fstack-protector-all      -fPIE -O2 -fwrapv -pipe -Wformat -Werror=format-security -gdwarf-4 -fno-debug-types-section -fvar-tracking-assignments -g2 -Wp,-D_FORTIFY_SOURCE=2 -fstack-protector-strong --param=ssp-buffer-size=4 -Werror=trampolines -fPIC -mtune=generic -march=x86-64 -gdwarf-4 -fno-debug-types-section -fvar-tracking-assignments -g2  -MT libbitcoin_server_a-chain.o -MD -MP -MF .deps/libbitcoin_server_a-chain.Tpo -c -o libbitcoin_server_a-chain.o `test -f 'chain.cpp' || echo './'`chain.cpp
mv -f .deps/libbitcoin_server_a-chain.Tpo .deps/libbitcoin_server_a-chain.Po
make[2]: Leaving directory '/tmp/B.Rh9Hq_/BUILD/litecoin-0.17.1/src'
make[2]: Entering directory '/tmp/B.Rh9Hq_/BUILD/litecoin-0.17.1/src'
x86_64-pld-linux-gnux32-g++ -std=c++11 -DHAVE_CONFIG_H -I. -I../src/config   -U_FORTIFY_SOURCE -D_FORTIFY_SOURCE=2 -I.  -DBOOST_SP_USE_STD_ATOMIC -DBOOST_AC_USE_STD_ATOMIC -pthread -I/usr/include -I./leveldb/include -I./leveldb/helpers/memenv   -I./secp256k1/include    -pthread -DHAVE_BUILD_INFO -D__STDC_FORMAT_MACROS  -Wstack-protector -fstack-protector-all      -fPIE -O2 -fwrapv -pipe -Wformat -Werror=format-security -gdwarf-4 -fno-debug-types-section -fvar-tracking-assignments -g2 -Wp,-D_FORTIFY_SOURCE=2 -fstack-protector-strong --param=ssp-buffer-size=4 -Werror=trampolines -fPIC -mtune=generic -march=x86-64 -gdwarf-4 -fno-debug-types-section -fvar-tracking-assignments -g2  -MT libbitcoin_server_a-checkpoints.o -MD -MP -MF .deps/libbitcoin_server_a-checkpoints.Tpo -c -o libbitcoin_server_a-checkpoints.o `test -f 'checkpoints.cpp' || echo './'`checkpoints.cpp
mv -f .deps/libbitcoin_server_a-checkpoints.Tpo .deps/libbitcoin_server_a-checkpoints.Po
make[2]: Leaving directory '/tmp/B.Rh9Hq_/BUILD/litecoin-0.17.1/src'
make[2]: Entering directory '/tmp/B.Rh9Hq_/BUILD/litecoin-0.17.1/src'
x86_64-pld-linux-gnux32-g++ -std=c++11 -DHAVE_CONFIG_H -I. -I../src/config   -U_FORTIFY_SOURCE -D_FORTIFY_SOURCE=2 -I.  -DBOOST_SP_USE_STD_ATOMIC -DBOOST_AC_USE_STD_ATOMIC -pthread -I/usr/include -I./leveldb/include -I./leveldb/helpers/memenv   -I./secp256k1/include    -pthread -DHAVE_BUILD_INFO -D__STDC_FORMAT_MACROS  -Wstack-protector -fstack-protector-all      -fPIE -O2 -fwrapv -pipe -Wformat -Werror=format-security -gdwarf-4 -fno-debug-types-section -fvar-tracking-assignments -g2 -Wp,-D_FORTIFY_SOURCE=2 -fstack-protector-strong --param=ssp-buffer-size=4 -Werror=trampolines -fPIC -mtune=generic -march=x86-64 -gdwarf-4 -fno-debug-types-section -fvar-tracking-assignments -g2  -MT libbitcoin_server_a-bloom.o -MD -MP -MF .deps/libbitcoin_server_a-bloom.Tpo -c -o libbitcoin_server_a-bloom.o `test -f 'bloom.cpp' || echo './'`bloom.cpp
mv -f .deps/libbitcoin_server_a-bloom.Tpo .deps/libbitcoin_server_a-bloom.Po
make[2]: Leaving directory '/tmp/B.Rh9Hq_/BUILD/litecoin-0.17.1/src'
make[2]: Entering directory '/tmp/B.Rh9Hq_/BUILD/litecoin-0.17.1/src'
x86_64-pld-linux-gnux32-g++ -std=c++11 -DHAVE_CONFIG_H -I. -I../src/config   -U_FORTIFY_SOURCE -D_FORTIFY_SOURCE=2 -I.  -DBOOST_SP_USE_STD_ATOMIC -DBOOST_AC_USE_STD_ATOMIC -pthread -I/usr/include -I./leveldb/include -I./leveldb/helpers/memenv   -I./secp256k1/include    -pthread -DHAVE_BUILD_INFO -D__STDC_FORMAT_MACROS  -Wstack-protector -fstack-protector-all      -fPIE -O2 -fwrapv -pipe -Wformat -Werror=format-security -gdwarf-4 -fno-debug-types-section -fvar-tracking-assignments -g2 -Wp,-D_FORTIFY_SOURCE=2 -fstack-protector-strong --param=ssp-buffer-size=4 -Werror=trampolines -fPIC -mtune=generic -march=x86-64 -gdwarf-4 -fno-debug-types-section -fvar-tracking-assignments -g2  -MT libbitcoin_server_a-merkleblock.o -MD -MP -MF .deps/libbitcoin_server_a-merkleblock.Tpo -c -o libbitcoin_server_a-merkleblock.o `test -f 'merkleblock.cpp' || echo './'`merkleblock.cpp
mv -f .deps/libbitcoin_server_a-merkleblock.Tpo .deps/libbitcoin_server_a-merkleblock.Po
make[2]: Leaving directory '/tmp/B.Rh9Hq_/BUILD/litecoin-0.17.1/src'
make[2]: Entering directory '/tmp/B.Rh9Hq_/BUILD/litecoin-0.17.1/src'
x86_64-pld-linux-gnux32-g++ -std=c++11 -DHAVE_CONFIG_H -I. -I../src/config   -U_FORTIFY_SOURCE -D_FORTIFY_SOURCE=2 -I.  -DBOOST_SP_USE_STD_ATOMIC -DBOOST_AC_USE_STD_ATOMIC -pthread -I/usr/include -I./leveldb/include -I./leveldb/helpers/memenv   -I./secp256k1/include  -DHAVE_BUILD_INFO -D__STDC_FORMAT_MACROS  -Wstack-protector -fstack-protector-all      -fPIE -O2 -fwrapv -pipe -Wformat -Werror=format-security -gdwarf-4 -fno-debug-types-section -fvar-tracking-assignments -g2 -Wp,-D_FORTIFY_SOURCE=2 -fstack-protector-strong --param=ssp-buffer-size=4 -Werror=trampolines -fPIC -mtune=generic -march=x86-64 -gdwarf-4 -fno-debug-types-section -fvar-tracking-assignments -g2  -MT litecoind-bitcoind.o -MD -MP -MF .deps/litecoind-bitcoind.Tpo -c -o litecoind-bitcoind.o `test -f 'bitcoind.cpp' || echo './'`bitcoind.cpp
mv -f .deps/litecoind-bitcoind.Tpo .deps/litecoind-bitcoind.Po
make[2]: Leaving directory '/tmp/B.Rh9Hq_/BUILD/litecoin-0.17.1/src'
make[2]: Entering directory '/tmp/B.Rh9Hq_/BUILD/litecoin-0.17.1/src'
x86_64-pld-linux-gnux32-g++ -std=c++11 -DHAVE_CONFIG_H -I. -I../src/config   -U_FORTIFY_SOURCE -D_FORTIFY_SOURCE=2 -I.  -DBOOST_SP_USE_STD_ATOMIC -DBOOST_AC_USE_STD_ATOMIC -pthread -I/usr/include -I./leveldb/include -I./leveldb/helpers/memenv   -I./secp256k1/include    -pthread -DHAVE_BUILD_INFO -D__STDC_FORMAT_MACROS  -Wstack-protector -fstack-protector-all      -fPIE -O2 -fwrapv -pipe -Wformat -Werror=format-security -gdwarf-4 -fno-debug-types-section -fvar-tracking-assignments -g2 -Wp,-D_FORTIFY_SOURCE=2 -fstack-protector-strong --param=ssp-buffer-size=4 -Werror=trampolines -fPIC -mtune=generic -march=x86-64 -gdwarf-4 -fno-debug-types-section -fvar-tracking-assignments -g2  -MT libbitcoin_server_a-httpserver.o -MD -MP -MF .deps/libbitcoin_server_a-httpserver.Tpo -c -o libbitcoin_server_a-httpserver.o `test -f 'httpserver.cpp' || echo './'`httpserver.cpp
httpserver.cpp:74:10: error: 'deque' in namespace 'std' does not name a template type
   74 |     std::deque<std::unique_ptr<WorkItem>> queue;
      |          ^~~~~
httpserver.cpp:33:1: note: 'std::deque' is defined in header '<deque>'; did you forget to '#include <deque>'?
   32 | #include <support/events.h>
  +++ |+#include <deque>
   33 | 
httpserver.cpp: In member function 'bool WorkQueue<WorkItem>::Enqueue(WorkItem*)':
httpserver.cpp:92:13: error: 'queue' was not declared in this scope; did you mean 'Enqueue'?
   92 |         if (queue.size() >= maxDepth) {
      |             ^~~~~
      |             Enqueue
httpserver.cpp:95:9: error: 'queue' was not declared in this scope; did you mean 'Enqueue'?
   95 |         queue.emplace_back(std::unique_ptr<WorkItem>(item));
      |         ^~~~~
      |         Enqueue
httpserver.cpp: In member function 'void WorkQueue<WorkItem>::Run()':
httpserver.cpp:106:35: error: 'queue' was not declared in this scope; did you mean 'Enqueue'?
  106 |                 while (running && queue.empty())
      |                                   ^~~~~
      |                                   Enqueue
httpserver.cpp:110:31: error: 'queue' was not declared in this scope; did you mean 'Enqueue'?
  110 |                 i = std::move(queue.front());
      |                               ^~~~~
      |                               Enqueue
make[2]: *** [Makefile:6346: libbitcoin_server_a-httpserver.o] Error 1
make[2]: Leaving directory '/tmp/B.Rh9Hq_/BUILD/litecoin-0.17.1/src'
make[2]: *** Waiting for unfinished jobs....
make[2]: Entering directory '/tmp/B.Rh9Hq_/BUILD/litecoin-0.17.1/src'
x86_64-pld-linux-gnux32-g++ -std=c++11 -DHAVE_CONFIG_H -I. -I../src/config   -U_FORTIFY_SOURCE -D_FORTIFY_SOURCE=2 -I.  -DBOOST_SP_USE_STD_ATOMIC -DBOOST_AC_USE_STD_ATOMIC -pthread -I/usr/include -I./leveldb/include -I./leveldb/helpers/memenv   -I./secp256k1/include    -pthread -DHAVE_BUILD_INFO -D__STDC_FORMAT_MACROS  -Wstack-protector -fstack-protector-all      -fPIE -O2 -fwrapv -pipe -Wformat -Werror=format-security -gdwarf-4 -fno-debug-types-section -fvar-tracking-assignments -g2 -Wp,-D_FORTIFY_SOURCE=2 -fstack-protector-strong --param=ssp-buffer-size=4 -Werror=trampolines -fPIC -mtune=generic -march=x86-64 -gdwarf-4 -fno-debug-types-section -fvar-tracking-assignments -g2  -MT libbitcoin_server_a-addrman.o -MD -MP -MF .deps/libbitcoin_server_a-addrman.Tpo -c -o libbitcoin_server_a-addrman.o `test -f 'addrman.cpp' || echo './'`addrman.cpp
mv -f .deps/libbitcoin_server_a-addrman.Tpo .deps/libbitcoin_server_a-addrman.Po
make[2]: Leaving directory '/tmp/B.Rh9Hq_/BUILD/litecoin-0.17.1/src'
make[2]: Entering directory '/tmp/B.Rh9Hq_/BUILD/litecoin-0.17.1/src'
x86_64-pld-linux-gnux32-g++ -std=c++11 -DHAVE_CONFIG_H -I. -I../src/config   -U_FORTIFY_SOURCE -D_FORTIFY_SOURCE=2 -I.  -DBOOST_SP_USE_STD_ATOMIC -DBOOST_AC_USE_STD_ATOMIC -pthread -I/usr/include -I./leveldb/include -I./leveldb/helpers/memenv   -I./secp256k1/include    -pthread -DHAVE_BUILD_INFO -D__STDC_FORMAT_MACROS  -Wstack-protector -fstack-protector-all      -fPIE -O2 -fwrapv -pipe -Wformat -Werror=format-security -gdwarf-4 -fno-debug-types-section -fvar-tracking-assignments -g2 -Wp,-D_FORTIFY_SOURCE=2 -fstack-protector-strong --param=ssp-buffer-size=4 -Werror=trampolines -fPIC -mtune=generic -march=x86-64 -gdwarf-4 -fno-debug-types-section -fvar-tracking-assignments -g2  -MT libbitcoin_server_a-blockencodings.o -MD -MP -MF .deps/libbitcoin_server_a-blockencodings.Tpo -c -o libbitcoin_server_a-blockencodings.o `test -f 'blockencodings.cpp' || echo './'`blockencodings.cpp
mv -f .deps/libbitcoin_server_a-blockencodings.Tpo .deps/libbitcoin_server_a-blockencodings.Po
make[2]: Leaving directory '/tmp/B.Rh9Hq_/BUILD/litecoin-0.17.1/src'
make[2]: Entering directory '/tmp/B.Rh9Hq_/BUILD/litecoin-0.17.1/src'
x86_64-pld-linux-gnux32-g++ -std=c++11 -DHAVE_CONFIG_H -I. -I../src/config   -U_FORTIFY_SOURCE -D_FORTIFY_SOURCE=2 -I.  -DBOOST_SP_USE_STD_ATOMIC -DBOOST_AC_USE_STD_ATOMIC -pthread -I/usr/include -I./leveldb/include -I./leveldb/helpers/memenv   -I./secp256k1/include    -pthread -DHAVE_BUILD_INFO -D__STDC_FORMAT_MACROS  -Wstack-protector -fstack-protector-all      -fPIE -O2 -fwrapv -pipe -Wformat -Werror=format-security -gdwarf-4 -fno-debug-types-section -fvar-tracking-assignments -g2 -Wp,-D_FORTIFY_SOURCE=2 -fstack-protector-strong --param=ssp-buffer-size=4 -Werror=trampolines -fPIC -mtune=generic -march=x86-64 -gdwarf-4 -fno-debug-types-section -fvar-tracking-assignments -g2  -MT libbitcoin_server_a-addrdb.o -MD -MP -MF .deps/libbitcoin_server_a-addrdb.Tpo -c -o libbitcoin_server_a-addrdb.o `test -f 'addrdb.cpp' || echo './'`addrdb.cpp
mv -f .deps/libbitcoin_server_a-addrdb.Tpo .deps/libbitcoin_server_a-addrdb.Po
make[2]: Leaving directory '/tmp/B.Rh9Hq_/BUILD/litecoin-0.17.1/src'
make[2]: Entering directory '/tmp/B.Rh9Hq_/BUILD/litecoin-0.17.1/src'
x86_64-pld-linux-gnux32-g++ -std=c++11 -DHAVE_CONFIG_H -I. -I../src/config   -U_FORTIFY_SOURCE -D_FORTIFY_SOURCE=2 -I.  -DBOOST_SP_USE_STD_ATOMIC -DBOOST_AC_USE_STD_ATOMIC -pthread -I/usr/include -I./leveldb/include -I./leveldb/helpers/memenv   -I./secp256k1/include    -pthread -DHAVE_BUILD_INFO -D__STDC_FORMAT_MACROS  -Wstack-protector -fstack-protector-all      -fPIE -O2 -fwrapv -pipe -Wformat -Werror=format-security -gdwarf-4 -fno-debug-types-section -fvar-tracking-assignments -g2 -Wp,-D_FORTIFY_SOURCE=2 -fstack-protector-strong --param=ssp-buffer-size=4 -Werror=trampolines -fPIC -mtune=generic -march=x86-64 -gdwarf-4 -fno-debug-types-section -fvar-tracking-assignments -g2  -MT libbitcoin_server_a-dbwrapper.o -MD -MP -MF .deps/libbitcoin_server_a-dbwrapper.Tpo -c -o libbitcoin_server_a-dbwrapper.o `test -f 'dbwrapper.cpp' || echo './'`dbwrapper.cpp
mv -f .deps/libbitcoin_server_a-dbwrapper.Tpo .deps/libbitcoin_server_a-dbwrapper.Po
make[2]: Leaving directory '/tmp/B.Rh9Hq_/BUILD/litecoin-0.17.1/src'
make[2]: Entering directory '/tmp/B.Rh9Hq_/BUILD/litecoin-0.17.1/src'
x86_64-pld-linux-gnux32-g++ -std=c++11 -DHAVE_CONFIG_H -I. -I../src/config   -U_FORTIFY_SOURCE -D_FORTIFY_SOURCE=2 -I.  -DBOOST_SP_USE_STD_ATOMIC -DBOOST_AC_USE_STD_ATOMIC -pthread -I/usr/include -I./leveldb/include -I./leveldb/helpers/memenv   -I./secp256k1/include    -pthread -DHAVE_BUILD_INFO -D__STDC_FORMAT_MACROS  -Wstack-protector -fstack-protector-all      -fPIE -O2 -fwrapv -pipe -Wformat -Werror=format-security -gdwarf-4 -fno-debug-types-section -fvar-tracking-assignments -g2 -Wp,-D_FORTIFY_SOURCE=2 -fstack-protector-strong --param=ssp-buffer-size=4 -Werror=trampolines -fPIC -mtune=generic -march=x86-64 -gdwarf-4 -fno-debug-types-section -fvar-tracking-assignments -g2  -MT libbitcoin_server_a-httprpc.o -MD -MP -MF .deps/libbitcoin_server_a-httprpc.Tpo -c -o libbitcoin_server_a-httprpc.o `test -f 'httprpc.cpp' || echo './'`httprpc.cpp
mv -f .deps/libbitcoin_server_a-httprpc.Tpo .deps/libbitcoin_server_a-httprpc.Po
make[2]: Leaving directory '/tmp/B.Rh9Hq_/BUILD/litecoin-0.17.1/src'
make[2]: Entering directory '/tmp/B.Rh9Hq_/BUILD/litecoin-0.17.1/src'
x86_64-pld-linux-gnux32-g++ -std=c++11 -DHAVE_CONFIG_H -I. -I../src/config   -U_FORTIFY_SOURCE -D_FORTIFY_SOURCE=2 -I.  -DBOOST_SP_USE_STD_ATOMIC -DBOOST_AC_USE_STD_ATOMIC -pthread -I/usr/include -I./leveldb/include -I./leveldb/helpers/memenv   -I./secp256k1/include    -pthread -DHAVE_BUILD_INFO -D__STDC_FORMAT_MACROS  -Wstack-protector -fstack-protector-all      -fPIE -O2 -fwrapv -pipe -Wformat -Werror=format-security -gdwarf-4 -fno-debug-types-section -fvar-tracking-assignments -g2 -Wp,-D_FORTIFY_SOURCE=2 -fstack-protector-strong --param=ssp-buffer-size=4 -Werror=trampolines -fPIC -mtune=generic -march=x86-64 -gdwarf-4 -fno-debug-types-section -fvar-tracking-assignments -g2  -MT libbitcoin_server_a-miner.o -MD -MP -MF .deps/libbitcoin_server_a-miner.Tpo -c -o libbitcoin_server_a-miner.o `test -f 'miner.cpp' || echo './'`miner.cpp
mv -f .deps/libbitcoin_server_a-miner.Tpo .deps/libbitcoin_server_a-miner.Po
make[2]: Leaving directory '/tmp/B.Rh9Hq_/BUILD/litecoin-0.17.1/src'
make[2]: Entering directory '/tmp/B.Rh9Hq_/BUILD/litecoin-0.17.1/src'
x86_64-pld-linux-gnux32-g++ -std=c++11 -DHAVE_CONFIG_H -I. -I../src/config   -U_FORTIFY_SOURCE -D_FORTIFY_SOURCE=2 -I.  -DBOOST_SP_USE_STD_ATOMIC -DBOOST_AC_USE_STD_ATOMIC -pthread -I/usr/include -I./leveldb/include -I./leveldb/helpers/memenv   -I./secp256k1/include    -pthread -DHAVE_BUILD_INFO -D__STDC_FORMAT_MACROS  -Wstack-protector -fstack-protector-all      -fPIE -O2 -fwrapv -pipe -Wformat -Werror=format-security -gdwarf-4 -fno-debug-types-section -fvar-tracking-assignments -g2 -Wp,-D_FORTIFY_SOURCE=2 -fstack-protector-strong --param=ssp-buffer-size=4 -Werror=trampolines -fPIC -mtune=generic -march=x86-64 -gdwarf-4 -fno-debug-types-section -fvar-tracking-assignments -g2  -MT libbitcoin_server_a-net.o -MD -MP -MF .deps/libbitcoin_server_a-net.Tpo -c -o libbitcoin_server_a-net.o `test -f 'net.cpp' || echo './'`net.cpp
mv -f .deps/libbitcoin_server_a-net.Tpo .deps/libbitcoin_server_a-net.Po
make[2]: Leaving directory '/tmp/B.Rh9Hq_/BUILD/litecoin-0.17.1/src'
make[2]: Entering directory '/tmp/B.Rh9Hq_/BUILD/litecoin-0.17.1/src'
x86_64-pld-linux-gnux32-g++ -std=c++11 -DHAVE_CONFIG_H -I. -I../src/config   -U_FORTIFY_SOURCE -D_FORTIFY_SOURCE=2 -I.  -DBOOST_SP_USE_STD_ATOMIC -DBOOST_AC_USE_STD_ATOMIC -pthread -I/usr/include -I./leveldb/include -I./leveldb/helpers/memenv   -I./secp256k1/include    -pthread -DHAVE_BUILD_INFO -D__STDC_FORMAT_MACROS  -Wstack-protector -fstack-protector-all      -fPIE -O2 -fwrapv -pipe -Wformat -Werror=format-security -gdwarf-4 -fno-debug-types-section -fvar-tracking-assignments -g2 -Wp,-D_FORTIFY_SOURCE=2 -fstack-protector-strong --param=ssp-buffer-size=4 -Werror=trampolines -fPIC -mtune=generic -march=x86-64 -gdwarf-4 -fno-debug-types-section -fvar-tracking-assignments -g2  -MT libbitcoin_server_a-init.o -MD -MP -MF .deps/libbitcoin_server_a-init.Tpo -c -o libbitcoin_server_a-init.o `test -f 'init.cpp' || echo './'`init.cpp
In file included from /usr/include/boost/bind.hpp:30,
                 from init.cpp:59:
/usr/include/boost/bind.hpp:36:1: note: '#pragma message: The practice of declaring the Bind placeholders (_1, _2, ...) in the global namespace is deprecated. Please use <boost/bind/bind.hpp> + using namespace boost::placeholders, or define BOOST_BIND_GLOBAL_PLACEHOLDERS to retain the current behavior.'
   36 | BOOST_PRAGMA_MESSAGE(
      | ^~~~~~~~~~~~~~~~~~~~
mv -f .deps/libbitcoin_server_a-init.Tpo .deps/libbitcoin_server_a-init.Po
make[2]: Leaving directory '/tmp/B.Rh9Hq_/BUILD/litecoin-0.17.1/src'
make[1]: *** [Makefile:10510: all-recursive] Error 1
make: *** [Makefile:774: all-recursive] Error 1
error: Bad exit status from /tmp/B.Rh9Hq_/BUILD/tmp/rpm-tmp.64931 (%build)


RPM build errors:
    Bad exit status from /tmp/B.Rh9Hq_/BUILD/tmp/rpm-tmp.64931 (%build)
ended at: Tue Jul 28 20:10:10 2020, done in 0:01:35.852416
error: No files produced.
+ chmod -R u+rwX /tmp/B.Rh9Hq_/BUILD
+ rm -rf /tmp/B.Rh9Hq_/tmp /tmp/B.Rh9Hq_/BUILD
+ rm -rf /tmp/B.Rh9Hq_
Begin-PLD-Builder-Info
Build-Time: user:189.32s sys:10.45s real:99.22s (faults io:0 non-io:3114426)

End-PLD-Builder-Info
[Back to list of logs] [View rpm -qa of builder]