FailedOk

th/SRPMS[OK]
th/x32[OK]
th/i686[OK]
th/x86_64[OK]

ac/SRPMS[OK]
ac/i386[OK]
ac/i586[OK]
ac/i686[OK]
ac/alpha[OK]
ac/amd64[OK]
ac/athlon[OK]
ac/ppc[OK]
ac/sparc[OK]
ac/sparc64[OK]

Advanced Search
main()
Powered by PLD Linux
(c) 2002-2020 PLD Team
$Revision: 1.37 $
Powered by computron.
Your IP: 35.168.112.145

lttng-modules 57a816ec-1155-4d12-846d-0db3403a9c22

Status:Failed
Source URL:https://buildlogs.pld-linux.org/pld/th/x32/FAIL/lttng-modules,57a816ec-1155-4d12-846d-0db3403a9c22.bz2
text/plain URL:View!
full text:View!
rpm -qa of builder:View!
Date:2020/06/06 10:12:48
Runtime:0:00:10.854309

Toc:

  • error 1
  • /tmp/B.ni56z2/BUILD/lttng-modules-2.12.0/lttng-modules-2.12.0/lttng-events.c:133:2: error: implicit declaration of function 'uuid_le_gen'; did you mean 'uuid_le_cmp'? [-Werror=implicit-function-declaration]
  • error 2
  • make[2]: *** [scripts/Makefile.build:267: /tmp/B.ni56z2/BUILD/lttng-modules-2.12.0/lttng-modules-2.12.0/lttng-events.o] Error 1
  • error 3
  • /tmp/B.ni56z2/BUILD/lttng-modules-2.12.0/lttng-modules-2.12.0/probes/../instrumentation/events/lttng-module/arch/x86/kvm/trace.h:440:50: error: 'vcpu->arch.emulate_ctxt' is a pointer; did you mean to use '->'?
  • error 4
  • /tmp/B.ni56z2/BUILD/lttng-modules-2.12.0/lttng-modules-2.12.0/probes/../instrumentation/events/lttng-module/arch/x86/kvm/trace.h:441:29: error: 'vcpu->arch.emulate_ctxt' is a pointer; did you mean to use '->'?
  • error 5
  • /tmp/B.ni56z2/BUILD/lttng-modules-2.12.0/lttng-modules-2.12.0/probes/../instrumentation/events/lttng-module/arch/x86/kvm/trace.h:442:29: error: 'vcpu->arch.emulate_ctxt' is a pointer; did you mean to use '->'?
  • error 6
  • /tmp/B.ni56z2/BUILD/lttng-modules-2.12.0/lttng-modules-2.12.0/probes/../instrumentation/events/lttng-module/arch/x86/kvm/trace.h:440:50: error: 'vcpu->arch.emulate_ctxt' is a pointer; did you mean to use '->'?
  • error 7
  • /tmp/B.ni56z2/BUILD/lttng-modules-2.12.0/lttng-modules-2.12.0/probes/../instrumentation/events/lttng-module/arch/x86/kvm/trace.h:441:29: error: 'vcpu->arch.emulate_ctxt' is a pointer; did you mean to use '->'?
  • error 8
  • /tmp/B.ni56z2/BUILD/lttng-modules-2.12.0/lttng-modules-2.12.0/probes/../instrumentation/events/lttng-module/arch/x86/kvm/trace.h:442:29: error: 'vcpu->arch.emulate_ctxt' is a pointer; did you mean to use '->'?
  • error 9
  • /tmp/B.ni56z2/BUILD/lttng-modules-2.12.0/lttng-modules-2.12.0/probes/../instrumentation/events/lttng-module/arch/x86/kvm/trace.h:440:50: error: 'vcpu->arch.emulate_ctxt' is a pointer; did you mean to use '->'?
  • error 10
  • /tmp/B.ni56z2/BUILD/lttng-modules-2.12.0/lttng-modules-2.12.0/probes/../instrumentation/events/lttng-module/arch/x86/kvm/trace.h:441:29: error: 'vcpu->arch.emulate_ctxt' is a pointer; did you mean to use '->'?
  • error 11
  • /tmp/B.ni56z2/BUILD/lttng-modules-2.12.0/lttng-modules-2.12.0/probes/../instrumentation/events/lttng-module/arch/x86/kvm/trace.h:442:29: error: 'vcpu->arch.emulate_ctxt' is a pointer; did you mean to use '->'?
  • error 12
  • /tmp/B.ni56z2/BUILD/lttng-modules-2.12.0/lttng-modules-2.12.0/probes/../instrumentation/events/lttng-module/arch/x86/kvm/trace.h:440:50: error: 'vcpu->arch.emulate_ctxt' is a pointer; did you mean to use '->'?
  • error 13
  • /tmp/B.ni56z2/BUILD/lttng-modules-2.12.0/lttng-modules-2.12.0/probes/../instrumentation/events/lttng-module/arch/x86/kvm/trace.h:441:29: error: 'vcpu->arch.emulate_ctxt' is a pointer; did you mean to use '->'?
  • error 14
  • /tmp/B.ni56z2/BUILD/lttng-modules-2.12.0/lttng-modules-2.12.0/probes/../instrumentation/events/lttng-module/arch/x86/kvm/trace.h:442:29: error: 'vcpu->arch.emulate_ctxt' is a pointer; did you mean to use '->'?
  • error 15
  • /tmp/B.ni56z2/BUILD/lttng-modules-2.12.0/lttng-modules-2.12.0/probes/../instrumentation/events/lttng-module/arch/x86/kvm/trace.h:440:50: error: 'vcpu->arch.emulate_ctxt' is a pointer; did you mean to use '->'?
  • error 16
  • /tmp/B.ni56z2/BUILD/lttng-modules-2.12.0/lttng-modules-2.12.0/probes/../instrumentation/events/lttng-module/arch/x86/kvm/trace.h:441:29: error: 'vcpu->arch.emulate_ctxt' is a pointer; did you mean to use '->'?
  • error 17
  • /tmp/B.ni56z2/BUILD/lttng-modules-2.12.0/lttng-modules-2.12.0/probes/../instrumentation/events/lttng-module/arch/x86/kvm/trace.h:442:29: error: 'vcpu->arch.emulate_ctxt' is a pointer; did you mean to use '->'?
  • error 18
  • /tmp/B.ni56z2/BUILD/lttng-modules-2.12.0/lttng-modules-2.12.0/probes/../instrumentation/events/lttng-module/arch/x86/kvm/trace.h:440:50: error: 'vcpu->arch.emulate_ctxt' is a pointer; did you mean to use '->'?
  • error 19
  • /tmp/B.ni56z2/BUILD/lttng-modules-2.12.0/lttng-modules-2.12.0/probes/../instrumentation/events/lttng-module/arch/x86/kvm/trace.h:441:29: error: 'vcpu->arch.emulate_ctxt' is a pointer; did you mean to use '->'?
  • error 20
  • /tmp/B.ni56z2/BUILD/lttng-modules-2.12.0/lttng-modules-2.12.0/probes/../instrumentation/events/lttng-module/arch/x86/kvm/trace.h:442:29: error: 'vcpu->arch.emulate_ctxt' is a pointer; did you mean to use '->'?
  • error 21
  • /tmp/B.ni56z2/BUILD/lttng-modules-2.12.0/lttng-modules-2.12.0/probes/../instrumentation/events/lttng-module/arch/x86/kvm/trace.h:440:50: error: 'vcpu->arch.emulate_ctxt' is a pointer; did you mean to use '->'?
  • error 22
  • /tmp/B.ni56z2/BUILD/lttng-modules-2.12.0/lttng-modules-2.12.0/probes/../instrumentation/events/lttng-module/arch/x86/kvm/trace.h:441:29: error: 'vcpu->arch.emulate_ctxt' is a pointer; did you mean to use '->'?
  • error 23
  • /tmp/B.ni56z2/BUILD/lttng-modules-2.12.0/lttng-modules-2.12.0/probes/../instrumentation/events/lttng-module/arch/x86/kvm/trace.h:442:29: error: 'vcpu->arch.emulate_ctxt' is a pointer; did you mean to use '->'?
  • error 24
  • /tmp/B.ni56z2/BUILD/lttng-modules-2.12.0/lttng-modules-2.12.0/probes/../instrumentation/events/lttng-module/arch/x86/kvm/trace.h:440:50: error: 'vcpu->arch.emulate_ctxt' is a pointer; did you mean to use '->'?
  • error 25
  • /tmp/B.ni56z2/BUILD/lttng-modules-2.12.0/lttng-modules-2.12.0/probes/../instrumentation/events/lttng-module/arch/x86/kvm/trace.h:441:29: error: 'vcpu->arch.emulate_ctxt' is a pointer; did you mean to use '->'?
  • error 26
  • /tmp/B.ni56z2/BUILD/lttng-modules-2.12.0/lttng-modules-2.12.0/probes/../instrumentation/events/lttng-module/arch/x86/kvm/trace.h:442:29: error: 'vcpu->arch.emulate_ctxt' is a pointer; did you mean to use '->'?
  • error 27
  • /tmp/B.ni56z2/BUILD/lttng-modules-2.12.0/lttng-modules-2.12.0/probes/../instrumentation/events/lttng-module/arch/x86/kvm/trace.h:443:41: error: invalid type argument of '->' (have 'struct kvm_x86_ops')
  • error 28
  • /tmp/B.ni56z2/BUILD/lttng-modules-2.12.0/lttng-modules-2.12.0/probes/../instrumentation/events/lttng-module/arch/x86/kvm/trace.h:443:41: error: invalid type argument of '->' (have 'struct kvm_x86_ops')
  • error 29
  • /tmp/B.ni56z2/BUILD/lttng-modules-2.12.0/lttng-modules-2.12.0/probes/../instrumentation/events/lttng-module/arch/x86/kvm/trace.h:443:41: error: invalid type argument of '->' (have 'struct kvm_x86_ops')
  • error 30
  • /tmp/B.ni56z2/BUILD/lttng-modules-2.12.0/lttng-modules-2.12.0/probes/../instrumentation/events/lttng-module/arch/x86/kvm/trace.h:443:41: error: invalid type argument of '->' (have 'struct kvm_x86_ops')
  • error 31
  • /tmp/B.ni56z2/BUILD/lttng-modules-2.12.0/lttng-modules-2.12.0/probes/../instrumentation/events/lttng-module/arch/x86/kvm/trace.h:443:41: error: invalid type argument of '->' (have 'struct kvm_x86_ops')
  • error 32
  • /tmp/B.ni56z2/BUILD/lttng-modules-2.12.0/lttng-modules-2.12.0/probes/../instrumentation/events/lttng-module/arch/x86/kvm/trace.h:443:41: error: invalid type argument of '->' (have 'struct kvm_x86_ops')
  • error 33
  • /tmp/B.ni56z2/BUILD/lttng-modules-2.12.0/lttng-modules-2.12.0/probes/../instrumentation/events/lttng-module/arch/x86/kvm/trace.h:443:41: error: invalid type argument of '->' (have 'struct kvm_x86_ops')
  • error 34
  • /tmp/B.ni56z2/BUILD/lttng-modules-2.12.0/lttng-modules-2.12.0/probes/../instrumentation/events/lttng-module/arch/x86/kvm/trace.h:443:41: error: invalid type argument of '->' (have 'struct kvm_x86_ops')
  • error 35
  • /tmp/B.ni56z2/BUILD/lttng-modules-2.12.0/lttng-modules-2.12.0/probes/../instrumentation/events/lttng-module/arch/x86/kvm/trace.h:444:49: error: 'vcpu->arch.emulate_ctxt' is a pointer; did you mean to use '->'?
  • error 36
  • /tmp/B.ni56z2/BUILD/lttng-modules-2.12.0/lttng-modules-2.12.0/probes/../instrumentation/events/lttng-module/arch/x86/kvm/trace.h:445:28: error: 'vcpu->arch.emulate_ctxt' is a pointer; did you mean to use '->'?
  • error 37
  • /tmp/B.ni56z2/BUILD/lttng-modules-2.12.0/lttng-modules-2.12.0/probes/../instrumentation/events/lttng-module/arch/x86/kvm/trace.h:444:49: error: 'vcpu->arch.emulate_ctxt' is a pointer; did you mean to use '->'?
  • error 38
  • /tmp/B.ni56z2/BUILD/lttng-modules-2.12.0/lttng-modules-2.12.0/probes/../instrumentation/events/lttng-module/arch/x86/kvm/trace.h:445:28: error: 'vcpu->arch.emulate_ctxt' is a pointer; did you mean to use '->'?
  • error 39
  • /tmp/B.ni56z2/BUILD/lttng-modules-2.12.0/lttng-modules-2.12.0/probes/../instrumentation/events/lttng-module/arch/x86/kvm/trace.h:444:49: error: 'vcpu->arch.emulate_ctxt' is a pointer; did you mean to use '->'?
  • error 40
  • /tmp/B.ni56z2/BUILD/lttng-modules-2.12.0/lttng-modules-2.12.0/probes/../instrumentation/events/lttng-module/arch/x86/kvm/trace.h:445:28: error: 'vcpu->arch.emulate_ctxt' is a pointer; did you mean to use '->'?
  • error 41
  • /tmp/B.ni56z2/BUILD/lttng-modules-2.12.0/lttng-modules-2.12.0/probes/../instrumentation/events/lttng-module/arch/x86/kvm/trace.h:444:49: error: 'vcpu->arch.emulate_ctxt' is a pointer; did you mean to use '->'?
  • error 42
  • /tmp/B.ni56z2/BUILD/lttng-modules-2.12.0/lttng-modules-2.12.0/probes/../instrumentation/events/lttng-module/arch/x86/kvm/trace.h:445:28: error: 'vcpu->arch.emulate_ctxt' is a pointer; did you mean to use '->'?
  • error 43
  • /tmp/B.ni56z2/BUILD/lttng-modules-2.12.0/lttng-modules-2.12.0/probes/../instrumentation/events/lttng-module/arch/x86/kvm/trace.h:444:49: error: 'vcpu->arch.emulate_ctxt' is a pointer; did you mean to use '->'?
  • error 44
  • /tmp/B.ni56z2/BUILD/lttng-modules-2.12.0/lttng-modules-2.12.0/probes/../instrumentation/events/lttng-module/arch/x86/kvm/trace.h:445:28: error: 'vcpu->arch.emulate_ctxt' is a pointer; did you mean to use '->'?
  • error 45
  • /tmp/B.ni56z2/BUILD/lttng-modules-2.12.0/lttng-modules-2.12.0/probes/../instrumentation/events/lttng-module/arch/x86/kvm/trace.h:444:49: error: 'vcpu->arch.emulate_ctxt' is a pointer; did you mean to use '->'?
  • error 46
  • /tmp/B.ni56z2/BUILD/lttng-modules-2.12.0/lttng-modules-2.12.0/probes/../instrumentation/events/lttng-module/arch/x86/kvm/trace.h:445:28: error: 'vcpu->arch.emulate_ctxt' is a pointer; did you mean to use '->'?
  • error 47
  • /tmp/B.ni56z2/BUILD/lttng-modules-2.12.0/lttng-modules-2.12.0/probes/../instrumentation/events/lttng-module/arch/x86/kvm/trace.h:444:49: error: 'vcpu->arch.emulate_ctxt' is a pointer; did you mean to use '->'?
  • error 48
  • /tmp/B.ni56z2/BUILD/lttng-modules-2.12.0/lttng-modules-2.12.0/probes/../instrumentation/events/lttng-module/arch/x86/kvm/trace.h:445:28: error: 'vcpu->arch.emulate_ctxt' is a pointer; did you mean to use '->'?
  • error 49
  • /tmp/B.ni56z2/BUILD/lttng-modules-2.12.0/lttng-modules-2.12.0/probes/../instrumentation/events/lttng-module/arch/x86/kvm/trace.h:444:49: error: 'vcpu->arch.emulate_ctxt' is a pointer; did you mean to use '->'?
  • error 50
  • /tmp/B.ni56z2/BUILD/lttng-modules-2.12.0/lttng-modules-2.12.0/probes/../instrumentation/events/lttng-module/arch/x86/kvm/trace.h:445:28: error: 'vcpu->arch.emulate_ctxt' is a pointer; did you mean to use '->'?
  • error 51
  • /tmp/B.ni56z2/BUILD/lttng-modules-2.12.0/lttng-modules-2.12.0/probes/../instrumentation/events/lttng-module/arch/x86/kvm/trace.h:446:48: error: 'vcpu->arch.emulate_ctxt' is a pointer; did you mean to use '->'?
  • error 52
  • /tmp/B.ni56z2/BUILD/lttng-modules-2.12.0/lttng-modules-2.12.0/probes/../instrumentation/events/lttng-module/arch/x86/kvm/trace.h:448:67: error: 'vcpu->arch.emulate_ctxt' is a pointer; did you mean to use '->'?
  • error 53
  • /tmp/B.ni56z2/BUILD/lttng-modules-2.12.0/lttng-modules-2.12.0/probes/../instrumentation/events/lttng-module/arch/x86/kvm/trace.h:401:7: error: 'X86EMUL_MODE_REAL' undeclared (first use in this function)
  • error 54
  • /tmp/B.ni56z2/BUILD/lttng-modules-2.12.0/lttng-modules-2.12.0/probes/../instrumentation/events/lttng-module/arch/x86/kvm/trace.h:404:7: error: 'X86EMUL_MODE_VM86' undeclared (first use in this function)
  • error 55
  • /tmp/B.ni56z2/BUILD/lttng-modules-2.12.0/lttng-modules-2.12.0/probes/../instrumentation/events/lttng-module/arch/x86/kvm/trace.h:407:7: error: 'X86EMUL_MODE_PROT16' undeclared (first use in this function)
  • error 56
  • /tmp/B.ni56z2/BUILD/lttng-modules-2.12.0/lttng-modules-2.12.0/probes/../instrumentation/events/lttng-module/arch/x86/kvm/trace.h:410:7: error: 'X86EMUL_MODE_PROT32' undeclared (first use in this function)
  • error 57
  • /tmp/B.ni56z2/BUILD/lttng-modules-2.12.0/lttng-modules-2.12.0/probes/../instrumentation/events/lttng-module/arch/x86/kvm/trace.h:414:7: error: 'X86EMUL_MODE_PROT64' undeclared (first use in this function)
  • error 58
  • /tmp/B.ni56z2/BUILD/lttng-modules-2.12.0/lttng-modules-2.12.0/probes/../instrumentation/events/lttng-module/arch/x86/kvm/trace.h:448:67: error: 'vcpu->arch.emulate_ctxt' is a pointer; did you mean to use '->'?
  • error 59
  • /tmp/B.ni56z2/BUILD/lttng-modules-2.12.0/lttng-modules-2.12.0/probes/../instrumentation/events/lttng-module/arch/x86/kvm/trace.h:448:67: error: 'vcpu->arch.emulate_ctxt' is a pointer; did you mean to use '->'?
  • error 60
  • /tmp/B.ni56z2/BUILD/lttng-modules-2.12.0/lttng-modules-2.12.0/probes/../instrumentation/events/lttng-module/arch/x86/kvm/trace.h:448:67: error: 'vcpu->arch.emulate_ctxt' is a pointer; did you mean to use '->'?
  • error 61
  • /tmp/B.ni56z2/BUILD/lttng-modules-2.12.0/lttng-modules-2.12.0/probes/../instrumentation/events/lttng-module/arch/x86/kvm/trace.h:448:67: error: 'vcpu->arch.emulate_ctxt' is a pointer; did you mean to use '->'?
  • error 62
  • /tmp/B.ni56z2/BUILD/lttng-modules-2.12.0/lttng-modules-2.12.0/probes/../instrumentation/events/lttng-module/arch/x86/kvm/trace.h:448:67: error: 'vcpu->arch.emulate_ctxt' is a pointer; did you mean to use '->'?
  • error 63
  • /tmp/B.ni56z2/BUILD/lttng-modules-2.12.0/lttng-modules-2.12.0/probes/../instrumentation/events/lttng-module/arch/x86/kvm/trace.h:448:67: error: 'vcpu->arch.emulate_ctxt' is a pointer; did you mean to use '->'?
  • error 64
  • /tmp/B.ni56z2/BUILD/lttng-modules-2.12.0/lttng-modules-2.12.0/probes/../instrumentation/events/lttng-module/arch/x86/kvm/trace.h:448:67: error: 'vcpu->arch.emulate_ctxt' is a pointer; did you mean to use '->'?
  • error 65
  • /tmp/B.ni56z2/BUILD/lttng-modules-2.12.0/lttng-modules-2.12.0/probes/../instrumentation/events/lttng-module/arch/x86/kvm/trace.h:127:14: error: invalid type argument of '->' (have 'struct kvm_x86_ops')
  • error 66
  • /tmp/B.ni56z2/BUILD/lttng-modules-2.12.0/lttng-modules-2.12.0/probes/../instrumentation/events/lttng-module/arch/x86/kvm/trace.h:440:50: error: 'vcpu->arch.emulate_ctxt' is a pointer; did you mean to use '->'?
  • error 67
  • /tmp/B.ni56z2/BUILD/lttng-modules-2.12.0/lttng-modules-2.12.0/probes/../instrumentation/events/lttng-module/arch/x86/kvm/trace.h:441:29: error: 'vcpu->arch.emulate_ctxt' is a pointer; did you mean to use '->'?
  • error 68
  • /tmp/B.ni56z2/BUILD/lttng-modules-2.12.0/lttng-modules-2.12.0/probes/../instrumentation/events/lttng-module/arch/x86/kvm/trace.h:442:29: error: 'vcpu->arch.emulate_ctxt' is a pointer; did you mean to use '->'?
  • error 69
  • /tmp/B.ni56z2/BUILD/lttng-modules-2.12.0/lttng-modules-2.12.0/probes/../instrumentation/events/lttng-module/arch/x86/kvm/trace.h:443:41: error: invalid type argument of '->' (have 'struct kvm_x86_ops')
  • error 70
  • /tmp/B.ni56z2/BUILD/lttng-modules-2.12.0/lttng-modules-2.12.0/probes/../instrumentation/events/lttng-module/arch/x86/kvm/trace.h:444:49: error: 'vcpu->arch.emulate_ctxt' is a pointer; did you mean to use '->'?
  • error 71
  • /tmp/B.ni56z2/BUILD/lttng-modules-2.12.0/lttng-modules-2.12.0/probes/../instrumentation/events/lttng-module/arch/x86/kvm/trace.h:445:28: error: 'vcpu->arch.emulate_ctxt' is a pointer; did you mean to use '->'?
  • error 72
  • /tmp/B.ni56z2/BUILD/lttng-modules-2.12.0/lttng-modules-2.12.0/probes/../instrumentation/events/lttng-module/arch/x86/kvm/trace.h:446:48: error: 'vcpu->arch.emulate_ctxt' is a pointer; did you mean to use '->'?
  • error 73
  • /tmp/B.ni56z2/BUILD/lttng-modules-2.12.0/lttng-modules-2.12.0/probes/../instrumentation/events/lttng-module/arch/x86/kvm/trace.h:446:48: error: 'vcpu->arch.emulate_ctxt' is a pointer; did you mean to use '->'?
  • error 74
  • /tmp/B.ni56z2/BUILD/lttng-modules-2.12.0/lttng-modules-2.12.0/probes/../instrumentation/events/lttng-module/arch/x86/kvm/trace.h:448:67: error: 'vcpu->arch.emulate_ctxt' is a pointer; did you mean to use '->'?
  • error 75
  • /tmp/B.ni56z2/BUILD/lttng-modules-2.12.0/lttng-modules-2.12.0/probes/../instrumentation/events/lttng-module/arch/x86/kvm/trace.h:401:7: error: 'X86EMUL_MODE_REAL' undeclared (first use in this function)
  • error 76
  • /tmp/B.ni56z2/BUILD/lttng-modules-2.12.0/lttng-modules-2.12.0/probes/../instrumentation/events/lttng-module/arch/x86/kvm/trace.h:404:7: error: 'X86EMUL_MODE_VM86' undeclared (first use in this function)
  • error 77
  • /tmp/B.ni56z2/BUILD/lttng-modules-2.12.0/lttng-modules-2.12.0/probes/../instrumentation/events/lttng-module/arch/x86/kvm/trace.h:407:7: error: 'X86EMUL_MODE_PROT16' undeclared (first use in this function)
  • error 78
  • /tmp/B.ni56z2/BUILD/lttng-modules-2.12.0/lttng-modules-2.12.0/probes/../instrumentation/events/lttng-module/arch/x86/kvm/trace.h:410:7: error: 'X86EMUL_MODE_PROT32' undeclared (first use in this function)
  • error 79
  • /tmp/B.ni56z2/BUILD/lttng-modules-2.12.0/lttng-modules-2.12.0/probes/../instrumentation/events/lttng-module/arch/x86/kvm/trace.h:414:7: error: 'X86EMUL_MODE_PROT64' undeclared (first use in this function)
  • error 80
  • make[3]: *** [scripts/Makefile.build:267: /tmp/B.ni56z2/BUILD/lttng-modules-2.12.0/lttng-modules-2.12.0/probes/lttng-probe-kvm-x86.o] Error 1
  • error 81
  • make[2]: *** [scripts/Makefile.build:488: /tmp/B.ni56z2/BUILD/lttng-modules-2.12.0/lttng-modules-2.12.0/probes] Error 2
  • error 82
  • make[1]: *** [Makefile:1729: /tmp/B.ni56z2/BUILD/lttng-modules-2.12.0/lttng-modules-2.12.0] Error 2
  • error 83
  • error: Bad exit status from /tmp/B.ni56z2/BUILD/tmp/rpm-tmp.35379 (%build)
  • error 84
  • RPM build errors:
  • error 85
  • error: No files produced.

Content:

- fix building with kernel 5.5.3+
- rel 2

* Wed Jan 29 2020 Jan Rękorajski <baggins@pld-linux.org> 4144a1b
- up to 2.11.1 * Sun Dec 01 2019 Jan Rękorajski <baggins@pld-linux.org> b91196d
- rework build dirs to make sure we clean them between building for different kernels - rel 2 * Sat Nov 30 2019 Jan Rękorajski <baggins@pld-linux.org> 04f5de0
- up to 2.11.0 * Sat Oct 26 2019 Jakub Bogusz <qboosh@pld-linux.org> e3bbd49
- updated to 2.10.12 * Fri Jul 12 2019 Jan Rękorajski <baggins@pld-linux.org> 882dfc8
- up to 2.10.10 + rpm -Uhv --nodeps --define '_topdir /tmp/B.ni56z2' --define '_specdir %{_topdir}' --define '_sourcedir %{_specdir}' --define '_rpmdir %{_topdir}/RPMS' --define '_builddir %{_topdir}/BUILD' --without userspace --define 'build_kernels head,5.4,4.19,4.14,4.9' lttng-modules-2.12.0-1@5.7.0_1.src.rpm Preparing... ################################################## lttng-modules ################################################## + rm -f lttng-modules-2.12.0-1@5.7.0_1.src.rpm + install -m 700 -d /tmp/B.ni56z2/BUILD/tmp + TMPDIR=/tmp/B.ni56z2/BUILD/tmp + exec nice -n 0 rpmbuild -bp --short-circuit --nodeps --define '_topdir /tmp/B.ni56z2' --define '_specdir %{_topdir}' --define '_sourcedir %{_specdir}' --define '_rpmdir %{_topdir}/RPMS' --define '_builddir %{_topdir}/BUILD' --without userspace --target x32-pld-linux --define 'build_kernels head,5.4,4.19,4.14,4.9' --define 'prep exit 0' /tmp/B.ni56z2/lttng-modules.spec Building target platforms: x32-pld-linux checking BuildConflict-ing packages no BuildConflicts found checking BR rpm: Building target platforms: x32-pld-linux no BR needed building RPM using: set -ex; : build-id: 57a816ec-1155-4d12-846d-0db3403a9c22; TMPDIR=/tmp/B.ni56z2/BUILD/tmp exec nice -n 0 rpmbuild -bb --define '_smp_mflags -j9' --define '_make_opts -Otarget' --define '_pld_builder 1' --define '_topdir /tmp/B.ni56z2' --define '_specdir %{_topdir}' --define '_sourcedir %{_specdir}' --define '_rpmdir %{_topdir}/RPMS' --define '_builddir %{_topdir}/BUILD' --without userspace --target x32-pld-linux --define 'build_kernels head,5.4,4.19,4.14,4.9' /tmp/B.ni56z2/lttng-modules.spec + : build-id: 57a816ec-1155-4d12-846d-0db3403a9c22 + TMPDIR=/tmp/B.ni56z2/BUILD/tmp + exec nice -n 0 rpmbuild -bb --define '_smp_mflags -j9' --define '_make_opts -Otarget' --define '_pld_builder 1' --define '_topdir /tmp/B.ni56z2' --define '_specdir %{_topdir}' --define '_sourcedir %{_specdir}' --define '_rpmdir %{_topdir}/RPMS' --define '_builddir %{_topdir}/BUILD' --without userspace --target x32-pld-linux --define 'build_kernels head,5.4,4.19,4.14,4.9' /tmp/B.ni56z2/lttng-modules.spec Building target platforms: x32-pld-linux Executing(%prep): /bin/sh -e /tmp/B.ni56z2/BUILD/tmp/rpm-tmp.35379 + umask 022 + cd /tmp/B.ni56z2/BUILD + cd /tmp/B.ni56z2/BUILD + rm -rf lttng-modules-2.12.0 + /bin/mkdir -p lttng-modules-2.12.0 + cd lttng-modules-2.12.0 + /usr/bin/bzip2 -dc /tmp/B.ni56z2/lttng-modules-2.12.0.tar.bz2 + /bin/tar -xf - + STATUS=0 + '[' 0 -ne 0 ']' + /bin/id -u + '[' 1000 '=' 0 ']' + /bin/id -u + '[' 1000 '=' 0 ']' + /bin/chmod -Rf a+rX,u+w,g-w,o-w . + cd lttng-modules-2.12.0 + echo 'Patch #0 (build.patch):' Patch #0 (build.patch): + '[' -f /tmp/B.ni56z2/build.patch ']' + /bin/cat /tmp/B.ni56z2/build.patch + /usr/bin/patch -s -p1 + exit 0 Executing(%build): /bin/sh -e /tmp/B.ni56z2/BUILD/tmp/rpm-tmp.35379 HOME=/home/users/builder PATH=/home/users/builder/GNUstep/Tools:/bin:/usr/bin:/usr/local/bin TMPDIR=/tmp/B.ni56z2/BUILD/tmp + umask 022 + cd /tmp/B.ni56z2/BUILD + cd lttng-modules-2.12.0 + cd lttng-modules-2.12.0 + /usr/bin/make -Otarget -j9 clean 'KERNELDIR=/usr/src/linux' /usr/bin/make -C /usr/src/linux M=/tmp/B.ni56z2/BUILD/lttng-modules-2.12.0/lttng-modules-2.12.0 clean find: '/tmp/B.ni56z2/BUILD/lttng-modules-2.12.0/lttng-modules-2.12.0/extra_version/patches/': No such file or directory find: '/tmp/B.ni56z2/BUILD/lttng-modules-2.12.0/lttng-modules-2.12.0/lib/../extra_version/patches/': No such file or directory find: '/tmp/B.ni56z2/BUILD/lttng-modules-2.12.0/lttng-modules-2.12.0/tests/../extra_version/patches/': No such file or directory find: '/tmp/B.ni56z2/BUILD/lttng-modules-2.12.0/lttng-modules-2.12.0/probes/../extra_version/patches/': No such file or directory + /usr/bin/make -Otarget -j9 'KERNELDIR=/usr/src/linux' /usr/bin/make -C /usr/src/linux M=/tmp/B.ni56z2/BUILD/lttng-modules-2.12.0/lttng-modules-2.12.0 CONFIG_LTTNG=m CONFIG_LTTNG_CLOCK_PLUGIN_TEST=m modules find: '/tmp/B.ni56z2/BUILD/lttng-modules-2.12.0/lttng-modules-2.12.0/extra_version/patches/': No such file or directory find: '/tmp/B.ni56z2/BUILD/lttng-modules-2.12.0/lttng-modules-2.12.0/lib/../extra_version/patches/': No such file or directory find: '/tmp/B.ni56z2/BUILD/lttng-modules-2.12.0/lttng-modules-2.12.0/tests/../extra_version/patches/': No such file or directory find: '/tmp/B.ni56z2/BUILD/lttng-modules-2.12.0/lttng-modules-2.12.0/probes/../extra_version/patches/': No such file or directory CC [M] /tmp/B.ni56z2/BUILD/lttng-modules-2.12.0/lttng-modules-2.12.0/lttng-ring-buffer-metadata-mmap-client.o CC [M] /tmp/B.ni56z2/BUILD/lttng-modules-2.12.0/lttng-modules-2.12.0/lttng-ring-buffer-metadata-client.o CC [M] /tmp/B.ni56z2/BUILD/lttng-modules-2.12.0/lttng-modules-2.12.0/lttng-ring-buffer-client-mmap-discard.o CC [M] /tmp/B.ni56z2/BUILD/lttng-modules-2.12.0/lttng-modules-2.12.0/tests/probes/lttng-test.o CC [M] /tmp/B.ni56z2/BUILD/lttng-modules-2.12.0/lttng-modules-2.12.0/lttng-ring-buffer-client-discard.o CC [M] /tmp/B.ni56z2/BUILD/lttng-modules-2.12.0/lttng-modules-2.12.0/lttng-ring-buffer-client-overwrite.o LD [M] /tmp/B.ni56z2/BUILD/lttng-modules-2.12.0/lttng-modules-2.12.0/tests/lttng-test.o CC [M] /tmp/B.ni56z2/BUILD/lttng-modules-2.12.0/lttng-modules-2.12.0/lttng-ring-buffer-client-mmap-overwrite.o CC [M] /tmp/B.ni56z2/BUILD/lttng-modules-2.12.0/lttng-modules-2.12.0/lttng-string-utils.o CC [M] /tmp/B.ni56z2/BUILD/lttng-modules-2.12.0/lttng-modules-2.12.0/lib/ringbuffer/ring_buffer_backend.o CC [M] /tmp/B.ni56z2/BUILD/lttng-modules-2.12.0/lttng-modules-2.12.0/tests/clock-plugin/lttng-clock-plugin-test.o LD [M] /tmp/B.ni56z2/BUILD/lttng-modules-2.12.0/lttng-modules-2.12.0/tests/lttng-clock-plugin-test.o CC [M] /tmp/B.ni56z2/BUILD/lttng-modules-2.12.0/lttng-modules-2.12.0/lttng-clock.o CC [M] /tmp/B.ni56z2/BUILD/lttng-modules-2.12.0/lttng-modules-2.12.0/probes/lttng-probe-sched.o CC [M] /tmp/B.ni56z2/BUILD/lttng-modules-2.12.0/lttng-modules-2.12.0/lttng-probes.o CC [M] /tmp/B.ni56z2/BUILD/lttng-modules-2.12.0/lttng-modules-2.12.0/lttng-abi.o CC [M] /tmp/B.ni56z2/BUILD/lttng-modules-2.12.0/lttng-modules-2.12.0/lttng-context.o CC [M] /tmp/B.ni56z2/BUILD/lttng-modules-2.12.0/lttng-modules-2.12.0/lttng-events.o /tmp/B.ni56z2/BUILD/lttng-modules-2.12.0/lttng-modules-2.12.0/lttng-events.c: In function 'lttng_session_create': /tmp/B.ni56z2/BUILD/lttng-modules-2.12.0/lttng-modules-2.12.0/lttng-events.c:133:2: error: implicit declaration of function 'uuid_le_gen'; did you mean 'uuid_le_cmp'? [-Werror=implicit-function-declaration] 133 | uuid_le_gen(&session->uuid); | ^~~~~~~~~~~ | uuid_le_cmp cc1: some warnings being treated as errors make[2]: *** [scripts/Makefile.build:267: /tmp/B.ni56z2/BUILD/lttng-modules-2.12.0/lttng-modules-2.12.0/lttng-events.o] Error 1 make[2]: *** Waiting for unfinished jobs.... CC [M] /tmp/B.ni56z2/BUILD/lttng-modules-2.12.0/lttng-modules-2.12.0/lttng-context-pid.o CC [M] /tmp/B.ni56z2/BUILD/lttng-modules-2.12.0/lttng-modules-2.12.0/lttng-context-procname.o CC [M] /tmp/B.ni56z2/BUILD/lttng-modules-2.12.0/lttng-modules-2.12.0/probes/lttng-probe-irq.o CC [M] /tmp/B.ni56z2/BUILD/lttng-modules-2.12.0/lttng-modules-2.12.0/lttng-context-prio.o CC [M] /tmp/B.ni56z2/BUILD/lttng-modules-2.12.0/lttng-modules-2.12.0/lib/ringbuffer/ring_buffer_frontend.o CC [M] /tmp/B.ni56z2/BUILD/lttng-modules-2.12.0/lttng-modules-2.12.0/lttng-context-vpid.o CC [M] /tmp/B.ni56z2/BUILD/lttng-modules-2.12.0/lttng-modules-2.12.0/lttng-context-nice.o CC [M] /tmp/B.ni56z2/BUILD/lttng-modules-2.12.0/lttng-modules-2.12.0/lib/ringbuffer/ring_buffer_iterator.o CC [M] /tmp/B.ni56z2/BUILD/lttng-modules-2.12.0/lttng-modules-2.12.0/probes/lttng-probe-timer.o CC [M] /tmp/B.ni56z2/BUILD/lttng-modules-2.12.0/lttng-modules-2.12.0/probes/lttng-probe-kmem.o CC [M] /tmp/B.ni56z2/BUILD/lttng-modules-2.12.0/lttng-modules-2.12.0/probes/lttng-probe-module.o CC [M] /tmp/B.ni56z2/BUILD/lttng-modules-2.12.0/lttng-modules-2.12.0/probes/lttng-probe-9p.o CC [M] /tmp/B.ni56z2/BUILD/lttng-modules-2.12.0/lttng-modules-2.12.0/probes/lttng-probe-power.o CC [M] /tmp/B.ni56z2/BUILD/lttng-modules-2.12.0/lttng-modules-2.12.0/lib/ringbuffer/ring_buffer_vfs.o CC [M] /tmp/B.ni56z2/BUILD/lttng-modules-2.12.0/lttng-modules-2.12.0/probes/lttng-probe-i2c.o CC [M] /tmp/B.ni56z2/BUILD/lttng-modules-2.12.0/lttng-modules-2.12.0/lib/ringbuffer/ring_buffer_splice.o CC [M] /tmp/B.ni56z2/BUILD/lttng-modules-2.12.0/lttng-modules-2.12.0/lib/prio_heap/lttng_prio_heap.o CC [M] /tmp/B.ni56z2/BUILD/lttng-modules-2.12.0/lttng-modules-2.12.0/lib/../wrapper/splice.o CC [M] /tmp/B.ni56z2/BUILD/lttng-modules-2.12.0/lttng-modules-2.12.0/probes/lttng-probe-x86-irq-vectors.o CC [M] /tmp/B.ni56z2/BUILD/lttng-modules-2.12.0/lttng-modules-2.12.0/lib/ringbuffer/ring_buffer_mmap.o LD [M] /tmp/B.ni56z2/BUILD/lttng-modules-2.12.0/lttng-modules-2.12.0/lib/lttng-lib-ring-buffer.o CC [M] /tmp/B.ni56z2/BUILD/lttng-modules-2.12.0/lttng-modules-2.12.0/probes/lttng-probe-kvm-x86-mmu.o CC [M] /tmp/B.ni56z2/BUILD/lttng-modules-2.12.0/lttng-modules-2.12.0/probes/lttng-probe-kvm.o CC [M] /tmp/B.ni56z2/BUILD/lttng-modules-2.12.0/lttng-modules-2.12.0/probes/lttng-probe-statedump.o CC [M] /tmp/B.ni56z2/BUILD/lttng-modules-2.12.0/lttng-modules-2.12.0/probes/lttng-probe-kvm-x86.o In file included from /tmp/B.ni56z2/BUILD/lttng-modules-2.12.0/lttng-modules-2.12.0/probes/../probes/define_trace.h:87, from /tmp/B.ni56z2/BUILD/lttng-modules-2.12.0/lttng-modules-2.12.0/probes/../instrumentation/events/lttng-module/arch/x86/kvm/trace.h:524, from /tmp/B.ni56z2/BUILD/lttng-modules-2.12.0/lttng-modules-2.12.0/probes/lttng-probe-kvm-x86.c:36: /tmp/B.ni56z2/BUILD/lttng-modules-2.12.0/lttng-modules-2.12.0/probes/../instrumentation/events/lttng-module/arch/x86/kvm/trace.h: In function '__event_prepare_filter_stack__kvm_x86_emulate_insn': /tmp/B.ni56z2/BUILD/lttng-modules-2.12.0/lttng-modules-2.12.0/probes/../instrumentation/events/lttng-module/arch/x86/kvm/trace.h:440:50: error: 'vcpu->arch.emulate_ctxt' is a pointer; did you mean to use '->'? 440 | ctf_integer(__u64, rip, vcpu->arch.emulate_ctxt._eip - | ^ /tmp/B.ni56z2/BUILD/lttng-modules-2.12.0/lttng-modules-2.12.0/probes/../probes/lttng-tracepoint-event-impl.h:763:2: note: in definition of macro 'LTTNG_TRACEPOINT_EVENT_CLASS_CODE' 763 | _fields \ | ^~~~~~~ /tmp/B.ni56z2/BUILD/lttng-modules-2.12.0/lttng-modules-2.12.0/probes/../probes/lttng-tracepoint-event-impl.h:105:3: note: in expansion of macro 'PARAMS' 105 | PARAMS(_fields), ) | ^~~~~~ /tmp/B.ni56z2/BUILD/lttng-modules-2.12.0/lttng-modules-2.12.0/probes/../probes/lttng-tracepoint-event-impl.h:39:2: note: in expansion of macro 'LTTNG_TRACEPOINT_EVENT_CLASS' 39 | LTTNG_TRACEPOINT_EVENT_CLASS(map, \ | ^~~~~~~~~~~~~~~~~~~~~~~~~~~~ /tmp/B.ni56z2/BUILD/lttng-modules-2.12.0/lttng-modules-2.12.0/probes/../probes/lttng-tracepoint-event-impl.h:42:9: note: in expansion of macro 'PARAMS' 42 | PARAMS(fields)) \ | ^~~~~~ /tmp/B.ni56z2/BUILD/lttng-modules-2.12.0/lttng-modules-2.12.0/probes/../instrumentation/events/lttng-module/arch/x86/kvm/trace.h:422:1: note: in expansion of macro 'LTTNG_TRACEPOINT_EVENT_MAP' 422 | LTTNG_TRACEPOINT_EVENT_MAP(kvm_emulate_insn, kvm_x86_emulate_insn, | ^~~~~~~~~~~~~~~~~~~~~~~~~~ /tmp/B.ni56z2/BUILD/lttng-modules-2.12.0/lttng-modules-2.12.0/probes/../instrumentation/events/lttng-module/arch/x86/kvm/trace.h:426:2: note: in expansion of macro 'TP_FIELDS' 426 | TP_FIELDS( | ^~~~~~~~~ /tmp/B.ni56z2/BUILD/lttng-modules-2.12.0/lttng-modules-2.12.0/probes/../probes/lttng-tracepoint-event-impl.h:669:2: note: in expansion of macro '_ctf_integer_ext_fetched' 669 | _ctf_integer_ext_fetched(_type, _item, _src, _byte_order, _base, _nowrite) | ^~~~~~~~~~~~~~~~~~~~~~~~ /tmp/B.ni56z2/BUILD/lttng-modules-2.12.0/lttng-modules-2.12.0/probes/../probes/lttng-tracepoint-event-impl.h:686:2: note: in expansion of macro '_ctf_integer_ext_isuser0' 686 | _ctf_integer_ext_isuser##_user(_type, _item, _user_src, _byte_order, _base, _nowrite) | ^~~~~~~~~~~~~~~~~~~~~~~ /tmp/B.ni56z2/BUILD/lttng-modules-2.12.0/lttng-modules-2.12.0/probes/../probes/lttng-events-write.h:10:2: note: in expansion of macro '_ctf_integer_ext' 10 | _ctf_integer_ext(_type, _item, _src, __BYTE_ORDER, 10, 0, 0) | ^~~~~~~~~~~~~~~~ /tmp/B.ni56z2/BUILD/lttng-modules-2.12.0/lttng-modules-2.12.0/probes/../instrumentation/events/lttng-module/arch/x86/kvm/trace.h:440:3: note: in expansion of macro 'ctf_integer' 440 | ctf_integer(__u64, rip, vcpu->arch.emulate_ctxt._eip - | ^~~~~~~~~~~ /tmp/B.ni56z2/BUILD/lttng-modules-2.12.0/lttng-modules-2.12.0/probes/../instrumentation/events/lttng-module/arch/x86/kvm/trace.h:441:29: error: 'vcpu->arch.emulate_ctxt' is a pointer; did you mean to use '->'? 441 | (vcpu->arch.emulate_ctxt.fetch.ptr - | ^ /tmp/B.ni56z2/BUILD/lttng-modules-2.12.0/lttng-modules-2.12.0/probes/../probes/lttng-tracepoint-event-impl.h:763:2: note: in definition of macro 'LTTNG_TRACEPOINT_EVENT_CLASS_CODE' 763 | _fields \ | ^~~~~~~ /tmp/B.ni56z2/BUILD/lttng-modules-2.12.0/lttng-modules-2.12.0/probes/../probes/lttng-tracepoint-event-impl.h:105:3: note: in expansion of macro 'PARAMS' 105 | PARAMS(_fields), ) | ^~~~~~ /tmp/B.ni56z2/BUILD/lttng-modules-2.12.0/lttng-modules-2.12.0/probes/../probes/lttng-tracepoint-event-impl.h:39:2: note: in expansion of macro 'LTTNG_TRACEPOINT_EVENT_CLASS' 39 | LTTNG_TRACEPOINT_EVENT_CLASS(map, \ | ^~~~~~~~~~~~~~~~~~~~~~~~~~~~ /tmp/B.ni56z2/BUILD/lttng-modules-2.12.0/lttng-modules-2.12.0/probes/../probes/lttng-tracepoint-event-impl.h:42:9: note: in expansion of macro 'PARAMS' 42 | PARAMS(fields)) \ | ^~~~~~ /tmp/B.ni56z2/BUILD/lttng-modules-2.12.0/lttng-modules-2.12.0/probes/../instrumentation/events/lttng-module/arch/x86/kvm/trace.h:422:1: note: in expansion of macro 'LTTNG_TRACEPOINT_EVENT_MAP' 422 | LTTNG_TRACEPOINT_EVENT_MAP(kvm_emulate_insn, kvm_x86_emulate_insn, | ^~~~~~~~~~~~~~~~~~~~~~~~~~ /tmp/B.ni56z2/BUILD/lttng-modules-2.12.0/lttng-modules-2.12.0/probes/../instrumentation/events/lttng-module/arch/x86/kvm/trace.h:426:2: note: in expansion of macro 'TP_FIELDS' 426 | TP_FIELDS( | ^~~~~~~~~ /tmp/B.ni56z2/BUILD/lttng-modules-2.12.0/lttng-modules-2.12.0/probes/../probes/lttng-tracepoint-event-impl.h:669:2: note: in expansion of macro '_ctf_integer_ext_fetched' 669 | _ctf_integer_ext_fetched(_type, _item, _src, _byte_order, _base, _nowrite) | ^~~~~~~~~~~~~~~~~~~~~~~~ /tmp/B.ni56z2/BUILD/lttng-modules-2.12.0/lttng-modules-2.12.0/probes/../probes/lttng-tracepoint-event-impl.h:686:2: note: in expansion of macro '_ctf_integer_ext_isuser0' 686 | _ctf_integer_ext_isuser##_user(_type, _item, _user_src, _byte_order, _base, _nowrite) | ^~~~~~~~~~~~~~~~~~~~~~~ /tmp/B.ni56z2/BUILD/lttng-modules-2.12.0/lttng-modules-2.12.0/probes/../probes/lttng-events-write.h:10:2: note: in expansion of macro '_ctf_integer_ext' 10 | _ctf_integer_ext(_type, _item, _src, __BYTE_ORDER, 10, 0, 0) | ^~~~~~~~~~~~~~~~ /tmp/B.ni56z2/BUILD/lttng-modules-2.12.0/lttng-modules-2.12.0/probes/../instrumentation/events/lttng-module/arch/x86/kvm/trace.h:440:3: note: in expansion of macro 'ctf_integer' 440 | ctf_integer(__u64, rip, vcpu->arch.emulate_ctxt._eip - | ^~~~~~~~~~~ /tmp/B.ni56z2/BUILD/lttng-modules-2.12.0/lttng-modules-2.12.0/probes/../instrumentation/events/lttng-module/arch/x86/kvm/trace.h:442:29: error: 'vcpu->arch.emulate_ctxt' is a pointer; did you mean to use '->'? 442 | vcpu->arch.emulate_ctxt.fetch.data)) | ^ /tmp/B.ni56z2/BUILD/lttng-modules-2.12.0/lttng-modules-2.12.0/probes/../probes/lttng-tracepoint-event-impl.h:763:2: note: in definition of macro 'LTTNG_TRACEPOINT_EVENT_CLASS_CODE' 763 | _fields \ | ^~~~~~~ /tmp/B.ni56z2/BUILD/lttng-modules-2.12.0/lttng-modules-2.12.0/probes/../probes/lttng-tracepoint-event-impl.h:105:3: note: in expansion of macro 'PARAMS' 105 | PARAMS(_fields), ) | ^~~~~~ /tmp/B.ni56z2/BUILD/lttng-modules-2.12.0/lttng-modules-2.12.0/probes/../probes/lttng-tracepoint-event-impl.h:39:2: note: in expansion of macro 'LTTNG_TRACEPOINT_EVENT_CLASS' 39 | LTTNG_TRACEPOINT_EVENT_CLASS(map, \ | ^~~~~~~~~~~~~~~~~~~~~~~~~~~~ /tmp/B.ni56z2/BUILD/lttng-modules-2.12.0/lttng-modules-2.12.0/probes/../probes/lttng-tracepoint-event-impl.h:42:9: note: in expansion of macro 'PARAMS' 42 | PARAMS(fields)) \ | ^~~~~~ /tmp/B.ni56z2/BUILD/lttng-modules-2.12.0/lttng-modules-2.12.0/probes/../instrumentation/events/lttng-module/arch/x86/kvm/trace.h:422:1: note: in expansion of macro 'LTTNG_TRACEPOINT_EVENT_MAP' 422 | LTTNG_TRACEPOINT_EVENT_MAP(kvm_emulate_insn, kvm_x86_emulate_insn, | ^~~~~~~~~~~~~~~~~~~~~~~~~~ /tmp/B.ni56z2/BUILD/lttng-modules-2.12.0/lttng-modules-2.12.0/probes/../instrumentation/events/lttng-module/arch/x86/kvm/trace.h:426:2: note: in expansion of macro 'TP_FIELDS' 426 | TP_FIELDS( | ^~~~~~~~~ /tmp/B.ni56z2/BUILD/lttng-modules-2.12.0/lttng-modules-2.12.0/probes/../probes/lttng-tracepoint-event-impl.h:669:2: note: in expansion of macro '_ctf_integer_ext_fetched' 669 | _ctf_integer_ext_fetched(_type, _item, _src, _byte_order, _base, _nowrite) | ^~~~~~~~~~~~~~~~~~~~~~~~ /tmp/B.ni56z2/BUILD/lttng-modules-2.12.0/lttng-modules-2.12.0/probes/../probes/lttng-tracepoint-event-impl.h:686:2: note: in expansion of macro '_ctf_integer_ext_isuser0' 686 | _ctf_integer_ext_isuser##_user(_type, _item, _user_src, _byte_order, _base, _nowrite) | ^~~~~~~~~~~~~~~~~~~~~~~ /tmp/B.ni56z2/BUILD/lttng-modules-2.12.0/lttng-modules-2.12.0/probes/../probes/lttng-events-write.h:10:2: note: in expansion of macro '_ctf_integer_ext' 10 | _ctf_integer_ext(_type, _item, _src, __BYTE_ORDER, 10, 0, 0) | ^~~~~~~~~~~~~~~~ /tmp/B.ni56z2/BUILD/lttng-modules-2.12.0/lttng-modules-2.12.0/probes/../instrumentation/events/lttng-module/arch/x86/kvm/trace.h:440:3: note: in expansion of macro 'ctf_integer' 440 | ctf_integer(__u64, rip, vcpu->arch.emulate_ctxt._eip - | ^~~~~~~~~~~ /tmp/B.ni56z2/BUILD/lttng-modules-2.12.0/lttng-modules-2.12.0/probes/../instrumentation/events/lttng-module/arch/x86/kvm/trace.h:440:50: error: 'vcpu->arch.emulate_ctxt' is a pointer; did you mean to use '->'? 440 | ctf_integer(__u64, rip, vcpu->arch.emulate_ctxt._eip - | ^ /tmp/B.ni56z2/BUILD/lttng-modules-2.12.0/lttng-modules-2.12.0/probes/../probes/lttng-tracepoint-event-impl.h:763:2: note: in definition of macro 'LTTNG_TRACEPOINT_EVENT_CLASS_CODE' 763 | _fields \ | ^~~~~~~ /tmp/B.ni56z2/BUILD/lttng-modules-2.12.0/lttng-modules-2.12.0/probes/../probes/lttng-tracepoint-event-impl.h:105:3: note: in expansion of macro 'PARAMS' 105 | PARAMS(_fields), ) | ^~~~~~ /tmp/B.ni56z2/BUILD/lttng-modules-2.12.0/lttng-modules-2.12.0/probes/../probes/lttng-tracepoint-event-impl.h:39:2: note: in expansion of macro 'LTTNG_TRACEPOINT_EVENT_CLASS' 39 | LTTNG_TRACEPOINT_EVENT_CLASS(map, \ | ^~~~~~~~~~~~~~~~~~~~~~~~~~~~ /tmp/B.ni56z2/BUILD/lttng-modules-2.12.0/lttng-modules-2.12.0/probes/../probes/lttng-tracepoint-event-impl.h:42:9: note: in expansion of macro 'PARAMS' 42 | PARAMS(fields)) \ | ^~~~~~ /tmp/B.ni56z2/BUILD/lttng-modules-2.12.0/lttng-modules-2.12.0/probes/../instrumentation/events/lttng-module/arch/x86/kvm/trace.h:422:1: note: in expansion of macro 'LTTNG_TRACEPOINT_EVENT_MAP' 422 | LTTNG_TRACEPOINT_EVENT_MAP(kvm_emulate_insn, kvm_x86_emulate_insn, | ^~~~~~~~~~~~~~~~~~~~~~~~~~ /tmp/B.ni56z2/BUILD/lttng-modules-2.12.0/lttng-modules-2.12.0/probes/../instrumentation/events/lttng-module/arch/x86/kvm/trace.h:426:2: note: in expansion of macro 'TP_FIELDS' 426 | TP_FIELDS( | ^~~~~~~~~ /tmp/B.ni56z2/BUILD/lttng-modules-2.12.0/lttng-modules-2.12.0/probes/../probes/lttng-tracepoint-event-impl.h:669:2: note: in expansion of macro '_ctf_integer_ext_fetched' 669 | _ctf_integer_ext_fetched(_type, _item, _src, _byte_order, _base, _nowrite) | ^~~~~~~~~~~~~~~~~~~~~~~~ /tmp/B.ni56z2/BUILD/lttng-modules-2.12.0/lttng-modules-2.12.0/probes/../probes/lttng-tracepoint-event-impl.h:686:2: note: in expansion of macro '_ctf_integer_ext_isuser0' 686 | _ctf_integer_ext_isuser##_user(_type, _item, _user_src, _byte_order, _base, _nowrite) | ^~~~~~~~~~~~~~~~~~~~~~~ /tmp/B.ni56z2/BUILD/lttng-modules-2.12.0/lttng-modules-2.12.0/probes/../probes/lttng-events-write.h:10:2: note: in expansion of macro '_ctf_integer_ext' 10 | _ctf_integer_ext(_type, _item, _src, __BYTE_ORDER, 10, 0, 0) | ^~~~~~~~~~~~~~~~ /tmp/B.ni56z2/BUILD/lttng-modules-2.12.0/lttng-modules-2.12.0/probes/../instrumentation/events/lttng-module/arch/x86/kvm/trace.h:440:3: note: in expansion of macro 'ctf_integer' 440 | ctf_integer(__u64, rip, vcpu->arch.emulate_ctxt._eip - | ^~~~~~~~~~~ /tmp/B.ni56z2/BUILD/lttng-modules-2.12.0/lttng-modules-2.12.0/probes/../instrumentation/events/lttng-module/arch/x86/kvm/trace.h:441:29: error: 'vcpu->arch.emulate_ctxt' is a pointer; did you mean to use '->'? 441 | (vcpu->arch.emulate_ctxt.fetch.ptr - | ^ /tmp/B.ni56z2/BUILD/lttng-modules-2.12.0/lttng-modules-2.12.0/probes/../probes/lttng-tracepoint-event-impl.h:763:2: note: in definition of macro 'LTTNG_TRACEPOINT_EVENT_CLASS_CODE' 763 | _fields \ | ^~~~~~~ /tmp/B.ni56z2/BUILD/lttng-modules-2.12.0/lttng-modules-2.12.0/probes/../probes/lttng-tracepoint-event-impl.h:105:3: note: in expansion of macro 'PARAMS' 105 | PARAMS(_fields), ) | ^~~~~~ /tmp/B.ni56z2/BUILD/lttng-modules-2.12.0/lttng-modules-2.12.0/probes/../probes/lttng-tracepoint-event-impl.h:39:2: note: in expansion of macro 'LTTNG_TRACEPOINT_EVENT_CLASS' 39 | LTTNG_TRACEPOINT_EVENT_CLASS(map, \ | ^~~~~~~~~~~~~~~~~~~~~~~~~~~~ /tmp/B.ni56z2/BUILD/lttng-modules-2.12.0/lttng-modules-2.12.0/probes/../probes/lttng-tracepoint-event-impl.h:42:9: note: in expansion of macro 'PARAMS' 42 | PARAMS(fields)) \ | ^~~~~~ /tmp/B.ni56z2/BUILD/lttng-modules-2.12.0/lttng-modules-2.12.0/probes/../instrumentation/events/lttng-module/arch/x86/kvm/trace.h:422:1: note: in expansion of macro 'LTTNG_TRACEPOINT_EVENT_MAP' 422 | LTTNG_TRACEPOINT_EVENT_MAP(kvm_emulate_insn, kvm_x86_emulate_insn, | ^~~~~~~~~~~~~~~~~~~~~~~~~~ /tmp/B.ni56z2/BUILD/lttng-modules-2.12.0/lttng-modules-2.12.0/probes/../instrumentation/events/lttng-module/arch/x86/kvm/trace.h:426:2: note: in expansion of macro 'TP_FIELDS' 426 | TP_FIELDS( | ^~~~~~~~~ /tmp/B.ni56z2/BUILD/lttng-modules-2.12.0/lttng-modules-2.12.0/probes/../probes/lttng-tracepoint-event-impl.h:669:2: note: in expansion of macro '_ctf_integer_ext_fetched' 669 | _ctf_integer_ext_fetched(_type, _item, _src, _byte_order, _base, _nowrite) | ^~~~~~~~~~~~~~~~~~~~~~~~ /tmp/B.ni56z2/BUILD/lttng-modules-2.12.0/lttng-modules-2.12.0/probes/../probes/lttng-tracepoint-event-impl.h:686:2: note: in expansion of macro '_ctf_integer_ext_isuser0' 686 | _ctf_integer_ext_isuser##_user(_type, _item, _user_src, _byte_order, _base, _nowrite) | ^~~~~~~~~~~~~~~~~~~~~~~ /tmp/B.ni56z2/BUILD/lttng-modules-2.12.0/lttng-modules-2.12.0/probes/../probes/lttng-events-write.h:10:2: note: in expansion of macro '_ctf_integer_ext' 10 | _ctf_integer_ext(_type, _item, _src, __BYTE_ORDER, 10, 0, 0) | ^~~~~~~~~~~~~~~~ /tmp/B.ni56z2/BUILD/lttng-modules-2.12.0/lttng-modules-2.12.0/probes/../instrumentation/events/lttng-module/arch/x86/kvm/trace.h:440:3: note: in expansion of macro 'ctf_integer' 440 | ctf_integer(__u64, rip, vcpu->arch.emulate_ctxt._eip - | ^~~~~~~~~~~ /tmp/B.ni56z2/BUILD/lttng-modules-2.12.0/lttng-modules-2.12.0/probes/../instrumentation/events/lttng-module/arch/x86/kvm/trace.h:442:29: error: 'vcpu->arch.emulate_ctxt' is a pointer; did you mean to use '->'? 442 | vcpu->arch.emulate_ctxt.fetch.data)) | ^ /tmp/B.ni56z2/BUILD/lttng-modules-2.12.0/lttng-modules-2.12.0/probes/../probes/lttng-tracepoint-event-impl.h:763:2: note: in definition of macro 'LTTNG_TRACEPOINT_EVENT_CLASS_CODE' 763 | _fields \ | ^~~~~~~ /tmp/B.ni56z2/BUILD/lttng-modules-2.12.0/lttng-modules-2.12.0/probes/../probes/lttng-tracepoint-event-impl.h:105:3: note: in expansion of macro 'PARAMS' 105 | PARAMS(_fields), ) | ^~~~~~ /tmp/B.ni56z2/BUILD/lttng-modules-2.12.0/lttng-modules-2.12.0/probes/../probes/lttng-tracepoint-event-impl.h:39:2: note: in expansion of macro 'LTTNG_TRACEPOINT_EVENT_CLASS' 39 | LTTNG_TRACEPOINT_EVENT_CLASS(map, \ | ^~~~~~~~~~~~~~~~~~~~~~~~~~~~ /tmp/B.ni56z2/BUILD/lttng-modules-2.12.0/lttng-modules-2.12.0/probes/../probes/lttng-tracepoint-event-impl.h:42:9: note: in expansion of macro 'PARAMS' 42 | PARAMS(fields)) \ | ^~~~~~ /tmp/B.ni56z2/BUILD/lttng-modules-2.12.0/lttng-modules-2.12.0/probes/../instrumentation/events/lttng-module/arch/x86/kvm/trace.h:422:1: note: in expansion of macro 'LTTNG_TRACEPOINT_EVENT_MAP' 422 | LTTNG_TRACEPOINT_EVENT_MAP(kvm_emulate_insn, kvm_x86_emulate_insn, | ^~~~~~~~~~~~~~~~~~~~~~~~~~ /tmp/B.ni56z2/BUILD/lttng-modules-2.12.0/lttng-modules-2.12.0/probes/../instrumentation/events/lttng-module/arch/x86/kvm/trace.h:426:2: note: in expansion of macro 'TP_FIELDS' 426 | TP_FIELDS( | ^~~~~~~~~ /tmp/B.ni56z2/BUILD/lttng-modules-2.12.0/lttng-modules-2.12.0/probes/../probes/lttng-tracepoint-event-impl.h:669:2: note: in expansion of macro '_ctf_integer_ext_fetched' 669 | _ctf_integer_ext_fetched(_type, _item, _src, _byte_order, _base, _nowrite) | ^~~~~~~~~~~~~~~~~~~~~~~~ /tmp/B.ni56z2/BUILD/lttng-modules-2.12.0/lttng-modules-2.12.0/probes/../probes/lttng-tracepoint-event-impl.h:686:2: note: in expansion of macro '_ctf_integer_ext_isuser0' 686 | _ctf_integer_ext_isuser##_user(_type, _item, _user_src, _byte_order, _base, _nowrite) | ^~~~~~~~~~~~~~~~~~~~~~~ /tmp/B.ni56z2/BUILD/lttng-modules-2.12.0/lttng-modules-2.12.0/probes/../probes/lttng-events-write.h:10:2: note: in expansion of macro '_ctf_integer_ext' 10 | _ctf_integer_ext(_type, _item, _src, __BYTE_ORDER, 10, 0, 0) | ^~~~~~~~~~~~~~~~ /tmp/B.ni56z2/BUILD/lttng-modules-2.12.0/lttng-modules-2.12.0/probes/../instrumentation/events/lttng-module/arch/x86/kvm/trace.h:440:3: note: in expansion of macro 'ctf_integer' 440 | ctf_integer(__u64, rip, vcpu->arch.emulate_ctxt._eip - | ^~~~~~~~~~~ /tmp/B.ni56z2/BUILD/lttng-modules-2.12.0/lttng-modules-2.12.0/probes/../instrumentation/events/lttng-module/arch/x86/kvm/trace.h:440:50: error: 'vcpu->arch.emulate_ctxt' is a pointer; did you mean to use '->'? 440 | ctf_integer(__u64, rip, vcpu->arch.emulate_ctxt._eip - | ^ /tmp/B.ni56z2/BUILD/lttng-modules-2.12.0/lttng-modules-2.12.0/probes/../probes/lttng-tracepoint-event-impl.h:763:2: note: in definition of macro 'LTTNG_TRACEPOINT_EVENT_CLASS_CODE' 763 | _fields \ | ^~~~~~~ /tmp/B.ni56z2/BUILD/lttng-modules-2.12.0/lttng-modules-2.12.0/probes/../probes/lttng-tracepoint-event-impl.h:105:3: note: in expansion of macro 'PARAMS' 105 | PARAMS(_fields), ) | ^~~~~~ /tmp/B.ni56z2/BUILD/lttng-modules-2.12.0/lttng-modules-2.12.0/probes/../probes/lttng-tracepoint-event-impl.h:39:2: note: in expansion of macro 'LTTNG_TRACEPOINT_EVENT_CLASS' 39 | LTTNG_TRACEPOINT_EVENT_CLASS(map, \ | ^~~~~~~~~~~~~~~~~~~~~~~~~~~~ /tmp/B.ni56z2/BUILD/lttng-modules-2.12.0/lttng-modules-2.12.0/probes/../probes/lttng-tracepoint-event-impl.h:42:9: note: in expansion of macro 'PARAMS' 42 | PARAMS(fields)) \ | ^~~~~~ /tmp/B.ni56z2/BUILD/lttng-modules-2.12.0/lttng-modules-2.12.0/probes/../instrumentation/events/lttng-module/arch/x86/kvm/trace.h:422:1: note: in expansion of macro 'LTTNG_TRACEPOINT_EVENT_MAP' 422 | LTTNG_TRACEPOINT_EVENT_MAP(kvm_emulate_insn, kvm_x86_emulate_insn, | ^~~~~~~~~~~~~~~~~~~~~~~~~~ /tmp/B.ni56z2/BUILD/lttng-modules-2.12.0/lttng-modules-2.12.0/probes/../instrumentation/events/lttng-module/arch/x86/kvm/trace.h:426:2: note: in expansion of macro 'TP_FIELDS' 426 | TP_FIELDS( | ^~~~~~~~~ /tmp/B.ni56z2/BUILD/lttng-modules-2.12.0/lttng-modules-2.12.0/probes/../probes/lttng-tracepoint-event-impl.h:669:2: note: in expansion of macro '_ctf_integer_ext_fetched' 669 | _ctf_integer_ext_fetched(_type, _item, _src, _byte_order, _base, _nowrite) | ^~~~~~~~~~~~~~~~~~~~~~~~ /tmp/B.ni56z2/BUILD/lttng-modules-2.12.0/lttng-modules-2.12.0/probes/../probes/lttng-tracepoint-event-impl.h:686:2: note: in expansion of macro '_ctf_integer_ext_isuser0' 686 | _ctf_integer_ext_isuser##_user(_type, _item, _user_src, _byte_order, _base, _nowrite) | ^~~~~~~~~~~~~~~~~~~~~~~ /tmp/B.ni56z2/BUILD/lttng-modules-2.12.0/lttng-modules-2.12.0/probes/../probes/lttng-events-write.h:10:2: note: in expansion of macro '_ctf_integer_ext' 10 | _ctf_integer_ext(_type, _item, _src, __BYTE_ORDER, 10, 0, 0) | ^~~~~~~~~~~~~~~~ /tmp/B.ni56z2/BUILD/lttng-modules-2.12.0/lttng-modules-2.12.0/probes/../instrumentation/events/lttng-module/arch/x86/kvm/trace.h:440:3: note: in expansion of macro 'ctf_integer' 440 | ctf_integer(__u64, rip, vcpu->arch.emulate_ctxt._eip - | ^~~~~~~~~~~ /tmp/B.ni56z2/BUILD/lttng-modules-2.12.0/lttng-modules-2.12.0/probes/../instrumentation/events/lttng-module/arch/x86/kvm/trace.h:441:29: error: 'vcpu->arch.emulate_ctxt' is a pointer; did you mean to use '->'? 441 | (vcpu->arch.emulate_ctxt.fetch.ptr - | ^ /tmp/B.ni56z2/BUILD/lttng-modules-2.12.0/lttng-modules-2.12.0/probes/../probes/lttng-tracepoint-event-impl.h:763:2: note: in definition of macro 'LTTNG_TRACEPOINT_EVENT_CLASS_CODE' 763 | _fields \ | ^~~~~~~ /tmp/B.ni56z2/BUILD/lttng-modules-2.12.0/lttng-modules-2.12.0/probes/../probes/lttng-tracepoint-event-impl.h:105:3: note: in expansion of macro 'PARAMS' 105 | PARAMS(_fields), ) | ^~~~~~ /tmp/B.ni56z2/BUILD/lttng-modules-2.12.0/lttng-modules-2.12.0/probes/../probes/lttng-tracepoint-event-impl.h:39:2: note: in expansion of macro 'LTTNG_TRACEPOINT_EVENT_CLASS' 39 | LTTNG_TRACEPOINT_EVENT_CLASS(map, \ | ^~~~~~~~~~~~~~~~~~~~~~~~~~~~ /tmp/B.ni56z2/BUILD/lttng-modules-2.12.0/lttng-modules-2.12.0/probes/../probes/lttng-tracepoint-event-impl.h:42:9: note: in expansion of macro 'PARAMS' 42 | PARAMS(fields)) \ | ^~~~~~ /tmp/B.ni56z2/BUILD/lttng-modules-2.12.0/lttng-modules-2.12.0/probes/../instrumentation/events/lttng-module/arch/x86/kvm/trace.h:422:1: note: in expansion of macro 'LTTNG_TRACEPOINT_EVENT_MAP' 422 | LTTNG_TRACEPOINT_EVENT_MAP(kvm_emulate_insn, kvm_x86_emulate_insn, | ^~~~~~~~~~~~~~~~~~~~~~~~~~ /tmp/B.ni56z2/BUILD/lttng-modules-2.12.0/lttng-modules-2.12.0/probes/../instrumentation/events/lttng-module/arch/x86/kvm/trace.h:426:2: note: in expansion of macro 'TP_FIELDS' 426 | TP_FIELDS( | ^~~~~~~~~ /tmp/B.ni56z2/BUILD/lttng-modules-2.12.0/lttng-modules-2.12.0/probes/../probes/lttng-tracepoint-event-impl.h:669:2: note: in expansion of macro '_ctf_integer_ext_fetched' 669 | _ctf_integer_ext_fetched(_type, _item, _src, _byte_order, _base, _nowrite) | ^~~~~~~~~~~~~~~~~~~~~~~~ /tmp/B.ni56z2/BUILD/lttng-modules-2.12.0/lttng-modules-2.12.0/probes/../probes/lttng-tracepoint-event-impl.h:686:2: note: in expansion of macro '_ctf_integer_ext_isuser0' 686 | _ctf_integer_ext_isuser##_user(_type, _item, _user_src, _byte_order, _base, _nowrite) | ^~~~~~~~~~~~~~~~~~~~~~~ /tmp/B.ni56z2/BUILD/lttng-modules-2.12.0/lttng-modules-2.12.0/probes/../probes/lttng-events-write.h:10:2: note: in expansion of macro '_ctf_integer_ext' 10 | _ctf_integer_ext(_type, _item, _src, __BYTE_ORDER, 10, 0, 0) | ^~~~~~~~~~~~~~~~ /tmp/B.ni56z2/BUILD/lttng-modules-2.12.0/lttng-modules-2.12.0/probes/../instrumentation/events/lttng-module/arch/x86/kvm/trace.h:440:3: note: in expansion of macro 'ctf_integer' 440 | ctf_integer(__u64, rip, vcpu->arch.emulate_ctxt._eip - | ^~~~~~~~~~~ /tmp/B.ni56z2/BUILD/lttng-modules-2.12.0/lttng-modules-2.12.0/probes/../instrumentation/events/lttng-module/arch/x86/kvm/trace.h:442:29: error: 'vcpu->arch.emulate_ctxt' is a pointer; did you mean to use '->'? 442 | vcpu->arch.emulate_ctxt.fetch.data)) | ^ /tmp/B.ni56z2/BUILD/lttng-modules-2.12.0/lttng-modules-2.12.0/probes/../probes/lttng-tracepoint-event-impl.h:763:2: note: in definition of macro 'LTTNG_TRACEPOINT_EVENT_CLASS_CODE' 763 | _fields \ | ^~~~~~~ /tmp/B.ni56z2/BUILD/lttng-modules-2.12.0/lttng-modules-2.12.0/probes/../probes/lttng-tracepoint-event-impl.h:105:3: note: in expansion of macro 'PARAMS' 105 | PARAMS(_fields), ) | ^~~~~~ /tmp/B.ni56z2/BUILD/lttng-modules-2.12.0/lttng-modules-2.12.0/probes/../probes/lttng-tracepoint-event-impl.h:39:2: note: in expansion of macro 'LTTNG_TRACEPOINT_EVENT_CLASS' 39 | LTTNG_TRACEPOINT_EVENT_CLASS(map, \ | ^~~~~~~~~~~~~~~~~~~~~~~~~~~~ /tmp/B.ni56z2/BUILD/lttng-modules-2.12.0/lttng-modules-2.12.0/probes/../probes/lttng-tracepoint-event-impl.h:42:9: note: in expansion of macro 'PARAMS' 42 | PARAMS(fields)) \ | ^~~~~~ /tmp/B.ni56z2/BUILD/lttng-modules-2.12.0/lttng-modules-2.12.0/probes/../instrumentation/events/lttng-module/arch/x86/kvm/trace.h:422:1: note: in expansion of macro 'LTTNG_TRACEPOINT_EVENT_MAP' 422 | LTTNG_TRACEPOINT_EVENT_MAP(kvm_emulate_insn, kvm_x86_emulate_insn, | ^~~~~~~~~~~~~~~~~~~~~~~~~~ /tmp/B.ni56z2/BUILD/lttng-modules-2.12.0/lttng-modules-2.12.0/probes/../instrumentation/events/lttng-module/arch/x86/kvm/trace.h:426:2: note: in expansion of macro 'TP_FIELDS' 426 | TP_FIELDS( | ^~~~~~~~~ /tmp/B.ni56z2/BUILD/lttng-modules-2.12.0/lttng-modules-2.12.0/probes/../probes/lttng-tracepoint-event-impl.h:669:2: note: in expansion of macro '_ctf_integer_ext_fetched' 669 | _ctf_integer_ext_fetched(_type, _item, _src, _byte_order, _base, _nowrite) | ^~~~~~~~~~~~~~~~~~~~~~~~ /tmp/B.ni56z2/BUILD/lttng-modules-2.12.0/lttng-modules-2.12.0/probes/../probes/lttng-tracepoint-event-impl.h:686:2: note: in expansion of macro '_ctf_integer_ext_isuser0' 686 | _ctf_integer_ext_isuser##_user(_type, _item, _user_src, _byte_order, _base, _nowrite) | ^~~~~~~~~~~~~~~~~~~~~~~ /tmp/B.ni56z2/BUILD/lttng-modules-2.12.0/lttng-modules-2.12.0/probes/../probes/lttng-events-write.h:10:2: note: in expansion of macro '_ctf_integer_ext' 10 | _ctf_integer_ext(_type, _item, _src, __BYTE_ORDER, 10, 0, 0) | ^~~~~~~~~~~~~~~~ /tmp/B.ni56z2/BUILD/lttng-modules-2.12.0/lttng-modules-2.12.0/probes/../instrumentation/events/lttng-module/arch/x86/kvm/trace.h:440:3: note: in expansion of macro 'ctf_integer' 440 | ctf_integer(__u64, rip, vcpu->arch.emulate_ctxt._eip - | ^~~~~~~~~~~ /tmp/B.ni56z2/BUILD/lttng-modules-2.12.0/lttng-modules-2.12.0/probes/../instrumentation/events/lttng-module/arch/x86/kvm/trace.h:440:50: error: 'vcpu->arch.emulate_ctxt' is a pointer; did you mean to use '->'? 440 | ctf_integer(__u64, rip, vcpu->arch.emulate_ctxt._eip - | ^ /tmp/B.ni56z2/BUILD/lttng-modules-2.12.0/lttng-modules-2.12.0/probes/../probes/lttng-tracepoint-event-impl.h:763:2: note: in definition of macro 'LTTNG_TRACEPOINT_EVENT_CLASS_CODE' 763 | _fields \ | ^~~~~~~ /tmp/B.ni56z2/BUILD/lttng-modules-2.12.0/lttng-modules-2.12.0/probes/../probes/lttng-tracepoint-event-impl.h:105:3: note: in expansion of macro 'PARAMS' 105 | PARAMS(_fields), ) | ^~~~~~ /tmp/B.ni56z2/BUILD/lttng-modules-2.12.0/lttng-modules-2.12.0/probes/../probes/lttng-tracepoint-event-impl.h:39:2: note: in expansion of macro 'LTTNG_TRACEPOINT_EVENT_CLASS' 39 | LTTNG_TRACEPOINT_EVENT_CLASS(map, \ | ^~~~~~~~~~~~~~~~~~~~~~~~~~~~ /tmp/B.ni56z2/BUILD/lttng-modules-2.12.0/lttng-modules-2.12.0/probes/../probes/lttng-tracepoint-event-impl.h:42:9: note: in expansion of macro 'PARAMS' 42 | PARAMS(fields)) \ | ^~~~~~ /tmp/B.ni56z2/BUILD/lttng-modules-2.12.0/lttng-modules-2.12.0/probes/../instrumentation/events/lttng-module/arch/x86/kvm/trace.h:422:1: note: in expansion of macro 'LTTNG_TRACEPOINT_EVENT_MAP' 422 | LTTNG_TRACEPOINT_EVENT_MAP(kvm_emulate_insn, kvm_x86_emulate_insn, | ^~~~~~~~~~~~~~~~~~~~~~~~~~ /tmp/B.ni56z2/BUILD/lttng-modules-2.12.0/lttng-modules-2.12.0/probes/../instrumentation/events/lttng-module/arch/x86/kvm/trace.h:426:2: note: in expansion of macro 'TP_FIELDS' 426 | TP_FIELDS( | ^~~~~~~~~ /tmp/B.ni56z2/BUILD/lttng-modules-2.12.0/lttng-modules-2.12.0/probes/../probes/lttng-tracepoint-event-impl.h:669:2: note: in expansion of macro '_ctf_integer_ext_fetched' 669 | _ctf_integer_ext_fetched(_type, _item, _src, _byte_order, _base, _nowrite) | ^~~~~~~~~~~~~~~~~~~~~~~~ /tmp/B.ni56z2/BUILD/lttng-modules-2.12.0/lttng-modules-2.12.0/probes/../probes/lttng-tracepoint-event-impl.h:686:2: note: in expansion of macro '_ctf_integer_ext_isuser0' 686 | _ctf_integer_ext_isuser##_user(_type, _item, _user_src, _byte_order, _base, _nowrite) | ^~~~~~~~~~~~~~~~~~~~~~~ /tmp/B.ni56z2/BUILD/lttng-modules-2.12.0/lttng-modules-2.12.0/probes/../probes/lttng-events-write.h:10:2: note: in expansion of macro '_ctf_integer_ext' 10 | _ctf_integer_ext(_type, _item, _src, __BYTE_ORDER, 10, 0, 0) | ^~~~~~~~~~~~~~~~ /tmp/B.ni56z2/BUILD/lttng-modules-2.12.0/lttng-modules-2.12.0/probes/../instrumentation/events/lttng-module/arch/x86/kvm/trace.h:440:3: note: in expansion of macro 'ctf_integer' 440 | ctf_integer(__u64, rip, vcpu->arch.emulate_ctxt._eip - | ^~~~~~~~~~~ /tmp/B.ni56z2/BUILD/lttng-modules-2.12.0/lttng-modules-2.12.0/probes/../instrumentation/events/lttng-module/arch/x86/kvm/trace.h:441:29: error: 'vcpu->arch.emulate_ctxt' is a pointer; did you mean to use '->'? 441 | (vcpu->arch.emulate_ctxt.fetch.ptr - | ^ /tmp/B.ni56z2/BUILD/lttng-modules-2.12.0/lttng-modules-2.12.0/probes/../probes/lttng-tracepoint-event-impl.h:763:2: note: in definition of macro 'LTTNG_TRACEPOINT_EVENT_CLASS_CODE' 763 | _fields \ | ^~~~~~~ /tmp/B.ni56z2/BUILD/lttng-modules-2.12.0/lttng-modules-2.12.0/probes/../probes/lttng-tracepoint-event-impl.h:105:3: note: in expansion of macro 'PARAMS' 105 | PARAMS(_fields), ) | ^~~~~~ /tmp/B.ni56z2/BUILD/lttng-modules-2.12.0/lttng-modules-2.12.0/probes/../probes/lttng-tracepoint-event-impl.h:39:2: note: in expansion of macro 'LTTNG_TRACEPOINT_EVENT_CLASS' 39 | LTTNG_TRACEPOINT_EVENT_CLASS(map, \ | ^~~~~~~~~~~~~~~~~~~~~~~~~~~~ /tmp/B.ni56z2/BUILD/lttng-modules-2.12.0/lttng-modules-2.12.0/probes/../probes/lttng-tracepoint-event-impl.h:42:9: note: in expansion of macro 'PARAMS' 42 | PARAMS(fields)) \ | ^~~~~~ /tmp/B.ni56z2/BUILD/lttng-modules-2.12.0/lttng-modules-2.12.0/probes/../instrumentation/events/lttng-module/arch/x86/kvm/trace.h:422:1: note: in expansion of macro 'LTTNG_TRACEPOINT_EVENT_MAP' 422 | LTTNG_TRACEPOINT_EVENT_MAP(kvm_emulate_insn, kvm_x86_emulate_insn, | ^~~~~~~~~~~~~~~~~~~~~~~~~~ /tmp/B.ni56z2/BUILD/lttng-modules-2.12.0/lttng-modules-2.12.0/probes/../instrumentation/events/lttng-module/arch/x86/kvm/trace.h:426:2: note: in expansion of macro 'TP_FIELDS' 426 | TP_FIELDS( | ^~~~~~~~~ /tmp/B.ni56z2/BUILD/lttng-modules-2.12.0/lttng-modules-2.12.0/probes/../probes/lttng-tracepoint-event-impl.h:669:2: note: in expansion of macro '_ctf_integer_ext_fetched' 669 | _ctf_integer_ext_fetched(_type, _item, _src, _byte_order, _base, _nowrite) | ^~~~~~~~~~~~~~~~~~~~~~~~ /tmp/B.ni56z2/BUILD/lttng-modules-2.12.0/lttng-modules-2.12.0/probes/../probes/lttng-tracepoint-event-impl.h:686:2: note: in expansion of macro '_ctf_integer_ext_isuser0' 686 | _ctf_integer_ext_isuser##_user(_type, _item, _user_src, _byte_order, _base, _nowrite) | ^~~~~~~~~~~~~~~~~~~~~~~ /tmp/B.ni56z2/BUILD/lttng-modules-2.12.0/lttng-modules-2.12.0/probes/../probes/lttng-events-write.h:10:2: note: in expansion of macro '_ctf_integer_ext' 10 | _ctf_integer_ext(_type, _item, _src, __BYTE_ORDER, 10, 0, 0) | ^~~~~~~~~~~~~~~~ /tmp/B.ni56z2/BUILD/lttng-modules-2.12.0/lttng-modules-2.12.0/probes/../instrumentation/events/lttng-module/arch/x86/kvm/trace.h:440:3: note: in expansion of macro 'ctf_integer' 440 | ctf_integer(__u64, rip, vcpu->arch.emulate_ctxt._eip - | ^~~~~~~~~~~ /tmp/B.ni56z2/BUILD/lttng-modules-2.12.0/lttng-modules-2.12.0/probes/../instrumentation/events/lttng-module/arch/x86/kvm/trace.h:442:29: error: 'vcpu->arch.emulate_ctxt' is a pointer; did you mean to use '->'? 442 | vcpu->arch.emulate_ctxt.fetch.data)) | ^ /tmp/B.ni56z2/BUILD/lttng-modules-2.12.0/lttng-modules-2.12.0/probes/../probes/lttng-tracepoint-event-impl.h:763:2: note: in definition of macro 'LTTNG_TRACEPOINT_EVENT_CLASS_CODE' 763 | _fields \ | ^~~~~~~ /tmp/B.ni56z2/BUILD/lttng-modules-2.12.0/lttng-modules-2.12.0/probes/../probes/lttng-tracepoint-event-impl.h:105:3: note: in expansion of macro 'PARAMS' 105 | PARAMS(_fields), ) | ^~~~~~ /tmp/B.ni56z2/BUILD/lttng-modules-2.12.0/lttng-modules-2.12.0/probes/../probes/lttng-tracepoint-event-impl.h:39:2: note: in expansion of macro 'LTTNG_TRACEPOINT_EVENT_CLASS' 39 | LTTNG_TRACEPOINT_EVENT_CLASS(map, \ | ^~~~~~~~~~~~~~~~~~~~~~~~~~~~ /tmp/B.ni56z2/BUILD/lttng-modules-2.12.0/lttng-modules-2.12.0/probes/../probes/lttng-tracepoint-event-impl.h:42:9: note: in expansion of macro 'PARAMS' 42 | PARAMS(fields)) \ | ^~~~~~ /tmp/B.ni56z2/BUILD/lttng-modules-2.12.0/lttng-modules-2.12.0/probes/../instrumentation/events/lttng-module/arch/x86/kvm/trace.h:422:1: note: in expansion of macro 'LTTNG_TRACEPOINT_EVENT_MAP' 422 | LTTNG_TRACEPOINT_EVENT_MAP(kvm_emulate_insn, kvm_x86_emulate_insn, | ^~~~~~~~~~~~~~~~~~~~~~~~~~ /tmp/B.ni56z2/BUILD/lttng-modules-2.12.0/lttng-modules-2.12.0/probes/../instrumentation/events/lttng-module/arch/x86/kvm/trace.h:426:2: note: in expansion of macro 'TP_FIELDS' 426 | TP_FIELDS( | ^~~~~~~~~ /tmp/B.ni56z2/BUILD/lttng-modules-2.12.0/lttng-modules-2.12.0/probes/../probes/lttng-tracepoint-event-impl.h:669:2: note: in expansion of macro '_ctf_integer_ext_fetched' 669 | _ctf_integer_ext_fetched(_type, _item, _src, _byte_order, _base, _nowrite) | ^~~~~~~~~~~~~~~~~~~~~~~~ /tmp/B.ni56z2/BUILD/lttng-modules-2.12.0/lttng-modules-2.12.0/probes/../probes/lttng-tracepoint-event-impl.h:686:2: note: in expansion of macro '_ctf_integer_ext_isuser0' 686 | _ctf_integer_ext_isuser##_user(_type, _item, _user_src, _byte_order, _base, _nowrite) | ^~~~~~~~~~~~~~~~~~~~~~~ /tmp/B.ni56z2/BUILD/lttng-modules-2.12.0/lttng-modules-2.12.0/probes/../probes/lttng-events-write.h:10:2: note: in expansion of macro '_ctf_integer_ext' 10 | _ctf_integer_ext(_type, _item, _src, __BYTE_ORDER, 10, 0, 0) | ^~~~~~~~~~~~~~~~ /tmp/B.ni56z2/BUILD/lttng-modules-2.12.0/lttng-modules-2.12.0/probes/../instrumentation/events/lttng-module/arch/x86/kvm/trace.h:440:3: note: in expansion of macro 'ctf_integer' 440 | ctf_integer(__u64, rip, vcpu->arch.emulate_ctxt._eip - | ^~~~~~~~~~~ /tmp/B.ni56z2/BUILD/lttng-modules-2.12.0/lttng-modules-2.12.0/probes/../instrumentation/events/lttng-module/arch/x86/kvm/trace.h:440:50: error: 'vcpu->arch.emulate_ctxt' is a pointer; did you mean to use '->'? 440 | ctf_integer(__u64, rip, vcpu->arch.emulate_ctxt._eip - | ^ /tmp/B.ni56z2/BUILD/lttng-modules-2.12.0/lttng-modules-2.12.0/probes/../probes/lttng-tracepoint-event-impl.h:763:2: note: in definition of macro 'LTTNG_TRACEPOINT_EVENT_CLASS_CODE' 763 | _fields \ | ^~~~~~~ /tmp/B.ni56z2/BUILD/lttng-modules-2.12.0/lttng-modules-2.12.0/probes/../probes/lttng-tracepoint-event-impl.h:105:3: note: in expansion of macro 'PARAMS' 105 | PARAMS(_fields), ) | ^~~~~~ /tmp/B.ni56z2/BUILD/lttng-modules-2.12.0/lttng-modules-2.12.0/probes/../probes/lttng-tracepoint-event-impl.h:39:2: note: in expansion of macro 'LTTNG_TRACEPOINT_EVENT_CLASS' 39 | LTTNG_TRACEPOINT_EVENT_CLASS(map, \ | ^~~~~~~~~~~~~~~~~~~~~~~~~~~~ /tmp/B.ni56z2/BUILD/lttng-modules-2.12.0/lttng-modules-2.12.0/probes/../probes/lttng-tracepoint-event-impl.h:42:9: note: in expansion of macro 'PARAMS' 42 | PARAMS(fields)) \ | ^~~~~~ /tmp/B.ni56z2/BUILD/lttng-modules-2.12.0/lttng-modules-2.12.0/probes/../instrumentation/events/lttng-module/arch/x86/kvm/trace.h:422:1: note: in expansion of macro 'LTTNG_TRACEPOINT_EVENT_MAP' 422 | LTTNG_TRACEPOINT_EVENT_MAP(kvm_emulate_insn, kvm_x86_emulate_insn, | ^~~~~~~~~~~~~~~~~~~~~~~~~~ /tmp/B.ni56z2/BUILD/lttng-modules-2.12.0/lttng-modules-2.12.0/probes/../instrumentation/events/lttng-module/arch/x86/kvm/trace.h:426:2: note: in expansion of macro 'TP_FIELDS' 426 | TP_FIELDS( | ^~~~~~~~~ /tmp/B.ni56z2/BUILD/lttng-modules-2.12.0/lttng-modules-2.12.0/probes/../probes/lttng-tracepoint-event-impl.h:669:2: note: in expansion of macro '_ctf_integer_ext_fetched' 669 | _ctf_integer_ext_fetched(_type, _item, _src, _byte_order, _base, _nowrite) | ^~~~~~~~~~~~~~~~~~~~~~~~ /tmp/B.ni56z2/BUILD/lttng-modules-2.12.0/lttng-modules-2.12.0/probes/../probes/lttng-tracepoint-event-impl.h:686:2: note: in expansion of macro '_ctf_integer_ext_isuser0' 686 | _ctf_integer_ext_isuser##_user(_type, _item, _user_src, _byte_order, _base, _nowrite) | ^~~~~~~~~~~~~~~~~~~~~~~ /tmp/B.ni56z2/BUILD/lttng-modules-2.12.0/lttng-modules-2.12.0/probes/../probes/lttng-events-write.h:10:2: note: in expansion of macro '_ctf_integer_ext' 10 | _ctf_integer_ext(_type, _item, _src, __BYTE_ORDER, 10, 0, 0) | ^~~~~~~~~~~~~~~~ /tmp/B.ni56z2/BUILD/lttng-modules-2.12.0/lttng-modules-2.12.0/probes/../instrumentation/events/lttng-module/arch/x86/kvm/trace.h:440:3: note: in expansion of macro 'ctf_integer' 440 | ctf_integer(__u64, rip, vcpu->arch.emulate_ctxt._eip - | ^~~~~~~~~~~ /tmp/B.ni56z2/BUILD/lttng-modules-2.12.0/lttng-modules-2.12.0/probes/../instrumentation/events/lttng-module/arch/x86/kvm/trace.h:441:29: error: 'vcpu->arch.emulate_ctxt' is a pointer; did you mean to use '->'? 441 | (vcpu->arch.emulate_ctxt.fetch.ptr - | ^ /tmp/B.ni56z2/BUILD/lttng-modules-2.12.0/lttng-modules-2.12.0/probes/../probes/lttng-tracepoint-event-impl.h:763:2: note: in definition of macro 'LTTNG_TRACEPOINT_EVENT_CLASS_CODE' 763 | _fields \ | ^~~~~~~ /tmp/B.ni56z2/BUILD/lttng-modules-2.12.0/lttng-modules-2.12.0/probes/../probes/lttng-tracepoint-event-impl.h:105:3: note: in expansion of macro 'PARAMS' 105 | PARAMS(_fields), ) | ^~~~~~ /tmp/B.ni56z2/BUILD/lttng-modules-2.12.0/lttng-modules-2.12.0/probes/../probes/lttng-tracepoint-event-impl.h:39:2: note: in expansion of macro 'LTTNG_TRACEPOINT_EVENT_CLASS' 39 | LTTNG_TRACEPOINT_EVENT_CLASS(map, \ | ^~~~~~~~~~~~~~~~~~~~~~~~~~~~ /tmp/B.ni56z2/BUILD/lttng-modules-2.12.0/lttng-modules-2.12.0/probes/../probes/lttng-tracepoint-event-impl.h:42:9: note: in expansion of macro 'PARAMS' 42 | PARAMS(fields)) \ | ^~~~~~ /tmp/B.ni56z2/BUILD/lttng-modules-2.12.0/lttng-modules-2.12.0/probes/../instrumentation/events/lttng-module/arch/x86/kvm/trace.h:422:1: note: in expansion of macro 'LTTNG_TRACEPOINT_EVENT_MAP' 422 | LTTNG_TRACEPOINT_EVENT_MAP(kvm_emulate_insn, kvm_x86_emulate_insn, | ^~~~~~~~~~~~~~~~~~~~~~~~~~ /tmp/B.ni56z2/BUILD/lttng-modules-2.12.0/lttng-modules-2.12.0/probes/../instrumentation/events/lttng-module/arch/x86/kvm/trace.h:426:2: note: in expansion of macro 'TP_FIELDS' 426 | TP_FIELDS( | ^~~~~~~~~ /tmp/B.ni56z2/BUILD/lttng-modules-2.12.0/lttng-modules-2.12.0/probes/../probes/lttng-tracepoint-event-impl.h:669:2: note: in expansion of macro '_ctf_integer_ext_fetched' 669 | _ctf_integer_ext_fetched(_type, _item, _src, _byte_order, _base, _nowrite) | ^~~~~~~~~~~~~~~~~~~~~~~~ /tmp/B.ni56z2/BUILD/lttng-modules-2.12.0/lttng-modules-2.12.0/probes/../probes/lttng-tracepoint-event-impl.h:686:2: note: in expansion of macro '_ctf_integer_ext_isuser0' 686 | _ctf_integer_ext_isuser##_user(_type, _item, _user_src, _byte_order, _base, _nowrite) | ^~~~~~~~~~~~~~~~~~~~~~~ /tmp/B.ni56z2/BUILD/lttng-modules-2.12.0/lttng-modules-2.12.0/probes/../probes/lttng-events-write.h:10:2: note: in expansion of macro '_ctf_integer_ext' 10 | _ctf_integer_ext(_type, _item, _src, __BYTE_ORDER, 10, 0, 0) | ^~~~~~~~~~~~~~~~ /tmp/B.ni56z2/BUILD/lttng-modules-2.12.0/lttng-modules-2.12.0/probes/../instrumentation/events/lttng-module/arch/x86/kvm/trace.h:440:3: note: in expansion of macro 'ctf_integer' 440 | ctf_integer(__u64, rip, vcpu->arch.emulate_ctxt._eip - | ^~~~~~~~~~~ /tmp/B.ni56z2/BUILD/lttng-modules-2.12.0/lttng-modules-2.12.0/probes/../instrumentation/events/lttng-module/arch/x86/kvm/trace.h:442:29: error: 'vcpu->arch.emulate_ctxt' is a pointer; did you mean to use '->'? 442 | vcpu->arch.emulate_ctxt.fetch.data)) | ^ /tmp/B.ni56z2/BUILD/lttng-modules-2.12.0/lttng-modules-2.12.0/probes/../probes/lttng-tracepoint-event-impl.h:763:2: note: in definition of macro 'LTTNG_TRACEPOINT_EVENT_CLASS_CODE' 763 | _fields \ | ^~~~~~~ /tmp/B.ni56z2/BUILD/lttng-modules-2.12.0/lttng-modules-2.12.0/probes/../probes/lttng-tracepoint-event-impl.h:105:3: note: in expansion of macro 'PARAMS' 105 | PARAMS(_fields), ) | ^~~~~~ /tmp/B.ni56z2/BUILD/lttng-modules-2.12.0/lttng-modules-2.12.0/probes/../probes/lttng-tracepoint-event-impl.h:39:2: note: in expansion of macro 'LTTNG_TRACEPOINT_EVENT_CLASS' 39 | LTTNG_TRACEPOINT_EVENT_CLASS(map, \ | ^~~~~~~~~~~~~~~~~~~~~~~~~~~~ /tmp/B.ni56z2/BUILD/lttng-modules-2.12.0/lttng-modules-2.12.0/probes/../probes/lttng-tracepoint-event-impl.h:42:9: note: in expansion of macro 'PARAMS' 42 | PARAMS(fields)) \ | ^~~~~~ /tmp/B.ni56z2/BUILD/lttng-modules-2.12.0/lttng-modules-2.12.0/probes/../instrumentation/events/lttng-module/arch/x86/kvm/trace.h:422:1: note: in expansion of macro 'LTTNG_TRACEPOINT_EVENT_MAP' 422 | LTTNG_TRACEPOINT_EVENT_MAP(kvm_emulate_insn, kvm_x86_emulate_insn, | ^~~~~~~~~~~~~~~~~~~~~~~~~~ /tmp/B.ni56z2/BUILD/lttng-modules-2.12.0/lttng-modules-2.12.0/probes/../instrumentation/events/lttng-module/arch/x86/kvm/trace.h:426:2: note: in expansion of macro 'TP_FIELDS' 426 | TP_FIELDS( | ^~~~~~~~~ /tmp/B.ni56z2/BUILD/lttng-modules-2.12.0/lttng-modules-2.12.0/probes/../probes/lttng-tracepoint-event-impl.h:669:2: note: in expansion of macro '_ctf_integer_ext_fetched' 669 | _ctf_integer_ext_fetched(_type, _item, _src, _byte_order, _base, _nowrite) | ^~~~~~~~~~~~~~~~~~~~~~~~ /tmp/B.ni56z2/BUILD/lttng-modules-2.12.0/lttng-modules-2.12.0/probes/../probes/lttng-tracepoint-event-impl.h:686:2: note: in expansion of macro '_ctf_integer_ext_isuser0' 686 | _ctf_integer_ext_isuser##_user(_type, _item, _user_src, _byte_order, _base, _nowrite) | ^~~~~~~~~~~~~~~~~~~~~~~ /tmp/B.ni56z2/BUILD/lttng-modules-2.12.0/lttng-modules-2.12.0/probes/../probes/lttng-events-write.h:10:2: note: in expansion of macro '_ctf_integer_ext' 10 | _ctf_integer_ext(_type, _item, _src, __BYTE_ORDER, 10, 0, 0) | ^~~~~~~~~~~~~~~~ /tmp/B.ni56z2/BUILD/lttng-modules-2.12.0/lttng-modules-2.12.0/probes/../instrumentation/events/lttng-module/arch/x86/kvm/trace.h:440:3: note: in expansion of macro 'ctf_integer' 440 | ctf_integer(__u64, rip, vcpu->arch.emulate_ctxt._eip - | ^~~~~~~~~~~ /tmp/B.ni56z2/BUILD/lttng-modules-2.12.0/lttng-modules-2.12.0/probes/../instrumentation/events/lttng-module/arch/x86/kvm/trace.h:440:50: error: 'vcpu->arch.emulate_ctxt' is a pointer; did you mean to use '->'? 440 | ctf_integer(__u64, rip, vcpu->arch.emulate_ctxt._eip - | ^ /tmp/B.ni56z2/BUILD/lttng-modules-2.12.0/lttng-modules-2.12.0/probes/../probes/lttng-tracepoint-event-impl.h:763:2: note: in definition of macro 'LTTNG_TRACEPOINT_EVENT_CLASS_CODE' 763 | _fields \ | ^~~~~~~ /tmp/B.ni56z2/BUILD/lttng-modules-2.12.0/lttng-modules-2.12.0/probes/../probes/lttng-tracepoint-event-impl.h:105:3: note: in expansion of macro 'PARAMS' 105 | PARAMS(_fields), ) | ^~~~~~ /tmp/B.ni56z2/BUILD/lttng-modules-2.12.0/lttng-modules-2.12.0/probes/../probes/lttng-tracepoint-event-impl.h:39:2: note: in expansion of macro 'LTTNG_TRACEPOINT_EVENT_CLASS' 39 | LTTNG_TRACEPOINT_EVENT_CLASS(map, \ | ^~~~~~~~~~~~~~~~~~~~~~~~~~~~ /tmp/B.ni56z2/BUILD/lttng-modules-2.12.0/lttng-modules-2.12.0/probes/../probes/lttng-tracepoint-event-impl.h:42:9: note: in expansion of macro 'PARAMS' 42 | PARAMS(fields)) \ | ^~~~~~ /tmp/B.ni56z2/BUILD/lttng-modules-2.12.0/lttng-modules-2.12.0/probes/../instrumentation/events/lttng-module/arch/x86/kvm/trace.h:422:1: note: in expansion of macro 'LTTNG_TRACEPOINT_EVENT_MAP' 422 | LTTNG_TRACEPOINT_EVENT_MAP(kvm_emulate_insn, kvm_x86_emulate_insn, | ^~~~~~~~~~~~~~~~~~~~~~~~~~ /tmp/B.ni56z2/BUILD/lttng-modules-2.12.0/lttng-modules-2.12.0/probes/../instrumentation/events/lttng-module/arch/x86/kvm/trace.h:426:2: note: in expansion of macro 'TP_FIELDS' 426 | TP_FIELDS( | ^~~~~~~~~ /tmp/B.ni56z2/BUILD/lttng-modules-2.12.0/lttng-modules-2.12.0/probes/../probes/lttng-tracepoint-event-impl.h:669:2: note: in expansion of macro '_ctf_integer_ext_fetched' 669 | _ctf_integer_ext_fetched(_type, _item, _src, _byte_order, _base, _nowrite) | ^~~~~~~~~~~~~~~~~~~~~~~~ /tmp/B.ni56z2/BUILD/lttng-modules-2.12.0/lttng-modules-2.12.0/probes/../probes/lttng-tracepoint-event-impl.h:686:2: note: in expansion of macro '_ctf_integer_ext_isuser0' 686 | _ctf_integer_ext_isuser##_user(_type, _item, _user_src, _byte_order, _base, _nowrite) | ^~~~~~~~~~~~~~~~~~~~~~~ /tmp/B.ni56z2/BUILD/lttng-modules-2.12.0/lttng-modules-2.12.0/probes/../probes/lttng-events-write.h:10:2: note: in expansion of macro '_ctf_integer_ext' 10 | _ctf_integer_ext(_type, _item, _src, __BYTE_ORDER, 10, 0, 0) | ^~~~~~~~~~~~~~~~ /tmp/B.ni56z2/BUILD/lttng-modules-2.12.0/lttng-modules-2.12.0/probes/../instrumentation/events/lttng-module/arch/x86/kvm/trace.h:440:3: note: in expansion of macro 'ctf_integer' 440 | ctf_integer(__u64, rip, vcpu->arch.emulate_ctxt._eip - | ^~~~~~~~~~~ /tmp/B.ni56z2/BUILD/lttng-modules-2.12.0/lttng-modules-2.12.0/probes/../instrumentation/events/lttng-module/arch/x86/kvm/trace.h:441:29: error: 'vcpu->arch.emulate_ctxt' is a pointer; did you mean to use '->'? 441 | (vcpu->arch.emulate_ctxt.fetch.ptr - | ^ /tmp/B.ni56z2/BUILD/lttng-modules-2.12.0/lttng-modules-2.12.0/probes/../probes/lttng-tracepoint-event-impl.h:763:2: note: in definition of macro 'LTTNG_TRACEPOINT_EVENT_CLASS_CODE' 763 | _fields \ | ^~~~~~~ /tmp/B.ni56z2/BUILD/lttng-modules-2.12.0/lttng-modules-2.12.0/probes/../probes/lttng-tracepoint-event-impl.h:105:3: note: in expansion of macro 'PARAMS' 105 | PARAMS(_fields), ) | ^~~~~~ /tmp/B.ni56z2/BUILD/lttng-modules-2.12.0/lttng-modules-2.12.0/probes/../probes/lttng-tracepoint-event-impl.h:39:2: note: in expansion of macro 'LTTNG_TRACEPOINT_EVENT_CLASS' 39 | LTTNG_TRACEPOINT_EVENT_CLASS(map, \ | ^~~~~~~~~~~~~~~~~~~~~~~~~~~~ /tmp/B.ni56z2/BUILD/lttng-modules-2.12.0/lttng-modules-2.12.0/probes/../probes/lttng-tracepoint-event-impl.h:42:9: note: in expansion of macro 'PARAMS' 42 | PARAMS(fields)) \ | ^~~~~~ /tmp/B.ni56z2/BUILD/lttng-modules-2.12.0/lttng-modules-2.12.0/probes/../instrumentation/events/lttng-module/arch/x86/kvm/trace.h:422:1: note: in expansion of macro 'LTTNG_TRACEPOINT_EVENT_MAP' 422 | LTTNG_TRACEPOINT_EVENT_MAP(kvm_emulate_insn, kvm_x86_emulate_insn, | ^~~~~~~~~~~~~~~~~~~~~~~~~~ /tmp/B.ni56z2/BUILD/lttng-modules-2.12.0/lttng-modules-2.12.0/probes/../instrumentation/events/lttng-module/arch/x86/kvm/trace.h:426:2: note: in expansion of macro 'TP_FIELDS' 426 | TP_FIELDS( | ^~~~~~~~~ /tmp/B.ni56z2/BUILD/lttng-modules-2.12.0/lttng-modules-2.12.0/probes/../probes/lttng-tracepoint-event-impl.h:669:2: note: in expansion of macro '_ctf_integer_ext_fetched' 669 | _ctf_integer_ext_fetched(_type, _item, _src, _byte_order, _base, _nowrite) | ^~~~~~~~~~~~~~~~~~~~~~~~ /tmp/B.ni56z2/BUILD/lttng-modules-2.12.0/lttng-modules-2.12.0/probes/../probes/lttng-tracepoint-event-impl.h:686:2: note: in expansion of macro '_ctf_integer_ext_isuser0' 686 | _ctf_integer_ext_isuser##_user(_type, _item, _user_src, _byte_order, _base, _nowrite) | ^~~~~~~~~~~~~~~~~~~~~~~ /tmp/B.ni56z2/BUILD/lttng-modules-2.12.0/lttng-modules-2.12.0/probes/../probes/lttng-events-write.h:10:2: note: in expansion of macro '_ctf_integer_ext' 10 | _ctf_integer_ext(_type, _item, _src, __BYTE_ORDER, 10, 0, 0) | ^~~~~~~~~~~~~~~~ /tmp/B.ni56z2/BUILD/lttng-modules-2.12.0/lttng-modules-2.12.0/probes/../instrumentation/events/lttng-module/arch/x86/kvm/trace.h:440:3: note: in expansion of macro 'ctf_integer' 440 | ctf_integer(__u64, rip, vcpu->arch.emulate_ctxt._eip - | ^~~~~~~~~~~ /tmp/B.ni56z2/BUILD/lttng-modules-2.12.0/lttng-modules-2.12.0/probes/../instrumentation/events/lttng-module/arch/x86/kvm/trace.h:442:29: error: 'vcpu->arch.emulate_ctxt' is a pointer; did you mean to use '->'? 442 | vcpu->arch.emulate_ctxt.fetch.data)) | ^ /tmp/B.ni56z2/BUILD/lttng-modules-2.12.0/lttng-modules-2.12.0/probes/../probes/lttng-tracepoint-event-impl.h:763:2: note: in definition of macro 'LTTNG_TRACEPOINT_EVENT_CLASS_CODE' 763 | _fields \ | ^~~~~~~ /tmp/B.ni56z2/BUILD/lttng-modules-2.12.0/lttng-modules-2.12.0/probes/../probes/lttng-tracepoint-event-impl.h:105:3: note: in expansion of macro 'PARAMS' 105 | PARAMS(_fields), ) | ^~~~~~ /tmp/B.ni56z2/BUILD/lttng-modules-2.12.0/lttng-modules-2.12.0/probes/../probes/lttng-tracepoint-event-impl.h:39:2: note: in expansion of macro 'LTTNG_TRACEPOINT_EVENT_CLASS' 39 | LTTNG_TRACEPOINT_EVENT_CLASS(map, \ | ^~~~~~~~~~~~~~~~~~~~~~~~~~~~ /tmp/B.ni56z2/BUILD/lttng-modules-2.12.0/lttng-modules-2.12.0/probes/../probes/lttng-tracepoint-event-impl.h:42:9: note: in expansion of macro 'PARAMS' 42 | PARAMS(fields)) \ | ^~~~~~ /tmp/B.ni56z2/BUILD/lttng-modules-2.12.0/lttng-modules-2.12.0/probes/../instrumentation/events/lttng-module/arch/x86/kvm/trace.h:422:1: note: in expansion of macro 'LTTNG_TRACEPOINT_EVENT_MAP' 422 | LTTNG_TRACEPOINT_EVENT_MAP(kvm_emulate_insn, kvm_x86_emulate_insn, | ^~~~~~~~~~~~~~~~~~~~~~~~~~ /tmp/B.ni56z2/BUILD/lttng-modules-2.12.0/lttng-modules-2.12.0/probes/../instrumentation/events/lttng-module/arch/x86/kvm/trace.h:426:2: note: in expansion of macro 'TP_FIELDS' 426 | TP_FIELDS( | ^~~~~~~~~ /tmp/B.ni56z2/BUILD/lttng-modules-2.12.0/lttng-modules-2.12.0/probes/../probes/lttng-tracepoint-event-impl.h:669:2: note: in expansion of macro '_ctf_integer_ext_fetched' 669 | _ctf_integer_ext_fetched(_type, _item, _src, _byte_order, _base, _nowrite) | ^~~~~~~~~~~~~~~~~~~~~~~~ /tmp/B.ni56z2/BUILD/lttng-modules-2.12.0/lttng-modules-2.12.0/probes/../probes/lttng-tracepoint-event-impl.h:686:2: note: in expansion of macro '_ctf_integer_ext_isuser0' 686 | _ctf_integer_ext_isuser##_user(_type, _item, _user_src, _byte_order, _base, _nowrite) | ^~~~~~~~~~~~~~~~~~~~~~~ /tmp/B.ni56z2/BUILD/lttng-modules-2.12.0/lttng-modules-2.12.0/probes/../probes/lttng-events-write.h:10:2: note: in expansion of macro '_ctf_integer_ext' 10 | _ctf_integer_ext(_type, _item, _src, __BYTE_ORDER, 10, 0, 0) | ^~~~~~~~~~~~~~~~ /tmp/B.ni56z2/BUILD/lttng-modules-2.12.0/lttng-modules-2.12.0/probes/../instrumentation/events/lttng-module/arch/x86/kvm/trace.h:440:3: note: in expansion of macro 'ctf_integer' 440 | ctf_integer(__u64, rip, vcpu->arch.emulate_ctxt._eip - | ^~~~~~~~~~~ /tmp/B.ni56z2/BUILD/lttng-modules-2.12.0/lttng-modules-2.12.0/probes/../instrumentation/events/lttng-module/arch/x86/kvm/trace.h:440:50: error: 'vcpu->arch.emulate_ctxt' is a pointer; did you mean to use '->'? 440 | ctf_integer(__u64, rip, vcpu->arch.emulate_ctxt._eip - | ^ /tmp/B.ni56z2/BUILD/lttng-modules-2.12.0/lttng-modules-2.12.0/probes/../probes/lttng-tracepoint-event-impl.h:763:2: note: in definition of macro 'LTTNG_TRACEPOINT_EVENT_CLASS_CODE' 763 | _fields \ | ^~~~~~~ /tmp/B.ni56z2/BUILD/lttng-modules-2.12.0/lttng-modules-2.12.0/probes/../probes/lttng-tracepoint-event-impl.h:105:3: note: in expansion of macro 'PARAMS' 105 | PARAMS(_fields), ) | ^~~~~~ /tmp/B.ni56z2/BUILD/lttng-modules-2.12.0/lttng-modules-2.12.0/probes/../probes/lttng-tracepoint-event-impl.h:39:2: note: in expansion of macro 'LTTNG_TRACEPOINT_EVENT_CLASS' 39 | LTTNG_TRACEPOINT_EVENT_CLASS(map, \ | ^~~~~~~~~~~~~~~~~~~~~~~~~~~~ /tmp/B.ni56z2/BUILD/lttng-modules-2.12.0/lttng-modules-2.12.0/probes/../probes/lttng-tracepoint-event-impl.h:42:9: note: in expansion of macro 'PARAMS' 42 | PARAMS(fields)) \ | ^~~~~~ /tmp/B.ni56z2/BUILD/lttng-modules-2.12.0/lttng-modules-2.12.0/probes/../instrumentation/events/lttng-module/arch/x86/kvm/trace.h:422:1: note: in expansion of macro 'LTTNG_TRACEPOINT_EVENT_MAP' 422 | LTTNG_TRACEPOINT_EVENT_MAP(kvm_emulate_insn, kvm_x86_emulate_insn, | ^~~~~~~~~~~~~~~~~~~~~~~~~~ /tmp/B.ni56z2/BUILD/lttng-modules-2.12.0/lttng-modules-2.12.0/probes/../instrumentation/events/lttng-module/arch/x86/kvm/trace.h:426:2: note: in expansion of macro 'TP_FIELDS' 426 | TP_FIELDS( | ^~~~~~~~~ /tmp/B.ni56z2/BUILD/lttng-modules-2.12.0/lttng-modules-2.12.0/probes/../probes/lttng-tracepoint-event-impl.h:669:2: note: in expansion of macro '_ctf_integer_ext_fetched' 669 | _ctf_integer_ext_fetched(_type, _item, _src, _byte_order, _base, _nowrite) | ^~~~~~~~~~~~~~~~~~~~~~~~ /tmp/B.ni56z2/BUILD/lttng-modules-2.12.0/lttng-modules-2.12.0/probes/../probes/lttng-tracepoint-event-impl.h:686:2: note: in expansion of macro '_ctf_integer_ext_isuser0' 686 | _ctf_integer_ext_isuser##_user(_type, _item, _user_src, _byte_order, _base, _nowrite) | ^~~~~~~~~~~~~~~~~~~~~~~ /tmp/B.ni56z2/BUILD/lttng-modules-2.12.0/lttng-modules-2.12.0/probes/../probes/lttng-events-write.h:10:2: note: in expansion of macro '_ctf_integer_ext' 10 | _ctf_integer_ext(_type, _item, _src, __BYTE_ORDER, 10, 0, 0) | ^~~~~~~~~~~~~~~~ /tmp/B.ni56z2/BUILD/lttng-modules-2.12.0/lttng-modules-2.12.0/probes/../instrumentation/events/lttng-module/arch/x86/kvm/trace.h:440:3: note: in expansion of macro 'ctf_integer' 440 | ctf_integer(__u64, rip, vcpu->arch.emulate_ctxt._eip - | ^~~~~~~~~~~ /tmp/B.ni56z2/BUILD/lttng-modules-2.12.0/lttng-modules-2.12.0/probes/../instrumentation/events/lttng-module/arch/x86/kvm/trace.h:441:29: error: 'vcpu->arch.emulate_ctxt' is a pointer; did you mean to use '->'? 441 | (vcpu->arch.emulate_ctxt.fetch.ptr - | ^ /tmp/B.ni56z2/BUILD/lttng-modules-2.12.0/lttng-modules-2.12.0/probes/../probes/lttng-tracepoint-event-impl.h:763:2: note: in definition of macro 'LTTNG_TRACEPOINT_EVENT_CLASS_CODE' 763 | _fields \ | ^~~~~~~ /tmp/B.ni56z2/BUILD/lttng-modules-2.12.0/lttng-modules-2.12.0/probes/../probes/lttng-tracepoint-event-impl.h:105:3: note: in expansion of macro 'PARAMS' 105 | PARAMS(_fields), ) | ^~~~~~ /tmp/B.ni56z2/BUILD/lttng-modules-2.12.0/lttng-modules-2.12.0/probes/../probes/lttng-tracepoint-event-impl.h:39:2: note: in expansion of macro 'LTTNG_TRACEPOINT_EVENT_CLASS' 39 | LTTNG_TRACEPOINT_EVENT_CLASS(map, \ | ^~~~~~~~~~~~~~~~~~~~~~~~~~~~ /tmp/B.ni56z2/BUILD/lttng-modules-2.12.0/lttng-modules-2.12.0/probes/../probes/lttng-tracepoint-event-impl.h:42:9: note: in expansion of macro 'PARAMS' 42 | PARAMS(fields)) \ | ^~~~~~ /tmp/B.ni56z2/BUILD/lttng-modules-2.12.0/lttng-modules-2.12.0/probes/../instrumentation/events/lttng-module/arch/x86/kvm/trace.h:422:1: note: in expansion of macro 'LTTNG_TRACEPOINT_EVENT_MAP' 422 | LTTNG_TRACEPOINT_EVENT_MAP(kvm_emulate_insn, kvm_x86_emulate_insn, | ^~~~~~~~~~~~~~~~~~~~~~~~~~ /tmp/B.ni56z2/BUILD/lttng-modules-2.12.0/lttng-modules-2.12.0/probes/../instrumentation/events/lttng-module/arch/x86/kvm/trace.h:426:2: note: in expansion of macro 'TP_FIELDS' 426 | TP_FIELDS( | ^~~~~~~~~ /tmp/B.ni56z2/BUILD/lttng-modules-2.12.0/lttng-modules-2.12.0/probes/../probes/lttng-tracepoint-event-impl.h:669:2: note: in expansion of macro '_ctf_integer_ext_fetched' 669 | _ctf_integer_ext_fetched(_type, _item, _src, _byte_order, _base, _nowrite) | ^~~~~~~~~~~~~~~~~~~~~~~~ /tmp/B.ni56z2/BUILD/lttng-modules-2.12.0/lttng-modules-2.12.0/probes/../probes/lttng-tracepoint-event-impl.h:686:2: note: in expansion of macro '_ctf_integer_ext_isuser0' 686 | _ctf_integer_ext_isuser##_user(_type, _item, _user_src, _byte_order, _base, _nowrite) | ^~~~~~~~~~~~~~~~~~~~~~~ /tmp/B.ni56z2/BUILD/lttng-modules-2.12.0/lttng-modules-2.12.0/probes/../probes/lttng-events-write.h:10:2: note: in expansion of macro '_ctf_integer_ext' 10 | _ctf_integer_ext(_type, _item, _src, __BYTE_ORDER, 10, 0, 0) | ^~~~~~~~~~~~~~~~ /tmp/B.ni56z2/BUILD/lttng-modules-2.12.0/lttng-modules-2.12.0/probes/../instrumentation/events/lttng-module/arch/x86/kvm/trace.h:440:3: note: in expansion of macro 'ctf_integer' 440 | ctf_integer(__u64, rip, vcpu->arch.emulate_ctxt._eip - | ^~~~~~~~~~~ /tmp/B.ni56z2/BUILD/lttng-modules-2.12.0/lttng-modules-2.12.0/probes/../instrumentation/events/lttng-module/arch/x86/kvm/trace.h:442:29: error: 'vcpu->arch.emulate_ctxt' is a pointer; did you mean to use '->'? 442 | vcpu->arch.emulate_ctxt.fetch.data)) | ^ /tmp/B.ni56z2/BUILD/lttng-modules-2.12.0/lttng-modules-2.12.0/probes/../probes/lttng-tracepoint-event-impl.h:763:2: note: in definition of macro 'LTTNG_TRACEPOINT_EVENT_CLASS_CODE' 763 | _fields \ | ^~~~~~~ /tmp/B.ni56z2/BUILD/lttng-modules-2.12.0/lttng-modules-2.12.0/probes/../probes/lttng-tracepoint-event-impl.h:105:3: note: in expansion of macro 'PARAMS' 105 | PARAMS(_fields), ) | ^~~~~~ /tmp/B.ni56z2/BUILD/lttng-modules-2.12.0/lttng-modules-2.12.0/probes/../probes/lttng-tracepoint-event-impl.h:39:2: note: in expansion of macro 'LTTNG_TRACEPOINT_EVENT_CLASS' 39 | LTTNG_TRACEPOINT_EVENT_CLASS(map, \ | ^~~~~~~~~~~~~~~~~~~~~~~~~~~~ /tmp/B.ni56z2/BUILD/lttng-modules-2.12.0/lttng-modules-2.12.0/probes/../probes/lttng-tracepoint-event-impl.h:42:9: note: in expansion of macro 'PARAMS' 42 | PARAMS(fields)) \ | ^~~~~~ /tmp/B.ni56z2/BUILD/lttng-modules-2.12.0/lttng-modules-2.12.0/probes/../instrumentation/events/lttng-module/arch/x86/kvm/trace.h:422:1: note: in expansion of macro 'LTTNG_TRACEPOINT_EVENT_MAP' 422 | LTTNG_TRACEPOINT_EVENT_MAP(kvm_emulate_insn, kvm_x86_emulate_insn, | ^~~~~~~~~~~~~~~~~~~~~~~~~~ /tmp/B.ni56z2/BUILD/lttng-modules-2.12.0/lttng-modules-2.12.0/probes/../instrumentation/events/lttng-module/arch/x86/kvm/trace.h:426:2: note: in expansion of macro 'TP_FIELDS' 426 | TP_FIELDS( | ^~~~~~~~~ /tmp/B.ni56z2/BUILD/lttng-modules-2.12.0/lttng-modules-2.12.0/probes/../probes/lttng-tracepoint-event-impl.h:669:2: note: in expansion of macro '_ctf_integer_ext_fetched' 669 | _ctf_integer_ext_fetched(_type, _item, _src, _byte_order, _base, _nowrite) | ^~~~~~~~~~~~~~~~~~~~~~~~ /tmp/B.ni56z2/BUILD/lttng-modules-2.12.0/lttng-modules-2.12.0/probes/../probes/lttng-tracepoint-event-impl.h:686:2: note: in expansion of macro '_ctf_integer_ext_isuser0' 686 | _ctf_integer_ext_isuser##_user(_type, _item, _user_src, _byte_order, _base, _nowrite) | ^~~~~~~~~~~~~~~~~~~~~~~ /tmp/B.ni56z2/BUILD/lttng-modules-2.12.0/lttng-modules-2.12.0/probes/../probes/lttng-events-write.h:10:2: note: in expansion of macro '_ctf_integer_ext' 10 | _ctf_integer_ext(_type, _item, _src, __BYTE_ORDER, 10, 0, 0) | ^~~~~~~~~~~~~~~~ /tmp/B.ni56z2/BUILD/lttng-modules-2.12.0/lttng-modules-2.12.0/probes/../instrumentation/events/lttng-module/arch/x86/kvm/trace.h:440:3: note: in expansion of macro 'ctf_integer' 440 | ctf_integer(__u64, rip, vcpu->arch.emulate_ctxt._eip - | ^~~~~~~~~~~ /tmp/B.ni56z2/BUILD/lttng-modules-2.12.0/lttng-modules-2.12.0/probes/../instrumentation/events/lttng-module/arch/x86/kvm/trace.h:440:50: error: 'vcpu->arch.emulate_ctxt' is a pointer; did you mean to use '->'? 440 | ctf_integer(__u64, rip, vcpu->arch.emulate_ctxt._eip - | ^ /tmp/B.ni56z2/BUILD/lttng-modules-2.12.0/lttng-modules-2.12.0/probes/../probes/lttng-tracepoint-event-impl.h:763:2: note: in definition of macro 'LTTNG_TRACEPOINT_EVENT_CLASS_CODE' 763 | _fields \ | ^~~~~~~ /tmp/B.ni56z2/BUILD/lttng-modules-2.12.0/lttng-modules-2.12.0/probes/../probes/lttng-tracepoint-event-impl.h:105:3: note: in expansion of macro 'PARAMS' 105 | PARAMS(_fields), ) | ^~~~~~ /tmp/B.ni56z2/BUILD/lttng-modules-2.12.0/lttng-modules-2.12.0/probes/../probes/lttng-tracepoint-event-impl.h:39:2: note: in expansion of macro 'LTTNG_TRACEPOINT_EVENT_CLASS' 39 | LTTNG_TRACEPOINT_EVENT_CLASS(map, \ | ^~~~~~~~~~~~~~~~~~~~~~~~~~~~ /tmp/B.ni56z2/BUILD/lttng-modules-2.12.0/lttng-modules-2.12.0/probes/../probes/lttng-tracepoint-event-impl.h:42:9: note: in expansion of macro 'PARAMS' 42 | PARAMS(fields)) \ | ^~~~~~ /tmp/B.ni56z2/BUILD/lttng-modules-2.12.0/lttng-modules-2.12.0/probes/../instrumentation/events/lttng-module/arch/x86/kvm/trace.h:422:1: note: in expansion of macro 'LTTNG_TRACEPOINT_EVENT_MAP' 422 | LTTNG_TRACEPOINT_EVENT_MAP(kvm_emulate_insn, kvm_x86_emulate_insn, | ^~~~~~~~~~~~~~~~~~~~~~~~~~ /tmp/B.ni56z2/BUILD/lttng-modules-2.12.0/lttng-modules-2.12.0/probes/../instrumentation/events/lttng-module/arch/x86/kvm/trace.h:426:2: note: in expansion of macro 'TP_FIELDS' 426 | TP_FIELDS( | ^~~~~~~~~ /tmp/B.ni56z2/BUILD/lttng-modules-2.12.0/lttng-modules-2.12.0/probes/../probes/lttng-tracepoint-event-impl.h:669:2: note: in expansion of macro '_ctf_integer_ext_fetched' 669 | _ctf_integer_ext_fetched(_type, _item, _src, _byte_order, _base, _nowrite) | ^~~~~~~~~~~~~~~~~~~~~~~~ /tmp/B.ni56z2/BUILD/lttng-modules-2.12.0/lttng-modules-2.12.0/probes/../probes/lttng-tracepoint-event-impl.h:686:2: note: in expansion of macro '_ctf_integer_ext_isuser0' 686 | _ctf_integer_ext_isuser##_user(_type, _item, _user_src, _byte_order, _base, _nowrite) | ^~~~~~~~~~~~~~~~~~~~~~~ /tmp/B.ni56z2/BUILD/lttng-modules-2.12.0/lttng-modules-2.12.0/probes/../probes/lttng-events-write.h:10:2: note: in expansion of macro '_ctf_integer_ext' 10 | _ctf_integer_ext(_type, _item, _src, __BYTE_ORDER, 10, 0, 0) | ^~~~~~~~~~~~~~~~ /tmp/B.ni56z2/BUILD/lttng-modules-2.12.0/lttng-modules-2.12.0/probes/../instrumentation/events/lttng-module/arch/x86/kvm/trace.h:440:3: note: in expansion of macro 'ctf_integer' 440 | ctf_integer(__u64, rip, vcpu->arch.emulate_ctxt._eip - | ^~~~~~~~~~~ /tmp/B.ni56z2/BUILD/lttng-modules-2.12.0/lttng-modules-2.12.0/probes/../instrumentation/events/lttng-module/arch/x86/kvm/trace.h:441:29: error: 'vcpu->arch.emulate_ctxt' is a pointer; did you mean to use '->'? 441 | (vcpu->arch.emulate_ctxt.fetch.ptr - | ^ /tmp/B.ni56z2/BUILD/lttng-modules-2.12.0/lttng-modules-2.12.0/probes/../probes/lttng-tracepoint-event-impl.h:763:2: note: in definition of macro 'LTTNG_TRACEPOINT_EVENT_CLASS_CODE' 763 | _fields \ | ^~~~~~~ /tmp/B.ni56z2/BUILD/lttng-modules-2.12.0/lttng-modules-2.12.0/probes/../probes/lttng-tracepoint-event-impl.h:105:3: note: in expansion of macro 'PARAMS' 105 | PARAMS(_fields), ) | ^~~~~~ /tmp/B.ni56z2/BUILD/lttng-modules-2.12.0/lttng-modules-2.12.0/probes/../probes/lttng-tracepoint-event-impl.h:39:2: note: in expansion of macro 'LTTNG_TRACEPOINT_EVENT_CLASS' 39 | LTTNG_TRACEPOINT_EVENT_CLASS(map, \ | ^~~~~~~~~~~~~~~~~~~~~~~~~~~~ /tmp/B.ni56z2/BUILD/lttng-modules-2.12.0/lttng-modules-2.12.0/probes/../probes/lttng-tracepoint-event-impl.h:42:9: note: in expansion of macro 'PARAMS' 42 | PARAMS(fields)) \ | ^~~~~~ /tmp/B.ni56z2/BUILD/lttng-modules-2.12.0/lttng-modules-2.12.0/probes/../instrumentation/events/lttng-module/arch/x86/kvm/trace.h:422:1: note: in expansion of macro 'LTTNG_TRACEPOINT_EVENT_MAP' 422 | LTTNG_TRACEPOINT_EVENT_MAP(kvm_emulate_insn, kvm_x86_emulate_insn, | ^~~~~~~~~~~~~~~~~~~~~~~~~~ /tmp/B.ni56z2/BUILD/lttng-modules-2.12.0/lttng-modules-2.12.0/probes/../instrumentation/events/lttng-module/arch/x86/kvm/trace.h:426:2: note: in expansion of macro 'TP_FIELDS' 426 | TP_FIELDS( | ^~~~~~~~~ /tmp/B.ni56z2/BUILD/lttng-modules-2.12.0/lttng-modules-2.12.0/probes/../probes/lttng-tracepoint-event-impl.h:669:2: note: in expansion of macro '_ctf_integer_ext_fetched' 669 | _ctf_integer_ext_fetched(_type, _item, _src, _byte_order, _base, _nowrite) | ^~~~~~~~~~~~~~~~~~~~~~~~ /tmp/B.ni56z2/BUILD/lttng-modules-2.12.0/lttng-modules-2.12.0/probes/../probes/lttng-tracepoint-event-impl.h:686:2: note: in expansion of macro '_ctf_integer_ext_isuser0' 686 | _ctf_integer_ext_isuser##_user(_type, _item, _user_src, _byte_order, _base, _nowrite) | ^~~~~~~~~~~~~~~~~~~~~~~ /tmp/B.ni56z2/BUILD/lttng-modules-2.12.0/lttng-modules-2.12.0/probes/../probes/lttng-events-write.h:10:2: note: in expansion of macro '_ctf_integer_ext' 10 | _ctf_integer_ext(_type, _item, _src, __BYTE_ORDER, 10, 0, 0) | ^~~~~~~~~~~~~~~~ /tmp/B.ni56z2/BUILD/lttng-modules-2.12.0/lttng-modules-2.12.0/probes/../instrumentation/events/lttng-module/arch/x86/kvm/trace.h:440:3: note: in expansion of macro 'ctf_integer' 440 | ctf_integer(__u64, rip, vcpu->arch.emulate_ctxt._eip - | ^~~~~~~~~~~ /tmp/B.ni56z2/BUILD/lttng-modules-2.12.0/lttng-modules-2.12.0/probes/../instrumentation/events/lttng-module/arch/x86/kvm/trace.h:442:29: error: 'vcpu->arch.emulate_ctxt' is a pointer; did you mean to use '->'? 442 | vcpu->arch.emulate_ctxt.fetch.data)) | ^ /tmp/B.ni56z2/BUILD/lttng-modules-2.12.0/lttng-modules-2.12.0/probes/../probes/lttng-tracepoint-event-impl.h:763:2: note: in definition of macro 'LTTNG_TRACEPOINT_EVENT_CLASS_CODE' 763 | _fields \ | ^~~~~~~ /tmp/B.ni56z2/BUILD/lttng-modules-2.12.0/lttng-modules-2.12.0/probes/../probes/lttng-tracepoint-event-impl.h:105:3: note: in expansion of macro 'PARAMS' 105 | PARAMS(_fields), ) | ^~~~~~ /tmp/B.ni56z2/BUILD/lttng-modules-2.12.0/lttng-modules-2.12.0/probes/../probes/lttng-tracepoint-event-impl.h:39:2: note: in expansion of macro 'LTTNG_TRACEPOINT_EVENT_CLASS' 39 | LTTNG_TRACEPOINT_EVENT_CLASS(map, \ | ^~~~~~~~~~~~~~~~~~~~~~~~~~~~ /tmp/B.ni56z2/BUILD/lttng-modules-2.12.0/lttng-modules-2.12.0/probes/../probes/lttng-tracepoint-event-impl.h:42:9: note: in expansion of macro 'PARAMS' 42 | PARAMS(fields)) \ | ^~~~~~ /tmp/B.ni56z2/BUILD/lttng-modules-2.12.0/lttng-modules-2.12.0/probes/../instrumentation/events/lttng-module/arch/x86/kvm/trace.h:422:1: note: in expansion of macro 'LTTNG_TRACEPOINT_EVENT_MAP' 422 | LTTNG_TRACEPOINT_EVENT_MAP(kvm_emulate_insn, kvm_x86_emulate_insn, | ^~~~~~~~~~~~~~~~~~~~~~~~~~ /tmp/B.ni56z2/BUILD/lttng-modules-2.12.0/lttng-modules-2.12.0/probes/../instrumentation/events/lttng-module/arch/x86/kvm/trace.h:426:2: note: in expansion of macro 'TP_FIELDS' 426 | TP_FIELDS( | ^~~~~~~~~ /tmp/B.ni56z2/BUILD/lttng-modules-2.12.0/lttng-modules-2.12.0/probes/../probes/lttng-tracepoint-event-impl.h:669:2: note: in expansion of macro '_ctf_integer_ext_fetched' 669 | _ctf_integer_ext_fetched(_type, _item, _src, _byte_order, _base, _nowrite) | ^~~~~~~~~~~~~~~~~~~~~~~~ /tmp/B.ni56z2/BUILD/lttng-modules-2.12.0/lttng-modules-2.12.0/probes/../probes/lttng-tracepoint-event-impl.h:686:2: note: in expansion of macro '_ctf_integer_ext_isuser0' 686 | _ctf_integer_ext_isuser##_user(_type, _item, _user_src, _byte_order, _base, _nowrite) | ^~~~~~~~~~~~~~~~~~~~~~~ /tmp/B.ni56z2/BUILD/lttng-modules-2.12.0/lttng-modules-2.12.0/probes/../probes/lttng-events-write.h:10:2: note: in expansion of macro '_ctf_integer_ext' 10 | _ctf_integer_ext(_type, _item, _src, __BYTE_ORDER, 10, 0, 0) | ^~~~~~~~~~~~~~~~ /tmp/B.ni56z2/BUILD/lttng-modules-2.12.0/lttng-modules-2.12.0/probes/../instrumentation/events/lttng-module/arch/x86/kvm/trace.h:440:3: note: in expansion of macro 'ctf_integer' 440 | ctf_integer(__u64, rip, vcpu->arch.emulate_ctxt._eip - | ^~~~~~~~~~~ /tmp/B.ni56z2/BUILD/lttng-modules-2.12.0/lttng-modules-2.12.0/probes/../instrumentation/events/lttng-module/arch/x86/kvm/trace.h:443:41: error: invalid type argument of '->' (have 'struct kvm_x86_ops') 443 | ctf_integer(__u32, csbase, kvm_x86_ops->get_segment_base(vcpu, VCPU_SREG_CS)) | ^~ /tmp/B.ni56z2/BUILD/lttng-modules-2.12.0/lttng-modules-2.12.0/probes/../probes/lttng-tracepoint-event-impl.h:763:2: note: in definition of macro 'LTTNG_TRACEPOINT_EVENT_CLASS_CODE' 763 | _fields \ | ^~~~~~~ /tmp/B.ni56z2/BUILD/lttng-modules-2.12.0/lttng-modules-2.12.0/probes/../probes/lttng-tracepoint-event-impl.h:105:3: note: in expansion of macro 'PARAMS' 105 | PARAMS(_fields), ) | ^~~~~~ /tmp/B.ni56z2/BUILD/lttng-modules-2.12.0/lttng-modules-2.12.0/probes/../probes/lttng-tracepoint-event-impl.h:39:2: note: in expansion of macro 'LTTNG_TRACEPOINT_EVENT_CLASS' 39 | LTTNG_TRACEPOINT_EVENT_CLASS(map, \ | ^~~~~~~~~~~~~~~~~~~~~~~~~~~~ /tmp/B.ni56z2/BUILD/lttng-modules-2.12.0/lttng-modules-2.12.0/probes/../probes/lttng-tracepoint-event-impl.h:42:9: note: in expansion of macro 'PARAMS' 42 | PARAMS(fields)) \ | ^~~~~~ /tmp/B.ni56z2/BUILD/lttng-modules-2.12.0/lttng-modules-2.12.0/probes/../instrumentation/events/lttng-module/arch/x86/kvm/trace.h:422:1: note: in expansion of macro 'LTTNG_TRACEPOINT_EVENT_MAP' 422 | LTTNG_TRACEPOINT_EVENT_MAP(kvm_emulate_insn, kvm_x86_emulate_insn, | ^~~~~~~~~~~~~~~~~~~~~~~~~~ /tmp/B.ni56z2/BUILD/lttng-modules-2.12.0/lttng-modules-2.12.0/probes/../instrumentation/events/lttng-module/arch/x86/kvm/trace.h:426:2: note: in expansion of macro 'TP_FIELDS' 426 | TP_FIELDS( | ^~~~~~~~~ /tmp/B.ni56z2/BUILD/lttng-modules-2.12.0/lttng-modules-2.12.0/probes/../probes/lttng-tracepoint-event-impl.h:669:2: note: in expansion of macro '_ctf_integer_ext_fetched' 669 | _ctf_integer_ext_fetched(_type, _item, _src, _byte_order, _base, _nowrite) | ^~~~~~~~~~~~~~~~~~~~~~~~ /tmp/B.ni56z2/BUILD/lttng-modules-2.12.0/lttng-modules-2.12.0/probes/../probes/lttng-tracepoint-event-impl.h:686:2: note: in expansion of macro '_ctf_integer_ext_isuser0' 686 | _ctf_integer_ext_isuser##_user(_type, _item, _user_src, _byte_order, _base, _nowrite) | ^~~~~~~~~~~~~~~~~~~~~~~ /tmp/B.ni56z2/BUILD/lttng-modules-2.12.0/lttng-modules-2.12.0/probes/../probes/lttng-events-write.h:10:2: note: in expansion of macro '_ctf_integer_ext' 10 | _ctf_integer_ext(_type, _item, _src, __BYTE_ORDER, 10, 0, 0) | ^~~~~~~~~~~~~~~~ /tmp/B.ni56z2/BUILD/lttng-modules-2.12.0/lttng-modules-2.12.0/probes/../instrumentation/events/lttng-module/arch/x86/kvm/trace.h:443:3: note: in expansion of macro 'ctf_integer' 443 | ctf_integer(__u32, csbase, kvm_x86_ops->get_segment_base(vcpu, VCPU_SREG_CS)) | ^~~~~~~~~~~ /tmp/B.ni56z2/BUILD/lttng-modules-2.12.0/lttng-modules-2.12.0/probes/../instrumentation/events/lttng-module/arch/x86/kvm/trace.h:443:41: error: invalid type argument of '->' (have 'struct kvm_x86_ops') 443 | ctf_integer(__u32, csbase, kvm_x86_ops->get_segment_base(vcpu, VCPU_SREG_CS)) | ^~ /tmp/B.ni56z2/BUILD/lttng-modules-2.12.0/lttng-modules-2.12.0/probes/../probes/lttng-tracepoint-event-impl.h:763:2: note: in definition of macro 'LTTNG_TRACEPOINT_EVENT_CLASS_CODE' 763 | _fields \ | ^~~~~~~ /tmp/B.ni56z2/BUILD/lttng-modules-2.12.0/lttng-modules-2.12.0/probes/../probes/lttng-tracepoint-event-impl.h:105:3: note: in expansion of macro 'PARAMS' 105 | PARAMS(_fields), ) | ^~~~~~ /tmp/B.ni56z2/BUILD/lttng-modules-2.12.0/lttng-modules-2.12.0/probes/../probes/lttng-tracepoint-event-impl.h:39:2: note: in expansion of macro 'LTTNG_TRACEPOINT_EVENT_CLASS' 39 | LTTNG_TRACEPOINT_EVENT_CLASS(map, \ | ^~~~~~~~~~~~~~~~~~~~~~~~~~~~ /tmp/B.ni56z2/BUILD/lttng-modules-2.12.0/lttng-modules-2.12.0/probes/../probes/lttng-tracepoint-event-impl.h:42:9: note: in expansion of macro 'PARAMS' 42 | PARAMS(fields)) \ | ^~~~~~ /tmp/B.ni56z2/BUILD/lttng-modules-2.12.0/lttng-modules-2.12.0/probes/../instrumentation/events/lttng-module/arch/x86/kvm/trace.h:422:1: note: in expansion of macro 'LTTNG_TRACEPOINT_EVENT_MAP' 422 | LTTNG_TRACEPOINT_EVENT_MAP(kvm_emulate_insn, kvm_x86_emulate_insn, | ^~~~~~~~~~~~~~~~~~~~~~~~~~ /tmp/B.ni56z2/BUILD/lttng-modules-2.12.0/lttng-modules-2.12.0/probes/../instrumentation/events/lttng-module/arch/x86/kvm/trace.h:426:2: note: in expansion of macro 'TP_FIELDS' 426 | TP_FIELDS( | ^~~~~~~~~ /tmp/B.ni56z2/BUILD/lttng-modules-2.12.0/lttng-modules-2.12.0/probes/../probes/lttng-tracepoint-event-impl.h:669:2: note: in expansion of macro '_ctf_integer_ext_fetched' 669 | _ctf_integer_ext_fetched(_type, _item, _src, _byte_order, _base, _nowrite) | ^~~~~~~~~~~~~~~~~~~~~~~~ /tmp/B.ni56z2/BUILD/lttng-modules-2.12.0/lttng-modules-2.12.0/probes/../probes/lttng-tracepoint-event-impl.h:686:2: note: in expansion of macro '_ctf_integer_ext_isuser0' 686 | _ctf_integer_ext_isuser##_user(_type, _item, _user_src, _byte_order, _base, _nowrite) | ^~~~~~~~~~~~~~~~~~~~~~~ /tmp/B.ni56z2/BUILD/lttng-modules-2.12.0/lttng-modules-2.12.0/probes/../probes/lttng-events-write.h:10:2: note: in expansion of macro '_ctf_integer_ext' 10 | _ctf_integer_ext(_type, _item, _src, __BYTE_ORDER, 10, 0, 0) | ^~~~~~~~~~~~~~~~ /tmp/B.ni56z2/BUILD/lttng-modules-2.12.0/lttng-modules-2.12.0/probes/../instrumentation/events/lttng-module/arch/x86/kvm/trace.h:443:3: note: in expansion of macro 'ctf_integer' 443 | ctf_integer(__u32, csbase, kvm_x86_ops->get_segment_base(vcpu, VCPU_SREG_CS)) | ^~~~~~~~~~~ /tmp/B.ni56z2/BUILD/lttng-modules-2.12.0/lttng-modules-2.12.0/probes/../instrumentation/events/lttng-module/arch/x86/kvm/trace.h:443:41: error: invalid type argument of '->' (have 'struct kvm_x86_ops') 443 | ctf_integer(__u32, csbase, kvm_x86_ops->get_segment_base(vcpu, VCPU_SREG_CS)) | ^~ /tmp/B.ni56z2/BUILD/lttng-modules-2.12.0/lttng-modules-2.12.0/probes/../probes/lttng-tracepoint-event-impl.h:763:2: note: in definition of macro 'LTTNG_TRACEPOINT_EVENT_CLASS_CODE' 763 | _fields \ | ^~~~~~~ /tmp/B.ni56z2/BUILD/lttng-modules-2.12.0/lttng-modules-2.12.0/probes/../probes/lttng-tracepoint-event-impl.h:105:3: note: in expansion of macro 'PARAMS' 105 | PARAMS(_fields), ) | ^~~~~~ /tmp/B.ni56z2/BUILD/lttng-modules-2.12.0/lttng-modules-2.12.0/probes/../probes/lttng-tracepoint-event-impl.h:39:2: note: in expansion of macro 'LTTNG_TRACEPOINT_EVENT_CLASS' 39 | LTTNG_TRACEPOINT_EVENT_CLASS(map, \ | ^~~~~~~~~~~~~~~~~~~~~~~~~~~~ /tmp/B.ni56z2/BUILD/lttng-modules-2.12.0/lttng-modules-2.12.0/probes/../probes/lttng-tracepoint-event-impl.h:42:9: note: in expansion of macro 'PARAMS' 42 | PARAMS(fields)) \ | ^~~~~~ /tmp/B.ni56z2/BUILD/lttng-modules-2.12.0/lttng-modules-2.12.0/probes/../instrumentation/events/lttng-module/arch/x86/kvm/trace.h:422:1: note: in expansion of macro 'LTTNG_TRACEPOINT_EVENT_MAP' 422 | LTTNG_TRACEPOINT_EVENT_MAP(kvm_emulate_insn, kvm_x86_emulate_insn, | ^~~~~~~~~~~~~~~~~~~~~~~~~~ /tmp/B.ni56z2/BUILD/lttng-modules-2.12.0/lttng-modules-2.12.0/probes/../instrumentation/events/lttng-module/arch/x86/kvm/trace.h:426:2: note: in expansion of macro 'TP_FIELDS' 426 | TP_FIELDS( | ^~~~~~~~~ /tmp/B.ni56z2/BUILD/lttng-modules-2.12.0/lttng-modules-2.12.0/probes/../probes/lttng-tracepoint-event-impl.h:669:2: note: in expansion of macro '_ctf_integer_ext_fetched' 669 | _ctf_integer_ext_fetched(_type, _item, _src, _byte_order, _base, _nowrite) | ^~~~~~~~~~~~~~~~~~~~~~~~ /tmp/B.ni56z2/BUILD/lttng-modules-2.12.0/lttng-modules-2.12.0/probes/../probes/lttng-tracepoint-event-impl.h:686:2: note: in expansion of macro '_ctf_integer_ext_isuser0' 686 | _ctf_integer_ext_isuser##_user(_type, _item, _user_src, _byte_order, _base, _nowrite) | ^~~~~~~~~~~~~~~~~~~~~~~ /tmp/B.ni56z2/BUILD/lttng-modules-2.12.0/lttng-modules-2.12.0/probes/../probes/lttng-events-write.h:10:2: note: in expansion of macro '_ctf_integer_ext' 10 | _ctf_integer_ext(_type, _item, _src, __BYTE_ORDER, 10, 0, 0) | ^~~~~~~~~~~~~~~~ /tmp/B.ni56z2/BUILD/lttng-modules-2.12.0/lttng-modules-2.12.0/probes/../instrumentation/events/lttng-module/arch/x86/kvm/trace.h:443:3: note: in expansion of macro 'ctf_integer' 443 | ctf_integer(__u32, csbase, kvm_x86_ops->get_segment_base(vcpu, VCPU_SREG_CS)) | ^~~~~~~~~~~ /tmp/B.ni56z2/BUILD/lttng-modules-2.12.0/lttng-modules-2.12.0/probes/../instrumentation/events/lttng-module/arch/x86/kvm/trace.h:443:41: error: invalid type argument of '->' (have 'struct kvm_x86_ops') 443 | ctf_integer(__u32, csbase, kvm_x86_ops->get_segment_base(vcpu, VCPU_SREG_CS)) | ^~ /tmp/B.ni56z2/BUILD/lttng-modules-2.12.0/lttng-modules-2.12.0/probes/../probes/lttng-tracepoint-event-impl.h:763:2: note: in definition of macro 'LTTNG_TRACEPOINT_EVENT_CLASS_CODE' 763 | _fields \ | ^~~~~~~ /tmp/B.ni56z2/BUILD/lttng-modules-2.12.0/lttng-modules-2.12.0/probes/../probes/lttng-tracepoint-event-impl.h:105:3: note: in expansion of macro 'PARAMS' 105 | PARAMS(_fields), ) | ^~~~~~ /tmp/B.ni56z2/BUILD/lttng-modules-2.12.0/lttng-modules-2.12.0/probes/../probes/lttng-tracepoint-event-impl.h:39:2: note: in expansion of macro 'LTTNG_TRACEPOINT_EVENT_CLASS' 39 | LTTNG_TRACEPOINT_EVENT_CLASS(map, \ | ^~~~~~~~~~~~~~~~~~~~~~~~~~~~ /tmp/B.ni56z2/BUILD/lttng-modules-2.12.0/lttng-modules-2.12.0/probes/../probes/lttng-tracepoint-event-impl.h:42:9: note: in expansion of macro 'PARAMS' 42 | PARAMS(fields)) \ | ^~~~~~ /tmp/B.ni56z2/BUILD/lttng-modules-2.12.0/lttng-modules-2.12.0/probes/../instrumentation/events/lttng-module/arch/x86/kvm/trace.h:422:1: note: in expansion of macro 'LTTNG_TRACEPOINT_EVENT_MAP' 422 | LTTNG_TRACEPOINT_EVENT_MAP(kvm_emulate_insn, kvm_x86_emulate_insn, | ^~~~~~~~~~~~~~~~~~~~~~~~~~ /tmp/B.ni56z2/BUILD/lttng-modules-2.12.0/lttng-modules-2.12.0/probes/../instrumentation/events/lttng-module/arch/x86/kvm/trace.h:426:2: note: in expansion of macro 'TP_FIELDS' 426 | TP_FIELDS( | ^~~~~~~~~ /tmp/B.ni56z2/BUILD/lttng-modules-2.12.0/lttng-modules-2.12.0/probes/../probes/lttng-tracepoint-event-impl.h:669:2: note: in expansion of macro '_ctf_integer_ext_fetched' 669 | _ctf_integer_ext_fetched(_type, _item, _src, _byte_order, _base, _nowrite) | ^~~~~~~~~~~~~~~~~~~~~~~~ /tmp/B.ni56z2/BUILD/lttng-modules-2.12.0/lttng-modules-2.12.0/probes/../probes/lttng-tracepoint-event-impl.h:686:2: note: in expansion of macro '_ctf_integer_ext_isuser0' 686 | _ctf_integer_ext_isuser##_user(_type, _item, _user_src, _byte_order, _base, _nowrite) | ^~~~~~~~~~~~~~~~~~~~~~~ /tmp/B.ni56z2/BUILD/lttng-modules-2.12.0/lttng-modules-2.12.0/probes/../probes/lttng-events-write.h:10:2: note: in expansion of macro '_ctf_integer_ext' 10 | _ctf_integer_ext(_type, _item, _src, __BYTE_ORDER, 10, 0, 0) | ^~~~~~~~~~~~~~~~ /tmp/B.ni56z2/BUILD/lttng-modules-2.12.0/lttng-modules-2.12.0/probes/../instrumentation/events/lttng-module/arch/x86/kvm/trace.h:443:3: note: in expansion of macro 'ctf_integer' 443 | ctf_integer(__u32, csbase, kvm_x86_ops->get_segment_base(vcpu, VCPU_SREG_CS)) | ^~~~~~~~~~~ /tmp/B.ni56z2/BUILD/lttng-modules-2.12.0/lttng-modules-2.12.0/probes/../instrumentation/events/lttng-module/arch/x86/kvm/trace.h:443:41: error: invalid type argument of '->' (have 'struct kvm_x86_ops') 443 | ctf_integer(__u32, csbase, kvm_x86_ops->get_segment_base(vcpu, VCPU_SREG_CS)) | ^~ /tmp/B.ni56z2/BUILD/lttng-modules-2.12.0/lttng-modules-2.12.0/probes/../probes/lttng-tracepoint-event-impl.h:763:2: note: in definition of macro 'LTTNG_TRACEPOINT_EVENT_CLASS_CODE' 763 | _fields \ | ^~~~~~~ /tmp/B.ni56z2/BUILD/lttng-modules-2.12.0/lttng-modules-2.12.0/probes/../probes/lttng-tracepoint-event-impl.h:105:3: note: in expansion of macro 'PARAMS' 105 | PARAMS(_fields), ) | ^~~~~~ /tmp/B.ni56z2/BUILD/lttng-modules-2.12.0/lttng-modules-2.12.0/probes/../probes/lttng-tracepoint-event-impl.h:39:2: note: in expansion of macro 'LTTNG_TRACEPOINT_EVENT_CLASS' 39 | LTTNG_TRACEPOINT_EVENT_CLASS(map, \ | ^~~~~~~~~~~~~~~~~~~~~~~~~~~~ /tmp/B.ni56z2/BUILD/lttng-modules-2.12.0/lttng-modules-2.12.0/probes/../probes/lttng-tracepoint-event-impl.h:42:9: note: in expansion of macro 'PARAMS' 42 | PARAMS(fields)) \ | ^~~~~~ /tmp/B.ni56z2/BUILD/lttng-modules-2.12.0/lttng-modules-2.12.0/probes/../instrumentation/events/lttng-module/arch/x86/kvm/trace.h:422:1: note: in expansion of macro 'LTTNG_TRACEPOINT_EVENT_MAP' 422 | LTTNG_TRACEPOINT_EVENT_MAP(kvm_emulate_insn, kvm_x86_emulate_insn, | ^~~~~~~~~~~~~~~~~~~~~~~~~~ /tmp/B.ni56z2/BUILD/lttng-modules-2.12.0/lttng-modules-2.12.0/probes/../instrumentation/events/lttng-module/arch/x86/kvm/trace.h:426:2: note: in expansion of macro 'TP_FIELDS' 426 | TP_FIELDS( | ^~~~~~~~~ /tmp/B.ni56z2/BUILD/lttng-modules-2.12.0/lttng-modules-2.12.0/probes/../probes/lttng-tracepoint-event-impl.h:669:2: note: in expansion of macro '_ctf_integer_ext_fetched' 669 | _ctf_integer_ext_fetched(_type, _item, _src, _byte_order, _base, _nowrite) | ^~~~~~~~~~~~~~~~~~~~~~~~ /tmp/B.ni56z2/BUILD/lttng-modules-2.12.0/lttng-modules-2.12.0/probes/../probes/lttng-tracepoint-event-impl.h:686:2: note: in expansion of macro '_ctf_integer_ext_isuser0' 686 | _ctf_integer_ext_isuser##_user(_type, _item, _user_src, _byte_order, _base, _nowrite) | ^~~~~~~~~~~~~~~~~~~~~~~ /tmp/B.ni56z2/BUILD/lttng-modules-2.12.0/lttng-modules-2.12.0/probes/../probes/lttng-events-write.h:10:2: note: in expansion of macro '_ctf_integer_ext' 10 | _ctf_integer_ext(_type, _item, _src, __BYTE_ORDER, 10, 0, 0) | ^~~~~~~~~~~~~~~~ /tmp/B.ni56z2/BUILD/lttng-modules-2.12.0/lttng-modules-2.12.0/probes/../instrumentation/events/lttng-module/arch/x86/kvm/trace.h:443:3: note: in expansion of macro 'ctf_integer' 443 | ctf_integer(__u32, csbase, kvm_x86_ops->get_segment_base(vcpu, VCPU_SREG_CS)) | ^~~~~~~~~~~ /tmp/B.ni56z2/BUILD/lttng-modules-2.12.0/lttng-modules-2.12.0/probes/../instrumentation/events/lttng-module/arch/x86/kvm/trace.h:443:41: error: invalid type argument of '->' (have 'struct kvm_x86_ops') 443 | ctf_integer(__u32, csbase, kvm_x86_ops->get_segment_base(vcpu, VCPU_SREG_CS)) | ^~ /tmp/B.ni56z2/BUILD/lttng-modules-2.12.0/lttng-modules-2.12.0/probes/../probes/lttng-tracepoint-event-impl.h:763:2: note: in definition of macro 'LTTNG_TRACEPOINT_EVENT_CLASS_CODE' 763 | _fields \ | ^~~~~~~ /tmp/B.ni56z2/BUILD/lttng-modules-2.12.0/lttng-modules-2.12.0/probes/../probes/lttng-tracepoint-event-impl.h:105:3: note: in expansion of macro 'PARAMS' 105 | PARAMS(_fields), ) | ^~~~~~ /tmp/B.ni56z2/BUILD/lttng-modules-2.12.0/lttng-modules-2.12.0/probes/../probes/lttng-tracepoint-event-impl.h:39:2: note: in expansion of macro 'LTTNG_TRACEPOINT_EVENT_CLASS' 39 | LTTNG_TRACEPOINT_EVENT_CLASS(map, \ | ^~~~~~~~~~~~~~~~~~~~~~~~~~~~ /tmp/B.ni56z2/BUILD/lttng-modules-2.12.0/lttng-modules-2.12.0/probes/../probes/lttng-tracepoint-event-impl.h:42:9: note: in expansion of macro 'PARAMS' 42 | PARAMS(fields)) \ | ^~~~~~ /tmp/B.ni56z2/BUILD/lttng-modules-2.12.0/lttng-modules-2.12.0/probes/../instrumentation/events/lttng-module/arch/x86/kvm/trace.h:422:1: note: in expansion of macro 'LTTNG_TRACEPOINT_EVENT_MAP' 422 | LTTNG_TRACEPOINT_EVENT_MAP(kvm_emulate_insn, kvm_x86_emulate_insn, | ^~~~~~~~~~~~~~~~~~~~~~~~~~ /tmp/B.ni56z2/BUILD/lttng-modules-2.12.0/lttng-modules-2.12.0/probes/../instrumentation/events/lttng-module/arch/x86/kvm/trace.h:426:2: note: in expansion of macro 'TP_FIELDS' 426 | TP_FIELDS( | ^~~~~~~~~ /tmp/B.ni56z2/BUILD/lttng-modules-2.12.0/lttng-modules-2.12.0/probes/../probes/lttng-tracepoint-event-impl.h:669:2: note: in expansion of macro '_ctf_integer_ext_fetched' 669 | _ctf_integer_ext_fetched(_type, _item, _src, _byte_order, _base, _nowrite) | ^~~~~~~~~~~~~~~~~~~~~~~~ /tmp/B.ni56z2/BUILD/lttng-modules-2.12.0/lttng-modules-2.12.0/probes/../probes/lttng-tracepoint-event-impl.h:686:2: note: in expansion of macro '_ctf_integer_ext_isuser0' 686 | _ctf_integer_ext_isuser##_user(_type, _item, _user_src, _byte_order, _base, _nowrite) | ^~~~~~~~~~~~~~~~~~~~~~~ /tmp/B.ni56z2/BUILD/lttng-modules-2.12.0/lttng-modules-2.12.0/probes/../probes/lttng-events-write.h:10:2: note: in expansion of macro '_ctf_integer_ext' 10 | _ctf_integer_ext(_type, _item, _src, __BYTE_ORDER, 10, 0, 0) | ^~~~~~~~~~~~~~~~ /tmp/B.ni56z2/BUILD/lttng-modules-2.12.0/lttng-modules-2.12.0/probes/../instrumentation/events/lttng-module/arch/x86/kvm/trace.h:443:3: note: in expansion of macro 'ctf_integer' 443 | ctf_integer(__u32, csbase, kvm_x86_ops->get_segment_base(vcpu, VCPU_SREG_CS)) | ^~~~~~~~~~~ /tmp/B.ni56z2/BUILD/lttng-modules-2.12.0/lttng-modules-2.12.0/probes/../instrumentation/events/lttng-module/arch/x86/kvm/trace.h:443:41: error: invalid type argument of '->' (have 'struct kvm_x86_ops') 443 | ctf_integer(__u32, csbase, kvm_x86_ops->get_segment_base(vcpu, VCPU_SREG_CS)) | ^~ /tmp/B.ni56z2/BUILD/lttng-modules-2.12.0/lttng-modules-2.12.0/probes/../probes/lttng-tracepoint-event-impl.h:763:2: note: in definition of macro 'LTTNG_TRACEPOINT_EVENT_CLASS_CODE' 763 | _fields \ | ^~~~~~~ /tmp/B.ni56z2/BUILD/lttng-modules-2.12.0/lttng-modules-2.12.0/probes/../probes/lttng-tracepoint-event-impl.h:105:3: note: in expansion of macro 'PARAMS' 105 | PARAMS(_fields), ) | ^~~~~~ /tmp/B.ni56z2/BUILD/lttng-modules-2.12.0/lttng-modules-2.12.0/probes/../probes/lttng-tracepoint-event-impl.h:39:2: note: in expansion of macro 'LTTNG_TRACEPOINT_EVENT_CLASS' 39 | LTTNG_TRACEPOINT_EVENT_CLASS(map, \ | ^~~~~~~~~~~~~~~~~~~~~~~~~~~~ /tmp/B.ni56z2/BUILD/lttng-modules-2.12.0/lttng-modules-2.12.0/probes/../probes/lttng-tracepoint-event-impl.h:42:9: note: in expansion of macro 'PARAMS' 42 | PARAMS(fields)) \ | ^~~~~~ /tmp/B.ni56z2/BUILD/lttng-modules-2.12.0/lttng-modules-2.12.0/probes/../instrumentation/events/lttng-module/arch/x86/kvm/trace.h:422:1: note: in expansion of macro 'LTTNG_TRACEPOINT_EVENT_MAP' 422 | LTTNG_TRACEPOINT_EVENT_MAP(kvm_emulate_insn, kvm_x86_emulate_insn, | ^~~~~~~~~~~~~~~~~~~~~~~~~~ /tmp/B.ni56z2/BUILD/lttng-modules-2.12.0/lttng-modules-2.12.0/probes/../instrumentation/events/lttng-module/arch/x86/kvm/trace.h:426:2: note: in expansion of macro 'TP_FIELDS' 426 | TP_FIELDS( | ^~~~~~~~~ /tmp/B.ni56z2/BUILD/lttng-modules-2.12.0/lttng-modules-2.12.0/probes/../probes/lttng-tracepoint-event-impl.h:669:2: note: in expansion of macro '_ctf_integer_ext_fetched' 669 | _ctf_integer_ext_fetched(_type, _item, _src, _byte_order, _base, _nowrite) | ^~~~~~~~~~~~~~~~~~~~~~~~ /tmp/B.ni56z2/BUILD/lttng-modules-2.12.0/lttng-modules-2.12.0/probes/../probes/lttng-tracepoint-event-impl.h:686:2: note: in expansion of macro '_ctf_integer_ext_isuser0' 686 | _ctf_integer_ext_isuser##_user(_type, _item, _user_src, _byte_order, _base, _nowrite) | ^~~~~~~~~~~~~~~~~~~~~~~ /tmp/B.ni56z2/BUILD/lttng-modules-2.12.0/lttng-modules-2.12.0/probes/../probes/lttng-events-write.h:10:2: note: in expansion of macro '_ctf_integer_ext' 10 | _ctf_integer_ext(_type, _item, _src, __BYTE_ORDER, 10, 0, 0) | ^~~~~~~~~~~~~~~~ /tmp/B.ni56z2/BUILD/lttng-modules-2.12.0/lttng-modules-2.12.0/probes/../instrumentation/events/lttng-module/arch/x86/kvm/trace.h:443:3: note: in expansion of macro 'ctf_integer' 443 | ctf_integer(__u32, csbase, kvm_x86_ops->get_segment_base(vcpu, VCPU_SREG_CS)) | ^~~~~~~~~~~ /tmp/B.ni56z2/BUILD/lttng-modules-2.12.0/lttng-modules-2.12.0/probes/../instrumentation/events/lttng-module/arch/x86/kvm/trace.h:443:41: error: invalid type argument of '->' (have 'struct kvm_x86_ops') 443 | ctf_integer(__u32, csbase, kvm_x86_ops->get_segment_base(vcpu, VCPU_SREG_CS)) | ^~ /tmp/B.ni56z2/BUILD/lttng-modules-2.12.0/lttng-modules-2.12.0/probes/../probes/lttng-tracepoint-event-impl.h:763:2: note: in definition of macro 'LTTNG_TRACEPOINT_EVENT_CLASS_CODE' 763 | _fields \ | ^~~~~~~ /tmp/B.ni56z2/BUILD/lttng-modules-2.12.0/lttng-modules-2.12.0/probes/../probes/lttng-tracepoint-event-impl.h:105:3: note: in expansion of macro 'PARAMS' 105 | PARAMS(_fields), ) | ^~~~~~ /tmp/B.ni56z2/BUILD/lttng-modules-2.12.0/lttng-modules-2.12.0/probes/../probes/lttng-tracepoint-event-impl.h:39:2: note: in expansion of macro 'LTTNG_TRACEPOINT_EVENT_CLASS' 39 | LTTNG_TRACEPOINT_EVENT_CLASS(map, \ | ^~~~~~~~~~~~~~~~~~~~~~~~~~~~ /tmp/B.ni56z2/BUILD/lttng-modules-2.12.0/lttng-modules-2.12.0/probes/../probes/lttng-tracepoint-event-impl.h:42:9: note: in expansion of macro 'PARAMS' 42 | PARAMS(fields)) \ | ^~~~~~ /tmp/B.ni56z2/BUILD/lttng-modules-2.12.0/lttng-modules-2.12.0/probes/../instrumentation/events/lttng-module/arch/x86/kvm/trace.h:422:1: note: in expansion of macro 'LTTNG_TRACEPOINT_EVENT_MAP' 422 | LTTNG_TRACEPOINT_EVENT_MAP(kvm_emulate_insn, kvm_x86_emulate_insn, | ^~~~~~~~~~~~~~~~~~~~~~~~~~ /tmp/B.ni56z2/BUILD/lttng-modules-2.12.0/lttng-modules-2.12.0/probes/../instrumentation/events/lttng-module/arch/x86/kvm/trace.h:426:2: note: in expansion of macro 'TP_FIELDS' 426 | TP_FIELDS( | ^~~~~~~~~ /tmp/B.ni56z2/BUILD/lttng-modules-2.12.0/lttng-modules-2.12.0/probes/../probes/lttng-tracepoint-event-impl.h:669:2: note: in expansion of macro '_ctf_integer_ext_fetched' 669 | _ctf_integer_ext_fetched(_type, _item, _src, _byte_order, _base, _nowrite) | ^~~~~~~~~~~~~~~~~~~~~~~~ /tmp/B.ni56z2/BUILD/lttng-modules-2.12.0/lttng-modules-2.12.0/probes/../probes/lttng-tracepoint-event-impl.h:686:2: note: in expansion of macro '_ctf_integer_ext_isuser0' 686 | _ctf_integer_ext_isuser##_user(_type, _item, _user_src, _byte_order, _base, _nowrite) | ^~~~~~~~~~~~~~~~~~~~~~~ /tmp/B.ni56z2/BUILD/lttng-modules-2.12.0/lttng-modules-2.12.0/probes/../probes/lttng-events-write.h:10:2: note: in expansion of macro '_ctf_integer_ext' 10 | _ctf_integer_ext(_type, _item, _src, __BYTE_ORDER, 10, 0, 0) | ^~~~~~~~~~~~~~~~ /tmp/B.ni56z2/BUILD/lttng-modules-2.12.0/lttng-modules-2.12.0/probes/../instrumentation/events/lttng-module/arch/x86/kvm/trace.h:443:3: note: in expansion of macro 'ctf_integer' 443 | ctf_integer(__u32, csbase, kvm_x86_ops->get_segment_base(vcpu, VCPU_SREG_CS)) | ^~~~~~~~~~~ /tmp/B.ni56z2/BUILD/lttng-modules-2.12.0/lttng-modules-2.12.0/probes/../instrumentation/events/lttng-module/arch/x86/kvm/trace.h:444:49: error: 'vcpu->arch.emulate_ctxt' is a pointer; did you mean to use '->'? 444 | ctf_integer(__u8, len, vcpu->arch.emulate_ctxt.fetch.ptr - | ^ /tmp/B.ni56z2/BUILD/lttng-modules-2.12.0/lttng-modules-2.12.0/probes/../probes/lttng-tracepoint-event-impl.h:763:2: note: in definition of macro 'LTTNG_TRACEPOINT_EVENT_CLASS_CODE' 763 | _fields \ | ^~~~~~~ /tmp/B.ni56z2/BUILD/lttng-modules-2.12.0/lttng-modules-2.12.0/probes/../probes/lttng-tracepoint-event-impl.h:105:3: note: in expansion of macro 'PARAMS' 105 | PARAMS(_fields), ) | ^~~~~~ /tmp/B.ni56z2/BUILD/lttng-modules-2.12.0/lttng-modules-2.12.0/probes/../probes/lttng-tracepoint-event-impl.h:39:2: note: in expansion of macro 'LTTNG_TRACEPOINT_EVENT_CLASS' 39 | LTTNG_TRACEPOINT_EVENT_CLASS(map, \ | ^~~~~~~~~~~~~~~~~~~~~~~~~~~~ /tmp/B.ni56z2/BUILD/lttng-modules-2.12.0/lttng-modules-2.12.0/probes/../probes/lttng-tracepoint-event-impl.h:42:9: note: in expansion of macro 'PARAMS' 42 | PARAMS(fields)) \ | ^~~~~~ /tmp/B.ni56z2/BUILD/lttng-modules-2.12.0/lttng-modules-2.12.0/probes/../instrumentation/events/lttng-module/arch/x86/kvm/trace.h:422:1: note: in expansion of macro 'LTTNG_TRACEPOINT_EVENT_MAP' 422 | LTTNG_TRACEPOINT_EVENT_MAP(kvm_emulate_insn, kvm_x86_emulate_insn, | ^~~~~~~~~~~~~~~~~~~~~~~~~~ /tmp/B.ni56z2/BUILD/lttng-modules-2.12.0/lttng-modules-2.12.0/probes/../instrumentation/events/lttng-module/arch/x86/kvm/trace.h:426:2: note: in expansion of macro 'TP_FIELDS' 426 | TP_FIELDS( | ^~~~~~~~~ /tmp/B.ni56z2/BUILD/lttng-modules-2.12.0/lttng-modules-2.12.0/probes/../probes/lttng-tracepoint-event-impl.h:669:2: note: in expansion of macro '_ctf_integer_ext_fetched' 669 | _ctf_integer_ext_fetched(_type, _item, _src, _byte_order, _base, _nowrite) | ^~~~~~~~~~~~~~~~~~~~~~~~ /tmp/B.ni56z2/BUILD/lttng-modules-2.12.0/lttng-modules-2.12.0/probes/../probes/lttng-tracepoint-event-impl.h:686:2: note: in expansion of macro '_ctf_integer_ext_isuser0' 686 | _ctf_integer_ext_isuser##_user(_type, _item, _user_src, _byte_order, _base, _nowrite) | ^~~~~~~~~~~~~~~~~~~~~~~ /tmp/B.ni56z2/BUILD/lttng-modules-2.12.0/lttng-modules-2.12.0/probes/../probes/lttng-events-write.h:10:2: note: in expansion of macro '_ctf_integer_ext' 10 | _ctf_integer_ext(_type, _item, _src, __BYTE_ORDER, 10, 0, 0) | ^~~~~~~~~~~~~~~~ /tmp/B.ni56z2/BUILD/lttng-modules-2.12.0/lttng-modules-2.12.0/probes/../instrumentation/events/lttng-module/arch/x86/kvm/trace.h:444:3: note: in expansion of macro 'ctf_integer' 444 | ctf_integer(__u8, len, vcpu->arch.emulate_ctxt.fetch.ptr - | ^~~~~~~~~~~ /tmp/B.ni56z2/BUILD/lttng-modules-2.12.0/lttng-modules-2.12.0/probes/../instrumentation/events/lttng-module/arch/x86/kvm/trace.h:445:28: error: 'vcpu->arch.emulate_ctxt' is a pointer; did you mean to use '->'? 445 | vcpu->arch.emulate_ctxt.fetch.data) | ^ /tmp/B.ni56z2/BUILD/lttng-modules-2.12.0/lttng-modules-2.12.0/probes/../probes/lttng-tracepoint-event-impl.h:763:2: note: in definition of macro 'LTTNG_TRACEPOINT_EVENT_CLASS_CODE' 763 | _fields \ | ^~~~~~~ /tmp/B.ni56z2/BUILD/lttng-modules-2.12.0/lttng-modules-2.12.0/probes/../probes/lttng-tracepoint-event-impl.h:105:3: note: in expansion of macro 'PARAMS' 105 | PARAMS(_fields), ) | ^~~~~~ /tmp/B.ni56z2/BUILD/lttng-modules-2.12.0/lttng-modules-2.12.0/probes/../probes/lttng-tracepoint-event-impl.h:39:2: note: in expansion of macro 'LTTNG_TRACEPOINT_EVENT_CLASS' 39 | LTTNG_TRACEPOINT_EVENT_CLASS(map, \ | ^~~~~~~~~~~~~~~~~~~~~~~~~~~~ /tmp/B.ni56z2/BUILD/lttng-modules-2.12.0/lttng-modules-2.12.0/probes/../probes/lttng-tracepoint-event-impl.h:42:9: note: in expansion of macro 'PARAMS' 42 | PARAMS(fields)) \ | ^~~~~~ /tmp/B.ni56z2/BUILD/lttng-modules-2.12.0/lttng-modules-2.12.0/probes/../instrumentation/events/lttng-module/arch/x86/kvm/trace.h:422:1: note: in expansion of macro 'LTTNG_TRACEPOINT_EVENT_MAP' 422 | LTTNG_TRACEPOINT_EVENT_MAP(kvm_emulate_insn, kvm_x86_emulate_insn, | ^~~~~~~~~~~~~~~~~~~~~~~~~~ /tmp/B.ni56z2/BUILD/lttng-modules-2.12.0/lttng-modules-2.12.0/probes/../instrumentation/events/lttng-module/arch/x86/kvm/trace.h:426:2: note: in expansion of macro 'TP_FIELDS' 426 | TP_FIELDS( | ^~~~~~~~~ /tmp/B.ni56z2/BUILD/lttng-modules-2.12.0/lttng-modules-2.12.0/probes/../probes/lttng-tracepoint-event-impl.h:669:2: note: in expansion of macro '_ctf_integer_ext_fetched' 669 | _ctf_integer_ext_fetched(_type, _item, _src, _byte_order, _base, _nowrite) | ^~~~~~~~~~~~~~~~~~~~~~~~ /tmp/B.ni56z2/BUILD/lttng-modules-2.12.0/lttng-modules-2.12.0/probes/../probes/lttng-tracepoint-event-impl.h:686:2: note: in expansion of macro '_ctf_integer_ext_isuser0' 686 | _ctf_integer_ext_isuser##_user(_type, _item, _user_src, _byte_order, _base, _nowrite) | ^~~~~~~~~~~~~~~~~~~~~~~ /tmp/B.ni56z2/BUILD/lttng-modules-2.12.0/lttng-modules-2.12.0/probes/../probes/lttng-events-write.h:10:2: note: in expansion of macro '_ctf_integer_ext' 10 | _ctf_integer_ext(_type, _item, _src, __BYTE_ORDER, 10, 0, 0) | ^~~~~~~~~~~~~~~~ /tmp/B.ni56z2/BUILD/lttng-modules-2.12.0/lttng-modules-2.12.0/probes/../instrumentation/events/lttng-module/arch/x86/kvm/trace.h:444:3: note: in expansion of macro 'ctf_integer' 444 | ctf_integer(__u8, len, vcpu->arch.emulate_ctxt.fetch.ptr - | ^~~~~~~~~~~ /tmp/B.ni56z2/BUILD/lttng-modules-2.12.0/lttng-modules-2.12.0/probes/../instrumentation/events/lttng-module/arch/x86/kvm/trace.h:444:49: error: 'vcpu->arch.emulate_ctxt' is a pointer; did you mean to use '->'? 444 | ctf_integer(__u8, len, vcpu->arch.emulate_ctxt.fetch.ptr - | ^ /tmp/B.ni56z2/BUILD/lttng-modules-2.12.0/lttng-modules-2.12.0/probes/../probes/lttng-tracepoint-event-impl.h:763:2: note: in definition of macro 'LTTNG_TRACEPOINT_EVENT_CLASS_CODE' 763 | _fields \ | ^~~~~~~ /tmp/B.ni56z2/BUILD/lttng-modules-2.12.0/lttng-modules-2.12.0/probes/../probes/lttng-tracepoint-event-impl.h:105:3: note: in expansion of macro 'PARAMS' 105 | PARAMS(_fields), ) | ^~~~~~ /tmp/B.ni56z2/BUILD/lttng-modules-2.12.0/lttng-modules-2.12.0/probes/../probes/lttng-tracepoint-event-impl.h:39:2: note: in expansion of macro 'LTTNG_TRACEPOINT_EVENT_CLASS' 39 | LTTNG_TRACEPOINT_EVENT_CLASS(map, \ | ^~~~~~~~~~~~~~~~~~~~~~~~~~~~ /tmp/B.ni56z2/BUILD/lttng-modules-2.12.0/lttng-modules-2.12.0/probes/../probes/lttng-tracepoint-event-impl.h:42:9: note: in expansion of macro 'PARAMS' 42 | PARAMS(fields)) \ | ^~~~~~ /tmp/B.ni56z2/BUILD/lttng-modules-2.12.0/lttng-modules-2.12.0/probes/../instrumentation/events/lttng-module/arch/x86/kvm/trace.h:422:1: note: in expansion of macro 'LTTNG_TRACEPOINT_EVENT_MAP' 422 | LTTNG_TRACEPOINT_EVENT_MAP(kvm_emulate_insn, kvm_x86_emulate_insn, | ^~~~~~~~~~~~~~~~~~~~~~~~~~ /tmp/B.ni56z2/BUILD/lttng-modules-2.12.0/lttng-modules-2.12.0/probes/../instrumentation/events/lttng-module/arch/x86/kvm/trace.h:426:2: note: in expansion of macro 'TP_FIELDS' 426 | TP_FIELDS( | ^~~~~~~~~ /tmp/B.ni56z2/BUILD/lttng-modules-2.12.0/lttng-modules-2.12.0/probes/../probes/lttng-tracepoint-event-impl.h:669:2: note: in expansion of macro '_ctf_integer_ext_fetched' 669 | _ctf_integer_ext_fetched(_type, _item, _src, _byte_order, _base, _nowrite) | ^~~~~~~~~~~~~~~~~~~~~~~~ /tmp/B.ni56z2/BUILD/lttng-modules-2.12.0/lttng-modules-2.12.0/probes/../probes/lttng-tracepoint-event-impl.h:686:2: note: in expansion of macro '_ctf_integer_ext_isuser0' 686 | _ctf_integer_ext_isuser##_user(_type, _item, _user_src, _byte_order, _base, _nowrite) | ^~~~~~~~~~~~~~~~~~~~~~~ /tmp/B.ni56z2/BUILD/lttng-modules-2.12.0/lttng-modules-2.12.0/probes/../probes/lttng-events-write.h:10:2: note: in expansion of macro '_ctf_integer_ext' 10 | _ctf_integer_ext(_type, _item, _src, __BYTE_ORDER, 10, 0, 0) | ^~~~~~~~~~~~~~~~ /tmp/B.ni56z2/BUILD/lttng-modules-2.12.0/lttng-modules-2.12.0/probes/../instrumentation/events/lttng-module/arch/x86/kvm/trace.h:444:3: note: in expansion of macro 'ctf_integer' 444 | ctf_integer(__u8, len, vcpu->arch.emulate_ctxt.fetch.ptr - | ^~~~~~~~~~~ /tmp/B.ni56z2/BUILD/lttng-modules-2.12.0/lttng-modules-2.12.0/probes/../instrumentation/events/lttng-module/arch/x86/kvm/trace.h:445:28: error: 'vcpu->arch.emulate_ctxt' is a pointer; did you mean to use '->'? 445 | vcpu->arch.emulate_ctxt.fetch.data) | ^ /tmp/B.ni56z2/BUILD/lttng-modules-2.12.0/lttng-modules-2.12.0/probes/../probes/lttng-tracepoint-event-impl.h:763:2: note: in definition of macro 'LTTNG_TRACEPOINT_EVENT_CLASS_CODE' 763 | _fields \ | ^~~~~~~ /tmp/B.ni56z2/BUILD/lttng-modules-2.12.0/lttng-modules-2.12.0/probes/../probes/lttng-tracepoint-event-impl.h:105:3: note: in expansion of macro 'PARAMS' 105 | PARAMS(_fields), ) | ^~~~~~ /tmp/B.ni56z2/BUILD/lttng-modules-2.12.0/lttng-modules-2.12.0/probes/../probes/lttng-tracepoint-event-impl.h:39:2: note: in expansion of macro 'LTTNG_TRACEPOINT_EVENT_CLASS' 39 | LTTNG_TRACEPOINT_EVENT_CLASS(map, \ | ^~~~~~~~~~~~~~~~~~~~~~~~~~~~ /tmp/B.ni56z2/BUILD/lttng-modules-2.12.0/lttng-modules-2.12.0/probes/../probes/lttng-tracepoint-event-impl.h:42:9: note: in expansion of macro 'PARAMS' 42 | PARAMS(fields)) \ | ^~~~~~ /tmp/B.ni56z2/BUILD/lttng-modules-2.12.0/lttng-modules-2.12.0/probes/../instrumentation/events/lttng-module/arch/x86/kvm/trace.h:422:1: note: in expansion of macro 'LTTNG_TRACEPOINT_EVENT_MAP' 422 | LTTNG_TRACEPOINT_EVENT_MAP(kvm_emulate_insn, kvm_x86_emulate_insn, | ^~~~~~~~~~~~~~~~~~~~~~~~~~ /tmp/B.ni56z2/BUILD/lttng-modules-2.12.0/lttng-modules-2.12.0/probes/../instrumentation/events/lttng-module/arch/x86/kvm/trace.h:426:2: note: in expansion of macro 'TP_FIELDS' 426 | TP_FIELDS( | ^~~~~~~~~ /tmp/B.ni56z2/BUILD/lttng-modules-2.12.0/lttng-modules-2.12.0/probes/../probes/lttng-tracepoint-event-impl.h:669:2: note: in expansion of macro '_ctf_integer_ext_fetched' 669 | _ctf_integer_ext_fetched(_type, _item, _src, _byte_order, _base, _nowrite) | ^~~~~~~~~~~~~~~~~~~~~~~~ /tmp/B.ni56z2/BUILD/lttng-modules-2.12.0/lttng-modules-2.12.0/probes/../probes/lttng-tracepoint-event-impl.h:686:2: note: in expansion of macro '_ctf_integer_ext_isuser0' 686 | _ctf_integer_ext_isuser##_user(_type, _item, _user_src, _byte_order, _base, _nowrite) | ^~~~~~~~~~~~~~~~~~~~~~~ /tmp/B.ni56z2/BUILD/lttng-modules-2.12.0/lttng-modules-2.12.0/probes/../probes/lttng-events-write.h:10:2: note: in expansion of macro '_ctf_integer_ext' 10 | _ctf_integer_ext(_type, _item, _src, __BYTE_ORDER, 10, 0, 0) | ^~~~~~~~~~~~~~~~ /tmp/B.ni56z2/BUILD/lttng-modules-2.12.0/lttng-modules-2.12.0/probes/../instrumentation/events/lttng-module/arch/x86/kvm/trace.h:444:3: note: in expansion of macro 'ctf_integer' 444 | ctf_integer(__u8, len, vcpu->arch.emulate_ctxt.fetch.ptr - | ^~~~~~~~~~~ /tmp/B.ni56z2/BUILD/lttng-modules-2.12.0/lttng-modules-2.12.0/probes/../instrumentation/events/lttng-module/arch/x86/kvm/trace.h:444:49: error: 'vcpu->arch.emulate_ctxt' is a pointer; did you mean to use '->'? 444 | ctf_integer(__u8, len, vcpu->arch.emulate_ctxt.fetch.ptr - | ^ /tmp/B.ni56z2/BUILD/lttng-modules-2.12.0/lttng-modules-2.12.0/probes/../probes/lttng-tracepoint-event-impl.h:763:2: note: in definition of macro 'LTTNG_TRACEPOINT_EVENT_CLASS_CODE' 763 | _fields \ | ^~~~~~~ /tmp/B.ni56z2/BUILD/lttng-modules-2.12.0/lttng-modules-2.12.0/probes/../probes/lttng-tracepoint-event-impl.h:105:3: note: in expansion of macro 'PARAMS' 105 | PARAMS(_fields), ) | ^~~~~~ /tmp/B.ni56z2/BUILD/lttng-modules-2.12.0/lttng-modules-2.12.0/probes/../probes/lttng-tracepoint-event-impl.h:39:2: note: in expansion of macro 'LTTNG_TRACEPOINT_EVENT_CLASS' 39 | LTTNG_TRACEPOINT_EVENT_CLASS(map, \ | ^~~~~~~~~~~~~~~~~~~~~~~~~~~~ /tmp/B.ni56z2/BUILD/lttng-modules-2.12.0/lttng-modules-2.12.0/probes/../probes/lttng-tracepoint-event-impl.h:42:9: note: in expansion of macro 'PARAMS' 42 | PARAMS(fields)) \ | ^~~~~~ /tmp/B.ni56z2/BUILD/lttng-modules-2.12.0/lttng-modules-2.12.0/probes/../instrumentation/events/lttng-module/arch/x86/kvm/trace.h:422:1: note: in expansion of macro 'LTTNG_TRACEPOINT_EVENT_MAP' 422 | LTTNG_TRACEPOINT_EVENT_MAP(kvm_emulate_insn, kvm_x86_emulate_insn, | ^~~~~~~~~~~~~~~~~~~~~~~~~~ /tmp/B.ni56z2/BUILD/lttng-modules-2.12.0/lttng-modules-2.12.0/probes/../instrumentation/events/lttng-module/arch/x86/kvm/trace.h:426:2: note: in expansion of macro 'TP_FIELDS' 426 | TP_FIELDS( | ^~~~~~~~~ /tmp/B.ni56z2/BUILD/lttng-modules-2.12.0/lttng-modules-2.12.0/probes/../probes/lttng-tracepoint-event-impl.h:669:2: note: in expansion of macro '_ctf_integer_ext_fetched' 669 | _ctf_integer_ext_fetched(_type, _item, _src, _byte_order, _base, _nowrite) | ^~~~~~~~~~~~~~~~~~~~~~~~ /tmp/B.ni56z2/BUILD/lttng-modules-2.12.0/lttng-modules-2.12.0/probes/../probes/lttng-tracepoint-event-impl.h:686:2: note: in expansion of macro '_ctf_integer_ext_isuser0' 686 | _ctf_integer_ext_isuser##_user(_type, _item, _user_src, _byte_order, _base, _nowrite) | ^~~~~~~~~~~~~~~~~~~~~~~ /tmp/B.ni56z2/BUILD/lttng-modules-2.12.0/lttng-modules-2.12.0/probes/../probes/lttng-events-write.h:10:2: note: in expansion of macro '_ctf_integer_ext' 10 | _ctf_integer_ext(_type, _item, _src, __BYTE_ORDER, 10, 0, 0) | ^~~~~~~~~~~~~~~~ /tmp/B.ni56z2/BUILD/lttng-modules-2.12.0/lttng-modules-2.12.0/probes/../instrumentation/events/lttng-module/arch/x86/kvm/trace.h:444:3: note: in expansion of macro 'ctf_integer' 444 | ctf_integer(__u8, len, vcpu->arch.emulate_ctxt.fetch.ptr - | ^~~~~~~~~~~ /tmp/B.ni56z2/BUILD/lttng-modules-2.12.0/lttng-modules-2.12.0/probes/../instrumentation/events/lttng-module/arch/x86/kvm/trace.h:445:28: error: 'vcpu->arch.emulate_ctxt' is a pointer; did you mean to use '->'? 445 | vcpu->arch.emulate_ctxt.fetch.data) | ^ /tmp/B.ni56z2/BUILD/lttng-modules-2.12.0/lttng-modules-2.12.0/probes/../probes/lttng-tracepoint-event-impl.h:763:2: note: in definition of macro 'LTTNG_TRACEPOINT_EVENT_CLASS_CODE' 763 | _fields \ | ^~~~~~~ /tmp/B.ni56z2/BUILD/lttng-modules-2.12.0/lttng-modules-2.12.0/probes/../probes/lttng-tracepoint-event-impl.h:105:3: note: in expansion of macro 'PARAMS' 105 | PARAMS(_fields), ) | ^~~~~~ /tmp/B.ni56z2/BUILD/lttng-modules-2.12.0/lttng-modules-2.12.0/probes/../probes/lttng-tracepoint-event-impl.h:39:2: note: in expansion of macro 'LTTNG_TRACEPOINT_EVENT_CLASS' 39 | LTTNG_TRACEPOINT_EVENT_CLASS(map, \ | ^~~~~~~~~~~~~~~~~~~~~~~~~~~~ /tmp/B.ni56z2/BUILD/lttng-modules-2.12.0/lttng-modules-2.12.0/probes/../probes/lttng-tracepoint-event-impl.h:42:9: note: in expansion of macro 'PARAMS' 42 | PARAMS(fields)) \ | ^~~~~~ /tmp/B.ni56z2/BUILD/lttng-modules-2.12.0/lttng-modules-2.12.0/probes/../instrumentation/events/lttng-module/arch/x86/kvm/trace.h:422:1: note: in expansion of macro 'LTTNG_TRACEPOINT_EVENT_MAP' 422 | LTTNG_TRACEPOINT_EVENT_MAP(kvm_emulate_insn, kvm_x86_emulate_insn, | ^~~~~~~~~~~~~~~~~~~~~~~~~~ /tmp/B.ni56z2/BUILD/lttng-modules-2.12.0/lttng-modules-2.12.0/probes/../instrumentation/events/lttng-module/arch/x86/kvm/trace.h:426:2: note: in expansion of macro 'TP_FIELDS' 426 | TP_FIELDS( | ^~~~~~~~~ /tmp/B.ni56z2/BUILD/lttng-modules-2.12.0/lttng-modules-2.12.0/probes/../probes/lttng-tracepoint-event-impl.h:669:2: note: in expansion of macro '_ctf_integer_ext_fetched' 669 | _ctf_integer_ext_fetched(_type, _item, _src, _byte_order, _base, _nowrite) | ^~~~~~~~~~~~~~~~~~~~~~~~ /tmp/B.ni56z2/BUILD/lttng-modules-2.12.0/lttng-modules-2.12.0/probes/../probes/lttng-tracepoint-event-impl.h:686:2: note: in expansion of macro '_ctf_integer_ext_isuser0' 686 | _ctf_integer_ext_isuser##_user(_type, _item, _user_src, _byte_order, _base, _nowrite) | ^~~~~~~~~~~~~~~~~~~~~~~ /tmp/B.ni56z2/BUILD/lttng-modules-2.12.0/lttng-modules-2.12.0/probes/../probes/lttng-events-write.h:10:2: note: in expansion of macro '_ctf_integer_ext' 10 | _ctf_integer_ext(_type, _item, _src, __BYTE_ORDER, 10, 0, 0) | ^~~~~~~~~~~~~~~~ /tmp/B.ni56z2/BUILD/lttng-modules-2.12.0/lttng-modules-2.12.0/probes/../instrumentation/events/lttng-module/arch/x86/kvm/trace.h:444:3: note: in expansion of macro 'ctf_integer' 444 | ctf_integer(__u8, len, vcpu->arch.emulate_ctxt.fetch.ptr - | ^~~~~~~~~~~ /tmp/B.ni56z2/BUILD/lttng-modules-2.12.0/lttng-modules-2.12.0/probes/../instrumentation/events/lttng-module/arch/x86/kvm/trace.h:444:49: error: 'vcpu->arch.emulate_ctxt' is a pointer; did you mean to use '->'? 444 | ctf_integer(__u8, len, vcpu->arch.emulate_ctxt.fetch.ptr - | ^ /tmp/B.ni56z2/BUILD/lttng-modules-2.12.0/lttng-modules-2.12.0/probes/../probes/lttng-tracepoint-event-impl.h:763:2: note: in definition of macro 'LTTNG_TRACEPOINT_EVENT_CLASS_CODE' 763 | _fields \ | ^~~~~~~ /tmp/B.ni56z2/BUILD/lttng-modules-2.12.0/lttng-modules-2.12.0/probes/../probes/lttng-tracepoint-event-impl.h:105:3: note: in expansion of macro 'PARAMS' 105 | PARAMS(_fields), ) | ^~~~~~ /tmp/B.ni56z2/BUILD/lttng-modules-2.12.0/lttng-modules-2.12.0/probes/../probes/lttng-tracepoint-event-impl.h:39:2: note: in expansion of macro 'LTTNG_TRACEPOINT_EVENT_CLASS' 39 | LTTNG_TRACEPOINT_EVENT_CLASS(map, \ | ^~~~~~~~~~~~~~~~~~~~~~~~~~~~ /tmp/B.ni56z2/BUILD/lttng-modules-2.12.0/lttng-modules-2.12.0/probes/../probes/lttng-tracepoint-event-impl.h:42:9: note: in expansion of macro 'PARAMS' 42 | PARAMS(fields)) \ | ^~~~~~ /tmp/B.ni56z2/BUILD/lttng-modules-2.12.0/lttng-modules-2.12.0/probes/../instrumentation/events/lttng-module/arch/x86/kvm/trace.h:422:1: note: in expansion of macro 'LTTNG_TRACEPOINT_EVENT_MAP' 422 | LTTNG_TRACEPOINT_EVENT_MAP(kvm_emulate_insn, kvm_x86_emulate_insn, | ^~~~~~~~~~~~~~~~~~~~~~~~~~ /tmp/B.ni56z2/BUILD/lttng-modules-2.12.0/lttng-modules-2.12.0/probes/../instrumentation/events/lttng-module/arch/x86/kvm/trace.h:426:2: note: in expansion of macro 'TP_FIELDS' 426 | TP_FIELDS( | ^~~~~~~~~ /tmp/B.ni56z2/BUILD/lttng-modules-2.12.0/lttng-modules-2.12.0/probes/../probes/lttng-tracepoint-event-impl.h:669:2: note: in expansion of macro '_ctf_integer_ext_fetched' 669 | _ctf_integer_ext_fetched(_type, _item, _src, _byte_order, _base, _nowrite) | ^~~~~~~~~~~~~~~~~~~~~~~~ /tmp/B.ni56z2/BUILD/lttng-modules-2.12.0/lttng-modules-2.12.0/probes/../probes/lttng-tracepoint-event-impl.h:686:2: note: in expansion of macro '_ctf_integer_ext_isuser0' 686 | _ctf_integer_ext_isuser##_user(_type, _item, _user_src, _byte_order, _base, _nowrite) | ^~~~~~~~~~~~~~~~~~~~~~~ /tmp/B.ni56z2/BUILD/lttng-modules-2.12.0/lttng-modules-2.12.0/probes/../probes/lttng-events-write.h:10:2: note: in expansion of macro '_ctf_integer_ext' 10 | _ctf_integer_ext(_type, _item, _src, __BYTE_ORDER, 10, 0, 0) | ^~~~~~~~~~~~~~~~ /tmp/B.ni56z2/BUILD/lttng-modules-2.12.0/lttng-modules-2.12.0/probes/../instrumentation/events/lttng-module/arch/x86/kvm/trace.h:444:3: note: in expansion of macro 'ctf_integer' 444 | ctf_integer(__u8, len, vcpu->arch.emulate_ctxt.fetch.ptr - | ^~~~~~~~~~~ /tmp/B.ni56z2/BUILD/lttng-modules-2.12.0/lttng-modules-2.12.0/probes/../instrumentation/events/lttng-module/arch/x86/kvm/trace.h:445:28: error: 'vcpu->arch.emulate_ctxt' is a pointer; did you mean to use '->'? 445 | vcpu->arch.emulate_ctxt.fetch.data) | ^ /tmp/B.ni56z2/BUILD/lttng-modules-2.12.0/lttng-modules-2.12.0/probes/../probes/lttng-tracepoint-event-impl.h:763:2: note: in definition of macro 'LTTNG_TRACEPOINT_EVENT_CLASS_CODE' 763 | _fields \ | ^~~~~~~ /tmp/B.ni56z2/BUILD/lttng-modules-2.12.0/lttng-modules-2.12.0/probes/../probes/lttng-tracepoint-event-impl.h:105:3: note: in expansion of macro 'PARAMS' 105 | PARAMS(_fields), ) | ^~~~~~ /tmp/B.ni56z2/BUILD/lttng-modules-2.12.0/lttng-modules-2.12.0/probes/../probes/lttng-tracepoint-event-impl.h:39:2: note: in expansion of macro 'LTTNG_TRACEPOINT_EVENT_CLASS' 39 | LTTNG_TRACEPOINT_EVENT_CLASS(map, \ | ^~~~~~~~~~~~~~~~~~~~~~~~~~~~ /tmp/B.ni56z2/BUILD/lttng-modules-2.12.0/lttng-modules-2.12.0/probes/../probes/lttng-tracepoint-event-impl.h:42:9: note: in expansion of macro 'PARAMS' 42 | PARAMS(fields)) \ | ^~~~~~ /tmp/B.ni56z2/BUILD/lttng-modules-2.12.0/lttng-modules-2.12.0/probes/../instrumentation/events/lttng-module/arch/x86/kvm/trace.h:422:1: note: in expansion of macro 'LTTNG_TRACEPOINT_EVENT_MAP' 422 | LTTNG_TRACEPOINT_EVENT_MAP(kvm_emulate_insn, kvm_x86_emulate_insn, | ^~~~~~~~~~~~~~~~~~~~~~~~~~ /tmp/B.ni56z2/BUILD/lttng-modules-2.12.0/lttng-modules-2.12.0/probes/../instrumentation/events/lttng-module/arch/x86/kvm/trace.h:426:2: note: in expansion of macro 'TP_FIELDS' 426 | TP_FIELDS( | ^~~~~~~~~ /tmp/B.ni56z2/BUILD/lttng-modules-2.12.0/lttng-modules-2.12.0/probes/../probes/lttng-tracepoint-event-impl.h:669:2: note: in expansion of macro '_ctf_integer_ext_fetched' 669 | _ctf_integer_ext_fetched(_type, _item, _src, _byte_order, _base, _nowrite) | ^~~~~~~~~~~~~~~~~~~~~~~~ /tmp/B.ni56z2/BUILD/lttng-modules-2.12.0/lttng-modules-2.12.0/probes/../probes/lttng-tracepoint-event-impl.h:686:2: note: in expansion of macro '_ctf_integer_ext_isuser0' 686 | _ctf_integer_ext_isuser##_user(_type, _item, _user_src, _byte_order, _base, _nowrite) | ^~~~~~~~~~~~~~~~~~~~~~~ /tmp/B.ni56z2/BUILD/lttng-modules-2.12.0/lttng-modules-2.12.0/probes/../probes/lttng-events-write.h:10:2: note: in expansion of macro '_ctf_integer_ext' 10 | _ctf_integer_ext(_type, _item, _src, __BYTE_ORDER, 10, 0, 0) | ^~~~~~~~~~~~~~~~ /tmp/B.ni56z2/BUILD/lttng-modules-2.12.0/lttng-modules-2.12.0/probes/../instrumentation/events/lttng-module/arch/x86/kvm/trace.h:444:3: note: in expansion of macro 'ctf_integer' 444 | ctf_integer(__u8, len, vcpu->arch.emulate_ctxt.fetch.ptr - | ^~~~~~~~~~~ /tmp/B.ni56z2/BUILD/lttng-modules-2.12.0/lttng-modules-2.12.0/probes/../instrumentation/events/lttng-module/arch/x86/kvm/trace.h:444:49: error: 'vcpu->arch.emulate_ctxt' is a pointer; did you mean to use '->'? 444 | ctf_integer(__u8, len, vcpu->arch.emulate_ctxt.fetch.ptr - | ^ /tmp/B.ni56z2/BUILD/lttng-modules-2.12.0/lttng-modules-2.12.0/probes/../probes/lttng-tracepoint-event-impl.h:763:2: note: in definition of macro 'LTTNG_TRACEPOINT_EVENT_CLASS_CODE' 763 | _fields \ | ^~~~~~~ /tmp/B.ni56z2/BUILD/lttng-modules-2.12.0/lttng-modules-2.12.0/probes/../probes/lttng-tracepoint-event-impl.h:105:3: note: in expansion of macro 'PARAMS' 105 | PARAMS(_fields), ) | ^~~~~~ /tmp/B.ni56z2/BUILD/lttng-modules-2.12.0/lttng-modules-2.12.0/probes/../probes/lttng-tracepoint-event-impl.h:39:2: note: in expansion of macro 'LTTNG_TRACEPOINT_EVENT_CLASS' 39 | LTTNG_TRACEPOINT_EVENT_CLASS(map, \ | ^~~~~~~~~~~~~~~~~~~~~~~~~~~~ /tmp/B.ni56z2/BUILD/lttng-modules-2.12.0/lttng-modules-2.12.0/probes/../probes/lttng-tracepoint-event-impl.h:42:9: note: in expansion of macro 'PARAMS' 42 | PARAMS(fields)) \ | ^~~~~~ /tmp/B.ni56z2/BUILD/lttng-modules-2.12.0/lttng-modules-2.12.0/probes/../instrumentation/events/lttng-module/arch/x86/kvm/trace.h:422:1: note: in expansion of macro 'LTTNG_TRACEPOINT_EVENT_MAP' 422 | LTTNG_TRACEPOINT_EVENT_MAP(kvm_emulate_insn, kvm_x86_emulate_insn, | ^~~~~~~~~~~~~~~~~~~~~~~~~~ /tmp/B.ni56z2/BUILD/lttng-modules-2.12.0/lttng-modules-2.12.0/probes/../instrumentation/events/lttng-module/arch/x86/kvm/trace.h:426:2: note: in expansion of macro 'TP_FIELDS' 426 | TP_FIELDS( | ^~~~~~~~~ /tmp/B.ni56z2/BUILD/lttng-modules-2.12.0/lttng-modules-2.12.0/probes/../probes/lttng-tracepoint-event-impl.h:669:2: note: in expansion of macro '_ctf_integer_ext_fetched' 669 | _ctf_integer_ext_fetched(_type, _item, _src, _byte_order, _base, _nowrite) | ^~~~~~~~~~~~~~~~~~~~~~~~ /tmp/B.ni56z2/BUILD/lttng-modules-2.12.0/lttng-modules-2.12.0/probes/../probes/lttng-tracepoint-event-impl.h:686:2: note: in expansion of macro '_ctf_integer_ext_isuser0' 686 | _ctf_integer_ext_isuser##_user(_type, _item, _user_src, _byte_order, _base, _nowrite) | ^~~~~~~~~~~~~~~~~~~~~~~ /tmp/B.ni56z2/BUILD/lttng-modules-2.12.0/lttng-modules-2.12.0/probes/../probes/lttng-events-write.h:10:2: note: in expansion of macro '_ctf_integer_ext' 10 | _ctf_integer_ext(_type, _item, _src, __BYTE_ORDER, 10, 0, 0) | ^~~~~~~~~~~~~~~~ /tmp/B.ni56z2/BUILD/lttng-modules-2.12.0/lttng-modules-2.12.0/probes/../instrumentation/events/lttng-module/arch/x86/kvm/trace.h:444:3: note: in expansion of macro 'ctf_integer' 444 | ctf_integer(__u8, len, vcpu->arch.emulate_ctxt.fetch.ptr - | ^~~~~~~~~~~ /tmp/B.ni56z2/BUILD/lttng-modules-2.12.0/lttng-modules-2.12.0/probes/../instrumentation/events/lttng-module/arch/x86/kvm/trace.h:445:28: error: 'vcpu->arch.emulate_ctxt' is a pointer; did you mean to use '->'? 445 | vcpu->arch.emulate_ctxt.fetch.data) | ^ /tmp/B.ni56z2/BUILD/lttng-modules-2.12.0/lttng-modules-2.12.0/probes/../probes/lttng-tracepoint-event-impl.h:763:2: note: in definition of macro 'LTTNG_TRACEPOINT_EVENT_CLASS_CODE' 763 | _fields \ | ^~~~~~~ /tmp/B.ni56z2/BUILD/lttng-modules-2.12.0/lttng-modules-2.12.0/probes/../probes/lttng-tracepoint-event-impl.h:105:3: note: in expansion of macro 'PARAMS' 105 | PARAMS(_fields), ) | ^~~~~~ /tmp/B.ni56z2/BUILD/lttng-modules-2.12.0/lttng-modules-2.12.0/probes/../probes/lttng-tracepoint-event-impl.h:39:2: note: in expansion of macro 'LTTNG_TRACEPOINT_EVENT_CLASS' 39 | LTTNG_TRACEPOINT_EVENT_CLASS(map, \ | ^~~~~~~~~~~~~~~~~~~~~~~~~~~~ /tmp/B.ni56z2/BUILD/lttng-modules-2.12.0/lttng-modules-2.12.0/probes/../probes/lttng-tracepoint-event-impl.h:42:9: note: in expansion of macro 'PARAMS' 42 | PARAMS(fields)) \ | ^~~~~~ /tmp/B.ni56z2/BUILD/lttng-modules-2.12.0/lttng-modules-2.12.0/probes/../instrumentation/events/lttng-module/arch/x86/kvm/trace.h:422:1: note: in expansion of macro 'LTTNG_TRACEPOINT_EVENT_MAP' 422 | LTTNG_TRACEPOINT_EVENT_MAP(kvm_emulate_insn, kvm_x86_emulate_insn, | ^~~~~~~~~~~~~~~~~~~~~~~~~~ /tmp/B.ni56z2/BUILD/lttng-modules-2.12.0/lttng-modules-2.12.0/probes/../instrumentation/events/lttng-module/arch/x86/kvm/trace.h:426:2: note: in expansion of macro 'TP_FIELDS' 426 | TP_FIELDS( | ^~~~~~~~~ /tmp/B.ni56z2/BUILD/lttng-modules-2.12.0/lttng-modules-2.12.0/probes/../probes/lttng-tracepoint-event-impl.h:669:2: note: in expansion of macro '_ctf_integer_ext_fetched' 669 | _ctf_integer_ext_fetched(_type, _item, _src, _byte_order, _base, _nowrite) | ^~~~~~~~~~~~~~~~~~~~~~~~ /tmp/B.ni56z2/BUILD/lttng-modules-2.12.0/lttng-modules-2.12.0/probes/../probes/lttng-tracepoint-event-impl.h:686:2: note: in expansion of macro '_ctf_integer_ext_isuser0' 686 | _ctf_integer_ext_isuser##_user(_type, _item, _user_src, _byte_order, _base, _nowrite) | ^~~~~~~~~~~~~~~~~~~~~~~ /tmp/B.ni56z2/BUILD/lttng-modules-2.12.0/lttng-modules-2.12.0/probes/../probes/lttng-events-write.h:10:2: note: in expansion of macro '_ctf_integer_ext' 10 | _ctf_integer_ext(_type, _item, _src, __BYTE_ORDER, 10, 0, 0) | ^~~~~~~~~~~~~~~~ /tmp/B.ni56z2/BUILD/lttng-modules-2.12.0/lttng-modules-2.12.0/probes/../instrumentation/events/lttng-module/arch/x86/kvm/trace.h:444:3: note: in expansion of macro 'ctf_integer' 444 | ctf_integer(__u8, len, vcpu->arch.emulate_ctxt.fetch.ptr - | ^~~~~~~~~~~ /tmp/B.ni56z2/BUILD/lttng-modules-2.12.0/lttng-modules-2.12.0/probes/../instrumentation/events/lttng-module/arch/x86/kvm/trace.h:444:49: error: 'vcpu->arch.emulate_ctxt' is a pointer; did you mean to use '->'? 444 | ctf_integer(__u8, len, vcpu->arch.emulate_ctxt.fetch.ptr - | ^ /tmp/B.ni56z2/BUILD/lttng-modules-2.12.0/lttng-modules-2.12.0/probes/../probes/lttng-tracepoint-event-impl.h:763:2: note: in definition of macro 'LTTNG_TRACEPOINT_EVENT_CLASS_CODE' 763 | _fields \ | ^~~~~~~ /tmp/B.ni56z2/BUILD/lttng-modules-2.12.0/lttng-modules-2.12.0/probes/../probes/lttng-tracepoint-event-impl.h:105:3: note: in expansion of macro 'PARAMS' 105 | PARAMS(_fields), ) | ^~~~~~ /tmp/B.ni56z2/BUILD/lttng-modules-2.12.0/lttng-modules-2.12.0/probes/../probes/lttng-tracepoint-event-impl.h:39:2: note: in expansion of macro 'LTTNG_TRACEPOINT_EVENT_CLASS' 39 | LTTNG_TRACEPOINT_EVENT_CLASS(map, \ | ^~~~~~~~~~~~~~~~~~~~~~~~~~~~ /tmp/B.ni56z2/BUILD/lttng-modules-2.12.0/lttng-modules-2.12.0/probes/../probes/lttng-tracepoint-event-impl.h:42:9: note: in expansion of macro 'PARAMS' 42 | PARAMS(fields)) \ | ^~~~~~ /tmp/B.ni56z2/BUILD/lttng-modules-2.12.0/lttng-modules-2.12.0/probes/../instrumentation/events/lttng-module/arch/x86/kvm/trace.h:422:1: note: in expansion of macro 'LTTNG_TRACEPOINT_EVENT_MAP' 422 | LTTNG_TRACEPOINT_EVENT_MAP(kvm_emulate_insn, kvm_x86_emulate_insn, | ^~~~~~~~~~~~~~~~~~~~~~~~~~ /tmp/B.ni56z2/BUILD/lttng-modules-2.12.0/lttng-modules-2.12.0/probes/../instrumentation/events/lttng-module/arch/x86/kvm/trace.h:426:2: note: in expansion of macro 'TP_FIELDS' 426 | TP_FIELDS( | ^~~~~~~~~ /tmp/B.ni56z2/BUILD/lttng-modules-2.12.0/lttng-modules-2.12.0/probes/../probes/lttng-tracepoint-event-impl.h:669:2: note: in expansion of macro '_ctf_integer_ext_fetched' 669 | _ctf_integer_ext_fetched(_type, _item, _src, _byte_order, _base, _nowrite) | ^~~~~~~~~~~~~~~~~~~~~~~~ /tmp/B.ni56z2/BUILD/lttng-modules-2.12.0/lttng-modules-2.12.0/probes/../probes/lttng-tracepoint-event-impl.h:686:2: note: in expansion of macro '_ctf_integer_ext_isuser0' 686 | _ctf_integer_ext_isuser##_user(_type, _item, _user_src, _byte_order, _base, _nowrite) | ^~~~~~~~~~~~~~~~~~~~~~~ /tmp/B.ni56z2/BUILD/lttng-modules-2.12.0/lttng-modules-2.12.0/probes/../probes/lttng-events-write.h:10:2: note: in expansion of macro '_ctf_integer_ext' 10 | _ctf_integer_ext(_type, _item, _src, __BYTE_ORDER, 10, 0, 0) | ^~~~~~~~~~~~~~~~ /tmp/B.ni56z2/BUILD/lttng-modules-2.12.0/lttng-modules-2.12.0/probes/../instrumentation/events/lttng-module/arch/x86/kvm/trace.h:444:3: note: in expansion of macro 'ctf_integer' 444 | ctf_integer(__u8, len, vcpu->arch.emulate_ctxt.fetch.ptr - | ^~~~~~~~~~~ /tmp/B.ni56z2/BUILD/lttng-modules-2.12.0/lttng-modules-2.12.0/probes/../instrumentation/events/lttng-module/arch/x86/kvm/trace.h:445:28: error: 'vcpu->arch.emulate_ctxt' is a pointer; did you mean to use '->'? 445 | vcpu->arch.emulate_ctxt.fetch.data) | ^ /tmp/B.ni56z2/BUILD/lttng-modules-2.12.0/lttng-modules-2.12.0/probes/../probes/lttng-tracepoint-event-impl.h:763:2: note: in definition of macro 'LTTNG_TRACEPOINT_EVENT_CLASS_CODE' 763 | _fields \ | ^~~~~~~ /tmp/B.ni56z2/BUILD/lttng-modules-2.12.0/lttng-modules-2.12.0/probes/../probes/lttng-tracepoint-event-impl.h:105:3: note: in expansion of macro 'PARAMS' 105 | PARAMS(_fields), ) | ^~~~~~ /tmp/B.ni56z2/BUILD/lttng-modules-2.12.0/lttng-modules-2.12.0/probes/../probes/lttng-tracepoint-event-impl.h:39:2: note: in expansion of macro 'LTTNG_TRACEPOINT_EVENT_CLASS' 39 | LTTNG_TRACEPOINT_EVENT_CLASS(map, \ | ^~~~~~~~~~~~~~~~~~~~~~~~~~~~ /tmp/B.ni56z2/BUILD/lttng-modules-2.12.0/lttng-modules-2.12.0/probes/../probes/lttng-tracepoint-event-impl.h:42:9: note: in expansion of macro 'PARAMS' 42 | PARAMS(fields)) \ | ^~~~~~ /tmp/B.ni56z2/BUILD/lttng-modules-2.12.0/lttng-modules-2.12.0/probes/../instrumentation/events/lttng-module/arch/x86/kvm/trace.h:422:1: note: in expansion of macro 'LTTNG_TRACEPOINT_EVENT_MAP' 422 | LTTNG_TRACEPOINT_EVENT_MAP(kvm_emulate_insn, kvm_x86_emulate_insn, | ^~~~~~~~~~~~~~~~~~~~~~~~~~ /tmp/B.ni56z2/BUILD/lttng-modules-2.12.0/lttng-modules-2.12.0/probes/../instrumentation/events/lttng-module/arch/x86/kvm/trace.h:426:2: note: in expansion of macro 'TP_FIELDS' 426 | TP_FIELDS( | ^~~~~~~~~ /tmp/B.ni56z2/BUILD/lttng-modules-2.12.0/lttng-modules-2.12.0/probes/../probes/lttng-tracepoint-event-impl.h:669:2: note: in expansion of macro '_ctf_integer_ext_fetched' 669 | _ctf_integer_ext_fetched(_type, _item, _src, _byte_order, _base, _nowrite) | ^~~~~~~~~~~~~~~~~~~~~~~~ /tmp/B.ni56z2/BUILD/lttng-modules-2.12.0/lttng-modules-2.12.0/probes/../probes/lttng-tracepoint-event-impl.h:686:2: note: in expansion of macro '_ctf_integer_ext_isuser0' 686 | _ctf_integer_ext_isuser##_user(_type, _item, _user_src, _byte_order, _base, _nowrite) | ^~~~~~~~~~~~~~~~~~~~~~~ /tmp/B.ni56z2/BUILD/lttng-modules-2.12.0/lttng-modules-2.12.0/probes/../probes/lttng-events-write.h:10:2: note: in expansion of macro '_ctf_integer_ext' 10 | _ctf_integer_ext(_type, _item, _src, __BYTE_ORDER, 10, 0, 0) | ^~~~~~~~~~~~~~~~ /tmp/B.ni56z2/BUILD/lttng-modules-2.12.0/lttng-modules-2.12.0/probes/../instrumentation/events/lttng-module/arch/x86/kvm/trace.h:444:3: note: in expansion of macro 'ctf_integer' 444 | ctf_integer(__u8, len, vcpu->arch.emulate_ctxt.fetch.ptr - | ^~~~~~~~~~~ /tmp/B.ni56z2/BUILD/lttng-modules-2.12.0/lttng-modules-2.12.0/probes/../instrumentation/events/lttng-module/arch/x86/kvm/trace.h:444:49: error: 'vcpu->arch.emulate_ctxt' is a pointer; did you mean to use '->'? 444 | ctf_integer(__u8, len, vcpu->arch.emulate_ctxt.fetch.ptr - | ^ /tmp/B.ni56z2/BUILD/lttng-modules-2.12.0/lttng-modules-2.12.0/probes/../probes/lttng-tracepoint-event-impl.h:763:2: note: in definition of macro 'LTTNG_TRACEPOINT_EVENT_CLASS_CODE' 763 | _fields \ | ^~~~~~~ /tmp/B.ni56z2/BUILD/lttng-modules-2.12.0/lttng-modules-2.12.0/probes/../probes/lttng-tracepoint-event-impl.h:105:3: note: in expansion of macro 'PARAMS' 105 | PARAMS(_fields), ) | ^~~~~~ /tmp/B.ni56z2/BUILD/lttng-modules-2.12.0/lttng-modules-2.12.0/probes/../probes/lttng-tracepoint-event-impl.h:39:2: note: in expansion of macro 'LTTNG_TRACEPOINT_EVENT_CLASS' 39 | LTTNG_TRACEPOINT_EVENT_CLASS(map, \ | ^~~~~~~~~~~~~~~~~~~~~~~~~~~~ /tmp/B.ni56z2/BUILD/lttng-modules-2.12.0/lttng-modules-2.12.0/probes/../probes/lttng-tracepoint-event-impl.h:42:9: note: in expansion of macro 'PARAMS' 42 | PARAMS(fields)) \ | ^~~~~~ /tmp/B.ni56z2/BUILD/lttng-modules-2.12.0/lttng-modules-2.12.0/probes/../instrumentation/events/lttng-module/arch/x86/kvm/trace.h:422:1: note: in expansion of macro 'LTTNG_TRACEPOINT_EVENT_MAP' 422 | LTTNG_TRACEPOINT_EVENT_MAP(kvm_emulate_insn, kvm_x86_emulate_insn, | ^~~~~~~~~~~~~~~~~~~~~~~~~~ /tmp/B.ni56z2/BUILD/lttng-modules-2.12.0/lttng-modules-2.12.0/probes/../instrumentation/events/lttng-module/arch/x86/kvm/trace.h:426:2: note: in expansion of macro 'TP_FIELDS' 426 | TP_FIELDS( | ^~~~~~~~~ /tmp/B.ni56z2/BUILD/lttng-modules-2.12.0/lttng-modules-2.12.0/probes/../probes/lttng-tracepoint-event-impl.h:669:2: note: in expansion of macro '_ctf_integer_ext_fetched' 669 | _ctf_integer_ext_fetched(_type, _item, _src, _byte_order, _base, _nowrite) | ^~~~~~~~~~~~~~~~~~~~~~~~ /tmp/B.ni56z2/BUILD/lttng-modules-2.12.0/lttng-modules-2.12.0/probes/../probes/lttng-tracepoint-event-impl.h:686:2: note: in expansion of macro '_ctf_integer_ext_isuser0' 686 | _ctf_integer_ext_isuser##_user(_type, _item, _user_src, _byte_order, _base, _nowrite) | ^~~~~~~~~~~~~~~~~~~~~~~ /tmp/B.ni56z2/BUILD/lttng-modules-2.12.0/lttng-modules-2.12.0/probes/../probes/lttng-events-write.h:10:2: note: in expansion of macro '_ctf_integer_ext' 10 | _ctf_integer_ext(_type, _item, _src, __BYTE_ORDER, 10, 0, 0) | ^~~~~~~~~~~~~~~~ /tmp/B.ni56z2/BUILD/lttng-modules-2.12.0/lttng-modules-2.12.0/probes/../instrumentation/events/lttng-module/arch/x86/kvm/trace.h:444:3: note: in expansion of macro 'ctf_integer' 444 | ctf_integer(__u8, len, vcpu->arch.emulate_ctxt.fetch.ptr - | ^~~~~~~~~~~ /tmp/B.ni56z2/BUILD/lttng-modules-2.12.0/lttng-modules-2.12.0/probes/../instrumentation/events/lttng-module/arch/x86/kvm/trace.h:445:28: error: 'vcpu->arch.emulate_ctxt' is a pointer; did you mean to use '->'? 445 | vcpu->arch.emulate_ctxt.fetch.data) | ^ /tmp/B.ni56z2/BUILD/lttng-modules-2.12.0/lttng-modules-2.12.0/probes/../probes/lttng-tracepoint-event-impl.h:763:2: note: in definition of macro 'LTTNG_TRACEPOINT_EVENT_CLASS_CODE' 763 | _fields \ | ^~~~~~~ /tmp/B.ni56z2/BUILD/lttng-modules-2.12.0/lttng-modules-2.12.0/probes/../probes/lttng-tracepoint-event-impl.h:105:3: note: in expansion of macro 'PARAMS' 105 | PARAMS(_fields), ) | ^~~~~~ /tmp/B.ni56z2/BUILD/lttng-modules-2.12.0/lttng-modules-2.12.0/probes/../probes/lttng-tracepoint-event-impl.h:39:2: note: in expansion of macro 'LTTNG_TRACEPOINT_EVENT_CLASS' 39 | LTTNG_TRACEPOINT_EVENT_CLASS(map, \ | ^~~~~~~~~~~~~~~~~~~~~~~~~~~~ /tmp/B.ni56z2/BUILD/lttng-modules-2.12.0/lttng-modules-2.12.0/probes/../probes/lttng-tracepoint-event-impl.h:42:9: note: in expansion of macro 'PARAMS' 42 | PARAMS(fields)) \ | ^~~~~~ /tmp/B.ni56z2/BUILD/lttng-modules-2.12.0/lttng-modules-2.12.0/probes/../instrumentation/events/lttng-module/arch/x86/kvm/trace.h:422:1: note: in expansion of macro 'LTTNG_TRACEPOINT_EVENT_MAP' 422 | LTTNG_TRACEPOINT_EVENT_MAP(kvm_emulate_insn, kvm_x86_emulate_insn, | ^~~~~~~~~~~~~~~~~~~~~~~~~~ /tmp/B.ni56z2/BUILD/lttng-modules-2.12.0/lttng-modules-2.12.0/probes/../instrumentation/events/lttng-module/arch/x86/kvm/trace.h:426:2: note: in expansion of macro 'TP_FIELDS' 426 | TP_FIELDS( | ^~~~~~~~~ /tmp/B.ni56z2/BUILD/lttng-modules-2.12.0/lttng-modules-2.12.0/probes/../probes/lttng-tracepoint-event-impl.h:669:2: note: in expansion of macro '_ctf_integer_ext_fetched' 669 | _ctf_integer_ext_fetched(_type, _item, _src, _byte_order, _base, _nowrite) | ^~~~~~~~~~~~~~~~~~~~~~~~ /tmp/B.ni56z2/BUILD/lttng-modules-2.12.0/lttng-modules-2.12.0/probes/../probes/lttng-tracepoint-event-impl.h:686:2: note: in expansion of macro '_ctf_integer_ext_isuser0' 686 | _ctf_integer_ext_isuser##_user(_type, _item, _user_src, _byte_order, _base, _nowrite) | ^~~~~~~~~~~~~~~~~~~~~~~ /tmp/B.ni56z2/BUILD/lttng-modules-2.12.0/lttng-modules-2.12.0/probes/../probes/lttng-events-write.h:10:2: note: in expansion of macro '_ctf_integer_ext' 10 | _ctf_integer_ext(_type, _item, _src, __BYTE_ORDER, 10, 0, 0) | ^~~~~~~~~~~~~~~~ /tmp/B.ni56z2/BUILD/lttng-modules-2.12.0/lttng-modules-2.12.0/probes/../instrumentation/events/lttng-module/arch/x86/kvm/trace.h:444:3: note: in expansion of macro 'ctf_integer' 444 | ctf_integer(__u8, len, vcpu->arch.emulate_ctxt.fetch.ptr - | ^~~~~~~~~~~ /tmp/B.ni56z2/BUILD/lttng-modules-2.12.0/lttng-modules-2.12.0/probes/../instrumentation/events/lttng-module/arch/x86/kvm/trace.h:444:49: error: 'vcpu->arch.emulate_ctxt' is a pointer; did you mean to use '->'? 444 | ctf_integer(__u8, len, vcpu->arch.emulate_ctxt.fetch.ptr - | ^ /tmp/B.ni56z2/BUILD/lttng-modules-2.12.0/lttng-modules-2.12.0/probes/../probes/lttng-tracepoint-event-impl.h:763:2: note: in definition of macro 'LTTNG_TRACEPOINT_EVENT_CLASS_CODE' 763 | _fields \ | ^~~~~~~ /tmp/B.ni56z2/BUILD/lttng-modules-2.12.0/lttng-modules-2.12.0/probes/../probes/lttng-tracepoint-event-impl.h:105:3: note: in expansion of macro 'PARAMS' 105 | PARAMS(_fields), ) | ^~~~~~ /tmp/B.ni56z2/BUILD/lttng-modules-2.12.0/lttng-modules-2.12.0/probes/../probes/lttng-tracepoint-event-impl.h:39:2: note: in expansion of macro 'LTTNG_TRACEPOINT_EVENT_CLASS' 39 | LTTNG_TRACEPOINT_EVENT_CLASS(map, \ | ^~~~~~~~~~~~~~~~~~~~~~~~~~~~ /tmp/B.ni56z2/BUILD/lttng-modules-2.12.0/lttng-modules-2.12.0/probes/../probes/lttng-tracepoint-event-impl.h:42:9: note: in expansion of macro 'PARAMS' 42 | PARAMS(fields)) \ | ^~~~~~ /tmp/B.ni56z2/BUILD/lttng-modules-2.12.0/lttng-modules-2.12.0/probes/../instrumentation/events/lttng-module/arch/x86/kvm/trace.h:422:1: note: in expansion of macro 'LTTNG_TRACEPOINT_EVENT_MAP' 422 | LTTNG_TRACEPOINT_EVENT_MAP(kvm_emulate_insn, kvm_x86_emulate_insn, | ^~~~~~~~~~~~~~~~~~~~~~~~~~ /tmp/B.ni56z2/BUILD/lttng-modules-2.12.0/lttng-modules-2.12.0/probes/../instrumentation/events/lttng-module/arch/x86/kvm/trace.h:426:2: note: in expansion of macro 'TP_FIELDS' 426 | TP_FIELDS( | ^~~~~~~~~ /tmp/B.ni56z2/BUILD/lttng-modules-2.12.0/lttng-modules-2.12.0/probes/../probes/lttng-tracepoint-event-impl.h:669:2: note: in expansion of macro '_ctf_integer_ext_fetched' 669 | _ctf_integer_ext_fetched(_type, _item, _src, _byte_order, _base, _nowrite) | ^~~~~~~~~~~~~~~~~~~~~~~~ /tmp/B.ni56z2/BUILD/lttng-modules-2.12.0/lttng-modules-2.12.0/probes/../probes/lttng-tracepoint-event-impl.h:686:2: note: in expansion of macro '_ctf_integer_ext_isuser0' 686 | _ctf_integer_ext_isuser##_user(_type, _item, _user_src, _byte_order, _base, _nowrite) | ^~~~~~~~~~~~~~~~~~~~~~~ /tmp/B.ni56z2/BUILD/lttng-modules-2.12.0/lttng-modules-2.12.0/probes/../probes/lttng-events-write.h:10:2: note: in expansion of macro '_ctf_integer_ext' 10 | _ctf_integer_ext(_type, _item, _src, __BYTE_ORDER, 10, 0, 0) | ^~~~~~~~~~~~~~~~ /tmp/B.ni56z2/BUILD/lttng-modules-2.12.0/lttng-modules-2.12.0/probes/../instrumentation/events/lttng-module/arch/x86/kvm/trace.h:444:3: note: in expansion of macro 'ctf_integer' 444 | ctf_integer(__u8, len, vcpu->arch.emulate_ctxt.fetch.ptr - | ^~~~~~~~~~~ /tmp/B.ni56z2/BUILD/lttng-modules-2.12.0/lttng-modules-2.12.0/probes/../instrumentation/events/lttng-module/arch/x86/kvm/trace.h:445:28: error: 'vcpu->arch.emulate_ctxt' is a pointer; did you mean to use '->'? 445 | vcpu->arch.emulate_ctxt.fetch.data) | ^ /tmp/B.ni56z2/BUILD/lttng-modules-2.12.0/lttng-modules-2.12.0/probes/../probes/lttng-tracepoint-event-impl.h:763:2: note: in definition of macro 'LTTNG_TRACEPOINT_EVENT_CLASS_CODE' 763 | _fields \ | ^~~~~~~ /tmp/B.ni56z2/BUILD/lttng-modules-2.12.0/lttng-modules-2.12.0/probes/../probes/lttng-tracepoint-event-impl.h:105:3: note: in expansion of macro 'PARAMS' 105 | PARAMS(_fields), ) | ^~~~~~ /tmp/B.ni56z2/BUILD/lttng-modules-2.12.0/lttng-modules-2.12.0/probes/../probes/lttng-tracepoint-event-impl.h:39:2: note: in expansion of macro 'LTTNG_TRACEPOINT_EVENT_CLASS' 39 | LTTNG_TRACEPOINT_EVENT_CLASS(map, \ | ^~~~~~~~~~~~~~~~~~~~~~~~~~~~ /tmp/B.ni56z2/BUILD/lttng-modules-2.12.0/lttng-modules-2.12.0/probes/../probes/lttng-tracepoint-event-impl.h:42:9: note: in expansion of macro 'PARAMS' 42 | PARAMS(fields)) \ | ^~~~~~ /tmp/B.ni56z2/BUILD/lttng-modules-2.12.0/lttng-modules-2.12.0/probes/../instrumentation/events/lttng-module/arch/x86/kvm/trace.h:422:1: note: in expansion of macro 'LTTNG_TRACEPOINT_EVENT_MAP' 422 | LTTNG_TRACEPOINT_EVENT_MAP(kvm_emulate_insn, kvm_x86_emulate_insn, | ^~~~~~~~~~~~~~~~~~~~~~~~~~ /tmp/B.ni56z2/BUILD/lttng-modules-2.12.0/lttng-modules-2.12.0/probes/../instrumentation/events/lttng-module/arch/x86/kvm/trace.h:426:2: note: in expansion of macro 'TP_FIELDS' 426 | TP_FIELDS( | ^~~~~~~~~ /tmp/B.ni56z2/BUILD/lttng-modules-2.12.0/lttng-modules-2.12.0/probes/../probes/lttng-tracepoint-event-impl.h:669:2: note: in expansion of macro '_ctf_integer_ext_fetched' 669 | _ctf_integer_ext_fetched(_type, _item, _src, _byte_order, _base, _nowrite) | ^~~~~~~~~~~~~~~~~~~~~~~~ /tmp/B.ni56z2/BUILD/lttng-modules-2.12.0/lttng-modules-2.12.0/probes/../probes/lttng-tracepoint-event-impl.h:686:2: note: in expansion of macro '_ctf_integer_ext_isuser0' 686 | _ctf_integer_ext_isuser##_user(_type, _item, _user_src, _byte_order, _base, _nowrite) | ^~~~~~~~~~~~~~~~~~~~~~~ /tmp/B.ni56z2/BUILD/lttng-modules-2.12.0/lttng-modules-2.12.0/probes/../probes/lttng-events-write.h:10:2: note: in expansion of macro '_ctf_integer_ext' 10 | _ctf_integer_ext(_type, _item, _src, __BYTE_ORDER, 10, 0, 0) | ^~~~~~~~~~~~~~~~ /tmp/B.ni56z2/BUILD/lttng-modules-2.12.0/lttng-modules-2.12.0/probes/../instrumentation/events/lttng-module/arch/x86/kvm/trace.h:444:3: note: in expansion of macro 'ctf_integer' 444 | ctf_integer(__u8, len, vcpu->arch.emulate_ctxt.fetch.ptr - | ^~~~~~~~~~~ /tmp/B.ni56z2/BUILD/lttng-modules-2.12.0/lttng-modules-2.12.0/probes/../instrumentation/events/lttng-module/arch/x86/kvm/trace.h:446:48: error: 'vcpu->arch.emulate_ctxt' is a pointer; did you mean to use '->'? 446 | ctf_array(__u8, insn, vcpu->arch.emulate_ctxt.fetch.data, 15) | ^ /tmp/B.ni56z2/BUILD/lttng-modules-2.12.0/lttng-modules-2.12.0/probes/../probes/lttng-tracepoint-event-impl.h:763:2: note: in definition of macro 'LTTNG_TRACEPOINT_EVENT_CLASS_CODE' 763 | _fields \ | ^~~~~~~ /tmp/B.ni56z2/BUILD/lttng-modules-2.12.0/lttng-modules-2.12.0/probes/../probes/lttng-tracepoint-event-impl.h:105:3: note: in expansion of macro 'PARAMS' 105 | PARAMS(_fields), ) | ^~~~~~ /tmp/B.ni56z2/BUILD/lttng-modules-2.12.0/lttng-modules-2.12.0/probes/../probes/lttng-tracepoint-event-impl.h:39:2: note: in expansion of macro 'LTTNG_TRACEPOINT_EVENT_CLASS' 39 | LTTNG_TRACEPOINT_EVENT_CLASS(map, \ | ^~~~~~~~~~~~~~~~~~~~~~~~~~~~ /tmp/B.ni56z2/BUILD/lttng-modules-2.12.0/lttng-modules-2.12.0/probes/../probes/lttng-tracepoint-event-impl.h:42:9: note: in expansion of macro 'PARAMS' 42 | PARAMS(fields)) \ | ^~~~~~ /tmp/B.ni56z2/BUILD/lttng-modules-2.12.0/lttng-modules-2.12.0/probes/../instrumentation/events/lttng-module/arch/x86/kvm/trace.h:422:1: note: in expansion of macro 'LTTNG_TRACEPOINT_EVENT_MAP' 422 | LTTNG_TRACEPOINT_EVENT_MAP(kvm_emulate_insn, kvm_x86_emulate_insn, | ^~~~~~~~~~~~~~~~~~~~~~~~~~ /tmp/B.ni56z2/BUILD/lttng-modules-2.12.0/lttng-modules-2.12.0/probes/../instrumentation/events/lttng-module/arch/x86/kvm/trace.h:426:2: note: in expansion of macro 'TP_FIELDS' 426 | TP_FIELDS( | ^~~~~~~~~ /tmp/B.ni56z2/BUILD/lttng-modules-2.12.0/lttng-modules-2.12.0/probes/../probes/lttng-events-write.h:34:2: note: in expansion of macro '_ctf_array_encoded' 34 | _ctf_array_encoded(_type, _item, _src, \ | ^~~~~~~~~~~~~~~~~~ /tmp/B.ni56z2/BUILD/lttng-modules-2.12.0/lttng-modules-2.12.0/probes/../instrumentation/events/lttng-module/arch/x86/kvm/trace.h:446:3: note: in expansion of macro 'ctf_array' 446 | ctf_array(__u8, insn, vcpu->arch.emulate_ctxt.fetch.data, 15) | ^~~~~~~~~ /tmp/B.ni56z2/BUILD/lttng-modules-2.12.0/lttng-modules-2.12.0/probes/../instrumentation/events/lttng-module/arch/x86/kvm/trace.h:448:67: error: 'vcpu->arch.emulate_ctxt' is a pointer; did you mean to use '->'? 448 | ctf_integer(__u8, flags, kei_decode_mode(vcpu->arch.emulate_ctxt.mode)) | ^ /tmp/B.ni56z2/BUILD/lttng-modules-2.12.0/lttng-modules-2.12.0/probes/../probes/lttng-tracepoint-event-impl.h:763:2: note: in definition of macro 'LTTNG_TRACEPOINT_EVENT_CLASS_CODE' 763 | _fields \ | ^~~~~~~ /tmp/B.ni56z2/BUILD/lttng-modules-2.12.0/lttng-modules-2.12.0/probes/../probes/lttng-tracepoint-event-impl.h:105:3: note: in expansion of macro 'PARAMS' 105 | PARAMS(_fields), ) | ^~~~~~ /tmp/B.ni56z2/BUILD/lttng-modules-2.12.0/lttng-modules-2.12.0/probes/../probes/lttng-tracepoint-event-impl.h:39:2: note: in expansion of macro 'LTTNG_TRACEPOINT_EVENT_CLASS' 39 | LTTNG_TRACEPOINT_EVENT_CLASS(map, \ | ^~~~~~~~~~~~~~~~~~~~~~~~~~~~ /tmp/B.ni56z2/BUILD/lttng-modules-2.12.0/lttng-modules-2.12.0/probes/../probes/lttng-tracepoint-event-impl.h:42:9: note: in expansion of macro 'PARAMS' 42 | PARAMS(fields)) \ | ^~~~~~ /tmp/B.ni56z2/BUILD/lttng-modules-2.12.0/lttng-modules-2.12.0/probes/../instrumentation/events/lttng-module/arch/x86/kvm/trace.h:422:1: note: in expansion of macro 'LTTNG_TRACEPOINT_EVENT_MAP' 422 | LTTNG_TRACEPOINT_EVENT_MAP(kvm_emulate_insn, kvm_x86_emulate_insn, | ^~~~~~~~~~~~~~~~~~~~~~~~~~ /tmp/B.ni56z2/BUILD/lttng-modules-2.12.0/lttng-modules-2.12.0/probes/../instrumentation/events/lttng-module/arch/x86/kvm/trace.h:426:2: note: in expansion of macro 'TP_FIELDS' 426 | TP_FIELDS( | ^~~~~~~~~ /tmp/B.ni56z2/BUILD/lttng-modules-2.12.0/lttng-modules-2.12.0/probes/../probes/lttng-tracepoint-event-impl.h:669:2: note: in expansion of macro '_ctf_integer_ext_fetched' 669 | _ctf_integer_ext_fetched(_type, _item, _src, _byte_order, _base, _nowrite) | ^~~~~~~~~~~~~~~~~~~~~~~~ /tmp/B.ni56z2/BUILD/lttng-modules-2.12.0/lttng-modules-2.12.0/probes/../probes/lttng-tracepoint-event-impl.h:686:2: note: in expansion of macro '_ctf_integer_ext_isuser0' 686 | _ctf_integer_ext_isuser##_user(_type, _item, _user_src, _byte_order, _base, _nowrite) | ^~~~~~~~~~~~~~~~~~~~~~~ /tmp/B.ni56z2/BUILD/lttng-modules-2.12.0/lttng-modules-2.12.0/probes/../probes/lttng-events-write.h:10:2: note: in expansion of macro '_ctf_integer_ext' 10 | _ctf_integer_ext(_type, _item, _src, __BYTE_ORDER, 10, 0, 0) | ^~~~~~~~~~~~~~~~ /tmp/B.ni56z2/BUILD/lttng-modules-2.12.0/lttng-modules-2.12.0/probes/../instrumentation/events/lttng-module/arch/x86/kvm/trace.h:448:3: note: in expansion of macro 'ctf_integer' 448 | ctf_integer(__u8, flags, kei_decode_mode(vcpu->arch.emulate_ctxt.mode)) | ^~~~~~~~~~~ /tmp/B.ni56z2/BUILD/lttng-modules-2.12.0/lttng-modules-2.12.0/probes/../instrumentation/events/lttng-module/arch/x86/kvm/trace.h:448:28: note: in expansion of macro 'kei_decode_mode' 448 | ctf_integer(__u8, flags, kei_decode_mode(vcpu->arch.emulate_ctxt.mode)) | ^~~~~~~~~~~~~~~ /tmp/B.ni56z2/BUILD/lttng-modules-2.12.0/lttng-modules-2.12.0/probes/../instrumentation/events/lttng-module/arch/x86/kvm/trace.h:401:7: error: 'X86EMUL_MODE_REAL' undeclared (first use in this function) 401 | case X86EMUL_MODE_REAL: \ | ^~~~~~~~~~~~~~~~~ /tmp/B.ni56z2/BUILD/lttng-modules-2.12.0/lttng-modules-2.12.0/probes/../probes/lttng-tracepoint-event-impl.h:763:2: note: in definition of macro 'LTTNG_TRACEPOINT_EVENT_CLASS_CODE' 763 | _fields \ | ^~~~~~~ /tmp/B.ni56z2/BUILD/lttng-modules-2.12.0/lttng-modules-2.12.0/probes/../probes/lttng-tracepoint-event-impl.h:105:3: note: in expansion of macro 'PARAMS' 105 | PARAMS(_fields), ) | ^~~~~~ /tmp/B.ni56z2/BUILD/lttng-modules-2.12.0/lttng-modules-2.12.0/probes/../probes/lttng-tracepoint-event-impl.h:39:2: note: in expansion of macro 'LTTNG_TRACEPOINT_EVENT_CLASS' 39 | LTTNG_TRACEPOINT_EVENT_CLASS(map, \ | ^~~~~~~~~~~~~~~~~~~~~~~~~~~~ /tmp/B.ni56z2/BUILD/lttng-modules-2.12.0/lttng-modules-2.12.0/probes/../probes/lttng-tracepoint-event-impl.h:42:9: note: in expansion of macro 'PARAMS' 42 | PARAMS(fields)) \ | ^~~~~~ /tmp/B.ni56z2/BUILD/lttng-modules-2.12.0/lttng-modules-2.12.0/probes/../instrumentation/events/lttng-module/arch/x86/kvm/trace.h:422:1: note: in expansion of macro 'LTTNG_TRACEPOINT_EVENT_MAP' 422 | LTTNG_TRACEPOINT_EVENT_MAP(kvm_emulate_insn, kvm_x86_emulate_insn, | ^~~~~~~~~~~~~~~~~~~~~~~~~~ /tmp/B.ni56z2/BUILD/lttng-modules-2.12.0/lttng-modules-2.12.0/probes/../instrumentation/events/lttng-module/arch/x86/kvm/trace.h:426:2: note: in expansion of macro 'TP_FIELDS' 426 | TP_FIELDS( | ^~~~~~~~~ /tmp/B.ni56z2/BUILD/lttng-modules-2.12.0/lttng-modules-2.12.0/probes/../probes/lttng-tracepoint-event-impl.h:669:2: note: in expansion of macro '_ctf_integer_ext_fetched' 669 | _ctf_integer_ext_fetched(_type, _item, _src, _byte_order, _base, _nowrite) | ^~~~~~~~~~~~~~~~~~~~~~~~ /tmp/B.ni56z2/BUILD/lttng-modules-2.12.0/lttng-modules-2.12.0/probes/../probes/lttng-tracepoint-event-impl.h:686:2: note: in expansion of macro '_ctf_integer_ext_isuser0' 686 | _ctf_integer_ext_isuser##_user(_type, _item, _user_src, _byte_order, _base, _nowrite) | ^~~~~~~~~~~~~~~~~~~~~~~ /tmp/B.ni56z2/BUILD/lttng-modules-2.12.0/lttng-modules-2.12.0/probes/../probes/lttng-events-write.h:10:2: note: in expansion of macro '_ctf_integer_ext' 10 | _ctf_integer_ext(_type, _item, _src, __BYTE_ORDER, 10, 0, 0) | ^~~~~~~~~~~~~~~~ /tmp/B.ni56z2/BUILD/lttng-modules-2.12.0/lttng-modules-2.12.0/probes/../instrumentation/events/lttng-module/arch/x86/kvm/trace.h:448:3: note: in expansion of macro 'ctf_integer' 448 | ctf_integer(__u8, flags, kei_decode_mode(vcpu->arch.emulate_ctxt.mode)) | ^~~~~~~~~~~ /tmp/B.ni56z2/BUILD/lttng-modules-2.12.0/lttng-modules-2.12.0/probes/../instrumentation/events/lttng-module/arch/x86/kvm/trace.h:448:28: note: in expansion of macro 'kei_decode_mode' 448 | ctf_integer(__u8, flags, kei_decode_mode(vcpu->arch.emulate_ctxt.mode)) | ^~~~~~~~~~~~~~~ /tmp/B.ni56z2/BUILD/lttng-modules-2.12.0/lttng-modules-2.12.0/probes/../instrumentation/events/lttng-module/arch/x86/kvm/trace.h:401:7: note: each undeclared identifier is reported only once for each function it appears in 401 | case X86EMUL_MODE_REAL: \ | ^~~~~~~~~~~~~~~~~ /tmp/B.ni56z2/BUILD/lttng-modules-2.12.0/lttng-modules-2.12.0/probes/../probes/lttng-tracepoint-event-impl.h:763:2: note: in definition of macro 'LTTNG_TRACEPOINT_EVENT_CLASS_CODE' 763 | _fields \ | ^~~~~~~ /tmp/B.ni56z2/BUILD/lttng-modules-2.12.0/lttng-modules-2.12.0/probes/../probes/lttng-tracepoint-event-impl.h:105:3: note: in expansion of macro 'PARAMS' 105 | PARAMS(_fields), ) | ^~~~~~ /tmp/B.ni56z2/BUILD/lttng-modules-2.12.0/lttng-modules-2.12.0/probes/../probes/lttng-tracepoint-event-impl.h:39:2: note: in expansion of macro 'LTTNG_TRACEPOINT_EVENT_CLASS' 39 | LTTNG_TRACEPOINT_EVENT_CLASS(map, \ | ^~~~~~~~~~~~~~~~~~~~~~~~~~~~ /tmp/B.ni56z2/BUILD/lttng-modules-2.12.0/lttng-modules-2.12.0/probes/../probes/lttng-tracepoint-event-impl.h:42:9: note: in expansion of macro 'PARAMS' 42 | PARAMS(fields)) \ | ^~~~~~ /tmp/B.ni56z2/BUILD/lttng-modules-2.12.0/lttng-modules-2.12.0/probes/../instrumentation/events/lttng-module/arch/x86/kvm/trace.h:422:1: note: in expansion of macro 'LTTNG_TRACEPOINT_EVENT_MAP' 422 | LTTNG_TRACEPOINT_EVENT_MAP(kvm_emulate_insn, kvm_x86_emulate_insn, | ^~~~~~~~~~~~~~~~~~~~~~~~~~ /tmp/B.ni56z2/BUILD/lttng-modules-2.12.0/lttng-modules-2.12.0/probes/../instrumentation/events/lttng-module/arch/x86/kvm/trace.h:426:2: note: in expansion of macro 'TP_FIELDS' 426 | TP_FIELDS( | ^~~~~~~~~ /tmp/B.ni56z2/BUILD/lttng-modules-2.12.0/lttng-modules-2.12.0/probes/../probes/lttng-tracepoint-event-impl.h:669:2: note: in expansion of macro '_ctf_integer_ext_fetched' 669 | _ctf_integer_ext_fetched(_type, _item, _src, _byte_order, _base, _nowrite) | ^~~~~~~~~~~~~~~~~~~~~~~~ /tmp/B.ni56z2/BUILD/lttng-modules-2.12.0/lttng-modules-2.12.0/probes/../probes/lttng-tracepoint-event-impl.h:686:2: note: in expansion of macro '_ctf_integer_ext_isuser0' 686 | _ctf_integer_ext_isuser##_user(_type, _item, _user_src, _byte_order, _base, _nowrite) | ^~~~~~~~~~~~~~~~~~~~~~~ /tmp/B.ni56z2/BUILD/lttng-modules-2.12.0/lttng-modules-2.12.0/probes/../probes/lttng-events-write.h:10:2: note: in expansion of macro '_ctf_integer_ext' 10 | _ctf_integer_ext(_type, _item, _src, __BYTE_ORDER, 10, 0, 0) | ^~~~~~~~~~~~~~~~ /tmp/B.ni56z2/BUILD/lttng-modules-2.12.0/lttng-modules-2.12.0/probes/../instrumentation/events/lttng-module/arch/x86/kvm/trace.h:448:3: note: in expansion of macro 'ctf_integer' 448 | ctf_integer(__u8, flags, kei_decode_mode(vcpu->arch.emulate_ctxt.mode)) | ^~~~~~~~~~~ /tmp/B.ni56z2/BUILD/lttng-modules-2.12.0/lttng-modules-2.12.0/probes/../instrumentation/events/lttng-module/arch/x86/kvm/trace.h:448:28: note: in expansion of macro 'kei_decode_mode' 448 | ctf_integer(__u8, flags, kei_decode_mode(vcpu->arch.emulate_ctxt.mode)) | ^~~~~~~~~~~~~~~ /tmp/B.ni56z2/BUILD/lttng-modules-2.12.0/lttng-modules-2.12.0/probes/../instrumentation/events/lttng-module/arch/x86/kvm/trace.h:404:7: error: 'X86EMUL_MODE_VM86' undeclared (first use in this function) 404 | case X86EMUL_MODE_VM86: \ | ^~~~~~~~~~~~~~~~~ /tmp/B.ni56z2/BUILD/lttng-modules-2.12.0/lttng-modules-2.12.0/probes/../probes/lttng-tracepoint-event-impl.h:763:2: note: in definition of macro 'LTTNG_TRACEPOINT_EVENT_CLASS_CODE' 763 | _fields \ | ^~~~~~~ /tmp/B.ni56z2/BUILD/lttng-modules-2.12.0/lttng-modules-2.12.0/probes/../probes/lttng-tracepoint-event-impl.h:105:3: note: in expansion of macro 'PARAMS' 105 | PARAMS(_fields), ) | ^~~~~~ /tmp/B.ni56z2/BUILD/lttng-modules-2.12.0/lttng-modules-2.12.0/probes/../probes/lttng-tracepoint-event-impl.h:39:2: note: in expansion of macro 'LTTNG_TRACEPOINT_EVENT_CLASS' 39 | LTTNG_TRACEPOINT_EVENT_CLASS(map, \ | ^~~~~~~~~~~~~~~~~~~~~~~~~~~~ /tmp/B.ni56z2/BUILD/lttng-modules-2.12.0/lttng-modules-2.12.0/probes/../probes/lttng-tracepoint-event-impl.h:42:9: note: in expansion of macro 'PARAMS' 42 | PARAMS(fields)) \ | ^~~~~~ /tmp/B.ni56z2/BUILD/lttng-modules-2.12.0/lttng-modules-2.12.0/probes/../instrumentation/events/lttng-module/arch/x86/kvm/trace.h:422:1: note: in expansion of macro 'LTTNG_TRACEPOINT_EVENT_MAP' 422 | LTTNG_TRACEPOINT_EVENT_MAP(kvm_emulate_insn, kvm_x86_emulate_insn, | ^~~~~~~~~~~~~~~~~~~~~~~~~~ /tmp/B.ni56z2/BUILD/lttng-modules-2.12.0/lttng-modules-2.12.0/probes/../instrumentation/events/lttng-module/arch/x86/kvm/trace.h:426:2: note: in expansion of macro 'TP_FIELDS' 426 | TP_FIELDS( | ^~~~~~~~~ /tmp/B.ni56z2/BUILD/lttng-modules-2.12.0/lttng-modules-2.12.0/probes/../probes/lttng-tracepoint-event-impl.h:669:2: note: in expansion of macro '_ctf_integer_ext_fetched' 669 | _ctf_integer_ext_fetched(_type, _item, _src, _byte_order, _base, _nowrite) | ^~~~~~~~~~~~~~~~~~~~~~~~ /tmp/B.ni56z2/BUILD/lttng-modules-2.12.0/lttng-modules-2.12.0/probes/../probes/lttng-tracepoint-event-impl.h:686:2: note: in expansion of macro '_ctf_integer_ext_isuser0' 686 | _ctf_integer_ext_isuser##_user(_type, _item, _user_src, _byte_order, _base, _nowrite) | ^~~~~~~~~~~~~~~~~~~~~~~ /tmp/B.ni56z2/BUILD/lttng-modules-2.12.0/lttng-modules-2.12.0/probes/../probes/lttng-events-write.h:10:2: note: in expansion of macro '_ctf_integer_ext' 10 | _ctf_integer_ext(_type, _item, _src, __BYTE_ORDER, 10, 0, 0) | ^~~~~~~~~~~~~~~~ /tmp/B.ni56z2/BUILD/lttng-modules-2.12.0/lttng-modules-2.12.0/probes/../instrumentation/events/lttng-module/arch/x86/kvm/trace.h:448:3: note: in expansion of macro 'ctf_integer' 448 | ctf_integer(__u8, flags, kei_decode_mode(vcpu->arch.emulate_ctxt.mode)) | ^~~~~~~~~~~ /tmp/B.ni56z2/BUILD/lttng-modules-2.12.0/lttng-modules-2.12.0/probes/../instrumentation/events/lttng-module/arch/x86/kvm/trace.h:448:28: note: in expansion of macro 'kei_decode_mode' 448 | ctf_integer(__u8, flags, kei_decode_mode(vcpu->arch.emulate_ctxt.mode)) | ^~~~~~~~~~~~~~~ /tmp/B.ni56z2/BUILD/lttng-modules-2.12.0/lttng-modules-2.12.0/probes/../instrumentation/events/lttng-module/arch/x86/kvm/trace.h:407:7: error: 'X86EMUL_MODE_PROT16' undeclared (first use in this function) 407 | case X86EMUL_MODE_PROT16: \ | ^~~~~~~~~~~~~~~~~~~ /tmp/B.ni56z2/BUILD/lttng-modules-2.12.0/lttng-modules-2.12.0/probes/../probes/lttng-tracepoint-event-impl.h:763:2: note: in definition of macro 'LTTNG_TRACEPOINT_EVENT_CLASS_CODE' 763 | _fields \ | ^~~~~~~ /tmp/B.ni56z2/BUILD/lttng-modules-2.12.0/lttng-modules-2.12.0/probes/../probes/lttng-tracepoint-event-impl.h:105:3: note: in expansion of macro 'PARAMS' 105 | PARAMS(_fields), ) | ^~~~~~ /tmp/B.ni56z2/BUILD/lttng-modules-2.12.0/lttng-modules-2.12.0/probes/../probes/lttng-tracepoint-event-impl.h:39:2: note: in expansion of macro 'LTTNG_TRACEPOINT_EVENT_CLASS' 39 | LTTNG_TRACEPOINT_EVENT_CLASS(map, \ | ^~~~~~~~~~~~~~~~~~~~~~~~~~~~ /tmp/B.ni56z2/BUILD/lttng-modules-2.12.0/lttng-modules-2.12.0/probes/../probes/lttng-tracepoint-event-impl.h:42:9: note: in expansion of macro 'PARAMS' 42 | PARAMS(fields)) \ | ^~~~~~ /tmp/B.ni56z2/BUILD/lttng-modules-2.12.0/lttng-modules-2.12.0/probes/../instrumentation/events/lttng-module/arch/x86/kvm/trace.h:422:1: note: in expansion of macro 'LTTNG_TRACEPOINT_EVENT_MAP' 422 | LTTNG_TRACEPOINT_EVENT_MAP(kvm_emulate_insn, kvm_x86_emulate_insn, | ^~~~~~~~~~~~~~~~~~~~~~~~~~ /tmp/B.ni56z2/BUILD/lttng-modules-2.12.0/lttng-modules-2.12.0/probes/../instrumentation/events/lttng-module/arch/x86/kvm/trace.h:426:2: note: in expansion of macro 'TP_FIELDS' 426 | TP_FIELDS( | ^~~~~~~~~ /tmp/B.ni56z2/BUILD/lttng-modules-2.12.0/lttng-modules-2.12.0/probes/../probes/lttng-tracepoint-event-impl.h:669:2: note: in expansion of macro '_ctf_integer_ext_fetched' 669 | _ctf_integer_ext_fetched(_type, _item, _src, _byte_order, _base, _nowrite) | ^~~~~~~~~~~~~~~~~~~~~~~~ /tmp/B.ni56z2/BUILD/lttng-modules-2.12.0/lttng-modules-2.12.0/probes/../probes/lttng-tracepoint-event-impl.h:686:2: note: in expansion of macro '_ctf_integer_ext_isuser0' 686 | _ctf_integer_ext_isuser##_user(_type, _item, _user_src, _byte_order, _base, _nowrite) | ^~~~~~~~~~~~~~~~~~~~~~~ /tmp/B.ni56z2/BUILD/lttng-modules-2.12.0/lttng-modules-2.12.0/probes/../probes/lttng-events-write.h:10:2: note: in expansion of macro '_ctf_integer_ext' 10 | _ctf_integer_ext(_type, _item, _src, __BYTE_ORDER, 10, 0, 0) | ^~~~~~~~~~~~~~~~ /tmp/B.ni56z2/BUILD/lttng-modules-2.12.0/lttng-modules-2.12.0/probes/../instrumentation/events/lttng-module/arch/x86/kvm/trace.h:448:3: note: in expansion of macro 'ctf_integer' 448 | ctf_integer(__u8, flags, kei_decode_mode(vcpu->arch.emulate_ctxt.mode)) | ^~~~~~~~~~~ /tmp/B.ni56z2/BUILD/lttng-modules-2.12.0/lttng-modules-2.12.0/probes/../instrumentation/events/lttng-module/arch/x86/kvm/trace.h:448:28: note: in expansion of macro 'kei_decode_mode' 448 | ctf_integer(__u8, flags, kei_decode_mode(vcpu->arch.emulate_ctxt.mode)) | ^~~~~~~~~~~~~~~ /tmp/B.ni56z2/BUILD/lttng-modules-2.12.0/lttng-modules-2.12.0/probes/../instrumentation/events/lttng-module/arch/x86/kvm/trace.h:410:7: error: 'X86EMUL_MODE_PROT32' undeclared (first use in this function) 410 | case X86EMUL_MODE_PROT32: \ | ^~~~~~~~~~~~~~~~~~~ /tmp/B.ni56z2/BUILD/lttng-modules-2.12.0/lttng-modules-2.12.0/probes/../probes/lttng-tracepoint-event-impl.h:763:2: note: in definition of macro 'LTTNG_TRACEPOINT_EVENT_CLASS_CODE' 763 | _fields \ | ^~~~~~~ /tmp/B.ni56z2/BUILD/lttng-modules-2.12.0/lttng-modules-2.12.0/probes/../probes/lttng-tracepoint-event-impl.h:105:3: note: in expansion of macro 'PARAMS' 105 | PARAMS(_fields), ) | ^~~~~~ /tmp/B.ni56z2/BUILD/lttng-modules-2.12.0/lttng-modules-2.12.0/probes/../probes/lttng-tracepoint-event-impl.h:39:2: note: in expansion of macro 'LTTNG_TRACEPOINT_EVENT_CLASS' 39 | LTTNG_TRACEPOINT_EVENT_CLASS(map, \ | ^~~~~~~~~~~~~~~~~~~~~~~~~~~~ /tmp/B.ni56z2/BUILD/lttng-modules-2.12.0/lttng-modules-2.12.0/probes/../probes/lttng-tracepoint-event-impl.h:42:9: note: in expansion of macro 'PARAMS' 42 | PARAMS(fields)) \ | ^~~~~~ /tmp/B.ni56z2/BUILD/lttng-modules-2.12.0/lttng-modules-2.12.0/probes/../instrumentation/events/lttng-module/arch/x86/kvm/trace.h:422:1: note: in expansion of macro 'LTTNG_TRACEPOINT_EVENT_MAP' 422 | LTTNG_TRACEPOINT_EVENT_MAP(kvm_emulate_insn, kvm_x86_emulate_insn, | ^~~~~~~~~~~~~~~~~~~~~~~~~~ /tmp/B.ni56z2/BUILD/lttng-modules-2.12.0/lttng-modules-2.12.0/probes/../instrumentation/events/lttng-module/arch/x86/kvm/trace.h:426:2: note: in expansion of macro 'TP_FIELDS' 426 | TP_FIELDS( | ^~~~~~~~~ /tmp/B.ni56z2/BUILD/lttng-modules-2.12.0/lttng-modules-2.12.0/probes/../probes/lttng-tracepoint-event-impl.h:669:2: note: in expansion of macro '_ctf_integer_ext_fetched' 669 | _ctf_integer_ext_fetched(_type, _item, _src, _byte_order, _base, _nowrite) | ^~~~~~~~~~~~~~~~~~~~~~~~ /tmp/B.ni56z2/BUILD/lttng-modules-2.12.0/lttng-modules-2.12.0/probes/../probes/lttng-tracepoint-event-impl.h:686:2: note: in expansion of macro '_ctf_integer_ext_isuser0' 686 | _ctf_integer_ext_isuser##_user(_type, _item, _user_src, _byte_order, _base, _nowrite) | ^~~~~~~~~~~~~~~~~~~~~~~ /tmp/B.ni56z2/BUILD/lttng-modules-2.12.0/lttng-modules-2.12.0/probes/../probes/lttng-events-write.h:10:2: note: in expansion of macro '_ctf_integer_ext' 10 | _ctf_integer_ext(_type, _item, _src, __BYTE_ORDER, 10, 0, 0) | ^~~~~~~~~~~~~~~~ /tmp/B.ni56z2/BUILD/lttng-modules-2.12.0/lttng-modules-2.12.0/probes/../instrumentation/events/lttng-module/arch/x86/kvm/trace.h:448:3: note: in expansion of macro 'ctf_integer' 448 | ctf_integer(__u8, flags, kei_decode_mode(vcpu->arch.emulate_ctxt.mode)) | ^~~~~~~~~~~ /tmp/B.ni56z2/BUILD/lttng-modules-2.12.0/lttng-modules-2.12.0/probes/../instrumentation/events/lttng-module/arch/x86/kvm/trace.h:448:28: note: in expansion of macro 'kei_decode_mode' 448 | ctf_integer(__u8, flags, kei_decode_mode(vcpu->arch.emulate_ctxt.mode)) | ^~~~~~~~~~~~~~~ /tmp/B.ni56z2/BUILD/lttng-modules-2.12.0/lttng-modules-2.12.0/probes/../instrumentation/events/lttng-module/arch/x86/kvm/trace.h:414:7: error: 'X86EMUL_MODE_PROT64' undeclared (first use in this function) 414 | case X86EMUL_MODE_PROT64: \ | ^~~~~~~~~~~~~~~~~~~ /tmp/B.ni56z2/BUILD/lttng-modules-2.12.0/lttng-modules-2.12.0/probes/../probes/lttng-tracepoint-event-impl.h:763:2: note: in definition of macro 'LTTNG_TRACEPOINT_EVENT_CLASS_CODE' 763 | _fields \ | ^~~~~~~ /tmp/B.ni56z2/BUILD/lttng-modules-2.12.0/lttng-modules-2.12.0/probes/../probes/lttng-tracepoint-event-impl.h:105:3: note: in expansion of macro 'PARAMS' 105 | PARAMS(_fields), ) | ^~~~~~ /tmp/B.ni56z2/BUILD/lttng-modules-2.12.0/lttng-modules-2.12.0/probes/../probes/lttng-tracepoint-event-impl.h:39:2: note: in expansion of macro 'LTTNG_TRACEPOINT_EVENT_CLASS' 39 | LTTNG_TRACEPOINT_EVENT_CLASS(map, \ | ^~~~~~~~~~~~~~~~~~~~~~~~~~~~ /tmp/B.ni56z2/BUILD/lttng-modules-2.12.0/lttng-modules-2.12.0/probes/../probes/lttng-tracepoint-event-impl.h:42:9: note: in expansion of macro 'PARAMS' 42 | PARAMS(fields)) \ | ^~~~~~ /tmp/B.ni56z2/BUILD/lttng-modules-2.12.0/lttng-modules-2.12.0/probes/../instrumentation/events/lttng-module/arch/x86/kvm/trace.h:422:1: note: in expansion of macro 'LTTNG_TRACEPOINT_EVENT_MAP' 422 | LTTNG_TRACEPOINT_EVENT_MAP(kvm_emulate_insn, kvm_x86_emulate_insn, | ^~~~~~~~~~~~~~~~~~~~~~~~~~ /tmp/B.ni56z2/BUILD/lttng-modules-2.12.0/lttng-modules-2.12.0/probes/../instrumentation/events/lttng-module/arch/x86/kvm/trace.h:426:2: note: in expansion of macro 'TP_FIELDS' 426 | TP_FIELDS( | ^~~~~~~~~ /tmp/B.ni56z2/BUILD/lttng-modules-2.12.0/lttng-modules-2.12.0/probes/../probes/lttng-tracepoint-event-impl.h:669:2: note: in expansion of macro '_ctf_integer_ext_fetched' 669 | _ctf_integer_ext_fetched(_type, _item, _src, _byte_order, _base, _nowrite) | ^~~~~~~~~~~~~~~~~~~~~~~~ /tmp/B.ni56z2/BUILD/lttng-modules-2.12.0/lttng-modules-2.12.0/probes/../probes/lttng-tracepoint-event-impl.h:686:2: note: in expansion of macro '_ctf_integer_ext_isuser0' 686 | _ctf_integer_ext_isuser##_user(_type, _item, _user_src, _byte_order, _base, _nowrite) | ^~~~~~~~~~~~~~~~~~~~~~~ /tmp/B.ni56z2/BUILD/lttng-modules-2.12.0/lttng-modules-2.12.0/probes/../probes/lttng-events-write.h:10:2: note: in expansion of macro '_ctf_integer_ext' 10 | _ctf_integer_ext(_type, _item, _src, __BYTE_ORDER, 10, 0, 0) | ^~~~~~~~~~~~~~~~ /tmp/B.ni56z2/BUILD/lttng-modules-2.12.0/lttng-modules-2.12.0/probes/../instrumentation/events/lttng-module/arch/x86/kvm/trace.h:448:3: note: in expansion of macro 'ctf_integer' 448 | ctf_integer(__u8, flags, kei_decode_mode(vcpu->arch.emulate_ctxt.mode)) | ^~~~~~~~~~~ /tmp/B.ni56z2/BUILD/lttng-modules-2.12.0/lttng-modules-2.12.0/probes/../instrumentation/events/lttng-module/arch/x86/kvm/trace.h:448:28: note: in expansion of macro 'kei_decode_mode' 448 | ctf_integer(__u8, flags, kei_decode_mode(vcpu->arch.emulate_ctxt.mode)) | ^~~~~~~~~~~~~~~ /tmp/B.ni56z2/BUILD/lttng-modules-2.12.0/lttng-modules-2.12.0/probes/../instrumentation/events/lttng-module/arch/x86/kvm/trace.h:448:67: error: 'vcpu->arch.emulate_ctxt' is a pointer; did you mean to use '->'? 448 | ctf_integer(__u8, flags, kei_decode_mode(vcpu->arch.emulate_ctxt.mode)) | ^ /tmp/B.ni56z2/BUILD/lttng-modules-2.12.0/lttng-modules-2.12.0/probes/../probes/lttng-tracepoint-event-impl.h:763:2: note: in definition of macro 'LTTNG_TRACEPOINT_EVENT_CLASS_CODE' 763 | _fields \ | ^~~~~~~ /tmp/B.ni56z2/BUILD/lttng-modules-2.12.0/lttng-modules-2.12.0/probes/../probes/lttng-tracepoint-event-impl.h:105:3: note: in expansion of macro 'PARAMS' 105 | PARAMS(_fields), ) | ^~~~~~ /tmp/B.ni56z2/BUILD/lttng-modules-2.12.0/lttng-modules-2.12.0/probes/../probes/lttng-tracepoint-event-impl.h:39:2: note: in expansion of macro 'LTTNG_TRACEPOINT_EVENT_CLASS' 39 | LTTNG_TRACEPOINT_EVENT_CLASS(map, \ | ^~~~~~~~~~~~~~~~~~~~~~~~~~~~ /tmp/B.ni56z2/BUILD/lttng-modules-2.12.0/lttng-modules-2.12.0/probes/../probes/lttng-tracepoint-event-impl.h:42:9: note: in expansion of macro 'PARAMS' 42 | PARAMS(fields)) \ | ^~~~~~ /tmp/B.ni56z2/BUILD/lttng-modules-2.12.0/lttng-modules-2.12.0/probes/../instrumentation/events/lttng-module/arch/x86/kvm/trace.h:422:1: note: in expansion of macro 'LTTNG_TRACEPOINT_EVENT_MAP' 422 | LTTNG_TRACEPOINT_EVENT_MAP(kvm_emulate_insn, kvm_x86_emulate_insn, | ^~~~~~~~~~~~~~~~~~~~~~~~~~ /tmp/B.ni56z2/BUILD/lttng-modules-2.12.0/lttng-modules-2.12.0/probes/../instrumentation/events/lttng-module/arch/x86/kvm/trace.h:426:2: note: in expansion of macro 'TP_FIELDS' 426 | TP_FIELDS( | ^~~~~~~~~ /tmp/B.ni56z2/BUILD/lttng-modules-2.12.0/lttng-modules-2.12.0/probes/../probes/lttng-tracepoint-event-impl.h:669:2: note: in expansion of macro '_ctf_integer_ext_fetched' 669 | _ctf_integer_ext_fetched(_type, _item, _src, _byte_order, _base, _nowrite) | ^~~~~~~~~~~~~~~~~~~~~~~~ /tmp/B.ni56z2/BUILD/lttng-modules-2.12.0/lttng-modules-2.12.0/probes/../probes/lttng-tracepoint-event-impl.h:686:2: note: in expansion of macro '_ctf_integer_ext_isuser0' 686 | _ctf_integer_ext_isuser##_user(_type, _item, _user_src, _byte_order, _base, _nowrite) | ^~~~~~~~~~~~~~~~~~~~~~~ /tmp/B.ni56z2/BUILD/lttng-modules-2.12.0/lttng-modules-2.12.0/probes/../probes/lttng-events-write.h:10:2: note: in expansion of macro '_ctf_integer_ext' 10 | _ctf_integer_ext(_type, _item, _src, __BYTE_ORDER, 10, 0, 0) | ^~~~~~~~~~~~~~~~ /tmp/B.ni56z2/BUILD/lttng-modules-2.12.0/lttng-modules-2.12.0/probes/../instrumentation/events/lttng-module/arch/x86/kvm/trace.h:448:3: note: in expansion of macro 'ctf_integer' 448 | ctf_integer(__u8, flags, kei_decode_mode(vcpu->arch.emulate_ctxt.mode)) | ^~~~~~~~~~~ /tmp/B.ni56z2/BUILD/lttng-modules-2.12.0/lttng-modules-2.12.0/probes/../instrumentation/events/lttng-module/arch/x86/kvm/trace.h:448:28: note: in expansion of macro 'kei_decode_mode' 448 | ctf_integer(__u8, flags, kei_decode_mode(vcpu->arch.emulate_ctxt.mode)) | ^~~~~~~~~~~~~~~ /tmp/B.ni56z2/BUILD/lttng-modules-2.12.0/lttng-modules-2.12.0/probes/../instrumentation/events/lttng-module/arch/x86/kvm/trace.h:448:67: error: 'vcpu->arch.emulate_ctxt' is a pointer; did you mean to use '->'? 448 | ctf_integer(__u8, flags, kei_decode_mode(vcpu->arch.emulate_ctxt.mode)) | ^ /tmp/B.ni56z2/BUILD/lttng-modules-2.12.0/lttng-modules-2.12.0/probes/../probes/lttng-tracepoint-event-impl.h:763:2: note: in definition of macro 'LTTNG_TRACEPOINT_EVENT_CLASS_CODE' 763 | _fields \ | ^~~~~~~ /tmp/B.ni56z2/BUILD/lttng-modules-2.12.0/lttng-modules-2.12.0/probes/../probes/lttng-tracepoint-event-impl.h:105:3: note: in expansion of macro 'PARAMS' 105 | PARAMS(_fields), ) | ^~~~~~ /tmp/B.ni56z2/BUILD/lttng-modules-2.12.0/lttng-modules-2.12.0/probes/../probes/lttng-tracepoint-event-impl.h:39:2: note: in expansion of macro 'LTTNG_TRACEPOINT_EVENT_CLASS' 39 | LTTNG_TRACEPOINT_EVENT_CLASS(map, \ | ^~~~~~~~~~~~~~~~~~~~~~~~~~~~ /tmp/B.ni56z2/BUILD/lttng-modules-2.12.0/lttng-modules-2.12.0/probes/../probes/lttng-tracepoint-event-impl.h:42:9: note: in expansion of macro 'PARAMS' 42 | PARAMS(fields)) \ | ^~~~~~ /tmp/B.ni56z2/BUILD/lttng-modules-2.12.0/lttng-modules-2.12.0/probes/../instrumentation/events/lttng-module/arch/x86/kvm/trace.h:422:1: note: in expansion of macro 'LTTNG_TRACEPOINT_EVENT_MAP' 422 | LTTNG_TRACEPOINT_EVENT_MAP(kvm_emulate_insn, kvm_x86_emulate_insn, | ^~~~~~~~~~~~~~~~~~~~~~~~~~ /tmp/B.ni56z2/BUILD/lttng-modules-2.12.0/lttng-modules-2.12.0/probes/../instrumentation/events/lttng-module/arch/x86/kvm/trace.h:426:2: note: in expansion of macro 'TP_FIELDS' 426 | TP_FIELDS( | ^~~~~~~~~ /tmp/B.ni56z2/BUILD/lttng-modules-2.12.0/lttng-modules-2.12.0/probes/../probes/lttng-tracepoint-event-impl.h:669:2: note: in expansion of macro '_ctf_integer_ext_fetched' 669 | _ctf_integer_ext_fetched(_type, _item, _src, _byte_order, _base, _nowrite) | ^~~~~~~~~~~~~~~~~~~~~~~~ /tmp/B.ni56z2/BUILD/lttng-modules-2.12.0/lttng-modules-2.12.0/probes/../probes/lttng-tracepoint-event-impl.h:686:2: note: in expansion of macro '_ctf_integer_ext_isuser0' 686 | _ctf_integer_ext_isuser##_user(_type, _item, _user_src, _byte_order, _base, _nowrite) | ^~~~~~~~~~~~~~~~~~~~~~~ /tmp/B.ni56z2/BUILD/lttng-modules-2.12.0/lttng-modules-2.12.0/probes/../probes/lttng-events-write.h:10:2: note: in expansion of macro '_ctf_integer_ext' 10 | _ctf_integer_ext(_type, _item, _src, __BYTE_ORDER, 10, 0, 0) | ^~~~~~~~~~~~~~~~ /tmp/B.ni56z2/BUILD/lttng-modules-2.12.0/lttng-modules-2.12.0/probes/../instrumentation/events/lttng-module/arch/x86/kvm/trace.h:448:3: note: in expansion of macro 'ctf_integer' 448 | ctf_integer(__u8, flags, kei_decode_mode(vcpu->arch.emulate_ctxt.mode)) | ^~~~~~~~~~~ /tmp/B.ni56z2/BUILD/lttng-modules-2.12.0/lttng-modules-2.12.0/probes/../instrumentation/events/lttng-module/arch/x86/kvm/trace.h:448:28: note: in expansion of macro 'kei_decode_mode' 448 | ctf_integer(__u8, flags, kei_decode_mode(vcpu->arch.emulate_ctxt.mode)) | ^~~~~~~~~~~~~~~ /tmp/B.ni56z2/BUILD/lttng-modules-2.12.0/lttng-modules-2.12.0/probes/../instrumentation/events/lttng-module/arch/x86/kvm/trace.h:448:67: error: 'vcpu->arch.emulate_ctxt' is a pointer; did you mean to use '->'? 448 | ctf_integer(__u8, flags, kei_decode_mode(vcpu->arch.emulate_ctxt.mode)) | ^ /tmp/B.ni56z2/BUILD/lttng-modules-2.12.0/lttng-modules-2.12.0/probes/../probes/lttng-tracepoint-event-impl.h:763:2: note: in definition of macro 'LTTNG_TRACEPOINT_EVENT_CLASS_CODE' 763 | _fields \ | ^~~~~~~ /tmp/B.ni56z2/BUILD/lttng-modules-2.12.0/lttng-modules-2.12.0/probes/../probes/lttng-tracepoint-event-impl.h:105:3: note: in expansion of macro 'PARAMS' 105 | PARAMS(_fields), ) | ^~~~~~ /tmp/B.ni56z2/BUILD/lttng-modules-2.12.0/lttng-modules-2.12.0/probes/../probes/lttng-tracepoint-event-impl.h:39:2: note: in expansion of macro 'LTTNG_TRACEPOINT_EVENT_CLASS' 39 | LTTNG_TRACEPOINT_EVENT_CLASS(map, \ | ^~~~~~~~~~~~~~~~~~~~~~~~~~~~ /tmp/B.ni56z2/BUILD/lttng-modules-2.12.0/lttng-modules-2.12.0/probes/../probes/lttng-tracepoint-event-impl.h:42:9: note: in expansion of macro 'PARAMS' 42 | PARAMS(fields)) \ | ^~~~~~ /tmp/B.ni56z2/BUILD/lttng-modules-2.12.0/lttng-modules-2.12.0/probes/../instrumentation/events/lttng-module/arch/x86/kvm/trace.h:422:1: note: in expansion of macro 'LTTNG_TRACEPOINT_EVENT_MAP' 422 | LTTNG_TRACEPOINT_EVENT_MAP(kvm_emulate_insn, kvm_x86_emulate_insn, | ^~~~~~~~~~~~~~~~~~~~~~~~~~ /tmp/B.ni56z2/BUILD/lttng-modules-2.12.0/lttng-modules-2.12.0/probes/../instrumentation/events/lttng-module/arch/x86/kvm/trace.h:426:2: note: in expansion of macro 'TP_FIELDS' 426 | TP_FIELDS( | ^~~~~~~~~ /tmp/B.ni56z2/BUILD/lttng-modules-2.12.0/lttng-modules-2.12.0/probes/../probes/lttng-tracepoint-event-impl.h:669:2: note: in expansion of macro '_ctf_integer_ext_fetched' 669 | _ctf_integer_ext_fetched(_type, _item, _src, _byte_order, _base, _nowrite) | ^~~~~~~~~~~~~~~~~~~~~~~~ /tmp/B.ni56z2/BUILD/lttng-modules-2.12.0/lttng-modules-2.12.0/probes/../probes/lttng-tracepoint-event-impl.h:686:2: note: in expansion of macro '_ctf_integer_ext_isuser0' 686 | _ctf_integer_ext_isuser##_user(_type, _item, _user_src, _byte_order, _base, _nowrite) | ^~~~~~~~~~~~~~~~~~~~~~~ /tmp/B.ni56z2/BUILD/lttng-modules-2.12.0/lttng-modules-2.12.0/probes/../probes/lttng-events-write.h:10:2: note: in expansion of macro '_ctf_integer_ext' 10 | _ctf_integer_ext(_type, _item, _src, __BYTE_ORDER, 10, 0, 0) | ^~~~~~~~~~~~~~~~ /tmp/B.ni56z2/BUILD/lttng-modules-2.12.0/lttng-modules-2.12.0/probes/../instrumentation/events/lttng-module/arch/x86/kvm/trace.h:448:3: note: in expansion of macro 'ctf_integer' 448 | ctf_integer(__u8, flags, kei_decode_mode(vcpu->arch.emulate_ctxt.mode)) | ^~~~~~~~~~~ /tmp/B.ni56z2/BUILD/lttng-modules-2.12.0/lttng-modules-2.12.0/probes/../instrumentation/events/lttng-module/arch/x86/kvm/trace.h:448:28: note: in expansion of macro 'kei_decode_mode' 448 | ctf_integer(__u8, flags, kei_decode_mode(vcpu->arch.emulate_ctxt.mode)) | ^~~~~~~~~~~~~~~ /tmp/B.ni56z2/BUILD/lttng-modules-2.12.0/lttng-modules-2.12.0/probes/../instrumentation/events/lttng-module/arch/x86/kvm/trace.h:448:67: error: 'vcpu->arch.emulate_ctxt' is a pointer; did you mean to use '->'? 448 | ctf_integer(__u8, flags, kei_decode_mode(vcpu->arch.emulate_ctxt.mode)) | ^ /tmp/B.ni56z2/BUILD/lttng-modules-2.12.0/lttng-modules-2.12.0/probes/../probes/lttng-tracepoint-event-impl.h:763:2: note: in definition of macro 'LTTNG_TRACEPOINT_EVENT_CLASS_CODE' 763 | _fields \ | ^~~~~~~ /tmp/B.ni56z2/BUILD/lttng-modules-2.12.0/lttng-modules-2.12.0/probes/../probes/lttng-tracepoint-event-impl.h:105:3: note: in expansion of macro 'PARAMS' 105 | PARAMS(_fields), ) | ^~~~~~ /tmp/B.ni56z2/BUILD/lttng-modules-2.12.0/lttng-modules-2.12.0/probes/../probes/lttng-tracepoint-event-impl.h:39:2: note: in expansion of macro 'LTTNG_TRACEPOINT_EVENT_CLASS' 39 | LTTNG_TRACEPOINT_EVENT_CLASS(map, \ | ^~~~~~~~~~~~~~~~~~~~~~~~~~~~ /tmp/B.ni56z2/BUILD/lttng-modules-2.12.0/lttng-modules-2.12.0/probes/../probes/lttng-tracepoint-event-impl.h:42:9: note: in expansion of macro 'PARAMS' 42 | PARAMS(fields)) \ | ^~~~~~ /tmp/B.ni56z2/BUILD/lttng-modules-2.12.0/lttng-modules-2.12.0/probes/../instrumentation/events/lttng-module/arch/x86/kvm/trace.h:422:1: note: in expansion of macro 'LTTNG_TRACEPOINT_EVENT_MAP' 422 | LTTNG_TRACEPOINT_EVENT_MAP(kvm_emulate_insn, kvm_x86_emulate_insn, | ^~~~~~~~~~~~~~~~~~~~~~~~~~ /tmp/B.ni56z2/BUILD/lttng-modules-2.12.0/lttng-modules-2.12.0/probes/../instrumentation/events/lttng-module/arch/x86/kvm/trace.h:426:2: note: in expansion of macro 'TP_FIELDS' 426 | TP_FIELDS( | ^~~~~~~~~ /tmp/B.ni56z2/BUILD/lttng-modules-2.12.0/lttng-modules-2.12.0/probes/../probes/lttng-tracepoint-event-impl.h:669:2: note: in expansion of macro '_ctf_integer_ext_fetched' 669 | _ctf_integer_ext_fetched(_type, _item, _src, _byte_order, _base, _nowrite) | ^~~~~~~~~~~~~~~~~~~~~~~~ /tmp/B.ni56z2/BUILD/lttng-modules-2.12.0/lttng-modules-2.12.0/probes/../probes/lttng-tracepoint-event-impl.h:686:2: note: in expansion of macro '_ctf_integer_ext_isuser0' 686 | _ctf_integer_ext_isuser##_user(_type, _item, _user_src, _byte_order, _base, _nowrite) | ^~~~~~~~~~~~~~~~~~~~~~~ /tmp/B.ni56z2/BUILD/lttng-modules-2.12.0/lttng-modules-2.12.0/probes/../probes/lttng-events-write.h:10:2: note: in expansion of macro '_ctf_integer_ext' 10 | _ctf_integer_ext(_type, _item, _src, __BYTE_ORDER, 10, 0, 0) | ^~~~~~~~~~~~~~~~ /tmp/B.ni56z2/BUILD/lttng-modules-2.12.0/lttng-modules-2.12.0/probes/../instrumentation/events/lttng-module/arch/x86/kvm/trace.h:448:3: note: in expansion of macro 'ctf_integer' 448 | ctf_integer(__u8, flags, kei_decode_mode(vcpu->arch.emulate_ctxt.mode)) | ^~~~~~~~~~~ /tmp/B.ni56z2/BUILD/lttng-modules-2.12.0/lttng-modules-2.12.0/probes/../instrumentation/events/lttng-module/arch/x86/kvm/trace.h:448:28: note: in expansion of macro 'kei_decode_mode' 448 | ctf_integer(__u8, flags, kei_decode_mode(vcpu->arch.emulate_ctxt.mode)) | ^~~~~~~~~~~~~~~ /tmp/B.ni56z2/BUILD/lttng-modules-2.12.0/lttng-modules-2.12.0/probes/../instrumentation/events/lttng-module/arch/x86/kvm/trace.h:448:67: error: 'vcpu->arch.emulate_ctxt' is a pointer; did you mean to use '->'? 448 | ctf_integer(__u8, flags, kei_decode_mode(vcpu->arch.emulate_ctxt.mode)) | ^ /tmp/B.ni56z2/BUILD/lttng-modules-2.12.0/lttng-modules-2.12.0/probes/../probes/lttng-tracepoint-event-impl.h:763:2: note: in definition of macro 'LTTNG_TRACEPOINT_EVENT_CLASS_CODE' 763 | _fields \ | ^~~~~~~ /tmp/B.ni56z2/BUILD/lttng-modules-2.12.0/lttng-modules-2.12.0/probes/../probes/lttng-tracepoint-event-impl.h:105:3: note: in expansion of macro 'PARAMS' 105 | PARAMS(_fields), ) | ^~~~~~ /tmp/B.ni56z2/BUILD/lttng-modules-2.12.0/lttng-modules-2.12.0/probes/../probes/lttng-tracepoint-event-impl.h:39:2: note: in expansion of macro 'LTTNG_TRACEPOINT_EVENT_CLASS' 39 | LTTNG_TRACEPOINT_EVENT_CLASS(map, \ | ^~~~~~~~~~~~~~~~~~~~~~~~~~~~ /tmp/B.ni56z2/BUILD/lttng-modules-2.12.0/lttng-modules-2.12.0/probes/../probes/lttng-tracepoint-event-impl.h:42:9: note: in expansion of macro 'PARAMS' 42 | PARAMS(fields)) \ | ^~~~~~ /tmp/B.ni56z2/BUILD/lttng-modules-2.12.0/lttng-modules-2.12.0/probes/../instrumentation/events/lttng-module/arch/x86/kvm/trace.h:422:1: note: in expansion of macro 'LTTNG_TRACEPOINT_EVENT_MAP' 422 | LTTNG_TRACEPOINT_EVENT_MAP(kvm_emulate_insn, kvm_x86_emulate_insn, | ^~~~~~~~~~~~~~~~~~~~~~~~~~ /tmp/B.ni56z2/BUILD/lttng-modules-2.12.0/lttng-modules-2.12.0/probes/../instrumentation/events/lttng-module/arch/x86/kvm/trace.h:426:2: note: in expansion of macro 'TP_FIELDS' 426 | TP_FIELDS( | ^~~~~~~~~ /tmp/B.ni56z2/BUILD/lttng-modules-2.12.0/lttng-modules-2.12.0/probes/../probes/lttng-tracepoint-event-impl.h:669:2: note: in expansion of macro '_ctf_integer_ext_fetched' 669 | _ctf_integer_ext_fetched(_type, _item, _src, _byte_order, _base, _nowrite) | ^~~~~~~~~~~~~~~~~~~~~~~~ /tmp/B.ni56z2/BUILD/lttng-modules-2.12.0/lttng-modules-2.12.0/probes/../probes/lttng-tracepoint-event-impl.h:686:2: note: in expansion of macro '_ctf_integer_ext_isuser0' 686 | _ctf_integer_ext_isuser##_user(_type, _item, _user_src, _byte_order, _base, _nowrite) | ^~~~~~~~~~~~~~~~~~~~~~~ /tmp/B.ni56z2/BUILD/lttng-modules-2.12.0/lttng-modules-2.12.0/probes/../probes/lttng-events-write.h:10:2: note: in expansion of macro '_ctf_integer_ext' 10 | _ctf_integer_ext(_type, _item, _src, __BYTE_ORDER, 10, 0, 0) | ^~~~~~~~~~~~~~~~ /tmp/B.ni56z2/BUILD/lttng-modules-2.12.0/lttng-modules-2.12.0/probes/../instrumentation/events/lttng-module/arch/x86/kvm/trace.h:448:3: note: in expansion of macro 'ctf_integer' 448 | ctf_integer(__u8, flags, kei_decode_mode(vcpu->arch.emulate_ctxt.mode)) | ^~~~~~~~~~~ /tmp/B.ni56z2/BUILD/lttng-modules-2.12.0/lttng-modules-2.12.0/probes/../instrumentation/events/lttng-module/arch/x86/kvm/trace.h:448:28: note: in expansion of macro 'kei_decode_mode' 448 | ctf_integer(__u8, flags, kei_decode_mode(vcpu->arch.emulate_ctxt.mode)) | ^~~~~~~~~~~~~~~ /tmp/B.ni56z2/BUILD/lttng-modules-2.12.0/lttng-modules-2.12.0/probes/../instrumentation/events/lttng-module/arch/x86/kvm/trace.h:448:67: error: 'vcpu->arch.emulate_ctxt' is a pointer; did you mean to use '->'? 448 | ctf_integer(__u8, flags, kei_decode_mode(vcpu->arch.emulate_ctxt.mode)) | ^ /tmp/B.ni56z2/BUILD/lttng-modules-2.12.0/lttng-modules-2.12.0/probes/../probes/lttng-tracepoint-event-impl.h:763:2: note: in definition of macro 'LTTNG_TRACEPOINT_EVENT_CLASS_CODE' 763 | _fields \ | ^~~~~~~ /tmp/B.ni56z2/BUILD/lttng-modules-2.12.0/lttng-modules-2.12.0/probes/../probes/lttng-tracepoint-event-impl.h:105:3: note: in expansion of macro 'PARAMS' 105 | PARAMS(_fields), ) | ^~~~~~ /tmp/B.ni56z2/BUILD/lttng-modules-2.12.0/lttng-modules-2.12.0/probes/../probes/lttng-tracepoint-event-impl.h:39:2: note: in expansion of macro 'LTTNG_TRACEPOINT_EVENT_CLASS' 39 | LTTNG_TRACEPOINT_EVENT_CLASS(map, \ | ^~~~~~~~~~~~~~~~~~~~~~~~~~~~ /tmp/B.ni56z2/BUILD/lttng-modules-2.12.0/lttng-modules-2.12.0/probes/../probes/lttng-tracepoint-event-impl.h:42:9: note: in expansion of macro 'PARAMS' 42 | PARAMS(fields)) \ | ^~~~~~ /tmp/B.ni56z2/BUILD/lttng-modules-2.12.0/lttng-modules-2.12.0/probes/../instrumentation/events/lttng-module/arch/x86/kvm/trace.h:422:1: note: in expansion of macro 'LTTNG_TRACEPOINT_EVENT_MAP' 422 | LTTNG_TRACEPOINT_EVENT_MAP(kvm_emulate_insn, kvm_x86_emulate_insn, | ^~~~~~~~~~~~~~~~~~~~~~~~~~ /tmp/B.ni56z2/BUILD/lttng-modules-2.12.0/lttng-modules-2.12.0/probes/../instrumentation/events/lttng-module/arch/x86/kvm/trace.h:426:2: note: in expansion of macro 'TP_FIELDS' 426 | TP_FIELDS( | ^~~~~~~~~ /tmp/B.ni56z2/BUILD/lttng-modules-2.12.0/lttng-modules-2.12.0/probes/../probes/lttng-tracepoint-event-impl.h:669:2: note: in expansion of macro '_ctf_integer_ext_fetched' 669 | _ctf_integer_ext_fetched(_type, _item, _src, _byte_order, _base, _nowrite) | ^~~~~~~~~~~~~~~~~~~~~~~~ /tmp/B.ni56z2/BUILD/lttng-modules-2.12.0/lttng-modules-2.12.0/probes/../probes/lttng-tracepoint-event-impl.h:686:2: note: in expansion of macro '_ctf_integer_ext_isuser0' 686 | _ctf_integer_ext_isuser##_user(_type, _item, _user_src, _byte_order, _base, _nowrite) | ^~~~~~~~~~~~~~~~~~~~~~~ /tmp/B.ni56z2/BUILD/lttng-modules-2.12.0/lttng-modules-2.12.0/probes/../probes/lttng-events-write.h:10:2: note: in expansion of macro '_ctf_integer_ext' 10 | _ctf_integer_ext(_type, _item, _src, __BYTE_ORDER, 10, 0, 0) | ^~~~~~~~~~~~~~~~ /tmp/B.ni56z2/BUILD/lttng-modules-2.12.0/lttng-modules-2.12.0/probes/../instrumentation/events/lttng-module/arch/x86/kvm/trace.h:448:3: note: in expansion of macro 'ctf_integer' 448 | ctf_integer(__u8, flags, kei_decode_mode(vcpu->arch.emulate_ctxt.mode)) | ^~~~~~~~~~~ /tmp/B.ni56z2/BUILD/lttng-modules-2.12.0/lttng-modules-2.12.0/probes/../instrumentation/events/lttng-module/arch/x86/kvm/trace.h:448:28: note: in expansion of macro 'kei_decode_mode' 448 | ctf_integer(__u8, flags, kei_decode_mode(vcpu->arch.emulate_ctxt.mode)) | ^~~~~~~~~~~~~~~ /tmp/B.ni56z2/BUILD/lttng-modules-2.12.0/lttng-modules-2.12.0/probes/../instrumentation/events/lttng-module/arch/x86/kvm/trace.h:448:67: error: 'vcpu->arch.emulate_ctxt' is a pointer; did you mean to use '->'? 448 | ctf_integer(__u8, flags, kei_decode_mode(vcpu->arch.emulate_ctxt.mode)) | ^ /tmp/B.ni56z2/BUILD/lttng-modules-2.12.0/lttng-modules-2.12.0/probes/../probes/lttng-tracepoint-event-impl.h:763:2: note: in definition of macro 'LTTNG_TRACEPOINT_EVENT_CLASS_CODE' 763 | _fields \ | ^~~~~~~ /tmp/B.ni56z2/BUILD/lttng-modules-2.12.0/lttng-modules-2.12.0/probes/../probes/lttng-tracepoint-event-impl.h:105:3: note: in expansion of macro 'PARAMS' 105 | PARAMS(_fields), ) | ^~~~~~ /tmp/B.ni56z2/BUILD/lttng-modules-2.12.0/lttng-modules-2.12.0/probes/../probes/lttng-tracepoint-event-impl.h:39:2: note: in expansion of macro 'LTTNG_TRACEPOINT_EVENT_CLASS' 39 | LTTNG_TRACEPOINT_EVENT_CLASS(map, \ | ^~~~~~~~~~~~~~~~~~~~~~~~~~~~ /tmp/B.ni56z2/BUILD/lttng-modules-2.12.0/lttng-modules-2.12.0/probes/../probes/lttng-tracepoint-event-impl.h:42:9: note: in expansion of macro 'PARAMS' 42 | PARAMS(fields)) \ | ^~~~~~ /tmp/B.ni56z2/BUILD/lttng-modules-2.12.0/lttng-modules-2.12.0/probes/../instrumentation/events/lttng-module/arch/x86/kvm/trace.h:422:1: note: in expansion of macro 'LTTNG_TRACEPOINT_EVENT_MAP' 422 | LTTNG_TRACEPOINT_EVENT_MAP(kvm_emulate_insn, kvm_x86_emulate_insn, | ^~~~~~~~~~~~~~~~~~~~~~~~~~ /tmp/B.ni56z2/BUILD/lttng-modules-2.12.0/lttng-modules-2.12.0/probes/../instrumentation/events/lttng-module/arch/x86/kvm/trace.h:426:2: note: in expansion of macro 'TP_FIELDS' 426 | TP_FIELDS( | ^~~~~~~~~ /tmp/B.ni56z2/BUILD/lttng-modules-2.12.0/lttng-modules-2.12.0/probes/../probes/lttng-tracepoint-event-impl.h:669:2: note: in expansion of macro '_ctf_integer_ext_fetched' 669 | _ctf_integer_ext_fetched(_type, _item, _src, _byte_order, _base, _nowrite) | ^~~~~~~~~~~~~~~~~~~~~~~~ /tmp/B.ni56z2/BUILD/lttng-modules-2.12.0/lttng-modules-2.12.0/probes/../probes/lttng-tracepoint-event-impl.h:686:2: note: in expansion of macro '_ctf_integer_ext_isuser0' 686 | _ctf_integer_ext_isuser##_user(_type, _item, _user_src, _byte_order, _base, _nowrite) | ^~~~~~~~~~~~~~~~~~~~~~~ /tmp/B.ni56z2/BUILD/lttng-modules-2.12.0/lttng-modules-2.12.0/probes/../probes/lttng-events-write.h:10:2: note: in expansion of macro '_ctf_integer_ext' 10 | _ctf_integer_ext(_type, _item, _src, __BYTE_ORDER, 10, 0, 0) | ^~~~~~~~~~~~~~~~ /tmp/B.ni56z2/BUILD/lttng-modules-2.12.0/lttng-modules-2.12.0/probes/../instrumentation/events/lttng-module/arch/x86/kvm/trace.h:448:3: note: in expansion of macro 'ctf_integer' 448 | ctf_integer(__u8, flags, kei_decode_mode(vcpu->arch.emulate_ctxt.mode)) | ^~~~~~~~~~~ /tmp/B.ni56z2/BUILD/lttng-modules-2.12.0/lttng-modules-2.12.0/probes/../instrumentation/events/lttng-module/arch/x86/kvm/trace.h:448:28: note: in expansion of macro 'kei_decode_mode' 448 | ctf_integer(__u8, flags, kei_decode_mode(vcpu->arch.emulate_ctxt.mode)) | ^~~~~~~~~~~~~~~ In file included from /tmp/B.ni56z2/BUILD/lttng-modules-2.12.0/lttng-modules-2.12.0/probes/../probes/define_trace.h:87, from /tmp/B.ni56z2/BUILD/lttng-modules-2.12.0/lttng-modules-2.12.0/probes/../instrumentation/events/lttng-module/arch/x86/kvm/trace.h:524, from /tmp/B.ni56z2/BUILD/lttng-modules-2.12.0/lttng-modules-2.12.0/probes/lttng-probe-kvm-x86.c:36: /tmp/B.ni56z2/BUILD/lttng-modules-2.12.0/lttng-modules-2.12.0/probes/../instrumentation/events/lttng-module/arch/x86/kvm/trace.h: In function '__event_probe__kvm_x86_exit': /tmp/B.ni56z2/BUILD/lttng-modules-2.12.0/lttng-modules-2.12.0/probes/../instrumentation/events/lttng-module/arch/x86/kvm/trace.h:127:14: error: invalid type argument of '->' (have 'struct kvm_x86_ops') 127 | kvm_x86_ops->get_exit_info(vcpu, &tp_locvar->info1, | ^~ /tmp/B.ni56z2/BUILD/lttng-modules-2.12.0/lttng-modules-2.12.0/probes/../probes/lttng-tracepoint-event-impl.h:1165:2: note: in definition of macro 'LTTNG_TRACEPOINT_EVENT_CLASS_CODE' 1165 | _code_pre \ | ^~~~~~~~~ /tmp/B.ni56z2/BUILD/lttng-modules-2.12.0/lttng-modules-2.12.0/probes/../probes/lttng-tracepoint-event-impl.h:57:9: note: in expansion of macro 'PARAMS' 57 | PARAMS(_code_pre), \ | ^~~~~~ /tmp/B.ni56z2/BUILD/lttng-modules-2.12.0/lttng-modules-2.12.0/probes/../instrumentation/events/lttng-module/arch/x86/kvm/trace.h:118:1: note: in expansion of macro 'LTTNG_TRACEPOINT_EVENT_CODE_MAP' 118 | LTTNG_TRACEPOINT_EVENT_CODE_MAP(kvm_exit, kvm_x86_exit, | ^~~~~~~~~~~~~~~~~~~~~~~~~~~~~~~ /tmp/B.ni56z2/BUILD/lttng-modules-2.12.0/lttng-modules-2.12.0/probes/../instrumentation/events/lttng-module/arch/x86/kvm/trace.h:126:2: note: in expansion of macro 'TP_code_pre' 126 | TP_code_pre( | ^~~~~~~~~~~ /tmp/B.ni56z2/BUILD/lttng-modules-2.12.0/lttng-modules-2.12.0/probes/../instrumentation/events/lttng-module/arch/x86/kvm/trace.h: In function '__event_probe__kvm_x86_emulate_insn': /tmp/B.ni56z2/BUILD/lttng-modules-2.12.0/lttng-modules-2.12.0/probes/../instrumentation/events/lttng-module/arch/x86/kvm/trace.h:440:50: error: 'vcpu->arch.emulate_ctxt' is a pointer; did you mean to use '->'? 440 | ctf_integer(__u64, rip, vcpu->arch.emulate_ctxt._eip - | ^ /tmp/B.ni56z2/BUILD/lttng-modules-2.12.0/lttng-modules-2.12.0/probes/../probes/lttng-tracepoint-event-impl.h:1191:2: note: in definition of macro 'LTTNG_TRACEPOINT_EVENT_CLASS_CODE' 1191 | _fields \ | ^~~~~~~ /tmp/B.ni56z2/BUILD/lttng-modules-2.12.0/lttng-modules-2.12.0/probes/../probes/lttng-tracepoint-event-impl.h:105:3: note: in expansion of macro 'PARAMS' 105 | PARAMS(_fields), ) | ^~~~~~ /tmp/B.ni56z2/BUILD/lttng-modules-2.12.0/lttng-modules-2.12.0/probes/../probes/lttng-tracepoint-event-impl.h:39:2: note: in expansion of macro 'LTTNG_TRACEPOINT_EVENT_CLASS' 39 | LTTNG_TRACEPOINT_EVENT_CLASS(map, \ | ^~~~~~~~~~~~~~~~~~~~~~~~~~~~ /tmp/B.ni56z2/BUILD/lttng-modules-2.12.0/lttng-modules-2.12.0/probes/../probes/lttng-tracepoint-event-impl.h:42:9: note: in expansion of macro 'PARAMS' 42 | PARAMS(fields)) \ | ^~~~~~ /tmp/B.ni56z2/BUILD/lttng-modules-2.12.0/lttng-modules-2.12.0/probes/../instrumentation/events/lttng-module/arch/x86/kvm/trace.h:422:1: note: in expansion of macro 'LTTNG_TRACEPOINT_EVENT_MAP' 422 | LTTNG_TRACEPOINT_EVENT_MAP(kvm_emulate_insn, kvm_x86_emulate_insn, | ^~~~~~~~~~~~~~~~~~~~~~~~~~ /tmp/B.ni56z2/BUILD/lttng-modules-2.12.0/lttng-modules-2.12.0/probes/../instrumentation/events/lttng-module/arch/x86/kvm/trace.h:426:2: note: in expansion of macro 'TP_FIELDS' 426 | TP_FIELDS( | ^~~~~~~~~ /tmp/B.ni56z2/BUILD/lttng-modules-2.12.0/lttng-modules-2.12.0/probes/../probes/lttng-tracepoint-event-impl.h:877:2: note: in expansion of macro '_ctf_integer_ext_fetched' 877 | _ctf_integer_ext_fetched(_type, _item, _src, _byte_order, _base, _nowrite) | ^~~~~~~~~~~~~~~~~~~~~~~~ /tmp/B.ni56z2/BUILD/lttng-modules-2.12.0/lttng-modules-2.12.0/probes/../probes/lttng-tracepoint-event-impl.h:894:2: note: in expansion of macro '_ctf_integer_ext_isuser0' 894 | _ctf_integer_ext_isuser##_user(_type, _item, _user_src, _byte_order, _base, _nowrite) | ^~~~~~~~~~~~~~~~~~~~~~~ /tmp/B.ni56z2/BUILD/lttng-modules-2.12.0/lttng-modules-2.12.0/probes/../probes/lttng-events-write.h:10:2: note: in expansion of macro '_ctf_integer_ext' 10 | _ctf_integer_ext(_type, _item, _src, __BYTE_ORDER, 10, 0, 0) | ^~~~~~~~~~~~~~~~ /tmp/B.ni56z2/BUILD/lttng-modules-2.12.0/lttng-modules-2.12.0/probes/../instrumentation/events/lttng-module/arch/x86/kvm/trace.h:440:3: note: in expansion of macro 'ctf_integer' 440 | ctf_integer(__u64, rip, vcpu->arch.emulate_ctxt._eip - | ^~~~~~~~~~~ /tmp/B.ni56z2/BUILD/lttng-modules-2.12.0/lttng-modules-2.12.0/probes/../instrumentation/events/lttng-module/arch/x86/kvm/trace.h:441:29: error: 'vcpu->arch.emulate_ctxt' is a pointer; did you mean to use '->'? 441 | (vcpu->arch.emulate_ctxt.fetch.ptr - | ^ /tmp/B.ni56z2/BUILD/lttng-modules-2.12.0/lttng-modules-2.12.0/probes/../probes/lttng-tracepoint-event-impl.h:1191:2: note: in definition of macro 'LTTNG_TRACEPOINT_EVENT_CLASS_CODE' 1191 | _fields \ | ^~~~~~~ /tmp/B.ni56z2/BUILD/lttng-modules-2.12.0/lttng-modules-2.12.0/probes/../probes/lttng-tracepoint-event-impl.h:105:3: note: in expansion of macro 'PARAMS' 105 | PARAMS(_fields), ) | ^~~~~~ /tmp/B.ni56z2/BUILD/lttng-modules-2.12.0/lttng-modules-2.12.0/probes/../probes/lttng-tracepoint-event-impl.h:39:2: note: in expansion of macro 'LTTNG_TRACEPOINT_EVENT_CLASS' 39 | LTTNG_TRACEPOINT_EVENT_CLASS(map, \ | ^~~~~~~~~~~~~~~~~~~~~~~~~~~~ /tmp/B.ni56z2/BUILD/lttng-modules-2.12.0/lttng-modules-2.12.0/probes/../probes/lttng-tracepoint-event-impl.h:42:9: note: in expansion of macro 'PARAMS' 42 | PARAMS(fields)) \ | ^~~~~~ /tmp/B.ni56z2/BUILD/lttng-modules-2.12.0/lttng-modules-2.12.0/probes/../instrumentation/events/lttng-module/arch/x86/kvm/trace.h:422:1: note: in expansion of macro 'LTTNG_TRACEPOINT_EVENT_MAP' 422 | LTTNG_TRACEPOINT_EVENT_MAP(kvm_emulate_insn, kvm_x86_emulate_insn, | ^~~~~~~~~~~~~~~~~~~~~~~~~~ /tmp/B.ni56z2/BUILD/lttng-modules-2.12.0/lttng-modules-2.12.0/probes/../instrumentation/events/lttng-module/arch/x86/kvm/trace.h:426:2: note: in expansion of macro 'TP_FIELDS' 426 | TP_FIELDS( | ^~~~~~~~~ /tmp/B.ni56z2/BUILD/lttng-modules-2.12.0/lttng-modules-2.12.0/probes/../probes/lttng-tracepoint-event-impl.h:877:2: note: in expansion of macro '_ctf_integer_ext_fetched' 877 | _ctf_integer_ext_fetched(_type, _item, _src, _byte_order, _base, _nowrite) | ^~~~~~~~~~~~~~~~~~~~~~~~ /tmp/B.ni56z2/BUILD/lttng-modules-2.12.0/lttng-modules-2.12.0/probes/../probes/lttng-tracepoint-event-impl.h:894:2: note: in expansion of macro '_ctf_integer_ext_isuser0' 894 | _ctf_integer_ext_isuser##_user(_type, _item, _user_src, _byte_order, _base, _nowrite) | ^~~~~~~~~~~~~~~~~~~~~~~ /tmp/B.ni56z2/BUILD/lttng-modules-2.12.0/lttng-modules-2.12.0/probes/../probes/lttng-events-write.h:10:2: note: in expansion of macro '_ctf_integer_ext' 10 | _ctf_integer_ext(_type, _item, _src, __BYTE_ORDER, 10, 0, 0) | ^~~~~~~~~~~~~~~~ /tmp/B.ni56z2/BUILD/lttng-modules-2.12.0/lttng-modules-2.12.0/probes/../instrumentation/events/lttng-module/arch/x86/kvm/trace.h:440:3: note: in expansion of macro 'ctf_integer' 440 | ctf_integer(__u64, rip, vcpu->arch.emulate_ctxt._eip - | ^~~~~~~~~~~ /tmp/B.ni56z2/BUILD/lttng-modules-2.12.0/lttng-modules-2.12.0/probes/../instrumentation/events/lttng-module/arch/x86/kvm/trace.h:442:29: error: 'vcpu->arch.emulate_ctxt' is a pointer; did you mean to use '->'? 442 | vcpu->arch.emulate_ctxt.fetch.data)) | ^ /tmp/B.ni56z2/BUILD/lttng-modules-2.12.0/lttng-modules-2.12.0/probes/../probes/lttng-tracepoint-event-impl.h:1191:2: note: in definition of macro 'LTTNG_TRACEPOINT_EVENT_CLASS_CODE' 1191 | _fields \ | ^~~~~~~ /tmp/B.ni56z2/BUILD/lttng-modules-2.12.0/lttng-modules-2.12.0/probes/../probes/lttng-tracepoint-event-impl.h:105:3: note: in expansion of macro 'PARAMS' 105 | PARAMS(_fields), ) | ^~~~~~ /tmp/B.ni56z2/BUILD/lttng-modules-2.12.0/lttng-modules-2.12.0/probes/../probes/lttng-tracepoint-event-impl.h:39:2: note: in expansion of macro 'LTTNG_TRACEPOINT_EVENT_CLASS' 39 | LTTNG_TRACEPOINT_EVENT_CLASS(map, \ | ^~~~~~~~~~~~~~~~~~~~~~~~~~~~ /tmp/B.ni56z2/BUILD/lttng-modules-2.12.0/lttng-modules-2.12.0/probes/../probes/lttng-tracepoint-event-impl.h:42:9: note: in expansion of macro 'PARAMS' 42 | PARAMS(fields)) \ | ^~~~~~ /tmp/B.ni56z2/BUILD/lttng-modules-2.12.0/lttng-modules-2.12.0/probes/../instrumentation/events/lttng-module/arch/x86/kvm/trace.h:422:1: note: in expansion of macro 'LTTNG_TRACEPOINT_EVENT_MAP' 422 | LTTNG_TRACEPOINT_EVENT_MAP(kvm_emulate_insn, kvm_x86_emulate_insn, | ^~~~~~~~~~~~~~~~~~~~~~~~~~ /tmp/B.ni56z2/BUILD/lttng-modules-2.12.0/lttng-modules-2.12.0/probes/../instrumentation/events/lttng-module/arch/x86/kvm/trace.h:426:2: note: in expansion of macro 'TP_FIELDS' 426 | TP_FIELDS( | ^~~~~~~~~ /tmp/B.ni56z2/BUILD/lttng-modules-2.12.0/lttng-modules-2.12.0/probes/../probes/lttng-tracepoint-event-impl.h:877:2: note: in expansion of macro '_ctf_integer_ext_fetched' 877 | _ctf_integer_ext_fetched(_type, _item, _src, _byte_order, _base, _nowrite) | ^~~~~~~~~~~~~~~~~~~~~~~~ /tmp/B.ni56z2/BUILD/lttng-modules-2.12.0/lttng-modules-2.12.0/probes/../probes/lttng-tracepoint-event-impl.h:894:2: note: in expansion of macro '_ctf_integer_ext_isuser0' 894 | _ctf_integer_ext_isuser##_user(_type, _item, _user_src, _byte_order, _base, _nowrite) | ^~~~~~~~~~~~~~~~~~~~~~~ /tmp/B.ni56z2/BUILD/lttng-modules-2.12.0/lttng-modules-2.12.0/probes/../probes/lttng-events-write.h:10:2: note: in expansion of macro '_ctf_integer_ext' 10 | _ctf_integer_ext(_type, _item, _src, __BYTE_ORDER, 10, 0, 0) | ^~~~~~~~~~~~~~~~ /tmp/B.ni56z2/BUILD/lttng-modules-2.12.0/lttng-modules-2.12.0/probes/../instrumentation/events/lttng-module/arch/x86/kvm/trace.h:440:3: note: in expansion of macro 'ctf_integer' 440 | ctf_integer(__u64, rip, vcpu->arch.emulate_ctxt._eip - | ^~~~~~~~~~~ /tmp/B.ni56z2/BUILD/lttng-modules-2.12.0/lttng-modules-2.12.0/probes/../instrumentation/events/lttng-module/arch/x86/kvm/trace.h:443:41: error: invalid type argument of '->' (have 'struct kvm_x86_ops') 443 | ctf_integer(__u32, csbase, kvm_x86_ops->get_segment_base(vcpu, VCPU_SREG_CS)) | ^~ /tmp/B.ni56z2/BUILD/lttng-modules-2.12.0/lttng-modules-2.12.0/probes/../probes/lttng-tracepoint-event-impl.h:1191:2: note: in definition of macro 'LTTNG_TRACEPOINT_EVENT_CLASS_CODE' 1191 | _fields \ | ^~~~~~~ /tmp/B.ni56z2/BUILD/lttng-modules-2.12.0/lttng-modules-2.12.0/probes/../probes/lttng-tracepoint-event-impl.h:105:3: note: in expansion of macro 'PARAMS' 105 | PARAMS(_fields), ) | ^~~~~~ /tmp/B.ni56z2/BUILD/lttng-modules-2.12.0/lttng-modules-2.12.0/probes/../probes/lttng-tracepoint-event-impl.h:39:2: note: in expansion of macro 'LTTNG_TRACEPOINT_EVENT_CLASS' 39 | LTTNG_TRACEPOINT_EVENT_CLASS(map, \ | ^~~~~~~~~~~~~~~~~~~~~~~~~~~~ /tmp/B.ni56z2/BUILD/lttng-modules-2.12.0/lttng-modules-2.12.0/probes/../probes/lttng-tracepoint-event-impl.h:42:9: note: in expansion of macro 'PARAMS' 42 | PARAMS(fields)) \ | ^~~~~~ /tmp/B.ni56z2/BUILD/lttng-modules-2.12.0/lttng-modules-2.12.0/probes/../instrumentation/events/lttng-module/arch/x86/kvm/trace.h:422:1: note: in expansion of macro 'LTTNG_TRACEPOINT_EVENT_MAP' 422 | LTTNG_TRACEPOINT_EVENT_MAP(kvm_emulate_insn, kvm_x86_emulate_insn, | ^~~~~~~~~~~~~~~~~~~~~~~~~~ /tmp/B.ni56z2/BUILD/lttng-modules-2.12.0/lttng-modules-2.12.0/probes/../instrumentation/events/lttng-module/arch/x86/kvm/trace.h:426:2: note: in expansion of macro 'TP_FIELDS' 426 | TP_FIELDS( | ^~~~~~~~~ /tmp/B.ni56z2/BUILD/lttng-modules-2.12.0/lttng-modules-2.12.0/probes/../probes/lttng-tracepoint-event-impl.h:877:2: note: in expansion of macro '_ctf_integer_ext_fetched' 877 | _ctf_integer_ext_fetched(_type, _item, _src, _byte_order, _base, _nowrite) | ^~~~~~~~~~~~~~~~~~~~~~~~ /tmp/B.ni56z2/BUILD/lttng-modules-2.12.0/lttng-modules-2.12.0/probes/../probes/lttng-tracepoint-event-impl.h:894:2: note: in expansion of macro '_ctf_integer_ext_isuser0' 894 | _ctf_integer_ext_isuser##_user(_type, _item, _user_src, _byte_order, _base, _nowrite) | ^~~~~~~~~~~~~~~~~~~~~~~ /tmp/B.ni56z2/BUILD/lttng-modules-2.12.0/lttng-modules-2.12.0/probes/../probes/lttng-events-write.h:10:2: note: in expansion of macro '_ctf_integer_ext' 10 | _ctf_integer_ext(_type, _item, _src, __BYTE_ORDER, 10, 0, 0) | ^~~~~~~~~~~~~~~~ /tmp/B.ni56z2/BUILD/lttng-modules-2.12.0/lttng-modules-2.12.0/probes/../instrumentation/events/lttng-module/arch/x86/kvm/trace.h:443:3: note: in expansion of macro 'ctf_integer' 443 | ctf_integer(__u32, csbase, kvm_x86_ops->get_segment_base(vcpu, VCPU_SREG_CS)) | ^~~~~~~~~~~ /tmp/B.ni56z2/BUILD/lttng-modules-2.12.0/lttng-modules-2.12.0/probes/../instrumentation/events/lttng-module/arch/x86/kvm/trace.h:444:49: error: 'vcpu->arch.emulate_ctxt' is a pointer; did you mean to use '->'? 444 | ctf_integer(__u8, len, vcpu->arch.emulate_ctxt.fetch.ptr - | ^ /tmp/B.ni56z2/BUILD/lttng-modules-2.12.0/lttng-modules-2.12.0/probes/../probes/lttng-tracepoint-event-impl.h:1191:2: note: in definition of macro 'LTTNG_TRACEPOINT_EVENT_CLASS_CODE' 1191 | _fields \ | ^~~~~~~ /tmp/B.ni56z2/BUILD/lttng-modules-2.12.0/lttng-modules-2.12.0/probes/../probes/lttng-tracepoint-event-impl.h:105:3: note: in expansion of macro 'PARAMS' 105 | PARAMS(_fields), ) | ^~~~~~ /tmp/B.ni56z2/BUILD/lttng-modules-2.12.0/lttng-modules-2.12.0/probes/../probes/lttng-tracepoint-event-impl.h:39:2: note: in expansion of macro 'LTTNG_TRACEPOINT_EVENT_CLASS' 39 | LTTNG_TRACEPOINT_EVENT_CLASS(map, \ | ^~~~~~~~~~~~~~~~~~~~~~~~~~~~ /tmp/B.ni56z2/BUILD/lttng-modules-2.12.0/lttng-modules-2.12.0/probes/../probes/lttng-tracepoint-event-impl.h:42:9: note: in expansion of macro 'PARAMS' 42 | PARAMS(fields)) \ | ^~~~~~ /tmp/B.ni56z2/BUILD/lttng-modules-2.12.0/lttng-modules-2.12.0/probes/../instrumentation/events/lttng-module/arch/x86/kvm/trace.h:422:1: note: in expansion of macro 'LTTNG_TRACEPOINT_EVENT_MAP' 422 | LTTNG_TRACEPOINT_EVENT_MAP(kvm_emulate_insn, kvm_x86_emulate_insn, | ^~~~~~~~~~~~~~~~~~~~~~~~~~ /tmp/B.ni56z2/BUILD/lttng-modules-2.12.0/lttng-modules-2.12.0/probes/../instrumentation/events/lttng-module/arch/x86/kvm/trace.h:426:2: note: in expansion of macro 'TP_FIELDS' 426 | TP_FIELDS( | ^~~~~~~~~ /tmp/B.ni56z2/BUILD/lttng-modules-2.12.0/lttng-modules-2.12.0/probes/../probes/lttng-tracepoint-event-impl.h:877:2: note: in expansion of macro '_ctf_integer_ext_fetched' 877 | _ctf_integer_ext_fetched(_type, _item, _src, _byte_order, _base, _nowrite) | ^~~~~~~~~~~~~~~~~~~~~~~~ /tmp/B.ni56z2/BUILD/lttng-modules-2.12.0/lttng-modules-2.12.0/probes/../probes/lttng-tracepoint-event-impl.h:894:2: note: in expansion of macro '_ctf_integer_ext_isuser0' 894 | _ctf_integer_ext_isuser##_user(_type, _item, _user_src, _byte_order, _base, _nowrite) | ^~~~~~~~~~~~~~~~~~~~~~~ /tmp/B.ni56z2/BUILD/lttng-modules-2.12.0/lttng-modules-2.12.0/probes/../probes/lttng-events-write.h:10:2: note: in expansion of macro '_ctf_integer_ext' 10 | _ctf_integer_ext(_type, _item, _src, __BYTE_ORDER, 10, 0, 0) | ^~~~~~~~~~~~~~~~ /tmp/B.ni56z2/BUILD/lttng-modules-2.12.0/lttng-modules-2.12.0/probes/../instrumentation/events/lttng-module/arch/x86/kvm/trace.h:444:3: note: in expansion of macro 'ctf_integer' 444 | ctf_integer(__u8, len, vcpu->arch.emulate_ctxt.fetch.ptr - | ^~~~~~~~~~~ /tmp/B.ni56z2/BUILD/lttng-modules-2.12.0/lttng-modules-2.12.0/probes/../instrumentation/events/lttng-module/arch/x86/kvm/trace.h:445:28: error: 'vcpu->arch.emulate_ctxt' is a pointer; did you mean to use '->'? 445 | vcpu->arch.emulate_ctxt.fetch.data) | ^ /tmp/B.ni56z2/BUILD/lttng-modules-2.12.0/lttng-modules-2.12.0/probes/../probes/lttng-tracepoint-event-impl.h:1191:2: note: in definition of macro 'LTTNG_TRACEPOINT_EVENT_CLASS_CODE' 1191 | _fields \ | ^~~~~~~ /tmp/B.ni56z2/BUILD/lttng-modules-2.12.0/lttng-modules-2.12.0/probes/../probes/lttng-tracepoint-event-impl.h:105:3: note: in expansion of macro 'PARAMS' 105 | PARAMS(_fields), ) | ^~~~~~ /tmp/B.ni56z2/BUILD/lttng-modules-2.12.0/lttng-modules-2.12.0/probes/../probes/lttng-tracepoint-event-impl.h:39:2: note: in expansion of macro 'LTTNG_TRACEPOINT_EVENT_CLASS' 39 | LTTNG_TRACEPOINT_EVENT_CLASS(map, \ | ^~~~~~~~~~~~~~~~~~~~~~~~~~~~ /tmp/B.ni56z2/BUILD/lttng-modules-2.12.0/lttng-modules-2.12.0/probes/../probes/lttng-tracepoint-event-impl.h:42:9: note: in expansion of macro 'PARAMS' 42 | PARAMS(fields)) \ | ^~~~~~ /tmp/B.ni56z2/BUILD/lttng-modules-2.12.0/lttng-modules-2.12.0/probes/../instrumentation/events/lttng-module/arch/x86/kvm/trace.h:422:1: note: in expansion of macro 'LTTNG_TRACEPOINT_EVENT_MAP' 422 | LTTNG_TRACEPOINT_EVENT_MAP(kvm_emulate_insn, kvm_x86_emulate_insn, | ^~~~~~~~~~~~~~~~~~~~~~~~~~ /tmp/B.ni56z2/BUILD/lttng-modules-2.12.0/lttng-modules-2.12.0/probes/../instrumentation/events/lttng-module/arch/x86/kvm/trace.h:426:2: note: in expansion of macro 'TP_FIELDS' 426 | TP_FIELDS( | ^~~~~~~~~ /tmp/B.ni56z2/BUILD/lttng-modules-2.12.0/lttng-modules-2.12.0/probes/../probes/lttng-tracepoint-event-impl.h:877:2: note: in expansion of macro '_ctf_integer_ext_fetched' 877 | _ctf_integer_ext_fetched(_type, _item, _src, _byte_order, _base, _nowrite) | ^~~~~~~~~~~~~~~~~~~~~~~~ /tmp/B.ni56z2/BUILD/lttng-modules-2.12.0/lttng-modules-2.12.0/probes/../probes/lttng-tracepoint-event-impl.h:894:2: note: in expansion of macro '_ctf_integer_ext_isuser0' 894 | _ctf_integer_ext_isuser##_user(_type, _item, _user_src, _byte_order, _base, _nowrite) | ^~~~~~~~~~~~~~~~~~~~~~~ /tmp/B.ni56z2/BUILD/lttng-modules-2.12.0/lttng-modules-2.12.0/probes/../probes/lttng-events-write.h:10:2: note: in expansion of macro '_ctf_integer_ext' 10 | _ctf_integer_ext(_type, _item, _src, __BYTE_ORDER, 10, 0, 0) | ^~~~~~~~~~~~~~~~ /tmp/B.ni56z2/BUILD/lttng-modules-2.12.0/lttng-modules-2.12.0/probes/../instrumentation/events/lttng-module/arch/x86/kvm/trace.h:444:3: note: in expansion of macro 'ctf_integer' 444 | ctf_integer(__u8, len, vcpu->arch.emulate_ctxt.fetch.ptr - | ^~~~~~~~~~~ /tmp/B.ni56z2/BUILD/lttng-modules-2.12.0/lttng-modules-2.12.0/probes/../instrumentation/events/lttng-module/arch/x86/kvm/trace.h:446:48: error: 'vcpu->arch.emulate_ctxt' is a pointer; did you mean to use '->'? 446 | ctf_array(__u8, insn, vcpu->arch.emulate_ctxt.fetch.data, 15) | ^ /tmp/B.ni56z2/BUILD/lttng-modules-2.12.0/lttng-modules-2.12.0/probes/../probes/lttng-tracepoint-event-impl.h:1191:2: note: in definition of macro 'LTTNG_TRACEPOINT_EVENT_CLASS_CODE' 1191 | _fields \ | ^~~~~~~ /tmp/B.ni56z2/BUILD/lttng-modules-2.12.0/lttng-modules-2.12.0/probes/../probes/lttng-tracepoint-event-impl.h:105:3: note: in expansion of macro 'PARAMS' 105 | PARAMS(_fields), ) | ^~~~~~ /tmp/B.ni56z2/BUILD/lttng-modules-2.12.0/lttng-modules-2.12.0/probes/../probes/lttng-tracepoint-event-impl.h:39:2: note: in expansion of macro 'LTTNG_TRACEPOINT_EVENT_CLASS' 39 | LTTNG_TRACEPOINT_EVENT_CLASS(map, \ | ^~~~~~~~~~~~~~~~~~~~~~~~~~~~ /tmp/B.ni56z2/BUILD/lttng-modules-2.12.0/lttng-modules-2.12.0/probes/../probes/lttng-tracepoint-event-impl.h:42:9: note: in expansion of macro 'PARAMS' 42 | PARAMS(fields)) \ | ^~~~~~ /tmp/B.ni56z2/BUILD/lttng-modules-2.12.0/lttng-modules-2.12.0/probes/../instrumentation/events/lttng-module/arch/x86/kvm/trace.h:422:1: note: in expansion of macro 'LTTNG_TRACEPOINT_EVENT_MAP' 422 | LTTNG_TRACEPOINT_EVENT_MAP(kvm_emulate_insn, kvm_x86_emulate_insn, | ^~~~~~~~~~~~~~~~~~~~~~~~~~ /tmp/B.ni56z2/BUILD/lttng-modules-2.12.0/lttng-modules-2.12.0/probes/../instrumentation/events/lttng-module/arch/x86/kvm/trace.h:426:2: note: in expansion of macro 'TP_FIELDS' 426 | TP_FIELDS( | ^~~~~~~~~ /tmp/B.ni56z2/BUILD/lttng-modules-2.12.0/lttng-modules-2.12.0/probes/../probes/lttng-events-write.h:34:2: note: in expansion of macro '_ctf_array_encoded' 34 | _ctf_array_encoded(_type, _item, _src, \ | ^~~~~~~~~~~~~~~~~~ /tmp/B.ni56z2/BUILD/lttng-modules-2.12.0/lttng-modules-2.12.0/probes/../instrumentation/events/lttng-module/arch/x86/kvm/trace.h:446:3: note: in expansion of macro 'ctf_array' 446 | ctf_array(__u8, insn, vcpu->arch.emulate_ctxt.fetch.data, 15) | ^~~~~~~~~ /tmp/B.ni56z2/BUILD/lttng-modules-2.12.0/lttng-modules-2.12.0/probes/../instrumentation/events/lttng-module/arch/x86/kvm/trace.h:446:48: error: 'vcpu->arch.emulate_ctxt' is a pointer; did you mean to use '->'? 446 | ctf_array(__u8, insn, vcpu->arch.emulate_ctxt.fetch.data, 15) | ^ /tmp/B.ni56z2/BUILD/lttng-modules-2.12.0/lttng-modules-2.12.0/probes/../probes/lttng-tracepoint-event-impl.h:1191:2: note: in definition of macro 'LTTNG_TRACEPOINT_EVENT_CLASS_CODE' 1191 | _fields \ | ^~~~~~~ /tmp/B.ni56z2/BUILD/lttng-modules-2.12.0/lttng-modules-2.12.0/probes/../probes/lttng-tracepoint-event-impl.h:105:3: note: in expansion of macro 'PARAMS' 105 | PARAMS(_fields), ) | ^~~~~~ /tmp/B.ni56z2/BUILD/lttng-modules-2.12.0/lttng-modules-2.12.0/probes/../probes/lttng-tracepoint-event-impl.h:39:2: note: in expansion of macro 'LTTNG_TRACEPOINT_EVENT_CLASS' 39 | LTTNG_TRACEPOINT_EVENT_CLASS(map, \ | ^~~~~~~~~~~~~~~~~~~~~~~~~~~~ /tmp/B.ni56z2/BUILD/lttng-modules-2.12.0/lttng-modules-2.12.0/probes/../probes/lttng-tracepoint-event-impl.h:42:9: note: in expansion of macro 'PARAMS' 42 | PARAMS(fields)) \ | ^~~~~~ /tmp/B.ni56z2/BUILD/lttng-modules-2.12.0/lttng-modules-2.12.0/probes/../instrumentation/events/lttng-module/arch/x86/kvm/trace.h:422:1: note: in expansion of macro 'LTTNG_TRACEPOINT_EVENT_MAP' 422 | LTTNG_TRACEPOINT_EVENT_MAP(kvm_emulate_insn, kvm_x86_emulate_insn, | ^~~~~~~~~~~~~~~~~~~~~~~~~~ /tmp/B.ni56z2/BUILD/lttng-modules-2.12.0/lttng-modules-2.12.0/probes/../instrumentation/events/lttng-module/arch/x86/kvm/trace.h:426:2: note: in expansion of macro 'TP_FIELDS' 426 | TP_FIELDS( | ^~~~~~~~~ /tmp/B.ni56z2/BUILD/lttng-modules-2.12.0/lttng-modules-2.12.0/probes/../probes/lttng-events-write.h:34:2: note: in expansion of macro '_ctf_array_encoded' 34 | _ctf_array_encoded(_type, _item, _src, \ | ^~~~~~~~~~~~~~~~~~ /tmp/B.ni56z2/BUILD/lttng-modules-2.12.0/lttng-modules-2.12.0/probes/../instrumentation/events/lttng-module/arch/x86/kvm/trace.h:446:3: note: in expansion of macro 'ctf_array' 446 | ctf_array(__u8, insn, vcpu->arch.emulate_ctxt.fetch.data, 15) | ^~~~~~~~~ /tmp/B.ni56z2/BUILD/lttng-modules-2.12.0/lttng-modules-2.12.0/probes/../instrumentation/events/lttng-module/arch/x86/kvm/trace.h:448:67: error: 'vcpu->arch.emulate_ctxt' is a pointer; did you mean to use '->'? 448 | ctf_integer(__u8, flags, kei_decode_mode(vcpu->arch.emulate_ctxt.mode)) | ^ /tmp/B.ni56z2/BUILD/lttng-modules-2.12.0/lttng-modules-2.12.0/probes/../probes/lttng-tracepoint-event-impl.h:1191:2: note: in definition of macro 'LTTNG_TRACEPOINT_EVENT_CLASS_CODE' 1191 | _fields \ | ^~~~~~~ /tmp/B.ni56z2/BUILD/lttng-modules-2.12.0/lttng-modules-2.12.0/probes/../probes/lttng-tracepoint-event-impl.h:105:3: note: in expansion of macro 'PARAMS' 105 | PARAMS(_fields), ) | ^~~~~~ /tmp/B.ni56z2/BUILD/lttng-modules-2.12.0/lttng-modules-2.12.0/probes/../probes/lttng-tracepoint-event-impl.h:39:2: note: in expansion of macro 'LTTNG_TRACEPOINT_EVENT_CLASS' 39 | LTTNG_TRACEPOINT_EVENT_CLASS(map, \ | ^~~~~~~~~~~~~~~~~~~~~~~~~~~~ /tmp/B.ni56z2/BUILD/lttng-modules-2.12.0/lttng-modules-2.12.0/probes/../probes/lttng-tracepoint-event-impl.h:42:9: note: in expansion of macro 'PARAMS' 42 | PARAMS(fields)) \ | ^~~~~~ /tmp/B.ni56z2/BUILD/lttng-modules-2.12.0/lttng-modules-2.12.0/probes/../instrumentation/events/lttng-module/arch/x86/kvm/trace.h:422:1: note: in expansion of macro 'LTTNG_TRACEPOINT_EVENT_MAP' 422 | LTTNG_TRACEPOINT_EVENT_MAP(kvm_emulate_insn, kvm_x86_emulate_insn, | ^~~~~~~~~~~~~~~~~~~~~~~~~~ /tmp/B.ni56z2/BUILD/lttng-modules-2.12.0/lttng-modules-2.12.0/probes/../instrumentation/events/lttng-module/arch/x86/kvm/trace.h:426:2: note: in expansion of macro 'TP_FIELDS' 426 | TP_FIELDS( | ^~~~~~~~~ /tmp/B.ni56z2/BUILD/lttng-modules-2.12.0/lttng-modules-2.12.0/probes/../probes/lttng-tracepoint-event-impl.h:877:2: note: in expansion of macro '_ctf_integer_ext_fetched' 877 | _ctf_integer_ext_fetched(_type, _item, _src, _byte_order, _base, _nowrite) | ^~~~~~~~~~~~~~~~~~~~~~~~ /tmp/B.ni56z2/BUILD/lttng-modules-2.12.0/lttng-modules-2.12.0/probes/../probes/lttng-tracepoint-event-impl.h:894:2: note: in expansion of macro '_ctf_integer_ext_isuser0' 894 | _ctf_integer_ext_isuser##_user(_type, _item, _user_src, _byte_order, _base, _nowrite) | ^~~~~~~~~~~~~~~~~~~~~~~ /tmp/B.ni56z2/BUILD/lttng-modules-2.12.0/lttng-modules-2.12.0/probes/../probes/lttng-events-write.h:10:2: note: in expansion of macro '_ctf_integer_ext' 10 | _ctf_integer_ext(_type, _item, _src, __BYTE_ORDER, 10, 0, 0) | ^~~~~~~~~~~~~~~~ /tmp/B.ni56z2/BUILD/lttng-modules-2.12.0/lttng-modules-2.12.0/probes/../instrumentation/events/lttng-module/arch/x86/kvm/trace.h:448:3: note: in expansion of macro 'ctf_integer' 448 | ctf_integer(__u8, flags, kei_decode_mode(vcpu->arch.emulate_ctxt.mode)) | ^~~~~~~~~~~ /tmp/B.ni56z2/BUILD/lttng-modules-2.12.0/lttng-modules-2.12.0/probes/../instrumentation/events/lttng-module/arch/x86/kvm/trace.h:448:28: note: in expansion of macro 'kei_decode_mode' 448 | ctf_integer(__u8, flags, kei_decode_mode(vcpu->arch.emulate_ctxt.mode)) | ^~~~~~~~~~~~~~~ /tmp/B.ni56z2/BUILD/lttng-modules-2.12.0/lttng-modules-2.12.0/probes/../instrumentation/events/lttng-module/arch/x86/kvm/trace.h:401:7: error: 'X86EMUL_MODE_REAL' undeclared (first use in this function) 401 | case X86EMUL_MODE_REAL: \ | ^~~~~~~~~~~~~~~~~ /tmp/B.ni56z2/BUILD/lttng-modules-2.12.0/lttng-modules-2.12.0/probes/../probes/lttng-tracepoint-event-impl.h:1191:2: note: in definition of macro 'LTTNG_TRACEPOINT_EVENT_CLASS_CODE' 1191 | _fields \ | ^~~~~~~ /tmp/B.ni56z2/BUILD/lttng-modules-2.12.0/lttng-modules-2.12.0/probes/../probes/lttng-tracepoint-event-impl.h:105:3: note: in expansion of macro 'PARAMS' 105 | PARAMS(_fields), ) | ^~~~~~ /tmp/B.ni56z2/BUILD/lttng-modules-2.12.0/lttng-modules-2.12.0/probes/../probes/lttng-tracepoint-event-impl.h:39:2: note: in expansion of macro 'LTTNG_TRACEPOINT_EVENT_CLASS' 39 | LTTNG_TRACEPOINT_EVENT_CLASS(map, \ | ^~~~~~~~~~~~~~~~~~~~~~~~~~~~ /tmp/B.ni56z2/BUILD/lttng-modules-2.12.0/lttng-modules-2.12.0/probes/../probes/lttng-tracepoint-event-impl.h:42:9: note: in expansion of macro 'PARAMS' 42 | PARAMS(fields)) \ | ^~~~~~ /tmp/B.ni56z2/BUILD/lttng-modules-2.12.0/lttng-modules-2.12.0/probes/../instrumentation/events/lttng-module/arch/x86/kvm/trace.h:422:1: note: in expansion of macro 'LTTNG_TRACEPOINT_EVENT_MAP' 422 | LTTNG_TRACEPOINT_EVENT_MAP(kvm_emulate_insn, kvm_x86_emulate_insn, | ^~~~~~~~~~~~~~~~~~~~~~~~~~ /tmp/B.ni56z2/BUILD/lttng-modules-2.12.0/lttng-modules-2.12.0/probes/../instrumentation/events/lttng-module/arch/x86/kvm/trace.h:426:2: note: in expansion of macro 'TP_FIELDS' 426 | TP_FIELDS( | ^~~~~~~~~ /tmp/B.ni56z2/BUILD/lttng-modules-2.12.0/lttng-modules-2.12.0/probes/../probes/lttng-tracepoint-event-impl.h:877:2: note: in expansion of macro '_ctf_integer_ext_fetched' 877 | _ctf_integer_ext_fetched(_type, _item, _src, _byte_order, _base, _nowrite) | ^~~~~~~~~~~~~~~~~~~~~~~~ /tmp/B.ni56z2/BUILD/lttng-modules-2.12.0/lttng-modules-2.12.0/probes/../probes/lttng-tracepoint-event-impl.h:894:2: note: in expansion of macro '_ctf_integer_ext_isuser0' 894 | _ctf_integer_ext_isuser##_user(_type, _item, _user_src, _byte_order, _base, _nowrite) | ^~~~~~~~~~~~~~~~~~~~~~~ /tmp/B.ni56z2/BUILD/lttng-modules-2.12.0/lttng-modules-2.12.0/probes/../probes/lttng-events-write.h:10:2: note: in expansion of macro '_ctf_integer_ext' 10 | _ctf_integer_ext(_type, _item, _src, __BYTE_ORDER, 10, 0, 0) | ^~~~~~~~~~~~~~~~ /tmp/B.ni56z2/BUILD/lttng-modules-2.12.0/lttng-modules-2.12.0/probes/../instrumentation/events/lttng-module/arch/x86/kvm/trace.h:448:3: note: in expansion of macro 'ctf_integer' 448 | ctf_integer(__u8, flags, kei_decode_mode(vcpu->arch.emulate_ctxt.mode)) | ^~~~~~~~~~~ /tmp/B.ni56z2/BUILD/lttng-modules-2.12.0/lttng-modules-2.12.0/probes/../instrumentation/events/lttng-module/arch/x86/kvm/trace.h:448:28: note: in expansion of macro 'kei_decode_mode' 448 | ctf_integer(__u8, flags, kei_decode_mode(vcpu->arch.emulate_ctxt.mode)) | ^~~~~~~~~~~~~~~ /tmp/B.ni56z2/BUILD/lttng-modules-2.12.0/lttng-modules-2.12.0/probes/../instrumentation/events/lttng-module/arch/x86/kvm/trace.h:404:7: error: 'X86EMUL_MODE_VM86' undeclared (first use in this function) 404 | case X86EMUL_MODE_VM86: \ | ^~~~~~~~~~~~~~~~~ /tmp/B.ni56z2/BUILD/lttng-modules-2.12.0/lttng-modules-2.12.0/probes/../probes/lttng-tracepoint-event-impl.h:1191:2: note: in definition of macro 'LTTNG_TRACEPOINT_EVENT_CLASS_CODE' 1191 | _fields \ | ^~~~~~~ /tmp/B.ni56z2/BUILD/lttng-modules-2.12.0/lttng-modules-2.12.0/probes/../probes/lttng-tracepoint-event-impl.h:105:3: note: in expansion of macro 'PARAMS' 105 | PARAMS(_fields), ) | ^~~~~~ /tmp/B.ni56z2/BUILD/lttng-modules-2.12.0/lttng-modules-2.12.0/probes/../probes/lttng-tracepoint-event-impl.h:39:2: note: in expansion of macro 'LTTNG_TRACEPOINT_EVENT_CLASS' 39 | LTTNG_TRACEPOINT_EVENT_CLASS(map, \ | ^~~~~~~~~~~~~~~~~~~~~~~~~~~~ /tmp/B.ni56z2/BUILD/lttng-modules-2.12.0/lttng-modules-2.12.0/probes/../probes/lttng-tracepoint-event-impl.h:42:9: note: in expansion of macro 'PARAMS' 42 | PARAMS(fields)) \ | ^~~~~~ /tmp/B.ni56z2/BUILD/lttng-modules-2.12.0/lttng-modules-2.12.0/probes/../instrumentation/events/lttng-module/arch/x86/kvm/trace.h:422:1: note: in expansion of macro 'LTTNG_TRACEPOINT_EVENT_MAP' 422 | LTTNG_TRACEPOINT_EVENT_MAP(kvm_emulate_insn, kvm_x86_emulate_insn, | ^~~~~~~~~~~~~~~~~~~~~~~~~~ /tmp/B.ni56z2/BUILD/lttng-modules-2.12.0/lttng-modules-2.12.0/probes/../instrumentation/events/lttng-module/arch/x86/kvm/trace.h:426:2: note: in expansion of macro 'TP_FIELDS' 426 | TP_FIELDS( | ^~~~~~~~~ /tmp/B.ni56z2/BUILD/lttng-modules-2.12.0/lttng-modules-2.12.0/probes/../probes/lttng-tracepoint-event-impl.h:877:2: note: in expansion of macro '_ctf_integer_ext_fetched' 877 | _ctf_integer_ext_fetched(_type, _item, _src, _byte_order, _base, _nowrite) | ^~~~~~~~~~~~~~~~~~~~~~~~ /tmp/B.ni56z2/BUILD/lttng-modules-2.12.0/lttng-modules-2.12.0/probes/../probes/lttng-tracepoint-event-impl.h:894:2: note: in expansion of macro '_ctf_integer_ext_isuser0' 894 | _ctf_integer_ext_isuser##_user(_type, _item, _user_src, _byte_order, _base, _nowrite) | ^~~~~~~~~~~~~~~~~~~~~~~ /tmp/B.ni56z2/BUILD/lttng-modules-2.12.0/lttng-modules-2.12.0/probes/../probes/lttng-events-write.h:10:2: note: in expansion of macro '_ctf_integer_ext' 10 | _ctf_integer_ext(_type, _item, _src, __BYTE_ORDER, 10, 0, 0) | ^~~~~~~~~~~~~~~~ /tmp/B.ni56z2/BUILD/lttng-modules-2.12.0/lttng-modules-2.12.0/probes/../instrumentation/events/lttng-module/arch/x86/kvm/trace.h:448:3: note: in expansion of macro 'ctf_integer' 448 | ctf_integer(__u8, flags, kei_decode_mode(vcpu->arch.emulate_ctxt.mode)) | ^~~~~~~~~~~ /tmp/B.ni56z2/BUILD/lttng-modules-2.12.0/lttng-modules-2.12.0/probes/../instrumentation/events/lttng-module/arch/x86/kvm/trace.h:448:28: note: in expansion of macro 'kei_decode_mode' 448 | ctf_integer(__u8, flags, kei_decode_mode(vcpu->arch.emulate_ctxt.mode)) | ^~~~~~~~~~~~~~~ /tmp/B.ni56z2/BUILD/lttng-modules-2.12.0/lttng-modules-2.12.0/probes/../instrumentation/events/lttng-module/arch/x86/kvm/trace.h:407:7: error: 'X86EMUL_MODE_PROT16' undeclared (first use in this function) 407 | case X86EMUL_MODE_PROT16: \ | ^~~~~~~~~~~~~~~~~~~ /tmp/B.ni56z2/BUILD/lttng-modules-2.12.0/lttng-modules-2.12.0/probes/../probes/lttng-tracepoint-event-impl.h:1191:2: note: in definition of macro 'LTTNG_TRACEPOINT_EVENT_CLASS_CODE' 1191 | _fields \ | ^~~~~~~ /tmp/B.ni56z2/BUILD/lttng-modules-2.12.0/lttng-modules-2.12.0/probes/../probes/lttng-tracepoint-event-impl.h:105:3: note: in expansion of macro 'PARAMS' 105 | PARAMS(_fields), ) | ^~~~~~ /tmp/B.ni56z2/BUILD/lttng-modules-2.12.0/lttng-modules-2.12.0/probes/../probes/lttng-tracepoint-event-impl.h:39:2: note: in expansion of macro 'LTTNG_TRACEPOINT_EVENT_CLASS' 39 | LTTNG_TRACEPOINT_EVENT_CLASS(map, \ | ^~~~~~~~~~~~~~~~~~~~~~~~~~~~ /tmp/B.ni56z2/BUILD/lttng-modules-2.12.0/lttng-modules-2.12.0/probes/../probes/lttng-tracepoint-event-impl.h:42:9: note: in expansion of macro 'PARAMS' 42 | PARAMS(fields)) \ | ^~~~~~ /tmp/B.ni56z2/BUILD/lttng-modules-2.12.0/lttng-modules-2.12.0/probes/../instrumentation/events/lttng-module/arch/x86/kvm/trace.h:422:1: note: in expansion of macro 'LTTNG_TRACEPOINT_EVENT_MAP' 422 | LTTNG_TRACEPOINT_EVENT_MAP(kvm_emulate_insn, kvm_x86_emulate_insn, | ^~~~~~~~~~~~~~~~~~~~~~~~~~ /tmp/B.ni56z2/BUILD/lttng-modules-2.12.0/lttng-modules-2.12.0/probes/../instrumentation/events/lttng-module/arch/x86/kvm/trace.h:426:2: note: in expansion of macro 'TP_FIELDS' 426 | TP_FIELDS( | ^~~~~~~~~ /tmp/B.ni56z2/BUILD/lttng-modules-2.12.0/lttng-modules-2.12.0/probes/../probes/lttng-tracepoint-event-impl.h:877:2: note: in expansion of macro '_ctf_integer_ext_fetched' 877 | _ctf_integer_ext_fetched(_type, _item, _src, _byte_order, _base, _nowrite) | ^~~~~~~~~~~~~~~~~~~~~~~~ /tmp/B.ni56z2/BUILD/lttng-modules-2.12.0/lttng-modules-2.12.0/probes/../probes/lttng-tracepoint-event-impl.h:894:2: note: in expansion of macro '_ctf_integer_ext_isuser0' 894 | _ctf_integer_ext_isuser##_user(_type, _item, _user_src, _byte_order, _base, _nowrite) | ^~~~~~~~~~~~~~~~~~~~~~~ /tmp/B.ni56z2/BUILD/lttng-modules-2.12.0/lttng-modules-2.12.0/probes/../probes/lttng-events-write.h:10:2: note: in expansion of macro '_ctf_integer_ext' 10 | _ctf_integer_ext(_type, _item, _src, __BYTE_ORDER, 10, 0, 0) | ^~~~~~~~~~~~~~~~ /tmp/B.ni56z2/BUILD/lttng-modules-2.12.0/lttng-modules-2.12.0/probes/../instrumentation/events/lttng-module/arch/x86/kvm/trace.h:448:3: note: in expansion of macro 'ctf_integer' 448 | ctf_integer(__u8, flags, kei_decode_mode(vcpu->arch.emulate_ctxt.mode)) | ^~~~~~~~~~~ /tmp/B.ni56z2/BUILD/lttng-modules-2.12.0/lttng-modules-2.12.0/probes/../instrumentation/events/lttng-module/arch/x86/kvm/trace.h:448:28: note: in expansion of macro 'kei_decode_mode' 448 | ctf_integer(__u8, flags, kei_decode_mode(vcpu->arch.emulate_ctxt.mode)) | ^~~~~~~~~~~~~~~ /tmp/B.ni56z2/BUILD/lttng-modules-2.12.0/lttng-modules-2.12.0/probes/../instrumentation/events/lttng-module/arch/x86/kvm/trace.h:410:7: error: 'X86EMUL_MODE_PROT32' undeclared (first use in this function) 410 | case X86EMUL_MODE_PROT32: \ | ^~~~~~~~~~~~~~~~~~~ /tmp/B.ni56z2/BUILD/lttng-modules-2.12.0/lttng-modules-2.12.0/probes/../probes/lttng-tracepoint-event-impl.h:1191:2: note: in definition of macro 'LTTNG_TRACEPOINT_EVENT_CLASS_CODE' 1191 | _fields \ | ^~~~~~~ /tmp/B.ni56z2/BUILD/lttng-modules-2.12.0/lttng-modules-2.12.0/probes/../probes/lttng-tracepoint-event-impl.h:105:3: note: in expansion of macro 'PARAMS' 105 | PARAMS(_fields), ) | ^~~~~~ /tmp/B.ni56z2/BUILD/lttng-modules-2.12.0/lttng-modules-2.12.0/probes/../probes/lttng-tracepoint-event-impl.h:39:2: note: in expansion of macro 'LTTNG_TRACEPOINT_EVENT_CLASS' 39 | LTTNG_TRACEPOINT_EVENT_CLASS(map, \ | ^~~~~~~~~~~~~~~~~~~~~~~~~~~~ /tmp/B.ni56z2/BUILD/lttng-modules-2.12.0/lttng-modules-2.12.0/probes/../probes/lttng-tracepoint-event-impl.h:42:9: note: in expansion of macro 'PARAMS' 42 | PARAMS(fields)) \ | ^~~~~~ /tmp/B.ni56z2/BUILD/lttng-modules-2.12.0/lttng-modules-2.12.0/probes/../instrumentation/events/lttng-module/arch/x86/kvm/trace.h:422:1: note: in expansion of macro 'LTTNG_TRACEPOINT_EVENT_MAP' 422 | LTTNG_TRACEPOINT_EVENT_MAP(kvm_emulate_insn, kvm_x86_emulate_insn, | ^~~~~~~~~~~~~~~~~~~~~~~~~~ /tmp/B.ni56z2/BUILD/lttng-modules-2.12.0/lttng-modules-2.12.0/probes/../instrumentation/events/lttng-module/arch/x86/kvm/trace.h:426:2: note: in expansion of macro 'TP_FIELDS' 426 | TP_FIELDS( | ^~~~~~~~~ /tmp/B.ni56z2/BUILD/lttng-modules-2.12.0/lttng-modules-2.12.0/probes/../probes/lttng-tracepoint-event-impl.h:877:2: note: in expansion of macro '_ctf_integer_ext_fetched' 877 | _ctf_integer_ext_fetched(_type, _item, _src, _byte_order, _base, _nowrite) | ^~~~~~~~~~~~~~~~~~~~~~~~ /tmp/B.ni56z2/BUILD/lttng-modules-2.12.0/lttng-modules-2.12.0/probes/../probes/lttng-tracepoint-event-impl.h:894:2: note: in expansion of macro '_ctf_integer_ext_isuser0' 894 | _ctf_integer_ext_isuser##_user(_type, _item, _user_src, _byte_order, _base, _nowrite) | ^~~~~~~~~~~~~~~~~~~~~~~ /tmp/B.ni56z2/BUILD/lttng-modules-2.12.0/lttng-modules-2.12.0/probes/../probes/lttng-events-write.h:10:2: note: in expansion of macro '_ctf_integer_ext' 10 | _ctf_integer_ext(_type, _item, _src, __BYTE_ORDER, 10, 0, 0) | ^~~~~~~~~~~~~~~~ /tmp/B.ni56z2/BUILD/lttng-modules-2.12.0/lttng-modules-2.12.0/probes/../instrumentation/events/lttng-module/arch/x86/kvm/trace.h:448:3: note: in expansion of macro 'ctf_integer' 448 | ctf_integer(__u8, flags, kei_decode_mode(vcpu->arch.emulate_ctxt.mode)) | ^~~~~~~~~~~ /tmp/B.ni56z2/BUILD/lttng-modules-2.12.0/lttng-modules-2.12.0/probes/../instrumentation/events/lttng-module/arch/x86/kvm/trace.h:448:28: note: in expansion of macro 'kei_decode_mode' 448 | ctf_integer(__u8, flags, kei_decode_mode(vcpu->arch.emulate_ctxt.mode)) | ^~~~~~~~~~~~~~~ /tmp/B.ni56z2/BUILD/lttng-modules-2.12.0/lttng-modules-2.12.0/probes/../instrumentation/events/lttng-module/arch/x86/kvm/trace.h:414:7: error: 'X86EMUL_MODE_PROT64' undeclared (first use in this function) 414 | case X86EMUL_MODE_PROT64: \ | ^~~~~~~~~~~~~~~~~~~ /tmp/B.ni56z2/BUILD/lttng-modules-2.12.0/lttng-modules-2.12.0/probes/../probes/lttng-tracepoint-event-impl.h:1191:2: note: in definition of macro 'LTTNG_TRACEPOINT_EVENT_CLASS_CODE' 1191 | _fields \ | ^~~~~~~ /tmp/B.ni56z2/BUILD/lttng-modules-2.12.0/lttng-modules-2.12.0/probes/../probes/lttng-tracepoint-event-impl.h:105:3: note: in expansion of macro 'PARAMS' 105 | PARAMS(_fields), ) | ^~~~~~ /tmp/B.ni56z2/BUILD/lttng-modules-2.12.0/lttng-modules-2.12.0/probes/../probes/lttng-tracepoint-event-impl.h:39:2: note: in expansion of macro 'LTTNG_TRACEPOINT_EVENT_CLASS' 39 | LTTNG_TRACEPOINT_EVENT_CLASS(map, \ | ^~~~~~~~~~~~~~~~~~~~~~~~~~~~ /tmp/B.ni56z2/BUILD/lttng-modules-2.12.0/lttng-modules-2.12.0/probes/../probes/lttng-tracepoint-event-impl.h:42:9: note: in expansion of macro 'PARAMS' 42 | PARAMS(fields)) \ | ^~~~~~ /tmp/B.ni56z2/BUILD/lttng-modules-2.12.0/lttng-modules-2.12.0/probes/../instrumentation/events/lttng-module/arch/x86/kvm/trace.h:422:1: note: in expansion of macro 'LTTNG_TRACEPOINT_EVENT_MAP' 422 | LTTNG_TRACEPOINT_EVENT_MAP(kvm_emulate_insn, kvm_x86_emulate_insn, | ^~~~~~~~~~~~~~~~~~~~~~~~~~ /tmp/B.ni56z2/BUILD/lttng-modules-2.12.0/lttng-modules-2.12.0/probes/../instrumentation/events/lttng-module/arch/x86/kvm/trace.h:426:2: note: in expansion of macro 'TP_FIELDS' 426 | TP_FIELDS( | ^~~~~~~~~ /tmp/B.ni56z2/BUILD/lttng-modules-2.12.0/lttng-modules-2.12.0/probes/../probes/lttng-tracepoint-event-impl.h:877:2: note: in expansion of macro '_ctf_integer_ext_fetched' 877 | _ctf_integer_ext_fetched(_type, _item, _src, _byte_order, _base, _nowrite) | ^~~~~~~~~~~~~~~~~~~~~~~~ /tmp/B.ni56z2/BUILD/lttng-modules-2.12.0/lttng-modules-2.12.0/probes/../probes/lttng-tracepoint-event-impl.h:894:2: note: in expansion of macro '_ctf_integer_ext_isuser0' 894 | _ctf_integer_ext_isuser##_user(_type, _item, _user_src, _byte_order, _base, _nowrite) | ^~~~~~~~~~~~~~~~~~~~~~~ /tmp/B.ni56z2/BUILD/lttng-modules-2.12.0/lttng-modules-2.12.0/probes/../probes/lttng-events-write.h:10:2: note: in expansion of macro '_ctf_integer_ext' 10 | _ctf_integer_ext(_type, _item, _src, __BYTE_ORDER, 10, 0, 0) | ^~~~~~~~~~~~~~~~ /tmp/B.ni56z2/BUILD/lttng-modules-2.12.0/lttng-modules-2.12.0/probes/../instrumentation/events/lttng-module/arch/x86/kvm/trace.h:448:3: note: in expansion of macro 'ctf_integer' 448 | ctf_integer(__u8, flags, kei_decode_mode(vcpu->arch.emulate_ctxt.mode)) | ^~~~~~~~~~~ /tmp/B.ni56z2/BUILD/lttng-modules-2.12.0/lttng-modules-2.12.0/probes/../instrumentation/events/lttng-module/arch/x86/kvm/trace.h:448:28: note: in expansion of macro 'kei_decode_mode' 448 | ctf_integer(__u8, flags, kei_decode_mode(vcpu->arch.emulate_ctxt.mode)) | ^~~~~~~~~~~~~~~ make[3]: *** [scripts/Makefile.build:267: /tmp/B.ni56z2/BUILD/lttng-modules-2.12.0/lttng-modules-2.12.0/probes/lttng-probe-kvm-x86.o] Error 1 make[3]: *** Waiting for unfinished jobs.... CC [M] /tmp/B.ni56z2/BUILD/lttng-modules-2.12.0/lttng-modules-2.12.0/probes/lttng-probe-x86-exceptions.o CC [M] /tmp/B.ni56z2/BUILD/lttng-modules-2.12.0/lttng-modules-2.12.0/probes/lttng-probe-signal.o CC [M] /tmp/B.ni56z2/BUILD/lttng-modules-2.12.0/lttng-modules-2.12.0/probes/lttng-probe-napi.o CC [M] /tmp/B.ni56z2/BUILD/lttng-modules-2.12.0/lttng-modules-2.12.0/probes/lttng-probe-skb.o CC [M] /tmp/B.ni56z2/BUILD/lttng-modules-2.12.0/lttng-modules-2.12.0/probes/lttng-probe-udp.o CC [M] /tmp/B.ni56z2/BUILD/lttng-modules-2.12.0/lttng-modules-2.12.0/probes/lttng-probe-sock.o CC [M] /tmp/B.ni56z2/BUILD/lttng-modules-2.12.0/lttng-modules-2.12.0/probes/lttng-probe-net.o CC [M] /tmp/B.ni56z2/BUILD/lttng-modules-2.12.0/lttng-modules-2.12.0/probes/lttng-probe-block.o make[2]: *** [scripts/Makefile.build:488: /tmp/B.ni56z2/BUILD/lttng-modules-2.12.0/lttng-modules-2.12.0/probes] Error 2 make[1]: *** [Makefile:1729: /tmp/B.ni56z2/BUILD/lttng-modules-2.12.0/lttng-modules-2.12.0] Error 2 make: *** [Makefile:145: modules] Error 2 error: Bad exit status from /tmp/B.ni56z2/BUILD/tmp/rpm-tmp.35379 (%build) RPM build errors: Bad exit status from /tmp/B.ni56z2/BUILD/tmp/rpm-tmp.35379 (%build) ended at: Sat Jun 6 10:12:48 2020, done in 0:00:10.854309 error: No files produced. + chmod -R u+rwX /tmp/B.ni56z2/BUILD + rm -rf /tmp/B.ni56z2/tmp /tmp/B.ni56z2/BUILD + rm -rf /tmp/B.ni56z2 Begin-PLD-Builder-Info Build-Time: user:52.50s sys:5.68s real:16.93s (faults io:0 non-io:1409488) End-PLD-Builder-Info
[Back to list of logs] [View rpm -qa of builder]