FailedOk

th/SRPMS[OK]
th/x32[OK]
th/i686[OK]
th/x86_64[OK]

ac/SRPMS[OK]
ac/i386[OK]
ac/i586[OK]
ac/i686[OK]
ac/alpha[OK]
ac/amd64[OK]
ac/athlon[OK]
ac/ppc[OK]
ac/sparc[OK]
ac/sparc64[OK]

Advanced Search
main()
Powered by PLD Linux
(c) 2002-2019 PLD Team
$Revision: 1.37 $
Powered by ufo.
Your IP: 54.87.18.165

lttng-modules b88e670a-8ae9-4737-b53a-97ee96d6c9d7

Status:Failed
Source URL:ftp://buildlogs.pld-linux.org/th/x32/FAIL/lttng-modules,b88e670a-8ae9-4737-b53a-97ee96d6c9d7.bz2
text/plain URL:View!
rpm -qa of builder:View!
Date:2019/01/02 11:04:04
Runtime:0:01:01.229499

Toc:

  • prep
  • Executing(%prep): /bin/sh -e /tmp/B.BDr8ki/BUILD/tmp/rpm-tmp.9137
  • build
  • Executing(%build): /bin/sh -e /tmp/B.BDr8ki/BUILD/tmp/rpm-tmp.9137
  • error 1
  • /tmp/B.BDr8ki/BUILD/lttng-modules-2.10.7/probes/../probes/lttng-tracepoint-event-impl.h:143:6: error: conflicting types for 'trace_signal_generate'
  • error 2
  • /tmp/B.BDr8ki/BUILD/lttng-modules-2.10.7/probes/../probes/lttng-tracepoint-event-impl.h:143:6: error: conflicting types for 'trace_signal_deliver'
  • error 3
  • /tmp/B.BDr8ki/BUILD/lttng-modules-2.10.7/probes/../instrumentation/events/lttng-module/signal.h:17:40: error: 'SEND_SIG_FORCED' undeclared (first use in this function); did you mean 'SEND_SIG_PRIV'?
  • error 4
  • /tmp/B.BDr8ki/BUILD/lttng-modules-2.10.7/probes/../instrumentation/events/lttng-module/signal.h:17:40: error: 'SEND_SIG_FORCED' undeclared (first use in this function); did you mean 'SEND_SIG_PRIV'?
  • error 5
  • /tmp/B.BDr8ki/BUILD/lttng-modules-2.10.7/probes/../instrumentation/events/lttng-module/signal.h:17:40: error: 'SEND_SIG_FORCED' undeclared (first use in this function); did you mean 'SEND_SIG_PRIV'?
  • error 6
  • /tmp/B.BDr8ki/BUILD/lttng-modules-2.10.7/probes/../instrumentation/events/lttng-module/signal.h:17:40: error: 'SEND_SIG_FORCED' undeclared (first use in this function); did you mean 'SEND_SIG_PRIV'?
  • error 7
  • make[3]: *** [scripts/Makefile.build:297: /tmp/B.BDr8ki/BUILD/lttng-modules-2.10.7/probes/lttng-probe-signal.o] Error 1
  • error 8
  • make[2]: *** [scripts/Makefile.build:516: /tmp/B.BDr8ki/BUILD/lttng-modules-2.10.7/probes] Error 2
  • error 9
  • make[1]: *** [Makefile:1563: _module_/tmp/B.BDr8ki/BUILD/lttng-modules-2.10.7] Error 2
  • error 10
  • error: Bad exit status from /tmp/B.BDr8ki/BUILD/tmp/rpm-tmp.9137 (%build)
  • error 11
  • RPM build errors:
  • error 12
  • error: No files produced.

Content:

request from: baggins
checking if we should skip the build
started at: Wed Jan  2 11:02:56 2019
killing old processes on a builder
sending signal 9 to pid -1
Killed
cleaning up /tmp
fetching https://srcbuilder.pld-linux.org/th//srpms/b88e670a-8ae9-4737-b53a-97ee96d6c9d7/lttng-modules-2.10.7-2%404.20.0_2.src.rpm
fetched 318679 bytes, 699.4 K/s
installing srpm: lttng-modules-2.10.7-2@4.20.0_2.src.rpm
+ install -d /tmp/B.BDr8ki/BUILD /tmp/B.BDr8ki/RPMS
+ LC_ALL=en_US.UTF-8
+ rpm -qp --changelog lttng-modules-2.10.7-2@4.20.0_2.src.rpm
* Wed Jan 02 2019 PLD Linux Team <feedback@pld-linux.org>
- For complete changelog see: http://git.pld-linux.org/?p=packages/lttng-modules.git;a=log;h=auto/th/lttng-modules-2.10.7-2
* Sat Oct 27 2018 Jan Rękorajski <baggins@pld-linux.org> cf47fa9
- fix building with kernel 4.19 * Mon Aug 13 2018 Jan Rękorajski <baggins@pld-linux.org> 616ac20
- up to 2.10.7 * Mon Jun 18 2018 Jan Rękorajski <baggins@pld-linux.org> 7681880
- up to 2.10.6 * Sat Apr 07 2018 Jan Rękorajski <baggins@pld-linux.org> ce7edfe
- upstream fixes for kernel 4.16 * Fri Apr 06 2018 Jan Rękorajski <baggins@pld-linux.org> bb69d75
- up to 2.10.5 * Mon Jan 29 2018 Jan Rękorajski <baggins@pld-linux.org> 9fd8375
- upstream fixes for kernel 4.15 - rel 3 * Fri Jan 19 2018 Jan Rękorajski <baggins@pld-linux.org> b1989bf
- upstream updates for kvm instrumentation - rel 2 + rpm -Uhv --nodeps --define '_topdir /tmp/B.BDr8ki' --define '_specdir %{_topdir}' --define '_sourcedir %{_specdir}' --define '_rpmdir %{_topdir}/RPMS' --define '_builddir %{_topdir}/BUILD' --without userspace --define 'build_kernels head,4.14,4.9,4.4' lttng-modules-2.10.7-2@4.20.0_2.src.rpm Preparing... ################################################## lttng-modules ################################################## + rm -f lttng-modules-2.10.7-2@4.20.0_2.src.rpm + install -m 700 -d /tmp/B.BDr8ki/BUILD/tmp + TMPDIR=/tmp/B.BDr8ki/BUILD/tmp + exec nice -n 0 rpmbuild -bp --short-circuit --nodeps --define '_topdir /tmp/B.BDr8ki' --define '_specdir %{_topdir}' --define '_sourcedir %{_specdir}' --define '_rpmdir %{_topdir}/RPMS' --define '_builddir %{_topdir}/BUILD' --without userspace --target x32-pld-linux --define 'build_kernels head,4.14,4.9,4.4' --define 'prep exit 0' /tmp/B.BDr8ki/lttng-modules.spec Building target platforms: x32-pld-linux checking BuildConflict-ing packages no BuildConflicts found checking BR rpm: Building target platforms: x32-pld-linux no BR needed building RPM using: set -ex; : build-id: b88e670a-8ae9-4737-b53a-97ee96d6c9d7; TMPDIR=/tmp/B.BDr8ki/BUILD/tmp exec nice -n 0 rpmbuild -bb --define '_smp_mflags -j9' --define '_make_opts -Otarget' --define '_pld_builder 1' --define '_topdir /tmp/B.BDr8ki' --define '_specdir %{_topdir}' --define '_sourcedir %{_specdir}' --define '_rpmdir %{_topdir}/RPMS' --define '_builddir %{_topdir}/BUILD' --without userspace --target x32-pld-linux --define 'build_kernels head,4.14,4.9,4.4' /tmp/B.BDr8ki/lttng-modules.spec + : build-id: b88e670a-8ae9-4737-b53a-97ee96d6c9d7 + TMPDIR=/tmp/B.BDr8ki/BUILD/tmp + exec nice -n 0 rpmbuild -bb --define '_smp_mflags -j9' --define '_make_opts -Otarget' --define '_pld_builder 1' --define '_topdir /tmp/B.BDr8ki' --define '_specdir %{_topdir}' --define '_sourcedir %{_specdir}' --define '_rpmdir %{_topdir}/RPMS' --define '_builddir %{_topdir}/BUILD' --without userspace --target x32-pld-linux --define 'build_kernels head,4.14,4.9,4.4' /tmp/B.BDr8ki/lttng-modules.spec Building target platforms: x32-pld-linux Executing(%prep): /bin/sh -e /tmp/B.BDr8ki/BUILD/tmp/rpm-tmp.9137 + umask 022 + cd /tmp/B.BDr8ki/BUILD + cd /tmp/B.BDr8ki/BUILD + rm -rf lttng-modules-2.10.7 + /usr/bin/bzip2 -dc /tmp/B.BDr8ki/lttng-modules-2.10.7.tar.bz2 + /bin/tar -xf - + STATUS=0 + '[' 0 -ne 0 ']' + cd lttng-modules-2.10.7 + /bin/id -u + '[' 1000 '=' 0 ']' + /bin/id -u + '[' 1000 '=' 0 ']' + /bin/chmod -Rf a+rX,u+w,g-w,o-w . + echo 'Patch #0 (build.patch):' Patch #0 (build.patch): + '[' -f /tmp/B.BDr8ki/build.patch ']' + /bin/cat /tmp/B.BDr8ki/build.patch + /usr/bin/patch -s -p1 + echo 'Patch #1 (kernel-4.19.patch):' Patch #1 (kernel-4.19.patch): + '[' -f /tmp/B.BDr8ki/kernel-4.19.patch ']' + /bin/cat /tmp/B.BDr8ki/kernel-4.19.patch + /usr/bin/patch -s -p1 + exit 0 Executing(%build): /bin/sh -e /tmp/B.BDr8ki/BUILD/tmp/rpm-tmp.9137 HOME=/home/users/builder PATH=/home/users/builder/GNUstep/Tools:/usr/local/bin:/usr/bin:/bin TMPDIR=/tmp/B.BDr8ki/BUILD/tmp + umask 022 + cd /tmp/B.BDr8ki/BUILD + cd lttng-modules-2.10.7 + /usr/bin/make -Otarget -j9 'KERNELDIR=/usr/src/linux' /usr/bin/make -C /usr/src/linux M=/tmp/B.BDr8ki/BUILD/lttng-modules-2.10.7 CONFIG_LTTNG=m CONFIG_LTTNG_CLOCK_PLUGIN_TEST=m modules find: '/tmp/B.BDr8ki/BUILD/lttng-modules-2.10.7/extra_version/patches/': No such file or directory find: '/tmp/B.BDr8ki/BUILD/lttng-modules-2.10.7/lib/../extra_version/patches/': No such file or directory find: '/tmp/B.BDr8ki/BUILD/lttng-modules-2.10.7/probes/../extra_version/patches/': No such file or directory find: '/tmp/B.BDr8ki/BUILD/lttng-modules-2.10.7/tests/../extra_version/patches/': No such file or directory CC [M] /tmp/B.BDr8ki/BUILD/lttng-modules-2.10.7/tests/probes/lttng-test.o CC [M] /tmp/B.BDr8ki/BUILD/lttng-modules-2.10.7/lttng-ring-buffer-metadata-client.o CC [M] /tmp/B.BDr8ki/BUILD/lttng-modules-2.10.7/lttng-ring-buffer-client-mmap-discard.o CC [M] /tmp/B.BDr8ki/BUILD/lttng-modules-2.10.7/lttng-ring-buffer-metadata-mmap-client.o CC [M] /tmp/B.BDr8ki/BUILD/lttng-modules-2.10.7/lttng-ring-buffer-client-mmap-overwrite.o CC [M] /tmp/B.BDr8ki/BUILD/lttng-modules-2.10.7/lttng-ring-buffer-client-discard.o CC [M] /tmp/B.BDr8ki/BUILD/lttng-modules-2.10.7/lttng-ring-buffer-client-overwrite.o CC [M] /tmp/B.BDr8ki/BUILD/lttng-modules-2.10.7/lttng-string-utils.o CC [M] /tmp/B.BDr8ki/BUILD/lttng-modules-2.10.7/tests/clock-plugin/lttng-clock-plugin-test.o LD [M] /tmp/B.BDr8ki/BUILD/lttng-modules-2.10.7/tests/lttng-test.o LD [M] /tmp/B.BDr8ki/BUILD/lttng-modules-2.10.7/tests/lttng-clock-plugin-test.o CC [M] /tmp/B.BDr8ki/BUILD/lttng-modules-2.10.7/probes/lttng-probe-sched.o CC [M] /tmp/B.BDr8ki/BUILD/lttng-modules-2.10.7/lib/ringbuffer/ring_buffer_backend.o CC [M] /tmp/B.BDr8ki/BUILD/lttng-modules-2.10.7/probes/lttng-probe-irq.o CC [M] /tmp/B.BDr8ki/BUILD/lttng-modules-2.10.7/lttng-abi.o CC [M] /tmp/B.BDr8ki/BUILD/lttng-modules-2.10.7/lttng-clock.o CC [M] /tmp/B.BDr8ki/BUILD/lttng-modules-2.10.7/lttng-probes.o CC [M] /tmp/B.BDr8ki/BUILD/lttng-modules-2.10.7/lttng-context.o CC [M] /tmp/B.BDr8ki/BUILD/lttng-modules-2.10.7/lttng-context-pid.o CC [M] /tmp/B.BDr8ki/BUILD/lttng-modules-2.10.7/probes/lttng-probe-timer.o CC [M] /tmp/B.BDr8ki/BUILD/lttng-modules-2.10.7/probes/lttng-probe-kmem.o CC [M] /tmp/B.BDr8ki/BUILD/lttng-modules-2.10.7/lttng-context-procname.o CC [M] /tmp/B.BDr8ki/BUILD/lttng-modules-2.10.7/lttng-context-nice.o CC [M] /tmp/B.BDr8ki/BUILD/lttng-modules-2.10.7/lttng-events.o CC [M] /tmp/B.BDr8ki/BUILD/lttng-modules-2.10.7/probes/lttng-probe-module.o CC [M] /tmp/B.BDr8ki/BUILD/lttng-modules-2.10.7/lib/ringbuffer/ring_buffer_frontend.o CC [M] /tmp/B.BDr8ki/BUILD/lttng-modules-2.10.7/lttng-context-prio.o CC [M] /tmp/B.BDr8ki/BUILD/lttng-modules-2.10.7/lttng-context-vpid.o CC [M] /tmp/B.BDr8ki/BUILD/lttng-modules-2.10.7/probes/lttng-probe-power.o CC [M] /tmp/B.BDr8ki/BUILD/lttng-modules-2.10.7/lttng-context-tid.o CC [M] /tmp/B.BDr8ki/BUILD/lttng-modules-2.10.7/lib/ringbuffer/ring_buffer_iterator.o CC [M] /tmp/B.BDr8ki/BUILD/lttng-modules-2.10.7/lttng-context-vtid.o CC [M] /tmp/B.BDr8ki/BUILD/lttng-modules-2.10.7/lib/ringbuffer/ring_buffer_vfs.o CC [M] /tmp/B.BDr8ki/BUILD/lttng-modules-2.10.7/probes/lttng-probe-i2c.o CC [M] /tmp/B.BDr8ki/BUILD/lttng-modules-2.10.7/lib/ringbuffer/ring_buffer_splice.o CC [M] /tmp/B.BDr8ki/BUILD/lttng-modules-2.10.7/probes/lttng-probe-statedump.o CC [M] /tmp/B.BDr8ki/BUILD/lttng-modules-2.10.7/probes/lttng-probe-kvm.o CC [M] /tmp/B.BDr8ki/BUILD/lttng-modules-2.10.7/lttng-context-ppid.o CC [M] /tmp/B.BDr8ki/BUILD/lttng-modules-2.10.7/lib/prio_heap/lttng_prio_heap.o CC [M] /tmp/B.BDr8ki/BUILD/lttng-modules-2.10.7/lib/../wrapper/splice.o CC [M] /tmp/B.BDr8ki/BUILD/lttng-modules-2.10.7/lib/ringbuffer/ring_buffer_mmap.o LD [M] /tmp/B.BDr8ki/BUILD/lttng-modules-2.10.7/lib/lttng-lib-ring-buffer.o CC [M] /tmp/B.BDr8ki/BUILD/lttng-modules-2.10.7/lttng-context-cpu-id.o CC [M] /tmp/B.BDr8ki/BUILD/lttng-modules-2.10.7/lttng-context-interruptible.o CC [M] /tmp/B.BDr8ki/BUILD/lttng-modules-2.10.7/lttng-context-vppid.o CC [M] /tmp/B.BDr8ki/BUILD/lttng-modules-2.10.7/probes/lttng-probe-x86-exceptions.o CC [M] /tmp/B.BDr8ki/BUILD/lttng-modules-2.10.7/lttng-calibrate.o CC [M] /tmp/B.BDr8ki/BUILD/lttng-modules-2.10.7/probes/lttng-probe-x86-irq-vectors.o CC [M] /tmp/B.BDr8ki/BUILD/lttng-modules-2.10.7/lttng-context-need-reschedule.o CC [M] /tmp/B.BDr8ki/BUILD/lttng-modules-2.10.7/wrapper/random.o CC [M] /tmp/B.BDr8ki/BUILD/lttng-modules-2.10.7/probes/lttng-probe-signal.o In file included from /tmp/B.BDr8ki/BUILD/lttng-modules-2.10.7/probes/../probes/define_trace.h:100, from /tmp/B.BDr8ki/BUILD/lttng-modules-2.10.7/probes/../instrumentation/events/lttng-module/signal.h:153, from /tmp/B.BDr8ki/BUILD/lttng-modules-2.10.7/probes/lttng-probe-signal.c:39: /tmp/B.BDr8ki/BUILD/lttng-modules-2.10.7/probes/../probes/lttng-tracepoint-event-impl.h:143:6: error: conflicting types for 'trace_signal_generate' void trace_##_name(_proto); ^~~~~~ /tmp/B.BDr8ki/BUILD/lttng-modules-2.10.7/probes/../probes/lttng-tracepoint-event-impl.h:55:2: note: in expansion of macro 'LTTNG_TRACEPOINT_EVENT_INSTANCE_MAP' LTTNG_TRACEPOINT_EVENT_INSTANCE_MAP(map, name, map, PARAMS(proto), PARAMS(args)) ^~~~~~~~~~~~~~~~~~~~~~~~~~~~~~~~~~~ /tmp/B.BDr8ki/BUILD/lttng-modules-2.10.7/probes/../probes/lttng-tracepoint-event-impl.h:97:2: note: in expansion of macro 'LTTNG_TRACEPOINT_EVENT_MAP' LTTNG_TRACEPOINT_EVENT_MAP(name, name, \ ^~~~~~~~~~~~~~~~~~~~~~~~~~ /tmp/B.BDr8ki/BUILD/lttng-modules-2.10.7/probes/../instrumentation/events/lttng-module/signal.h:53:1: note: in expansion of macro 'LTTNG_TRACEPOINT_EVENT' LTTNG_TRACEPOINT_EVENT(signal_generate, ^~~~~~~~~~~~~~~~~~~~~~ In file included from ./include/trace/events/signal.h:10, from /tmp/B.BDr8ki/BUILD/lttng-modules-2.10.7/probes/lttng-probe-signal.c:30: ./include/linux/tracepoint.h:235:21: note: previous definition of 'trace_signal_generate' was here static inline void trace_##name(proto) \ ^~~~~~ ./include/linux/tracepoint.h:398:2: note: in expansion of macro '__DECLARE_TRACE' __DECLARE_TRACE(name, PARAMS(proto), PARAMS(args), \ ^~~~~~~~~~~~~~~ ./include/linux/tracepoint.h:534:2: note: in expansion of macro 'DECLARE_TRACE' DECLARE_TRACE(name, PARAMS(proto), PARAMS(args)) ^~~~~~~~~~~~~ ./include/trace/events/signal.h:50:1: note: in expansion of macro 'TRACE_EVENT' TRACE_EVENT(signal_generate, ^~~~~~~~~~~ In file included from /tmp/B.BDr8ki/BUILD/lttng-modules-2.10.7/probes/../probes/define_trace.h:100, from /tmp/B.BDr8ki/BUILD/lttng-modules-2.10.7/probes/../instrumentation/events/lttng-module/signal.h:153, from /tmp/B.BDr8ki/BUILD/lttng-modules-2.10.7/probes/lttng-probe-signal.c:39: /tmp/B.BDr8ki/BUILD/lttng-modules-2.10.7/probes/../probes/lttng-tracepoint-event-impl.h:143:6: error: conflicting types for 'trace_signal_deliver' void trace_##_name(_proto); ^~~~~~ /tmp/B.BDr8ki/BUILD/lttng-modules-2.10.7/probes/../probes/lttng-tracepoint-event-impl.h:55:2: note: in expansion of macro 'LTTNG_TRACEPOINT_EVENT_INSTANCE_MAP' LTTNG_TRACEPOINT_EVENT_INSTANCE_MAP(map, name, map, PARAMS(proto), PARAMS(args)) ^~~~~~~~~~~~~~~~~~~~~~~~~~~~~~~~~~~ /tmp/B.BDr8ki/BUILD/lttng-modules-2.10.7/probes/../probes/lttng-tracepoint-event-impl.h:97:2: note: in expansion of macro 'LTTNG_TRACEPOINT_EVENT_MAP' LTTNG_TRACEPOINT_EVENT_MAP(name, name, \ ^~~~~~~~~~~~~~~~~~~~~~~~~~ /tmp/B.BDr8ki/BUILD/lttng-modules-2.10.7/probes/../instrumentation/events/lttng-module/signal.h:85:1: note: in expansion of macro 'LTTNG_TRACEPOINT_EVENT' LTTNG_TRACEPOINT_EVENT(signal_deliver, ^~~~~~~~~~~~~~~~~~~~~~ In file included from ./include/trace/events/signal.h:10, from /tmp/B.BDr8ki/BUILD/lttng-modules-2.10.7/probes/lttng-probe-signal.c:30: ./include/linux/tracepoint.h:235:21: note: previous definition of 'trace_signal_deliver' was here static inline void trace_##name(proto) \ ^~~~~~ ./include/linux/tracepoint.h:398:2: note: in expansion of macro '__DECLARE_TRACE' __DECLARE_TRACE(name, PARAMS(proto), PARAMS(args), \ ^~~~~~~~~~~~~~~ ./include/linux/tracepoint.h:534:2: note: in expansion of macro 'DECLARE_TRACE' DECLARE_TRACE(name, PARAMS(proto), PARAMS(args)) ^~~~~~~~~~~~~ ./include/trace/events/signal.h:96:1: note: in expansion of macro 'TRACE_EVENT' TRACE_EVENT(signal_deliver, ^~~~~~~~~~~ In file included from /tmp/B.BDr8ki/BUILD/lttng-modules-2.10.7/probes/../probes/define_trace.h:100, from /tmp/B.BDr8ki/BUILD/lttng-modules-2.10.7/probes/../instrumentation/events/lttng-module/signal.h:153, from /tmp/B.BDr8ki/BUILD/lttng-modules-2.10.7/probes/lttng-probe-signal.c:39: /tmp/B.BDr8ki/BUILD/lttng-modules-2.10.7/probes/../instrumentation/events/lttng-module/signal.h: In function '__event_prepare_filter_stack__signal_generate': /tmp/B.BDr8ki/BUILD/lttng-modules-2.10.7/probes/../instrumentation/events/lttng-module/signal.h:17:10: warning: comparison of distinct pointer types lacks a cast (info == SEND_SIG_NOINFO || info == SEND_SIG_FORCED || info == SEND_SIG_PRIV) ? \ ^~ /tmp/B.BDr8ki/BUILD/lttng-modules-2.10.7/probes/../probes/lttng-tracepoint-event-impl.h:775:2: note: in definition of macro 'LTTNG_TRACEPOINT_EVENT_CLASS_CODE' _fields \ ^~~~~~~ /tmp/B.BDr8ki/BUILD/lttng-modules-2.10.7/probes/../probes/lttng-tracepoint-event-impl.h:117:3: note: in expansion of macro 'PARAMS' PARAMS(_fields), ) ^~~~~~ /tmp/B.BDr8ki/BUILD/lttng-modules-2.10.7/probes/../probes/lttng-tracepoint-event-impl.h:51:2: note: in expansion of macro 'LTTNG_TRACEPOINT_EVENT_CLASS' LTTNG_TRACEPOINT_EVENT_CLASS(map, \ ^~~~~~~~~~~~~~~~~~~~~~~~~~~~ /tmp/B.BDr8ki/BUILD/lttng-modules-2.10.7/probes/../probes/lttng-tracepoint-event-impl.h:54:9: note: in expansion of macro 'PARAMS' PARAMS(fields)) \ ^~~~~~ /tmp/B.BDr8ki/BUILD/lttng-modules-2.10.7/probes/../probes/lttng-tracepoint-event-impl.h:97:2: note: in expansion of macro 'LTTNG_TRACEPOINT_EVENT_MAP' LTTNG_TRACEPOINT_EVENT_MAP(name, name, \ ^~~~~~~~~~~~~~~~~~~~~~~~~~ /tmp/B.BDr8ki/BUILD/lttng-modules-2.10.7/probes/../probes/lttng-tracepoint-event-impl.h:100:4: note: in expansion of macro 'PARAMS' PARAMS(fields)) ^~~~~~ /tmp/B.BDr8ki/BUILD/lttng-modules-2.10.7/probes/../instrumentation/events/lttng-module/signal.h:53:1: note: in expansion of macro 'LTTNG_TRACEPOINT_EVENT' LTTNG_TRACEPOINT_EVENT(signal_generate, ^~~~~~~~~~~~~~~~~~~~~~ /tmp/B.BDr8ki/BUILD/lttng-modules-2.10.7/probes/../instrumentation/events/lttng-module/signal.h:60:2: note: in expansion of macro 'TP_FIELDS' TP_FIELDS( ^~~~~~~~~ /tmp/B.BDr8ki/BUILD/lttng-modules-2.10.7/probes/../probes/lttng-tracepoint-event-impl.h:681:2: note: in expansion of macro '_ctf_integer_ext_fetched' _ctf_integer_ext_fetched(_type, _item, _src, _byte_order, _base, _nowrite) ^~~~~~~~~~~~~~~~~~~~~~~~ /tmp/B.BDr8ki/BUILD/lttng-modules-2.10.7/probes/../probes/lttng-tracepoint-event-impl.h:698:2: note: in expansion of macro '_ctf_integer_ext_isuser0' _ctf_integer_ext_isuser##_user(_type, _item, _user_src, _byte_order, _base, _nowrite) ^~~~~~~~~~~~~~~~~~~~~~~ /tmp/B.BDr8ki/BUILD/lttng-modules-2.10.7/probes/../probes/lttng-events-write.h:23:2: note: in expansion of macro '_ctf_integer_ext' _ctf_integer_ext(_type, _item, _src, __BYTE_ORDER, 10, 0, 0) ^~~~~~~~~~~~~~~~ /tmp/B.BDr8ki/BUILD/lttng-modules-2.10.7/probes/../instrumentation/events/lttng-module/signal.h:16:3: note: in expansion of macro 'ctf_integer' ctf_integer(int, errno, \ ^~~~~~~~~~~ /tmp/B.BDr8ki/BUILD/lttng-modules-2.10.7/probes/../instrumentation/events/lttng-module/signal.h:62:3: note: in expansion of macro 'LTTNG_FIELDS_SIGINFO' LTTNG_FIELDS_SIGINFO(info) ^~~~~~~~~~~~~~~~~~~~ /tmp/B.BDr8ki/BUILD/lttng-modules-2.10.7/probes/../instrumentation/events/lttng-module/signal.h:17:40: error: 'SEND_SIG_FORCED' undeclared (first use in this function); did you mean 'SEND_SIG_PRIV'? (info == SEND_SIG_NOINFO || info == SEND_SIG_FORCED || info == SEND_SIG_PRIV) ? \ ^~~~~~~~~~~~~~~ /tmp/B.BDr8ki/BUILD/lttng-modules-2.10.7/probes/../probes/lttng-tracepoint-event-impl.h:775:2: note: in definition of macro 'LTTNG_TRACEPOINT_EVENT_CLASS_CODE' _fields \ ^~~~~~~ /tmp/B.BDr8ki/BUILD/lttng-modules-2.10.7/probes/../probes/lttng-tracepoint-event-impl.h:117:3: note: in expansion of macro 'PARAMS' PARAMS(_fields), ) ^~~~~~ /tmp/B.BDr8ki/BUILD/lttng-modules-2.10.7/probes/../probes/lttng-tracepoint-event-impl.h:51:2: note: in expansion of macro 'LTTNG_TRACEPOINT_EVENT_CLASS' LTTNG_TRACEPOINT_EVENT_CLASS(map, \ ^~~~~~~~~~~~~~~~~~~~~~~~~~~~ /tmp/B.BDr8ki/BUILD/lttng-modules-2.10.7/probes/../probes/lttng-tracepoint-event-impl.h:54:9: note: in expansion of macro 'PARAMS' PARAMS(fields)) \ ^~~~~~ /tmp/B.BDr8ki/BUILD/lttng-modules-2.10.7/probes/../probes/lttng-tracepoint-event-impl.h:97:2: note: in expansion of macro 'LTTNG_TRACEPOINT_EVENT_MAP' LTTNG_TRACEPOINT_EVENT_MAP(name, name, \ ^~~~~~~~~~~~~~~~~~~~~~~~~~ /tmp/B.BDr8ki/BUILD/lttng-modules-2.10.7/probes/../probes/lttng-tracepoint-event-impl.h:100:4: note: in expansion of macro 'PARAMS' PARAMS(fields)) ^~~~~~ /tmp/B.BDr8ki/BUILD/lttng-modules-2.10.7/probes/../instrumentation/events/lttng-module/signal.h:53:1: note: in expansion of macro 'LTTNG_TRACEPOINT_EVENT' LTTNG_TRACEPOINT_EVENT(signal_generate, ^~~~~~~~~~~~~~~~~~~~~~ /tmp/B.BDr8ki/BUILD/lttng-modules-2.10.7/probes/../instrumentation/events/lttng-module/signal.h:60:2: note: in expansion of macro 'TP_FIELDS' TP_FIELDS( ^~~~~~~~~ /tmp/B.BDr8ki/BUILD/lttng-modules-2.10.7/probes/../probes/lttng-tracepoint-event-impl.h:681:2: note: in expansion of macro '_ctf_integer_ext_fetched' _ctf_integer_ext_fetched(_type, _item, _src, _byte_order, _base, _nowrite) ^~~~~~~~~~~~~~~~~~~~~~~~ /tmp/B.BDr8ki/BUILD/lttng-modules-2.10.7/probes/../probes/lttng-tracepoint-event-impl.h:698:2: note: in expansion of macro '_ctf_integer_ext_isuser0' _ctf_integer_ext_isuser##_user(_type, _item, _user_src, _byte_order, _base, _nowrite) ^~~~~~~~~~~~~~~~~~~~~~~ /tmp/B.BDr8ki/BUILD/lttng-modules-2.10.7/probes/../probes/lttng-events-write.h:23:2: note: in expansion of macro '_ctf_integer_ext' _ctf_integer_ext(_type, _item, _src, __BYTE_ORDER, 10, 0, 0) ^~~~~~~~~~~~~~~~ /tmp/B.BDr8ki/BUILD/lttng-modules-2.10.7/probes/../instrumentation/events/lttng-module/signal.h:16:3: note: in expansion of macro 'ctf_integer' ctf_integer(int, errno, \ ^~~~~~~~~~~ /tmp/B.BDr8ki/BUILD/lttng-modules-2.10.7/probes/../instrumentation/events/lttng-module/signal.h:62:3: note: in expansion of macro 'LTTNG_FIELDS_SIGINFO' LTTNG_FIELDS_SIGINFO(info) ^~~~~~~~~~~~~~~~~~~~ /tmp/B.BDr8ki/BUILD/lttng-modules-2.10.7/probes/../instrumentation/events/lttng-module/signal.h:17:40: note: each undeclared identifier is reported only once for each function it appears in (info == SEND_SIG_NOINFO || info == SEND_SIG_FORCED || info == SEND_SIG_PRIV) ? \ ^~~~~~~~~~~~~~~ /tmp/B.BDr8ki/BUILD/lttng-modules-2.10.7/probes/../probes/lttng-tracepoint-event-impl.h:775:2: note: in definition of macro 'LTTNG_TRACEPOINT_EVENT_CLASS_CODE' _fields \ ^~~~~~~ /tmp/B.BDr8ki/BUILD/lttng-modules-2.10.7/probes/../probes/lttng-tracepoint-event-impl.h:117:3: note: in expansion of macro 'PARAMS' PARAMS(_fields), ) ^~~~~~ /tmp/B.BDr8ki/BUILD/lttng-modules-2.10.7/probes/../probes/lttng-tracepoint-event-impl.h:51:2: note: in expansion of macro 'LTTNG_TRACEPOINT_EVENT_CLASS' LTTNG_TRACEPOINT_EVENT_CLASS(map, \ ^~~~~~~~~~~~~~~~~~~~~~~~~~~~ /tmp/B.BDr8ki/BUILD/lttng-modules-2.10.7/probes/../probes/lttng-tracepoint-event-impl.h:54:9: note: in expansion of macro 'PARAMS' PARAMS(fields)) \ ^~~~~~ /tmp/B.BDr8ki/BUILD/lttng-modules-2.10.7/probes/../probes/lttng-tracepoint-event-impl.h:97:2: note: in expansion of macro 'LTTNG_TRACEPOINT_EVENT_MAP' LTTNG_TRACEPOINT_EVENT_MAP(name, name, \ ^~~~~~~~~~~~~~~~~~~~~~~~~~ /tmp/B.BDr8ki/BUILD/lttng-modules-2.10.7/probes/../probes/lttng-tracepoint-event-impl.h:100:4: note: in expansion of macro 'PARAMS' PARAMS(fields)) ^~~~~~ /tmp/B.BDr8ki/BUILD/lttng-modules-2.10.7/probes/../instrumentation/events/lttng-module/signal.h:53:1: note: in expansion of macro 'LTTNG_TRACEPOINT_EVENT' LTTNG_TRACEPOINT_EVENT(signal_generate, ^~~~~~~~~~~~~~~~~~~~~~ /tmp/B.BDr8ki/BUILD/lttng-modules-2.10.7/probes/../instrumentation/events/lttng-module/signal.h:60:2: note: in expansion of macro 'TP_FIELDS' TP_FIELDS( ^~~~~~~~~ /tmp/B.BDr8ki/BUILD/lttng-modules-2.10.7/probes/../probes/lttng-tracepoint-event-impl.h:681:2: note: in expansion of macro '_ctf_integer_ext_fetched' _ctf_integer_ext_fetched(_type, _item, _src, _byte_order, _base, _nowrite) ^~~~~~~~~~~~~~~~~~~~~~~~ /tmp/B.BDr8ki/BUILD/lttng-modules-2.10.7/probes/../probes/lttng-tracepoint-event-impl.h:698:2: note: in expansion of macro '_ctf_integer_ext_isuser0' _ctf_integer_ext_isuser##_user(_type, _item, _user_src, _byte_order, _base, _nowrite) ^~~~~~~~~~~~~~~~~~~~~~~ /tmp/B.BDr8ki/BUILD/lttng-modules-2.10.7/probes/../probes/lttng-events-write.h:23:2: note: in expansion of macro '_ctf_integer_ext' _ctf_integer_ext(_type, _item, _src, __BYTE_ORDER, 10, 0, 0) ^~~~~~~~~~~~~~~~ /tmp/B.BDr8ki/BUILD/lttng-modules-2.10.7/probes/../instrumentation/events/lttng-module/signal.h:16:3: note: in expansion of macro 'ctf_integer' ctf_integer(int, errno, \ ^~~~~~~~~~~ /tmp/B.BDr8ki/BUILD/lttng-modules-2.10.7/probes/../instrumentation/events/lttng-module/signal.h:62:3: note: in expansion of macro 'LTTNG_FIELDS_SIGINFO' LTTNG_FIELDS_SIGINFO(info) ^~~~~~~~~~~~~~~~~~~~ /tmp/B.BDr8ki/BUILD/lttng-modules-2.10.7/probes/../instrumentation/events/lttng-module/signal.h:17:64: warning: comparison of distinct pointer types lacks a cast (info == SEND_SIG_NOINFO || info == SEND_SIG_FORCED || info == SEND_SIG_PRIV) ? \ ^~ /tmp/B.BDr8ki/BUILD/lttng-modules-2.10.7/probes/../probes/lttng-tracepoint-event-impl.h:775:2: note: in definition of macro 'LTTNG_TRACEPOINT_EVENT_CLASS_CODE' _fields \ ^~~~~~~ /tmp/B.BDr8ki/BUILD/lttng-modules-2.10.7/probes/../probes/lttng-tracepoint-event-impl.h:117:3: note: in expansion of macro 'PARAMS' PARAMS(_fields), ) ^~~~~~ /tmp/B.BDr8ki/BUILD/lttng-modules-2.10.7/probes/../probes/lttng-tracepoint-event-impl.h:51:2: note: in expansion of macro 'LTTNG_TRACEPOINT_EVENT_CLASS' LTTNG_TRACEPOINT_EVENT_CLASS(map, \ ^~~~~~~~~~~~~~~~~~~~~~~~~~~~ /tmp/B.BDr8ki/BUILD/lttng-modules-2.10.7/probes/../probes/lttng-tracepoint-event-impl.h:54:9: note: in expansion of macro 'PARAMS' PARAMS(fields)) \ ^~~~~~ /tmp/B.BDr8ki/BUILD/lttng-modules-2.10.7/probes/../probes/lttng-tracepoint-event-impl.h:97:2: note: in expansion of macro 'LTTNG_TRACEPOINT_EVENT_MAP' LTTNG_TRACEPOINT_EVENT_MAP(name, name, \ ^~~~~~~~~~~~~~~~~~~~~~~~~~ /tmp/B.BDr8ki/BUILD/lttng-modules-2.10.7/probes/../probes/lttng-tracepoint-event-impl.h:100:4: note: in expansion of macro 'PARAMS' PARAMS(fields)) ^~~~~~ /tmp/B.BDr8ki/BUILD/lttng-modules-2.10.7/probes/../instrumentation/events/lttng-module/signal.h:53:1: note: in expansion of macro 'LTTNG_TRACEPOINT_EVENT' LTTNG_TRACEPOINT_EVENT(signal_generate, ^~~~~~~~~~~~~~~~~~~~~~ /tmp/B.BDr8ki/BUILD/lttng-modules-2.10.7/probes/../instrumentation/events/lttng-module/signal.h:60:2: note: in expansion of macro 'TP_FIELDS' TP_FIELDS( ^~~~~~~~~ /tmp/B.BDr8ki/BUILD/lttng-modules-2.10.7/probes/../probes/lttng-tracepoint-event-impl.h:681:2: note: in expansion of macro '_ctf_integer_ext_fetched' _ctf_integer_ext_fetched(_type, _item, _src, _byte_order, _base, _nowrite) ^~~~~~~~~~~~~~~~~~~~~~~~ /tmp/B.BDr8ki/BUILD/lttng-modules-2.10.7/probes/../probes/lttng-tracepoint-event-impl.h:698:2: note: in expansion of macro '_ctf_integer_ext_isuser0' _ctf_integer_ext_isuser##_user(_type, _item, _user_src, _byte_order, _base, _nowrite) ^~~~~~~~~~~~~~~~~~~~~~~ /tmp/B.BDr8ki/BUILD/lttng-modules-2.10.7/probes/../probes/lttng-events-write.h:23:2: note: in expansion of macro '_ctf_integer_ext' _ctf_integer_ext(_type, _item, _src, __BYTE_ORDER, 10, 0, 0) ^~~~~~~~~~~~~~~~ /tmp/B.BDr8ki/BUILD/lttng-modules-2.10.7/probes/../instrumentation/events/lttng-module/signal.h:16:3: note: in expansion of macro 'ctf_integer' ctf_integer(int, errno, \ ^~~~~~~~~~~ /tmp/B.BDr8ki/BUILD/lttng-modules-2.10.7/probes/../instrumentation/events/lttng-module/signal.h:62:3: note: in expansion of macro 'LTTNG_FIELDS_SIGINFO' LTTNG_FIELDS_SIGINFO(info) ^~~~~~~~~~~~~~~~~~~~ /tmp/B.BDr8ki/BUILD/lttng-modules-2.10.7/probes/../instrumentation/events/lttng-module/signal.h:17:10: warning: comparison of distinct pointer types lacks a cast (info == SEND_SIG_NOINFO || info == SEND_SIG_FORCED || info == SEND_SIG_PRIV) ? \ ^~ /tmp/B.BDr8ki/BUILD/lttng-modules-2.10.7/probes/../probes/lttng-tracepoint-event-impl.h:775:2: note: in definition of macro 'LTTNG_TRACEPOINT_EVENT_CLASS_CODE' _fields \ ^~~~~~~ /tmp/B.BDr8ki/BUILD/lttng-modules-2.10.7/probes/../probes/lttng-tracepoint-event-impl.h:117:3: note: in expansion of macro 'PARAMS' PARAMS(_fields), ) ^~~~~~ /tmp/B.BDr8ki/BUILD/lttng-modules-2.10.7/probes/../probes/lttng-tracepoint-event-impl.h:51:2: note: in expansion of macro 'LTTNG_TRACEPOINT_EVENT_CLASS' LTTNG_TRACEPOINT_EVENT_CLASS(map, \ ^~~~~~~~~~~~~~~~~~~~~~~~~~~~ /tmp/B.BDr8ki/BUILD/lttng-modules-2.10.7/probes/../probes/lttng-tracepoint-event-impl.h:54:9: note: in expansion of macro 'PARAMS' PARAMS(fields)) \ ^~~~~~ /tmp/B.BDr8ki/BUILD/lttng-modules-2.10.7/probes/../probes/lttng-tracepoint-event-impl.h:97:2: note: in expansion of macro 'LTTNG_TRACEPOINT_EVENT_MAP' LTTNG_TRACEPOINT_EVENT_MAP(name, name, \ ^~~~~~~~~~~~~~~~~~~~~~~~~~ /tmp/B.BDr8ki/BUILD/lttng-modules-2.10.7/probes/../probes/lttng-tracepoint-event-impl.h:100:4: note: in expansion of macro 'PARAMS' PARAMS(fields)) ^~~~~~ /tmp/B.BDr8ki/BUILD/lttng-modules-2.10.7/probes/../instrumentation/events/lttng-module/signal.h:53:1: note: in expansion of macro 'LTTNG_TRACEPOINT_EVENT' LTTNG_TRACEPOINT_EVENT(signal_generate, ^~~~~~~~~~~~~~~~~~~~~~ /tmp/B.BDr8ki/BUILD/lttng-modules-2.10.7/probes/../instrumentation/events/lttng-module/signal.h:60:2: note: in expansion of macro 'TP_FIELDS' TP_FIELDS( ^~~~~~~~~ /tmp/B.BDr8ki/BUILD/lttng-modules-2.10.7/probes/../probes/lttng-tracepoint-event-impl.h:681:2: note: in expansion of macro '_ctf_integer_ext_fetched' _ctf_integer_ext_fetched(_type, _item, _src, _byte_order, _base, _nowrite) ^~~~~~~~~~~~~~~~~~~~~~~~ /tmp/B.BDr8ki/BUILD/lttng-modules-2.10.7/probes/../probes/lttng-tracepoint-event-impl.h:698:2: note: in expansion of macro '_ctf_integer_ext_isuser0' _ctf_integer_ext_isuser##_user(_type, _item, _user_src, _byte_order, _base, _nowrite) ^~~~~~~~~~~~~~~~~~~~~~~ /tmp/B.BDr8ki/BUILD/lttng-modules-2.10.7/probes/../probes/lttng-events-write.h:23:2: note: in expansion of macro '_ctf_integer_ext' _ctf_integer_ext(_type, _item, _src, __BYTE_ORDER, 10, 0, 0) ^~~~~~~~~~~~~~~~ /tmp/B.BDr8ki/BUILD/lttng-modules-2.10.7/probes/../instrumentation/events/lttng-module/signal.h:16:3: note: in expansion of macro 'ctf_integer' ctf_integer(int, errno, \ ^~~~~~~~~~~ /tmp/B.BDr8ki/BUILD/lttng-modules-2.10.7/probes/../instrumentation/events/lttng-module/signal.h:62:3: note: in expansion of macro 'LTTNG_FIELDS_SIGINFO' LTTNG_FIELDS_SIGINFO(info) ^~~~~~~~~~~~~~~~~~~~ /tmp/B.BDr8ki/BUILD/lttng-modules-2.10.7/probes/../instrumentation/events/lttng-module/signal.h:17:64: warning: comparison of distinct pointer types lacks a cast (info == SEND_SIG_NOINFO || info == SEND_SIG_FORCED || info == SEND_SIG_PRIV) ? \ ^~ /tmp/B.BDr8ki/BUILD/lttng-modules-2.10.7/probes/../probes/lttng-tracepoint-event-impl.h:775:2: note: in definition of macro 'LTTNG_TRACEPOINT_EVENT_CLASS_CODE' _fields \ ^~~~~~~ /tmp/B.BDr8ki/BUILD/lttng-modules-2.10.7/probes/../probes/lttng-tracepoint-event-impl.h:117:3: note: in expansion of macro 'PARAMS' PARAMS(_fields), ) ^~~~~~ /tmp/B.BDr8ki/BUILD/lttng-modules-2.10.7/probes/../probes/lttng-tracepoint-event-impl.h:51:2: note: in expansion of macro 'LTTNG_TRACEPOINT_EVENT_CLASS' LTTNG_TRACEPOINT_EVENT_CLASS(map, \ ^~~~~~~~~~~~~~~~~~~~~~~~~~~~ /tmp/B.BDr8ki/BUILD/lttng-modules-2.10.7/probes/../probes/lttng-tracepoint-event-impl.h:54:9: note: in expansion of macro 'PARAMS' PARAMS(fields)) \ ^~~~~~ /tmp/B.BDr8ki/BUILD/lttng-modules-2.10.7/probes/../probes/lttng-tracepoint-event-impl.h:97:2: note: in expansion of macro 'LTTNG_TRACEPOINT_EVENT_MAP' LTTNG_TRACEPOINT_EVENT_MAP(name, name, \ ^~~~~~~~~~~~~~~~~~~~~~~~~~ /tmp/B.BDr8ki/BUILD/lttng-modules-2.10.7/probes/../probes/lttng-tracepoint-event-impl.h:100:4: note: in expansion of macro 'PARAMS' PARAMS(fields)) ^~~~~~ /tmp/B.BDr8ki/BUILD/lttng-modules-2.10.7/probes/../instrumentation/events/lttng-module/signal.h:53:1: note: in expansion of macro 'LTTNG_TRACEPOINT_EVENT' LTTNG_TRACEPOINT_EVENT(signal_generate, ^~~~~~~~~~~~~~~~~~~~~~ /tmp/B.BDr8ki/BUILD/lttng-modules-2.10.7/probes/../instrumentation/events/lttng-module/signal.h:60:2: note: in expansion of macro 'TP_FIELDS' TP_FIELDS( ^~~~~~~~~ /tmp/B.BDr8ki/BUILD/lttng-modules-2.10.7/probes/../probes/lttng-tracepoint-event-impl.h:681:2: note: in expansion of macro '_ctf_integer_ext_fetched' _ctf_integer_ext_fetched(_type, _item, _src, _byte_order, _base, _nowrite) ^~~~~~~~~~~~~~~~~~~~~~~~ /tmp/B.BDr8ki/BUILD/lttng-modules-2.10.7/probes/../probes/lttng-tracepoint-event-impl.h:698:2: note: in expansion of macro '_ctf_integer_ext_isuser0' _ctf_integer_ext_isuser##_user(_type, _item, _user_src, _byte_order, _base, _nowrite) ^~~~~~~~~~~~~~~~~~~~~~~ /tmp/B.BDr8ki/BUILD/lttng-modules-2.10.7/probes/../probes/lttng-events-write.h:23:2: note: in expansion of macro '_ctf_integer_ext' _ctf_integer_ext(_type, _item, _src, __BYTE_ORDER, 10, 0, 0) ^~~~~~~~~~~~~~~~ /tmp/B.BDr8ki/BUILD/lttng-modules-2.10.7/probes/../instrumentation/events/lttng-module/signal.h:16:3: note: in expansion of macro 'ctf_integer' ctf_integer(int, errno, \ ^~~~~~~~~~~ /tmp/B.BDr8ki/BUILD/lttng-modules-2.10.7/probes/../instrumentation/events/lttng-module/signal.h:62:3: note: in expansion of macro 'LTTNG_FIELDS_SIGINFO' LTTNG_FIELDS_SIGINFO(info) ^~~~~~~~~~~~~~~~~~~~ /tmp/B.BDr8ki/BUILD/lttng-modules-2.10.7/probes/../instrumentation/events/lttng-module/signal.h:17:10: warning: comparison of distinct pointer types lacks a cast (info == SEND_SIG_NOINFO || info == SEND_SIG_FORCED || info == SEND_SIG_PRIV) ? \ ^~ /tmp/B.BDr8ki/BUILD/lttng-modules-2.10.7/probes/../probes/lttng-tracepoint-event-impl.h:775:2: note: in definition of macro 'LTTNG_TRACEPOINT_EVENT_CLASS_CODE' _fields \ ^~~~~~~ /tmp/B.BDr8ki/BUILD/lttng-modules-2.10.7/probes/../probes/lttng-tracepoint-event-impl.h:117:3: note: in expansion of macro 'PARAMS' PARAMS(_fields), ) ^~~~~~ /tmp/B.BDr8ki/BUILD/lttng-modules-2.10.7/probes/../probes/lttng-tracepoint-event-impl.h:51:2: note: in expansion of macro 'LTTNG_TRACEPOINT_EVENT_CLASS' LTTNG_TRACEPOINT_EVENT_CLASS(map, \ ^~~~~~~~~~~~~~~~~~~~~~~~~~~~ /tmp/B.BDr8ki/BUILD/lttng-modules-2.10.7/probes/../probes/lttng-tracepoint-event-impl.h:54:9: note: in expansion of macro 'PARAMS' PARAMS(fields)) \ ^~~~~~ /tmp/B.BDr8ki/BUILD/lttng-modules-2.10.7/probes/../probes/lttng-tracepoint-event-impl.h:97:2: note: in expansion of macro 'LTTNG_TRACEPOINT_EVENT_MAP' LTTNG_TRACEPOINT_EVENT_MAP(name, name, \ ^~~~~~~~~~~~~~~~~~~~~~~~~~ /tmp/B.BDr8ki/BUILD/lttng-modules-2.10.7/probes/../probes/lttng-tracepoint-event-impl.h:100:4: note: in expansion of macro 'PARAMS' PARAMS(fields)) ^~~~~~ /tmp/B.BDr8ki/BUILD/lttng-modules-2.10.7/probes/../instrumentation/events/lttng-module/signal.h:53:1: note: in expansion of macro 'LTTNG_TRACEPOINT_EVENT' LTTNG_TRACEPOINT_EVENT(signal_generate, ^~~~~~~~~~~~~~~~~~~~~~ /tmp/B.BDr8ki/BUILD/lttng-modules-2.10.7/probes/../instrumentation/events/lttng-module/signal.h:60:2: note: in expansion of macro 'TP_FIELDS' TP_FIELDS( ^~~~~~~~~ /tmp/B.BDr8ki/BUILD/lttng-modules-2.10.7/probes/../probes/lttng-tracepoint-event-impl.h:681:2: note: in expansion of macro '_ctf_integer_ext_fetched' _ctf_integer_ext_fetched(_type, _item, _src, _byte_order, _base, _nowrite) ^~~~~~~~~~~~~~~~~~~~~~~~ /tmp/B.BDr8ki/BUILD/lttng-modules-2.10.7/probes/../probes/lttng-tracepoint-event-impl.h:698:2: note: in expansion of macro '_ctf_integer_ext_isuser0' _ctf_integer_ext_isuser##_user(_type, _item, _user_src, _byte_order, _base, _nowrite) ^~~~~~~~~~~~~~~~~~~~~~~ /tmp/B.BDr8ki/BUILD/lttng-modules-2.10.7/probes/../probes/lttng-events-write.h:23:2: note: in expansion of macro '_ctf_integer_ext' _ctf_integer_ext(_type, _item, _src, __BYTE_ORDER, 10, 0, 0) ^~~~~~~~~~~~~~~~ /tmp/B.BDr8ki/BUILD/lttng-modules-2.10.7/probes/../instrumentation/events/lttng-module/signal.h:16:3: note: in expansion of macro 'ctf_integer' ctf_integer(int, errno, \ ^~~~~~~~~~~ /tmp/B.BDr8ki/BUILD/lttng-modules-2.10.7/probes/../instrumentation/events/lttng-module/signal.h:62:3: note: in expansion of macro 'LTTNG_FIELDS_SIGINFO' LTTNG_FIELDS_SIGINFO(info) ^~~~~~~~~~~~~~~~~~~~ /tmp/B.BDr8ki/BUILD/lttng-modules-2.10.7/probes/../instrumentation/events/lttng-module/signal.h:17:64: warning: comparison of distinct pointer types lacks a cast (info == SEND_SIG_NOINFO || info == SEND_SIG_FORCED || info == SEND_SIG_PRIV) ? \ ^~ /tmp/B.BDr8ki/BUILD/lttng-modules-2.10.7/probes/../probes/lttng-tracepoint-event-impl.h:775:2: note: in definition of macro 'LTTNG_TRACEPOINT_EVENT_CLASS_CODE' _fields \ ^~~~~~~ /tmp/B.BDr8ki/BUILD/lttng-modules-2.10.7/probes/../probes/lttng-tracepoint-event-impl.h:117:3: note: in expansion of macro 'PARAMS' PARAMS(_fields), ) ^~~~~~ /tmp/B.BDr8ki/BUILD/lttng-modules-2.10.7/probes/../probes/lttng-tracepoint-event-impl.h:51:2: note: in expansion of macro 'LTTNG_TRACEPOINT_EVENT_CLASS' LTTNG_TRACEPOINT_EVENT_CLASS(map, \ ^~~~~~~~~~~~~~~~~~~~~~~~~~~~ /tmp/B.BDr8ki/BUILD/lttng-modules-2.10.7/probes/../probes/lttng-tracepoint-event-impl.h:54:9: note: in expansion of macro 'PARAMS' PARAMS(fields)) \ ^~~~~~ /tmp/B.BDr8ki/BUILD/lttng-modules-2.10.7/probes/../probes/lttng-tracepoint-event-impl.h:97:2: note: in expansion of macro 'LTTNG_TRACEPOINT_EVENT_MAP' LTTNG_TRACEPOINT_EVENT_MAP(name, name, \ ^~~~~~~~~~~~~~~~~~~~~~~~~~ /tmp/B.BDr8ki/BUILD/lttng-modules-2.10.7/probes/../probes/lttng-tracepoint-event-impl.h:100:4: note: in expansion of macro 'PARAMS' PARAMS(fields)) ^~~~~~ /tmp/B.BDr8ki/BUILD/lttng-modules-2.10.7/probes/../instrumentation/events/lttng-module/signal.h:53:1: note: in expansion of macro 'LTTNG_TRACEPOINT_EVENT' LTTNG_TRACEPOINT_EVENT(signal_generate, ^~~~~~~~~~~~~~~~~~~~~~ /tmp/B.BDr8ki/BUILD/lttng-modules-2.10.7/probes/../instrumentation/events/lttng-module/signal.h:60:2: note: in expansion of macro 'TP_FIELDS' TP_FIELDS( ^~~~~~~~~ /tmp/B.BDr8ki/BUILD/lttng-modules-2.10.7/probes/../probes/lttng-tracepoint-event-impl.h:681:2: note: in expansion of macro '_ctf_integer_ext_fetched' _ctf_integer_ext_fetched(_type, _item, _src, _byte_order, _base, _nowrite) ^~~~~~~~~~~~~~~~~~~~~~~~ /tmp/B.BDr8ki/BUILD/lttng-modules-2.10.7/probes/../probes/lttng-tracepoint-event-impl.h:698:2: note: in expansion of macro '_ctf_integer_ext_isuser0' _ctf_integer_ext_isuser##_user(_type, _item, _user_src, _byte_order, _base, _nowrite) ^~~~~~~~~~~~~~~~~~~~~~~ /tmp/B.BDr8ki/BUILD/lttng-modules-2.10.7/probes/../probes/lttng-events-write.h:23:2: note: in expansion of macro '_ctf_integer_ext' _ctf_integer_ext(_type, _item, _src, __BYTE_ORDER, 10, 0, 0) ^~~~~~~~~~~~~~~~ /tmp/B.BDr8ki/BUILD/lttng-modules-2.10.7/probes/../instrumentation/events/lttng-module/signal.h:16:3: note: in expansion of macro 'ctf_integer' ctf_integer(int, errno, \ ^~~~~~~~~~~ /tmp/B.BDr8ki/BUILD/lttng-modules-2.10.7/probes/../instrumentation/events/lttng-module/signal.h:62:3: note: in expansion of macro 'LTTNG_FIELDS_SIGINFO' LTTNG_FIELDS_SIGINFO(info) ^~~~~~~~~~~~~~~~~~~~ /tmp/B.BDr8ki/BUILD/lttng-modules-2.10.7/probes/../instrumentation/events/lttng-module/signal.h:17:10: warning: comparison of distinct pointer types lacks a cast (info == SEND_SIG_NOINFO || info == SEND_SIG_FORCED || info == SEND_SIG_PRIV) ? \ ^~ /tmp/B.BDr8ki/BUILD/lttng-modules-2.10.7/probes/../probes/lttng-tracepoint-event-impl.h:775:2: note: in definition of macro 'LTTNG_TRACEPOINT_EVENT_CLASS_CODE' _fields \ ^~~~~~~ /tmp/B.BDr8ki/BUILD/lttng-modules-2.10.7/probes/../probes/lttng-tracepoint-event-impl.h:117:3: note: in expansion of macro 'PARAMS' PARAMS(_fields), ) ^~~~~~ /tmp/B.BDr8ki/BUILD/lttng-modules-2.10.7/probes/../probes/lttng-tracepoint-event-impl.h:51:2: note: in expansion of macro 'LTTNG_TRACEPOINT_EVENT_CLASS' LTTNG_TRACEPOINT_EVENT_CLASS(map, \ ^~~~~~~~~~~~~~~~~~~~~~~~~~~~ /tmp/B.BDr8ki/BUILD/lttng-modules-2.10.7/probes/../probes/lttng-tracepoint-event-impl.h:54:9: note: in expansion of macro 'PARAMS' PARAMS(fields)) \ ^~~~~~ /tmp/B.BDr8ki/BUILD/lttng-modules-2.10.7/probes/../probes/lttng-tracepoint-event-impl.h:97:2: note: in expansion of macro 'LTTNG_TRACEPOINT_EVENT_MAP' LTTNG_TRACEPOINT_EVENT_MAP(name, name, \ ^~~~~~~~~~~~~~~~~~~~~~~~~~ /tmp/B.BDr8ki/BUILD/lttng-modules-2.10.7/probes/../probes/lttng-tracepoint-event-impl.h:100:4: note: in expansion of macro 'PARAMS' PARAMS(fields)) ^~~~~~ /tmp/B.BDr8ki/BUILD/lttng-modules-2.10.7/probes/../instrumentation/events/lttng-module/signal.h:53:1: note: in expansion of macro 'LTTNG_TRACEPOINT_EVENT' LTTNG_TRACEPOINT_EVENT(signal_generate, ^~~~~~~~~~~~~~~~~~~~~~ /tmp/B.BDr8ki/BUILD/lttng-modules-2.10.7/probes/../instrumentation/events/lttng-module/signal.h:60:2: note: in expansion of macro 'TP_FIELDS' TP_FIELDS( ^~~~~~~~~ /tmp/B.BDr8ki/BUILD/lttng-modules-2.10.7/probes/../probes/lttng-tracepoint-event-impl.h:681:2: note: in expansion of macro '_ctf_integer_ext_fetched' _ctf_integer_ext_fetched(_type, _item, _src, _byte_order, _base, _nowrite) ^~~~~~~~~~~~~~~~~~~~~~~~ /tmp/B.BDr8ki/BUILD/lttng-modules-2.10.7/probes/../probes/lttng-tracepoint-event-impl.h:698:2: note: in expansion of macro '_ctf_integer_ext_isuser0' _ctf_integer_ext_isuser##_user(_type, _item, _user_src, _byte_order, _base, _nowrite) ^~~~~~~~~~~~~~~~~~~~~~~ /tmp/B.BDr8ki/BUILD/lttng-modules-2.10.7/probes/../probes/lttng-events-write.h:23:2: note: in expansion of macro '_ctf_integer_ext' _ctf_integer_ext(_type, _item, _src, __BYTE_ORDER, 10, 0, 0) ^~~~~~~~~~~~~~~~ /tmp/B.BDr8ki/BUILD/lttng-modules-2.10.7/probes/../instrumentation/events/lttng-module/signal.h:16:3: note: in expansion of macro 'ctf_integer' ctf_integer(int, errno, \ ^~~~~~~~~~~ /tmp/B.BDr8ki/BUILD/lttng-modules-2.10.7/probes/../instrumentation/events/lttng-module/signal.h:62:3: note: in expansion of macro 'LTTNG_FIELDS_SIGINFO' LTTNG_FIELDS_SIGINFO(info) ^~~~~~~~~~~~~~~~~~~~ /tmp/B.BDr8ki/BUILD/lttng-modules-2.10.7/probes/../instrumentation/events/lttng-module/signal.h:17:64: warning: comparison of distinct pointer types lacks a cast (info == SEND_SIG_NOINFO || info == SEND_SIG_FORCED || info == SEND_SIG_PRIV) ? \ ^~ /tmp/B.BDr8ki/BUILD/lttng-modules-2.10.7/probes/../probes/lttng-tracepoint-event-impl.h:775:2: note: in definition of macro 'LTTNG_TRACEPOINT_EVENT_CLASS_CODE' _fields \ ^~~~~~~ /tmp/B.BDr8ki/BUILD/lttng-modules-2.10.7/probes/../probes/lttng-tracepoint-event-impl.h:117:3: note: in expansion of macro 'PARAMS' PARAMS(_fields), ) ^~~~~~ /tmp/B.BDr8ki/BUILD/lttng-modules-2.10.7/probes/../probes/lttng-tracepoint-event-impl.h:51:2: note: in expansion of macro 'LTTNG_TRACEPOINT_EVENT_CLASS' LTTNG_TRACEPOINT_EVENT_CLASS(map, \ ^~~~~~~~~~~~~~~~~~~~~~~~~~~~ /tmp/B.BDr8ki/BUILD/lttng-modules-2.10.7/probes/../probes/lttng-tracepoint-event-impl.h:54:9: note: in expansion of macro 'PARAMS' PARAMS(fields)) \ ^~~~~~ /tmp/B.BDr8ki/BUILD/lttng-modules-2.10.7/probes/../probes/lttng-tracepoint-event-impl.h:97:2: note: in expansion of macro 'LTTNG_TRACEPOINT_EVENT_MAP' LTTNG_TRACEPOINT_EVENT_MAP(name, name, \ ^~~~~~~~~~~~~~~~~~~~~~~~~~ /tmp/B.BDr8ki/BUILD/lttng-modules-2.10.7/probes/../probes/lttng-tracepoint-event-impl.h:100:4: note: in expansion of macro 'PARAMS' PARAMS(fields)) ^~~~~~ /tmp/B.BDr8ki/BUILD/lttng-modules-2.10.7/probes/../instrumentation/events/lttng-module/signal.h:53:1: note: in expansion of macro 'LTTNG_TRACEPOINT_EVENT' LTTNG_TRACEPOINT_EVENT(signal_generate, ^~~~~~~~~~~~~~~~~~~~~~ /tmp/B.BDr8ki/BUILD/lttng-modules-2.10.7/probes/../instrumentation/events/lttng-module/signal.h:60:2: note: in expansion of macro 'TP_FIELDS' TP_FIELDS( ^~~~~~~~~ /tmp/B.BDr8ki/BUILD/lttng-modules-2.10.7/probes/../probes/lttng-tracepoint-event-impl.h:681:2: note: in expansion of macro '_ctf_integer_ext_fetched' _ctf_integer_ext_fetched(_type, _item, _src, _byte_order, _base, _nowrite) ^~~~~~~~~~~~~~~~~~~~~~~~ /tmp/B.BDr8ki/BUILD/lttng-modules-2.10.7/probes/../probes/lttng-tracepoint-event-impl.h:698:2: note: in expansion of macro '_ctf_integer_ext_isuser0' _ctf_integer_ext_isuser##_user(_type, _item, _user_src, _byte_order, _base, _nowrite) ^~~~~~~~~~~~~~~~~~~~~~~ /tmp/B.BDr8ki/BUILD/lttng-modules-2.10.7/probes/../probes/lttng-events-write.h:23:2: note: in expansion of macro '_ctf_integer_ext' _ctf_integer_ext(_type, _item, _src, __BYTE_ORDER, 10, 0, 0) ^~~~~~~~~~~~~~~~ /tmp/B.BDr8ki/BUILD/lttng-modules-2.10.7/probes/../instrumentation/events/lttng-module/signal.h:16:3: note: in expansion of macro 'ctf_integer' ctf_integer(int, errno, \ ^~~~~~~~~~~ /tmp/B.BDr8ki/BUILD/lttng-modules-2.10.7/probes/../instrumentation/events/lttng-module/signal.h:62:3: note: in expansion of macro 'LTTNG_FIELDS_SIGINFO' LTTNG_FIELDS_SIGINFO(info) ^~~~~~~~~~~~~~~~~~~~ /tmp/B.BDr8ki/BUILD/lttng-modules-2.10.7/probes/../instrumentation/events/lttng-module/signal.h:17:10: warning: comparison of distinct pointer types lacks a cast (info == SEND_SIG_NOINFO || info == SEND_SIG_FORCED || info == SEND_SIG_PRIV) ? \ ^~ /tmp/B.BDr8ki/BUILD/lttng-modules-2.10.7/probes/../probes/lttng-tracepoint-event-impl.h:775:2: note: in definition of macro 'LTTNG_TRACEPOINT_EVENT_CLASS_CODE' _fields \ ^~~~~~~ /tmp/B.BDr8ki/BUILD/lttng-modules-2.10.7/probes/../probes/lttng-tracepoint-event-impl.h:117:3: note: in expansion of macro 'PARAMS' PARAMS(_fields), ) ^~~~~~ /tmp/B.BDr8ki/BUILD/lttng-modules-2.10.7/probes/../probes/lttng-tracepoint-event-impl.h:51:2: note: in expansion of macro 'LTTNG_TRACEPOINT_EVENT_CLASS' LTTNG_TRACEPOINT_EVENT_CLASS(map, \ ^~~~~~~~~~~~~~~~~~~~~~~~~~~~ /tmp/B.BDr8ki/BUILD/lttng-modules-2.10.7/probes/../probes/lttng-tracepoint-event-impl.h:54:9: note: in expansion of macro 'PARAMS' PARAMS(fields)) \ ^~~~~~ /tmp/B.BDr8ki/BUILD/lttng-modules-2.10.7/probes/../probes/lttng-tracepoint-event-impl.h:97:2: note: in expansion of macro 'LTTNG_TRACEPOINT_EVENT_MAP' LTTNG_TRACEPOINT_EVENT_MAP(name, name, \ ^~~~~~~~~~~~~~~~~~~~~~~~~~ /tmp/B.BDr8ki/BUILD/lttng-modules-2.10.7/probes/../probes/lttng-tracepoint-event-impl.h:100:4: note: in expansion of macro 'PARAMS' PARAMS(fields)) ^~~~~~ /tmp/B.BDr8ki/BUILD/lttng-modules-2.10.7/probes/../instrumentation/events/lttng-module/signal.h:53:1: note: in expansion of macro 'LTTNG_TRACEPOINT_EVENT' LTTNG_TRACEPOINT_EVENT(signal_generate, ^~~~~~~~~~~~~~~~~~~~~~ /tmp/B.BDr8ki/BUILD/lttng-modules-2.10.7/probes/../instrumentation/events/lttng-module/signal.h:60:2: note: in expansion of macro 'TP_FIELDS' TP_FIELDS( ^~~~~~~~~ /tmp/B.BDr8ki/BUILD/lttng-modules-2.10.7/probes/../probes/lttng-tracepoint-event-impl.h:681:2: note: in expansion of macro '_ctf_integer_ext_fetched' _ctf_integer_ext_fetched(_type, _item, _src, _byte_order, _base, _nowrite) ^~~~~~~~~~~~~~~~~~~~~~~~ /tmp/B.BDr8ki/BUILD/lttng-modules-2.10.7/probes/../probes/lttng-tracepoint-event-impl.h:698:2: note: in expansion of macro '_ctf_integer_ext_isuser0' _ctf_integer_ext_isuser##_user(_type, _item, _user_src, _byte_order, _base, _nowrite) ^~~~~~~~~~~~~~~~~~~~~~~ /tmp/B.BDr8ki/BUILD/lttng-modules-2.10.7/probes/../probes/lttng-events-write.h:23:2: note: in expansion of macro '_ctf_integer_ext' _ctf_integer_ext(_type, _item, _src, __BYTE_ORDER, 10, 0, 0) ^~~~~~~~~~~~~~~~ /tmp/B.BDr8ki/BUILD/lttng-modules-2.10.7/probes/../instrumentation/events/lttng-module/signal.h:16:3: note: in expansion of macro 'ctf_integer' ctf_integer(int, errno, \ ^~~~~~~~~~~ /tmp/B.BDr8ki/BUILD/lttng-modules-2.10.7/probes/../instrumentation/events/lttng-module/signal.h:62:3: note: in expansion of macro 'LTTNG_FIELDS_SIGINFO' LTTNG_FIELDS_SIGINFO(info) ^~~~~~~~~~~~~~~~~~~~ /tmp/B.BDr8ki/BUILD/lttng-modules-2.10.7/probes/../instrumentation/events/lttng-module/signal.h:17:64: warning: comparison of distinct pointer types lacks a cast (info == SEND_SIG_NOINFO || info == SEND_SIG_FORCED || info == SEND_SIG_PRIV) ? \ ^~ /tmp/B.BDr8ki/BUILD/lttng-modules-2.10.7/probes/../probes/lttng-tracepoint-event-impl.h:775:2: note: in definition of macro 'LTTNG_TRACEPOINT_EVENT_CLASS_CODE' _fields \ ^~~~~~~ /tmp/B.BDr8ki/BUILD/lttng-modules-2.10.7/probes/../probes/lttng-tracepoint-event-impl.h:117:3: note: in expansion of macro 'PARAMS' PARAMS(_fields), ) ^~~~~~ /tmp/B.BDr8ki/BUILD/lttng-modules-2.10.7/probes/../probes/lttng-tracepoint-event-impl.h:51:2: note: in expansion of macro 'LTTNG_TRACEPOINT_EVENT_CLASS' LTTNG_TRACEPOINT_EVENT_CLASS(map, \ ^~~~~~~~~~~~~~~~~~~~~~~~~~~~ /tmp/B.BDr8ki/BUILD/lttng-modules-2.10.7/probes/../probes/lttng-tracepoint-event-impl.h:54:9: note: in expansion of macro 'PARAMS' PARAMS(fields)) \ ^~~~~~ /tmp/B.BDr8ki/BUILD/lttng-modules-2.10.7/probes/../probes/lttng-tracepoint-event-impl.h:97:2: note: in expansion of macro 'LTTNG_TRACEPOINT_EVENT_MAP' LTTNG_TRACEPOINT_EVENT_MAP(name, name, \ ^~~~~~~~~~~~~~~~~~~~~~~~~~ /tmp/B.BDr8ki/BUILD/lttng-modules-2.10.7/probes/../probes/lttng-tracepoint-event-impl.h:100:4: note: in expansion of macro 'PARAMS' PARAMS(fields)) ^~~~~~ /tmp/B.BDr8ki/BUILD/lttng-modules-2.10.7/probes/../instrumentation/events/lttng-module/signal.h:53:1: note: in expansion of macro 'LTTNG_TRACEPOINT_EVENT' LTTNG_TRACEPOINT_EVENT(signal_generate, ^~~~~~~~~~~~~~~~~~~~~~ /tmp/B.BDr8ki/BUILD/lttng-modules-2.10.7/probes/../instrumentation/events/lttng-module/signal.h:60:2: note: in expansion of macro 'TP_FIELDS' TP_FIELDS( ^~~~~~~~~ /tmp/B.BDr8ki/BUILD/lttng-modules-2.10.7/probes/../probes/lttng-tracepoint-event-impl.h:681:2: note: in expansion of macro '_ctf_integer_ext_fetched' _ctf_integer_ext_fetched(_type, _item, _src, _byte_order, _base, _nowrite) ^~~~~~~~~~~~~~~~~~~~~~~~ /tmp/B.BDr8ki/BUILD/lttng-modules-2.10.7/probes/../probes/lttng-tracepoint-event-impl.h:698:2: note: in expansion of macro '_ctf_integer_ext_isuser0' _ctf_integer_ext_isuser##_user(_type, _item, _user_src, _byte_order, _base, _nowrite) ^~~~~~~~~~~~~~~~~~~~~~~ /tmp/B.BDr8ki/BUILD/lttng-modules-2.10.7/probes/../probes/lttng-events-write.h:23:2: note: in expansion of macro '_ctf_integer_ext' _ctf_integer_ext(_type, _item, _src, __BYTE_ORDER, 10, 0, 0) ^~~~~~~~~~~~~~~~ /tmp/B.BDr8ki/BUILD/lttng-modules-2.10.7/probes/../instrumentation/events/lttng-module/signal.h:16:3: note: in expansion of macro 'ctf_integer' ctf_integer(int, errno, \ ^~~~~~~~~~~ /tmp/B.BDr8ki/BUILD/lttng-modules-2.10.7/probes/../instrumentation/events/lttng-module/signal.h:62:3: note: in expansion of macro 'LTTNG_FIELDS_SIGINFO' LTTNG_FIELDS_SIGINFO(info) ^~~~~~~~~~~~~~~~~~~~ /tmp/B.BDr8ki/BUILD/lttng-modules-2.10.7/probes/../instrumentation/events/lttng-module/signal.h:17:10: warning: comparison of distinct pointer types lacks a cast (info == SEND_SIG_NOINFO || info == SEND_SIG_FORCED || info == SEND_SIG_PRIV) ? \ ^~ /tmp/B.BDr8ki/BUILD/lttng-modules-2.10.7/probes/../probes/lttng-tracepoint-event-impl.h:775:2: note: in definition of macro 'LTTNG_TRACEPOINT_EVENT_CLASS_CODE' _fields \ ^~~~~~~ /tmp/B.BDr8ki/BUILD/lttng-modules-2.10.7/probes/../probes/lttng-tracepoint-event-impl.h:117:3: note: in expansion of macro 'PARAMS' PARAMS(_fields), ) ^~~~~~ /tmp/B.BDr8ki/BUILD/lttng-modules-2.10.7/probes/../probes/lttng-tracepoint-event-impl.h:51:2: note: in expansion of macro 'LTTNG_TRACEPOINT_EVENT_CLASS' LTTNG_TRACEPOINT_EVENT_CLASS(map, \ ^~~~~~~~~~~~~~~~~~~~~~~~~~~~ /tmp/B.BDr8ki/BUILD/lttng-modules-2.10.7/probes/../probes/lttng-tracepoint-event-impl.h:54:9: note: in expansion of macro 'PARAMS' PARAMS(fields)) \ ^~~~~~ /tmp/B.BDr8ki/BUILD/lttng-modules-2.10.7/probes/../probes/lttng-tracepoint-event-impl.h:97:2: note: in expansion of macro 'LTTNG_TRACEPOINT_EVENT_MAP' LTTNG_TRACEPOINT_EVENT_MAP(name, name, \ ^~~~~~~~~~~~~~~~~~~~~~~~~~ /tmp/B.BDr8ki/BUILD/lttng-modules-2.10.7/probes/../probes/lttng-tracepoint-event-impl.h:100:4: note: in expansion of macro 'PARAMS' PARAMS(fields)) ^~~~~~ /tmp/B.BDr8ki/BUILD/lttng-modules-2.10.7/probes/../instrumentation/events/lttng-module/signal.h:53:1: note: in expansion of macro 'LTTNG_TRACEPOINT_EVENT' LTTNG_TRACEPOINT_EVENT(signal_generate, ^~~~~~~~~~~~~~~~~~~~~~ /tmp/B.BDr8ki/BUILD/lttng-modules-2.10.7/probes/../instrumentation/events/lttng-module/signal.h:60:2: note: in expansion of macro 'TP_FIELDS' TP_FIELDS( ^~~~~~~~~ /tmp/B.BDr8ki/BUILD/lttng-modules-2.10.7/probes/../probes/lttng-tracepoint-event-impl.h:681:2: note: in expansion of macro '_ctf_integer_ext_fetched' _ctf_integer_ext_fetched(_type, _item, _src, _byte_order, _base, _nowrite) ^~~~~~~~~~~~~~~~~~~~~~~~ /tmp/B.BDr8ki/BUILD/lttng-modules-2.10.7/probes/../probes/lttng-tracepoint-event-impl.h:698:2: note: in expansion of macro '_ctf_integer_ext_isuser0' _ctf_integer_ext_isuser##_user(_type, _item, _user_src, _byte_order, _base, _nowrite) ^~~~~~~~~~~~~~~~~~~~~~~ /tmp/B.BDr8ki/BUILD/lttng-modules-2.10.7/probes/../probes/lttng-events-write.h:23:2: note: in expansion of macro '_ctf_integer_ext' _ctf_integer_ext(_type, _item, _src, __BYTE_ORDER, 10, 0, 0) ^~~~~~~~~~~~~~~~ /tmp/B.BDr8ki/BUILD/lttng-modules-2.10.7/probes/../instrumentation/events/lttng-module/signal.h:16:3: note: in expansion of macro 'ctf_integer' ctf_integer(int, errno, \ ^~~~~~~~~~~ /tmp/B.BDr8ki/BUILD/lttng-modules-2.10.7/probes/../instrumentation/events/lttng-module/signal.h:62:3: note: in expansion of macro 'LTTNG_FIELDS_SIGINFO' LTTNG_FIELDS_SIGINFO(info) ^~~~~~~~~~~~~~~~~~~~ /tmp/B.BDr8ki/BUILD/lttng-modules-2.10.7/probes/../instrumentation/events/lttng-module/signal.h:17:64: warning: comparison of distinct pointer types lacks a cast (info == SEND_SIG_NOINFO || info == SEND_SIG_FORCED || info == SEND_SIG_PRIV) ? \ ^~ /tmp/B.BDr8ki/BUILD/lttng-modules-2.10.7/probes/../probes/lttng-tracepoint-event-impl.h:775:2: note: in definition of macro 'LTTNG_TRACEPOINT_EVENT_CLASS_CODE' _fields \ ^~~~~~~ /tmp/B.BDr8ki/BUILD/lttng-modules-2.10.7/probes/../probes/lttng-tracepoint-event-impl.h:117:3: note: in expansion of macro 'PARAMS' PARAMS(_fields), ) ^~~~~~ /tmp/B.BDr8ki/BUILD/lttng-modules-2.10.7/probes/../probes/lttng-tracepoint-event-impl.h:51:2: note: in expansion of macro 'LTTNG_TRACEPOINT_EVENT_CLASS' LTTNG_TRACEPOINT_EVENT_CLASS(map, \ ^~~~~~~~~~~~~~~~~~~~~~~~~~~~ /tmp/B.BDr8ki/BUILD/lttng-modules-2.10.7/probes/../probes/lttng-tracepoint-event-impl.h:54:9: note: in expansion of macro 'PARAMS' PARAMS(fields)) \ ^~~~~~ /tmp/B.BDr8ki/BUILD/lttng-modules-2.10.7/probes/../probes/lttng-tracepoint-event-impl.h:97:2: note: in expansion of macro 'LTTNG_TRACEPOINT_EVENT_MAP' LTTNG_TRACEPOINT_EVENT_MAP(name, name, \ ^~~~~~~~~~~~~~~~~~~~~~~~~~ /tmp/B.BDr8ki/BUILD/lttng-modules-2.10.7/probes/../probes/lttng-tracepoint-event-impl.h:100:4: note: in expansion of macro 'PARAMS' PARAMS(fields)) ^~~~~~ /tmp/B.BDr8ki/BUILD/lttng-modules-2.10.7/probes/../instrumentation/events/lttng-module/signal.h:53:1: note: in expansion of macro 'LTTNG_TRACEPOINT_EVENT' LTTNG_TRACEPOINT_EVENT(signal_generate, ^~~~~~~~~~~~~~~~~~~~~~ /tmp/B.BDr8ki/BUILD/lttng-modules-2.10.7/probes/../instrumentation/events/lttng-module/signal.h:60:2: note: in expansion of macro 'TP_FIELDS' TP_FIELDS( ^~~~~~~~~ /tmp/B.BDr8ki/BUILD/lttng-modules-2.10.7/probes/../probes/lttng-tracepoint-event-impl.h:681:2: note: in expansion of macro '_ctf_integer_ext_fetched' _ctf_integer_ext_fetched(_type, _item, _src, _byte_order, _base, _nowrite) ^~~~~~~~~~~~~~~~~~~~~~~~ /tmp/B.BDr8ki/BUILD/lttng-modules-2.10.7/probes/../probes/lttng-tracepoint-event-impl.h:698:2: note: in expansion of macro '_ctf_integer_ext_isuser0' _ctf_integer_ext_isuser##_user(_type, _item, _user_src, _byte_order, _base, _nowrite) ^~~~~~~~~~~~~~~~~~~~~~~ /tmp/B.BDr8ki/BUILD/lttng-modules-2.10.7/probes/../probes/lttng-events-write.h:23:2: note: in expansion of macro '_ctf_integer_ext' _ctf_integer_ext(_type, _item, _src, __BYTE_ORDER, 10, 0, 0) ^~~~~~~~~~~~~~~~ /tmp/B.BDr8ki/BUILD/lttng-modules-2.10.7/probes/../instrumentation/events/lttng-module/signal.h:16:3: note: in expansion of macro 'ctf_integer' ctf_integer(int, errno, \ ^~~~~~~~~~~ /tmp/B.BDr8ki/BUILD/lttng-modules-2.10.7/probes/../instrumentation/events/lttng-module/signal.h:62:3: note: in expansion of macro 'LTTNG_FIELDS_SIGINFO' LTTNG_FIELDS_SIGINFO(info) ^~~~~~~~~~~~~~~~~~~~ /tmp/B.BDr8ki/BUILD/lttng-modules-2.10.7/probes/../instrumentation/events/lttng-module/signal.h:17:10: warning: comparison of distinct pointer types lacks a cast (info == SEND_SIG_NOINFO || info == SEND_SIG_FORCED || info == SEND_SIG_PRIV) ? \ ^~ /tmp/B.BDr8ki/BUILD/lttng-modules-2.10.7/probes/../probes/lttng-tracepoint-event-impl.h:775:2: note: in definition of macro 'LTTNG_TRACEPOINT_EVENT_CLASS_CODE' _fields \ ^~~~~~~ /tmp/B.BDr8ki/BUILD/lttng-modules-2.10.7/probes/../probes/lttng-tracepoint-event-impl.h:117:3: note: in expansion of macro 'PARAMS' PARAMS(_fields), ) ^~~~~~ /tmp/B.BDr8ki/BUILD/lttng-modules-2.10.7/probes/../probes/lttng-tracepoint-event-impl.h:51:2: note: in expansion of macro 'LTTNG_TRACEPOINT_EVENT_CLASS' LTTNG_TRACEPOINT_EVENT_CLASS(map, \ ^~~~~~~~~~~~~~~~~~~~~~~~~~~~ /tmp/B.BDr8ki/BUILD/lttng-modules-2.10.7/probes/../probes/lttng-tracepoint-event-impl.h:54:9: note: in expansion of macro 'PARAMS' PARAMS(fields)) \ ^~~~~~ /tmp/B.BDr8ki/BUILD/lttng-modules-2.10.7/probes/../probes/lttng-tracepoint-event-impl.h:97:2: note: in expansion of macro 'LTTNG_TRACEPOINT_EVENT_MAP' LTTNG_TRACEPOINT_EVENT_MAP(name, name, \ ^~~~~~~~~~~~~~~~~~~~~~~~~~ /tmp/B.BDr8ki/BUILD/lttng-modules-2.10.7/probes/../probes/lttng-tracepoint-event-impl.h:100:4: note: in expansion of macro 'PARAMS' PARAMS(fields)) ^~~~~~ /tmp/B.BDr8ki/BUILD/lttng-modules-2.10.7/probes/../instrumentation/events/lttng-module/signal.h:53:1: note: in expansion of macro 'LTTNG_TRACEPOINT_EVENT' LTTNG_TRACEPOINT_EVENT(signal_generate, ^~~~~~~~~~~~~~~~~~~~~~ /tmp/B.BDr8ki/BUILD/lttng-modules-2.10.7/probes/../instrumentation/events/lttng-module/signal.h:60:2: note: in expansion of macro 'TP_FIELDS' TP_FIELDS( ^~~~~~~~~ /tmp/B.BDr8ki/BUILD/lttng-modules-2.10.7/probes/../probes/lttng-tracepoint-event-impl.h:681:2: note: in expansion of macro '_ctf_integer_ext_fetched' _ctf_integer_ext_fetched(_type, _item, _src, _byte_order, _base, _nowrite) ^~~~~~~~~~~~~~~~~~~~~~~~ /tmp/B.BDr8ki/BUILD/lttng-modules-2.10.7/probes/../probes/lttng-tracepoint-event-impl.h:698:2: note: in expansion of macro '_ctf_integer_ext_isuser0' _ctf_integer_ext_isuser##_user(_type, _item, _user_src, _byte_order, _base, _nowrite) ^~~~~~~~~~~~~~~~~~~~~~~ /tmp/B.BDr8ki/BUILD/lttng-modules-2.10.7/probes/../probes/lttng-events-write.h:23:2: note: in expansion of macro '_ctf_integer_ext' _ctf_integer_ext(_type, _item, _src, __BYTE_ORDER, 10, 0, 0) ^~~~~~~~~~~~~~~~ /tmp/B.BDr8ki/BUILD/lttng-modules-2.10.7/probes/../instrumentation/events/lttng-module/signal.h:16:3: note: in expansion of macro 'ctf_integer' ctf_integer(int, errno, \ ^~~~~~~~~~~ /tmp/B.BDr8ki/BUILD/lttng-modules-2.10.7/probes/../instrumentation/events/lttng-module/signal.h:62:3: note: in expansion of macro 'LTTNG_FIELDS_SIGINFO' LTTNG_FIELDS_SIGINFO(info) ^~~~~~~~~~~~~~~~~~~~ /tmp/B.BDr8ki/BUILD/lttng-modules-2.10.7/probes/../instrumentation/events/lttng-module/signal.h:17:64: warning: comparison of distinct pointer types lacks a cast (info == SEND_SIG_NOINFO || info == SEND_SIG_FORCED || info == SEND_SIG_PRIV) ? \ ^~ /tmp/B.BDr8ki/BUILD/lttng-modules-2.10.7/probes/../probes/lttng-tracepoint-event-impl.h:775:2: note: in definition of macro 'LTTNG_TRACEPOINT_EVENT_CLASS_CODE' _fields \ ^~~~~~~ /tmp/B.BDr8ki/BUILD/lttng-modules-2.10.7/probes/../probes/lttng-tracepoint-event-impl.h:117:3: note: in expansion of macro 'PARAMS' PARAMS(_fields), ) ^~~~~~ /tmp/B.BDr8ki/BUILD/lttng-modules-2.10.7/probes/../probes/lttng-tracepoint-event-impl.h:51:2: note: in expansion of macro 'LTTNG_TRACEPOINT_EVENT_CLASS' LTTNG_TRACEPOINT_EVENT_CLASS(map, \ ^~~~~~~~~~~~~~~~~~~~~~~~~~~~ /tmp/B.BDr8ki/BUILD/lttng-modules-2.10.7/probes/../probes/lttng-tracepoint-event-impl.h:54:9: note: in expansion of macro 'PARAMS' PARAMS(fields)) \ ^~~~~~ /tmp/B.BDr8ki/BUILD/lttng-modules-2.10.7/probes/../probes/lttng-tracepoint-event-impl.h:97:2: note: in expansion of macro 'LTTNG_TRACEPOINT_EVENT_MAP' LTTNG_TRACEPOINT_EVENT_MAP(name, name, \ ^~~~~~~~~~~~~~~~~~~~~~~~~~ /tmp/B.BDr8ki/BUILD/lttng-modules-2.10.7/probes/../probes/lttng-tracepoint-event-impl.h:100:4: note: in expansion of macro 'PARAMS' PARAMS(fields)) ^~~~~~ /tmp/B.BDr8ki/BUILD/lttng-modules-2.10.7/probes/../instrumentation/events/lttng-module/signal.h:53:1: note: in expansion of macro 'LTTNG_TRACEPOINT_EVENT' LTTNG_TRACEPOINT_EVENT(signal_generate, ^~~~~~~~~~~~~~~~~~~~~~ /tmp/B.BDr8ki/BUILD/lttng-modules-2.10.7/probes/../instrumentation/events/lttng-module/signal.h:60:2: note: in expansion of macro 'TP_FIELDS' TP_FIELDS( ^~~~~~~~~ /tmp/B.BDr8ki/BUILD/lttng-modules-2.10.7/probes/../probes/lttng-tracepoint-event-impl.h:681:2: note: in expansion of macro '_ctf_integer_ext_fetched' _ctf_integer_ext_fetched(_type, _item, _src, _byte_order, _base, _nowrite) ^~~~~~~~~~~~~~~~~~~~~~~~ /tmp/B.BDr8ki/BUILD/lttng-modules-2.10.7/probes/../probes/lttng-tracepoint-event-impl.h:698:2: note: in expansion of macro '_ctf_integer_ext_isuser0' _ctf_integer_ext_isuser##_user(_type, _item, _user_src, _byte_order, _base, _nowrite) ^~~~~~~~~~~~~~~~~~~~~~~ /tmp/B.BDr8ki/BUILD/lttng-modules-2.10.7/probes/../probes/lttng-events-write.h:23:2: note: in expansion of macro '_ctf_integer_ext' _ctf_integer_ext(_type, _item, _src, __BYTE_ORDER, 10, 0, 0) ^~~~~~~~~~~~~~~~ /tmp/B.BDr8ki/BUILD/lttng-modules-2.10.7/probes/../instrumentation/events/lttng-module/signal.h:16:3: note: in expansion of macro 'ctf_integer' ctf_integer(int, errno, \ ^~~~~~~~~~~ /tmp/B.BDr8ki/BUILD/lttng-modules-2.10.7/probes/../instrumentation/events/lttng-module/signal.h:62:3: note: in expansion of macro 'LTTNG_FIELDS_SIGINFO' LTTNG_FIELDS_SIGINFO(info) ^~~~~~~~~~~~~~~~~~~~ /tmp/B.BDr8ki/BUILD/lttng-modules-2.10.7/probes/../instrumentation/events/lttng-module/signal.h:17:10: warning: comparison of distinct pointer types lacks a cast (info == SEND_SIG_NOINFO || info == SEND_SIG_FORCED || info == SEND_SIG_PRIV) ? \ ^~ /tmp/B.BDr8ki/BUILD/lttng-modules-2.10.7/probes/../probes/lttng-tracepoint-event-impl.h:775:2: note: in definition of macro 'LTTNG_TRACEPOINT_EVENT_CLASS_CODE' _fields \ ^~~~~~~ /tmp/B.BDr8ki/BUILD/lttng-modules-2.10.7/probes/../probes/lttng-tracepoint-event-impl.h:117:3: note: in expansion of macro 'PARAMS' PARAMS(_fields), ) ^~~~~~ /tmp/B.BDr8ki/BUILD/lttng-modules-2.10.7/probes/../probes/lttng-tracepoint-event-impl.h:51:2: note: in expansion of macro 'LTTNG_TRACEPOINT_EVENT_CLASS' LTTNG_TRACEPOINT_EVENT_CLASS(map, \ ^~~~~~~~~~~~~~~~~~~~~~~~~~~~ /tmp/B.BDr8ki/BUILD/lttng-modules-2.10.7/probes/../probes/lttng-tracepoint-event-impl.h:54:9: note: in expansion of macro 'PARAMS' PARAMS(fields)) \ ^~~~~~ /tmp/B.BDr8ki/BUILD/lttng-modules-2.10.7/probes/../probes/lttng-tracepoint-event-impl.h:97:2: note: in expansion of macro 'LTTNG_TRACEPOINT_EVENT_MAP' LTTNG_TRACEPOINT_EVENT_MAP(name, name, \ ^~~~~~~~~~~~~~~~~~~~~~~~~~ /tmp/B.BDr8ki/BUILD/lttng-modules-2.10.7/probes/../probes/lttng-tracepoint-event-impl.h:100:4: note: in expansion of macro 'PARAMS' PARAMS(fields)) ^~~~~~ /tmp/B.BDr8ki/BUILD/lttng-modules-2.10.7/probes/../instrumentation/events/lttng-module/signal.h:53:1: note: in expansion of macro 'LTTNG_TRACEPOINT_EVENT' LTTNG_TRACEPOINT_EVENT(signal_generate, ^~~~~~~~~~~~~~~~~~~~~~ /tmp/B.BDr8ki/BUILD/lttng-modules-2.10.7/probes/../instrumentation/events/lttng-module/signal.h:60:2: note: in expansion of macro 'TP_FIELDS' TP_FIELDS( ^~~~~~~~~ /tmp/B.BDr8ki/BUILD/lttng-modules-2.10.7/probes/../probes/lttng-tracepoint-event-impl.h:681:2: note: in expansion of macro '_ctf_integer_ext_fetched' _ctf_integer_ext_fetched(_type, _item, _src, _byte_order, _base, _nowrite) ^~~~~~~~~~~~~~~~~~~~~~~~ /tmp/B.BDr8ki/BUILD/lttng-modules-2.10.7/probes/../probes/lttng-tracepoint-event-impl.h:698:2: note: in expansion of macro '_ctf_integer_ext_isuser0' _ctf_integer_ext_isuser##_user(_type, _item, _user_src, _byte_order, _base, _nowrite) ^~~~~~~~~~~~~~~~~~~~~~~ /tmp/B.BDr8ki/BUILD/lttng-modules-2.10.7/probes/../probes/lttng-events-write.h:23:2: note: in expansion of macro '_ctf_integer_ext' _ctf_integer_ext(_type, _item, _src, __BYTE_ORDER, 10, 0, 0) ^~~~~~~~~~~~~~~~ /tmp/B.BDr8ki/BUILD/lttng-modules-2.10.7/probes/../instrumentation/events/lttng-module/signal.h:16:3: note: in expansion of macro 'ctf_integer' ctf_integer(int, errno, \ ^~~~~~~~~~~ /tmp/B.BDr8ki/BUILD/lttng-modules-2.10.7/probes/../instrumentation/events/lttng-module/signal.h:62:3: note: in expansion of macro 'LTTNG_FIELDS_SIGINFO' LTTNG_FIELDS_SIGINFO(info) ^~~~~~~~~~~~~~~~~~~~ /tmp/B.BDr8ki/BUILD/lttng-modules-2.10.7/probes/../instrumentation/events/lttng-module/signal.h:17:64: warning: comparison of distinct pointer types lacks a cast (info == SEND_SIG_NOINFO || info == SEND_SIG_FORCED || info == SEND_SIG_PRIV) ? \ ^~ /tmp/B.BDr8ki/BUILD/lttng-modules-2.10.7/probes/../probes/lttng-tracepoint-event-impl.h:775:2: note: in definition of macro 'LTTNG_TRACEPOINT_EVENT_CLASS_CODE' _fields \ ^~~~~~~ /tmp/B.BDr8ki/BUILD/lttng-modules-2.10.7/probes/../probes/lttng-tracepoint-event-impl.h:117:3: note: in expansion of macro 'PARAMS' PARAMS(_fields), ) ^~~~~~ /tmp/B.BDr8ki/BUILD/lttng-modules-2.10.7/probes/../probes/lttng-tracepoint-event-impl.h:51:2: note: in expansion of macro 'LTTNG_TRACEPOINT_EVENT_CLASS' LTTNG_TRACEPOINT_EVENT_CLASS(map, \ ^~~~~~~~~~~~~~~~~~~~~~~~~~~~ /tmp/B.BDr8ki/BUILD/lttng-modules-2.10.7/probes/../probes/lttng-tracepoint-event-impl.h:54:9: note: in expansion of macro 'PARAMS' PARAMS(fields)) \ ^~~~~~ /tmp/B.BDr8ki/BUILD/lttng-modules-2.10.7/probes/../probes/lttng-tracepoint-event-impl.h:97:2: note: in expansion of macro 'LTTNG_TRACEPOINT_EVENT_MAP' LTTNG_TRACEPOINT_EVENT_MAP(name, name, \ ^~~~~~~~~~~~~~~~~~~~~~~~~~ /tmp/B.BDr8ki/BUILD/lttng-modules-2.10.7/probes/../probes/lttng-tracepoint-event-impl.h:100:4: note: in expansion of macro 'PARAMS' PARAMS(fields)) ^~~~~~ /tmp/B.BDr8ki/BUILD/lttng-modules-2.10.7/probes/../instrumentation/events/lttng-module/signal.h:53:1: note: in expansion of macro 'LTTNG_TRACEPOINT_EVENT' LTTNG_TRACEPOINT_EVENT(signal_generate, ^~~~~~~~~~~~~~~~~~~~~~ /tmp/B.BDr8ki/BUILD/lttng-modules-2.10.7/probes/../instrumentation/events/lttng-module/signal.h:60:2: note: in expansion of macro 'TP_FIELDS' TP_FIELDS( ^~~~~~~~~ /tmp/B.BDr8ki/BUILD/lttng-modules-2.10.7/probes/../probes/lttng-tracepoint-event-impl.h:681:2: note: in expansion of macro '_ctf_integer_ext_fetched' _ctf_integer_ext_fetched(_type, _item, _src, _byte_order, _base, _nowrite) ^~~~~~~~~~~~~~~~~~~~~~~~ /tmp/B.BDr8ki/BUILD/lttng-modules-2.10.7/probes/../probes/lttng-tracepoint-event-impl.h:698:2: note: in expansion of macro '_ctf_integer_ext_isuser0' _ctf_integer_ext_isuser##_user(_type, _item, _user_src, _byte_order, _base, _nowrite) ^~~~~~~~~~~~~~~~~~~~~~~ /tmp/B.BDr8ki/BUILD/lttng-modules-2.10.7/probes/../probes/lttng-events-write.h:23:2: note: in expansion of macro '_ctf_integer_ext' _ctf_integer_ext(_type, _item, _src, __BYTE_ORDER, 10, 0, 0) ^~~~~~~~~~~~~~~~ /tmp/B.BDr8ki/BUILD/lttng-modules-2.10.7/probes/../instrumentation/events/lttng-module/signal.h:16:3: note: in expansion of macro 'ctf_integer' ctf_integer(int, errno, \ ^~~~~~~~~~~ /tmp/B.BDr8ki/BUILD/lttng-modules-2.10.7/probes/../instrumentation/events/lttng-module/signal.h:62:3: note: in expansion of macro 'LTTNG_FIELDS_SIGINFO' LTTNG_FIELDS_SIGINFO(info) ^~~~~~~~~~~~~~~~~~~~ /tmp/B.BDr8ki/BUILD/lttng-modules-2.10.7/probes/../instrumentation/events/lttng-module/signal.h:21:10: warning: comparison of distinct pointer types lacks a cast (info == SEND_SIG_NOINFO || info == SEND_SIG_FORCED) ? \ ^~ /tmp/B.BDr8ki/BUILD/lttng-modules-2.10.7/probes/../probes/lttng-tracepoint-event-impl.h:775:2: note: in definition of macro 'LTTNG_TRACEPOINT_EVENT_CLASS_CODE' _fields \ ^~~~~~~ /tmp/B.BDr8ki/BUILD/lttng-modules-2.10.7/probes/../probes/lttng-tracepoint-event-impl.h:117:3: note: in expansion of macro 'PARAMS' PARAMS(_fields), ) ^~~~~~ /tmp/B.BDr8ki/BUILD/lttng-modules-2.10.7/probes/../probes/lttng-tracepoint-event-impl.h:51:2: note: in expansion of macro 'LTTNG_TRACEPOINT_EVENT_CLASS' LTTNG_TRACEPOINT_EVENT_CLASS(map, \ ^~~~~~~~~~~~~~~~~~~~~~~~~~~~ /tmp/B.BDr8ki/BUILD/lttng-modules-2.10.7/probes/../probes/lttng-tracepoint-event-impl.h:54:9: note: in expansion of macro 'PARAMS' PARAMS(fields)) \ ^~~~~~ /tmp/B.BDr8ki/BUILD/lttng-modules-2.10.7/probes/../probes/lttng-tracepoint-event-impl.h:97:2: note: in expansion of macro 'LTTNG_TRACEPOINT_EVENT_MAP' LTTNG_TRACEPOINT_EVENT_MAP(name, name, \ ^~~~~~~~~~~~~~~~~~~~~~~~~~ /tmp/B.BDr8ki/BUILD/lttng-modules-2.10.7/probes/../probes/lttng-tracepoint-event-impl.h:100:4: note: in expansion of macro 'PARAMS' PARAMS(fields)) ^~~~~~ /tmp/B.BDr8ki/BUILD/lttng-modules-2.10.7/probes/../instrumentation/events/lttng-module/signal.h:53:1: note: in expansion of macro 'LTTNG_TRACEPOINT_EVENT' LTTNG_TRACEPOINT_EVENT(signal_generate, ^~~~~~~~~~~~~~~~~~~~~~ /tmp/B.BDr8ki/BUILD/lttng-modules-2.10.7/probes/../instrumentation/events/lttng-module/signal.h:60:2: note: in expansion of macro 'TP_FIELDS' TP_FIELDS( ^~~~~~~~~ /tmp/B.BDr8ki/BUILD/lttng-modules-2.10.7/probes/../probes/lttng-tracepoint-event-impl.h:681:2: note: in expansion of macro '_ctf_integer_ext_fetched' _ctf_integer_ext_fetched(_type, _item, _src, _byte_order, _base, _nowrite) ^~~~~~~~~~~~~~~~~~~~~~~~ /tmp/B.BDr8ki/BUILD/lttng-modules-2.10.7/probes/../probes/lttng-tracepoint-event-impl.h:698:2: note: in expansion of macro '_ctf_integer_ext_isuser0' _ctf_integer_ext_isuser##_user(_type, _item, _user_src, _byte_order, _base, _nowrite) ^~~~~~~~~~~~~~~~~~~~~~~ /tmp/B.BDr8ki/BUILD/lttng-modules-2.10.7/probes/../probes/lttng-events-write.h:23:2: note: in expansion of macro '_ctf_integer_ext' _ctf_integer_ext(_type, _item, _src, __BYTE_ORDER, 10, 0, 0) ^~~~~~~~~~~~~~~~ /tmp/B.BDr8ki/BUILD/lttng-modules-2.10.7/probes/../instrumentation/events/lttng-module/signal.h:20:3: note: in expansion of macro 'ctf_integer' ctf_integer(int, code, \ ^~~~~~~~~~~ /tmp/B.BDr8ki/BUILD/lttng-modules-2.10.7/probes/../instrumentation/events/lttng-module/signal.h:62:3: note: in expansion of macro 'LTTNG_FIELDS_SIGINFO' LTTNG_FIELDS_SIGINFO(info) ^~~~~~~~~~~~~~~~~~~~ /tmp/B.BDr8ki/BUILD/lttng-modules-2.10.7/probes/../instrumentation/events/lttng-module/signal.h:23:11: warning: comparison of distinct pointer types lacks a cast ((info == SEND_SIG_PRIV) ? SI_KERNEL : info->si_code)) ^~ /tmp/B.BDr8ki/BUILD/lttng-modules-2.10.7/probes/../probes/lttng-tracepoint-event-impl.h:775:2: note: in definition of macro 'LTTNG_TRACEPOINT_EVENT_CLASS_CODE' _fields \ ^~~~~~~ /tmp/B.BDr8ki/BUILD/lttng-modules-2.10.7/probes/../probes/lttng-tracepoint-event-impl.h:117:3: note: in expansion of macro 'PARAMS' PARAMS(_fields), ) ^~~~~~ /tmp/B.BDr8ki/BUILD/lttng-modules-2.10.7/probes/../probes/lttng-tracepoint-event-impl.h:51:2: note: in expansion of macro 'LTTNG_TRACEPOINT_EVENT_CLASS' LTTNG_TRACEPOINT_EVENT_CLASS(map, \ ^~~~~~~~~~~~~~~~~~~~~~~~~~~~ /tmp/B.BDr8ki/BUILD/lttng-modules-2.10.7/probes/../probes/lttng-tracepoint-event-impl.h:54:9: note: in expansion of macro 'PARAMS' PARAMS(fields)) \ ^~~~~~ /tmp/B.BDr8ki/BUILD/lttng-modules-2.10.7/probes/../probes/lttng-tracepoint-event-impl.h:97:2: note: in expansion of macro 'LTTNG_TRACEPOINT_EVENT_MAP' LTTNG_TRACEPOINT_EVENT_MAP(name, name, \ ^~~~~~~~~~~~~~~~~~~~~~~~~~ /tmp/B.BDr8ki/BUILD/lttng-modules-2.10.7/probes/../probes/lttng-tracepoint-event-impl.h:100:4: note: in expansion of macro 'PARAMS' PARAMS(fields)) ^~~~~~ /tmp/B.BDr8ki/BUILD/lttng-modules-2.10.7/probes/../instrumentation/events/lttng-module/signal.h:53:1: note: in expansion of macro 'LTTNG_TRACEPOINT_EVENT' LTTNG_TRACEPOINT_EVENT(signal_generate, ^~~~~~~~~~~~~~~~~~~~~~ /tmp/B.BDr8ki/BUILD/lttng-modules-2.10.7/probes/../instrumentation/events/lttng-module/signal.h:60:2: note: in expansion of macro 'TP_FIELDS' TP_FIELDS( ^~~~~~~~~ /tmp/B.BDr8ki/BUILD/lttng-modules-2.10.7/probes/../probes/lttng-tracepoint-event-impl.h:681:2: note: in expansion of macro '_ctf_integer_ext_fetched' _ctf_integer_ext_fetched(_type, _item, _src, _byte_order, _base, _nowrite) ^~~~~~~~~~~~~~~~~~~~~~~~ /tmp/B.BDr8ki/BUILD/lttng-modules-2.10.7/probes/../probes/lttng-tracepoint-event-impl.h:698:2: note: in expansion of macro '_ctf_integer_ext_isuser0' _ctf_integer_ext_isuser##_user(_type, _item, _user_src, _byte_order, _base, _nowrite) ^~~~~~~~~~~~~~~~~~~~~~~ /tmp/B.BDr8ki/BUILD/lttng-modules-2.10.7/probes/../probes/lttng-events-write.h:23:2: note: in expansion of macro '_ctf_integer_ext' _ctf_integer_ext(_type, _item, _src, __BYTE_ORDER, 10, 0, 0) ^~~~~~~~~~~~~~~~ /tmp/B.BDr8ki/BUILD/lttng-modules-2.10.7/probes/../instrumentation/events/lttng-module/signal.h:20:3: note: in expansion of macro 'ctf_integer' ctf_integer(int, code, \ ^~~~~~~~~~~ /tmp/B.BDr8ki/BUILD/lttng-modules-2.10.7/probes/../instrumentation/events/lttng-module/signal.h:62:3: note: in expansion of macro 'LTTNG_FIELDS_SIGINFO' LTTNG_FIELDS_SIGINFO(info) ^~~~~~~~~~~~~~~~~~~~ /tmp/B.BDr8ki/BUILD/lttng-modules-2.10.7/probes/../instrumentation/events/lttng-module/signal.h:21:10: warning: comparison of distinct pointer types lacks a cast (info == SEND_SIG_NOINFO || info == SEND_SIG_FORCED) ? \ ^~ /tmp/B.BDr8ki/BUILD/lttng-modules-2.10.7/probes/../probes/lttng-tracepoint-event-impl.h:775:2: note: in definition of macro 'LTTNG_TRACEPOINT_EVENT_CLASS_CODE' _fields \ ^~~~~~~ /tmp/B.BDr8ki/BUILD/lttng-modules-2.10.7/probes/../probes/lttng-tracepoint-event-impl.h:117:3: note: in expansion of macro 'PARAMS' PARAMS(_fields), ) ^~~~~~ /tmp/B.BDr8ki/BUILD/lttng-modules-2.10.7/probes/../probes/lttng-tracepoint-event-impl.h:51:2: note: in expansion of macro 'LTTNG_TRACEPOINT_EVENT_CLASS' LTTNG_TRACEPOINT_EVENT_CLASS(map, \ ^~~~~~~~~~~~~~~~~~~~~~~~~~~~ /tmp/B.BDr8ki/BUILD/lttng-modules-2.10.7/probes/../probes/lttng-tracepoint-event-impl.h:54:9: note: in expansion of macro 'PARAMS' PARAMS(fields)) \ ^~~~~~ /tmp/B.BDr8ki/BUILD/lttng-modules-2.10.7/probes/../probes/lttng-tracepoint-event-impl.h:97:2: note: in expansion of macro 'LTTNG_TRACEPOINT_EVENT_MAP' LTTNG_TRACEPOINT_EVENT_MAP(name, name, \ ^~~~~~~~~~~~~~~~~~~~~~~~~~ /tmp/B.BDr8ki/BUILD/lttng-modules-2.10.7/probes/../probes/lttng-tracepoint-event-impl.h:100:4: note: in expansion of macro 'PARAMS' PARAMS(fields)) ^~~~~~ /tmp/B.BDr8ki/BUILD/lttng-modules-2.10.7/probes/../instrumentation/events/lttng-module/signal.h:53:1: note: in expansion of macro 'LTTNG_TRACEPOINT_EVENT' LTTNG_TRACEPOINT_EVENT(signal_generate, ^~~~~~~~~~~~~~~~~~~~~~ /tmp/B.BDr8ki/BUILD/lttng-modules-2.10.7/probes/../instrumentation/events/lttng-module/signal.h:60:2: note: in expansion of macro 'TP_FIELDS' TP_FIELDS( ^~~~~~~~~ /tmp/B.BDr8ki/BUILD/lttng-modules-2.10.7/probes/../probes/lttng-tracepoint-event-impl.h:681:2: note: in expansion of macro '_ctf_integer_ext_fetched' _ctf_integer_ext_fetched(_type, _item, _src, _byte_order, _base, _nowrite) ^~~~~~~~~~~~~~~~~~~~~~~~ /tmp/B.BDr8ki/BUILD/lttng-modules-2.10.7/probes/../probes/lttng-tracepoint-event-impl.h:698:2: note: in expansion of macro '_ctf_integer_ext_isuser0' _ctf_integer_ext_isuser##_user(_type, _item, _user_src, _byte_order, _base, _nowrite) ^~~~~~~~~~~~~~~~~~~~~~~ /tmp/B.BDr8ki/BUILD/lttng-modules-2.10.7/probes/../probes/lttng-events-write.h:23:2: note: in expansion of macro '_ctf_integer_ext' _ctf_integer_ext(_type, _item, _src, __BYTE_ORDER, 10, 0, 0) ^~~~~~~~~~~~~~~~ /tmp/B.BDr8ki/BUILD/lttng-modules-2.10.7/probes/../instrumentation/events/lttng-module/signal.h:20:3: note: in expansion of macro 'ctf_integer' ctf_integer(int, code, \ ^~~~~~~~~~~ /tmp/B.BDr8ki/BUILD/lttng-modules-2.10.7/probes/../instrumentation/events/lttng-module/signal.h:62:3: note: in expansion of macro 'LTTNG_FIELDS_SIGINFO' LTTNG_FIELDS_SIGINFO(info) ^~~~~~~~~~~~~~~~~~~~ /tmp/B.BDr8ki/BUILD/lttng-modules-2.10.7/probes/../instrumentation/events/lttng-module/signal.h:23:11: warning: comparison of distinct pointer types lacks a cast ((info == SEND_SIG_PRIV) ? SI_KERNEL : info->si_code)) ^~ /tmp/B.BDr8ki/BUILD/lttng-modules-2.10.7/probes/../probes/lttng-tracepoint-event-impl.h:775:2: note: in definition of macro 'LTTNG_TRACEPOINT_EVENT_CLASS_CODE' _fields \ ^~~~~~~ /tmp/B.BDr8ki/BUILD/lttng-modules-2.10.7/probes/../probes/lttng-tracepoint-event-impl.h:117:3: note: in expansion of macro 'PARAMS' PARAMS(_fields), ) ^~~~~~ /tmp/B.BDr8ki/BUILD/lttng-modules-2.10.7/probes/../probes/lttng-tracepoint-event-impl.h:51:2: note: in expansion of macro 'LTTNG_TRACEPOINT_EVENT_CLASS' LTTNG_TRACEPOINT_EVENT_CLASS(map, \ ^~~~~~~~~~~~~~~~~~~~~~~~~~~~ /tmp/B.BDr8ki/BUILD/lttng-modules-2.10.7/probes/../probes/lttng-tracepoint-event-impl.h:54:9: note: in expansion of macro 'PARAMS' PARAMS(fields)) \ ^~~~~~ /tmp/B.BDr8ki/BUILD/lttng-modules-2.10.7/probes/../probes/lttng-tracepoint-event-impl.h:97:2: note: in expansion of macro 'LTTNG_TRACEPOINT_EVENT_MAP' LTTNG_TRACEPOINT_EVENT_MAP(name, name, \ ^~~~~~~~~~~~~~~~~~~~~~~~~~ /tmp/B.BDr8ki/BUILD/lttng-modules-2.10.7/probes/../probes/lttng-tracepoint-event-impl.h:100:4: note: in expansion of macro 'PARAMS' PARAMS(fields)) ^~~~~~ /tmp/B.BDr8ki/BUILD/lttng-modules-2.10.7/probes/../instrumentation/events/lttng-module/signal.h:53:1: note: in expansion of macro 'LTTNG_TRACEPOINT_EVENT' LTTNG_TRACEPOINT_EVENT(signal_generate, ^~~~~~~~~~~~~~~~~~~~~~ /tmp/B.BDr8ki/BUILD/lttng-modules-2.10.7/probes/../instrumentation/events/lttng-module/signal.h:60:2: note: in expansion of macro 'TP_FIELDS' TP_FIELDS( ^~~~~~~~~ /tmp/B.BDr8ki/BUILD/lttng-modules-2.10.7/probes/../probes/lttng-tracepoint-event-impl.h:681:2: note: in expansion of macro '_ctf_integer_ext_fetched' _ctf_integer_ext_fetched(_type, _item, _src, _byte_order, _base, _nowrite) ^~~~~~~~~~~~~~~~~~~~~~~~ /tmp/B.BDr8ki/BUILD/lttng-modules-2.10.7/probes/../probes/lttng-tracepoint-event-impl.h:698:2: note: in expansion of macro '_ctf_integer_ext_isuser0' _ctf_integer_ext_isuser##_user(_type, _item, _user_src, _byte_order, _base, _nowrite) ^~~~~~~~~~~~~~~~~~~~~~~ /tmp/B.BDr8ki/BUILD/lttng-modules-2.10.7/probes/../probes/lttng-events-write.h:23:2: note: in expansion of macro '_ctf_integer_ext' _ctf_integer_ext(_type, _item, _src, __BYTE_ORDER, 10, 0, 0) ^~~~~~~~~~~~~~~~ /tmp/B.BDr8ki/BUILD/lttng-modules-2.10.7/probes/../instrumentation/events/lttng-module/signal.h:20:3: note: in expansion of macro 'ctf_integer' ctf_integer(int, code, \ ^~~~~~~~~~~ /tmp/B.BDr8ki/BUILD/lttng-modules-2.10.7/probes/../instrumentation/events/lttng-module/signal.h:62:3: note: in expansion of macro 'LTTNG_FIELDS_SIGINFO' LTTNG_FIELDS_SIGINFO(info) ^~~~~~~~~~~~~~~~~~~~ /tmp/B.BDr8ki/BUILD/lttng-modules-2.10.7/probes/../instrumentation/events/lttng-module/signal.h:21:10: warning: comparison of distinct pointer types lacks a cast (info == SEND_SIG_NOINFO || info == SEND_SIG_FORCED) ? \ ^~ /tmp/B.BDr8ki/BUILD/lttng-modules-2.10.7/probes/../probes/lttng-tracepoint-event-impl.h:775:2: note: in definition of macro 'LTTNG_TRACEPOINT_EVENT_CLASS_CODE' _fields \ ^~~~~~~ /tmp/B.BDr8ki/BUILD/lttng-modules-2.10.7/probes/../probes/lttng-tracepoint-event-impl.h:117:3: note: in expansion of macro 'PARAMS' PARAMS(_fields), ) ^~~~~~ /tmp/B.BDr8ki/BUILD/lttng-modules-2.10.7/probes/../probes/lttng-tracepoint-event-impl.h:51:2: note: in expansion of macro 'LTTNG_TRACEPOINT_EVENT_CLASS' LTTNG_TRACEPOINT_EVENT_CLASS(map, \ ^~~~~~~~~~~~~~~~~~~~~~~~~~~~ /tmp/B.BDr8ki/BUILD/lttng-modules-2.10.7/probes/../probes/lttng-tracepoint-event-impl.h:54:9: note: in expansion of macro 'PARAMS' PARAMS(fields)) \ ^~~~~~ /tmp/B.BDr8ki/BUILD/lttng-modules-2.10.7/probes/../probes/lttng-tracepoint-event-impl.h:97:2: note: in expansion of macro 'LTTNG_TRACEPOINT_EVENT_MAP' LTTNG_TRACEPOINT_EVENT_MAP(name, name, \ ^~~~~~~~~~~~~~~~~~~~~~~~~~ /tmp/B.BDr8ki/BUILD/lttng-modules-2.10.7/probes/../probes/lttng-tracepoint-event-impl.h:100:4: note: in expansion of macro 'PARAMS' PARAMS(fields)) ^~~~~~ /tmp/B.BDr8ki/BUILD/lttng-modules-2.10.7/probes/../instrumentation/events/lttng-module/signal.h:53:1: note: in expansion of macro 'LTTNG_TRACEPOINT_EVENT' LTTNG_TRACEPOINT_EVENT(signal_generate, ^~~~~~~~~~~~~~~~~~~~~~ /tmp/B.BDr8ki/BUILD/lttng-modules-2.10.7/probes/../instrumentation/events/lttng-module/signal.h:60:2: note: in expansion of macro 'TP_FIELDS' TP_FIELDS( ^~~~~~~~~ /tmp/B.BDr8ki/BUILD/lttng-modules-2.10.7/probes/../probes/lttng-tracepoint-event-impl.h:681:2: note: in expansion of macro '_ctf_integer_ext_fetched' _ctf_integer_ext_fetched(_type, _item, _src, _byte_order, _base, _nowrite) ^~~~~~~~~~~~~~~~~~~~~~~~ /tmp/B.BDr8ki/BUILD/lttng-modules-2.10.7/probes/../probes/lttng-tracepoint-event-impl.h:698:2: note: in expansion of macro '_ctf_integer_ext_isuser0' _ctf_integer_ext_isuser##_user(_type, _item, _user_src, _byte_order, _base, _nowrite) ^~~~~~~~~~~~~~~~~~~~~~~ /tmp/B.BDr8ki/BUILD/lttng-modules-2.10.7/probes/../probes/lttng-events-write.h:23:2: note: in expansion of macro '_ctf_integer_ext' _ctf_integer_ext(_type, _item, _src, __BYTE_ORDER, 10, 0, 0) ^~~~~~~~~~~~~~~~ /tmp/B.BDr8ki/BUILD/lttng-modules-2.10.7/probes/../instrumentation/events/lttng-module/signal.h:20:3: note: in expansion of macro 'ctf_integer' ctf_integer(int, code, \ ^~~~~~~~~~~ /tmp/B.BDr8ki/BUILD/lttng-modules-2.10.7/probes/../instrumentation/events/lttng-module/signal.h:62:3: note: in expansion of macro 'LTTNG_FIELDS_SIGINFO' LTTNG_FIELDS_SIGINFO(info) ^~~~~~~~~~~~~~~~~~~~ /tmp/B.BDr8ki/BUILD/lttng-modules-2.10.7/probes/../instrumentation/events/lttng-module/signal.h:23:11: warning: comparison of distinct pointer types lacks a cast ((info == SEND_SIG_PRIV) ? SI_KERNEL : info->si_code)) ^~ /tmp/B.BDr8ki/BUILD/lttng-modules-2.10.7/probes/../probes/lttng-tracepoint-event-impl.h:775:2: note: in definition of macro 'LTTNG_TRACEPOINT_EVENT_CLASS_CODE' _fields \ ^~~~~~~ /tmp/B.BDr8ki/BUILD/lttng-modules-2.10.7/probes/../probes/lttng-tracepoint-event-impl.h:117:3: note: in expansion of macro 'PARAMS' PARAMS(_fields), ) ^~~~~~ /tmp/B.BDr8ki/BUILD/lttng-modules-2.10.7/probes/../probes/lttng-tracepoint-event-impl.h:51:2: note: in expansion of macro 'LTTNG_TRACEPOINT_EVENT_CLASS' LTTNG_TRACEPOINT_EVENT_CLASS(map, \ ^~~~~~~~~~~~~~~~~~~~~~~~~~~~ /tmp/B.BDr8ki/BUILD/lttng-modules-2.10.7/probes/../probes/lttng-tracepoint-event-impl.h:54:9: note: in expansion of macro 'PARAMS' PARAMS(fields)) \ ^~~~~~ /tmp/B.BDr8ki/BUILD/lttng-modules-2.10.7/probes/../probes/lttng-tracepoint-event-impl.h:97:2: note: in expansion of macro 'LTTNG_TRACEPOINT_EVENT_MAP' LTTNG_TRACEPOINT_EVENT_MAP(name, name, \ ^~~~~~~~~~~~~~~~~~~~~~~~~~ /tmp/B.BDr8ki/BUILD/lttng-modules-2.10.7/probes/../probes/lttng-tracepoint-event-impl.h:100:4: note: in expansion of macro 'PARAMS' PARAMS(fields)) ^~~~~~ /tmp/B.BDr8ki/BUILD/lttng-modules-2.10.7/probes/../instrumentation/events/lttng-module/signal.h:53:1: note: in expansion of macro 'LTTNG_TRACEPOINT_EVENT' LTTNG_TRACEPOINT_EVENT(signal_generate, ^~~~~~~~~~~~~~~~~~~~~~ /tmp/B.BDr8ki/BUILD/lttng-modules-2.10.7/probes/../instrumentation/events/lttng-module/signal.h:60:2: note: in expansion of macro 'TP_FIELDS' TP_FIELDS( ^~~~~~~~~ /tmp/B.BDr8ki/BUILD/lttng-modules-2.10.7/probes/../probes/lttng-tracepoint-event-impl.h:681:2: note: in expansion of macro '_ctf_integer_ext_fetched' _ctf_integer_ext_fetched(_type, _item, _src, _byte_order, _base, _nowrite) ^~~~~~~~~~~~~~~~~~~~~~~~ /tmp/B.BDr8ki/BUILD/lttng-modules-2.10.7/probes/../probes/lttng-tracepoint-event-impl.h:698:2: note: in expansion of macro '_ctf_integer_ext_isuser0' _ctf_integer_ext_isuser##_user(_type, _item, _user_src, _byte_order, _base, _nowrite) ^~~~~~~~~~~~~~~~~~~~~~~ /tmp/B.BDr8ki/BUILD/lttng-modules-2.10.7/probes/../probes/lttng-events-write.h:23:2: note: in expansion of macro '_ctf_integer_ext' _ctf_integer_ext(_type, _item, _src, __BYTE_ORDER, 10, 0, 0) ^~~~~~~~~~~~~~~~ /tmp/B.BDr8ki/BUILD/lttng-modules-2.10.7/probes/../instrumentation/events/lttng-module/signal.h:20:3: note: in expansion of macro 'ctf_integer' ctf_integer(int, code, \ ^~~~~~~~~~~ /tmp/B.BDr8ki/BUILD/lttng-modules-2.10.7/probes/../instrumentation/events/lttng-module/signal.h:62:3: note: in expansion of macro 'LTTNG_FIELDS_SIGINFO' LTTNG_FIELDS_SIGINFO(info) ^~~~~~~~~~~~~~~~~~~~ /tmp/B.BDr8ki/BUILD/lttng-modules-2.10.7/probes/../instrumentation/events/lttng-module/signal.h:21:10: warning: comparison of distinct pointer types lacks a cast (info == SEND_SIG_NOINFO || info == SEND_SIG_FORCED) ? \ ^~ /tmp/B.BDr8ki/BUILD/lttng-modules-2.10.7/probes/../probes/lttng-tracepoint-event-impl.h:775:2: note: in definition of macro 'LTTNG_TRACEPOINT_EVENT_CLASS_CODE' _fields \ ^~~~~~~ /tmp/B.BDr8ki/BUILD/lttng-modules-2.10.7/probes/../probes/lttng-tracepoint-event-impl.h:117:3: note: in expansion of macro 'PARAMS' PARAMS(_fields), ) ^~~~~~ /tmp/B.BDr8ki/BUILD/lttng-modules-2.10.7/probes/../probes/lttng-tracepoint-event-impl.h:51:2: note: in expansion of macro 'LTTNG_TRACEPOINT_EVENT_CLASS' LTTNG_TRACEPOINT_EVENT_CLASS(map, \ ^~~~~~~~~~~~~~~~~~~~~~~~~~~~ /tmp/B.BDr8ki/BUILD/lttng-modules-2.10.7/probes/../probes/lttng-tracepoint-event-impl.h:54:9: note: in expansion of macro 'PARAMS' PARAMS(fields)) \ ^~~~~~ /tmp/B.BDr8ki/BUILD/lttng-modules-2.10.7/probes/../probes/lttng-tracepoint-event-impl.h:97:2: note: in expansion of macro 'LTTNG_TRACEPOINT_EVENT_MAP' LTTNG_TRACEPOINT_EVENT_MAP(name, name, \ ^~~~~~~~~~~~~~~~~~~~~~~~~~ /tmp/B.BDr8ki/BUILD/lttng-modules-2.10.7/probes/../probes/lttng-tracepoint-event-impl.h:100:4: note: in expansion of macro 'PARAMS' PARAMS(fields)) ^~~~~~ /tmp/B.BDr8ki/BUILD/lttng-modules-2.10.7/probes/../instrumentation/events/lttng-module/signal.h:53:1: note: in expansion of macro 'LTTNG_TRACEPOINT_EVENT' LTTNG_TRACEPOINT_EVENT(signal_generate, ^~~~~~~~~~~~~~~~~~~~~~ /tmp/B.BDr8ki/BUILD/lttng-modules-2.10.7/probes/../instrumentation/events/lttng-module/signal.h:60:2: note: in expansion of macro 'TP_FIELDS' TP_FIELDS( ^~~~~~~~~ /tmp/B.BDr8ki/BUILD/lttng-modules-2.10.7/probes/../probes/lttng-tracepoint-event-impl.h:681:2: note: in expansion of macro '_ctf_integer_ext_fetched' _ctf_integer_ext_fetched(_type, _item, _src, _byte_order, _base, _nowrite) ^~~~~~~~~~~~~~~~~~~~~~~~ /tmp/B.BDr8ki/BUILD/lttng-modules-2.10.7/probes/../probes/lttng-tracepoint-event-impl.h:698:2: note: in expansion of macro '_ctf_integer_ext_isuser0' _ctf_integer_ext_isuser##_user(_type, _item, _user_src, _byte_order, _base, _nowrite) ^~~~~~~~~~~~~~~~~~~~~~~ /tmp/B.BDr8ki/BUILD/lttng-modules-2.10.7/probes/../probes/lttng-events-write.h:23:2: note: in expansion of macro '_ctf_integer_ext' _ctf_integer_ext(_type, _item, _src, __BYTE_ORDER, 10, 0, 0) ^~~~~~~~~~~~~~~~ /tmp/B.BDr8ki/BUILD/lttng-modules-2.10.7/probes/../instrumentation/events/lttng-module/signal.h:20:3: note: in expansion of macro 'ctf_integer' ctf_integer(int, code, \ ^~~~~~~~~~~ /tmp/B.BDr8ki/BUILD/lttng-modules-2.10.7/probes/../instrumentation/events/lttng-module/signal.h:62:3: note: in expansion of macro 'LTTNG_FIELDS_SIGINFO' LTTNG_FIELDS_SIGINFO(info) ^~~~~~~~~~~~~~~~~~~~ /tmp/B.BDr8ki/BUILD/lttng-modules-2.10.7/probes/../instrumentation/events/lttng-module/signal.h:23:11: warning: comparison of distinct pointer types lacks a cast ((info == SEND_SIG_PRIV) ? SI_KERNEL : info->si_code)) ^~ /tmp/B.BDr8ki/BUILD/lttng-modules-2.10.7/probes/../probes/lttng-tracepoint-event-impl.h:775:2: note: in definition of macro 'LTTNG_TRACEPOINT_EVENT_CLASS_CODE' _fields \ ^~~~~~~ /tmp/B.BDr8ki/BUILD/lttng-modules-2.10.7/probes/../probes/lttng-tracepoint-event-impl.h:117:3: note: in expansion of macro 'PARAMS' PARAMS(_fields), ) ^~~~~~ /tmp/B.BDr8ki/BUILD/lttng-modules-2.10.7/probes/../probes/lttng-tracepoint-event-impl.h:51:2: note: in expansion of macro 'LTTNG_TRACEPOINT_EVENT_CLASS' LTTNG_TRACEPOINT_EVENT_CLASS(map, \ ^~~~~~~~~~~~~~~~~~~~~~~~~~~~ /tmp/B.BDr8ki/BUILD/lttng-modules-2.10.7/probes/../probes/lttng-tracepoint-event-impl.h:54:9: note: in expansion of macro 'PARAMS' PARAMS(fields)) \ ^~~~~~ /tmp/B.BDr8ki/BUILD/lttng-modules-2.10.7/probes/../probes/lttng-tracepoint-event-impl.h:97:2: note: in expansion of macro 'LTTNG_TRACEPOINT_EVENT_MAP' LTTNG_TRACEPOINT_EVENT_MAP(name, name, \ ^~~~~~~~~~~~~~~~~~~~~~~~~~ /tmp/B.BDr8ki/BUILD/lttng-modules-2.10.7/probes/../probes/lttng-tracepoint-event-impl.h:100:4: note: in expansion of macro 'PARAMS' PARAMS(fields)) ^~~~~~ /tmp/B.BDr8ki/BUILD/lttng-modules-2.10.7/probes/../instrumentation/events/lttng-module/signal.h:53:1: note: in expansion of macro 'LTTNG_TRACEPOINT_EVENT' LTTNG_TRACEPOINT_EVENT(signal_generate, ^~~~~~~~~~~~~~~~~~~~~~ /tmp/B.BDr8ki/BUILD/lttng-modules-2.10.7/probes/../instrumentation/events/lttng-module/signal.h:60:2: note: in expansion of macro 'TP_FIELDS' TP_FIELDS( ^~~~~~~~~ /tmp/B.BDr8ki/BUILD/lttng-modules-2.10.7/probes/../probes/lttng-tracepoint-event-impl.h:681:2: note: in expansion of macro '_ctf_integer_ext_fetched' _ctf_integer_ext_fetched(_type, _item, _src, _byte_order, _base, _nowrite) ^~~~~~~~~~~~~~~~~~~~~~~~ /tmp/B.BDr8ki/BUILD/lttng-modules-2.10.7/probes/../probes/lttng-tracepoint-event-impl.h:698:2: note: in expansion of macro '_ctf_integer_ext_isuser0' _ctf_integer_ext_isuser##_user(_type, _item, _user_src, _byte_order, _base, _nowrite) ^~~~~~~~~~~~~~~~~~~~~~~ /tmp/B.BDr8ki/BUILD/lttng-modules-2.10.7/probes/../probes/lttng-events-write.h:23:2: note: in expansion of macro '_ctf_integer_ext' _ctf_integer_ext(_type, _item, _src, __BYTE_ORDER, 10, 0, 0) ^~~~~~~~~~~~~~~~ /tmp/B.BDr8ki/BUILD/lttng-modules-2.10.7/probes/../instrumentation/events/lttng-module/signal.h:20:3: note: in expansion of macro 'ctf_integer' ctf_integer(int, code, \ ^~~~~~~~~~~ /tmp/B.BDr8ki/BUILD/lttng-modules-2.10.7/probes/../instrumentation/events/lttng-module/signal.h:62:3: note: in expansion of macro 'LTTNG_FIELDS_SIGINFO' LTTNG_FIELDS_SIGINFO(info) ^~~~~~~~~~~~~~~~~~~~ /tmp/B.BDr8ki/BUILD/lttng-modules-2.10.7/probes/../instrumentation/events/lttng-module/signal.h:21:10: warning: comparison of distinct pointer types lacks a cast (info == SEND_SIG_NOINFO || info == SEND_SIG_FORCED) ? \ ^~ /tmp/B.BDr8ki/BUILD/lttng-modules-2.10.7/probes/../probes/lttng-tracepoint-event-impl.h:775:2: note: in definition of macro 'LTTNG_TRACEPOINT_EVENT_CLASS_CODE' _fields \ ^~~~~~~ /tmp/B.BDr8ki/BUILD/lttng-modules-2.10.7/probes/../probes/lttng-tracepoint-event-impl.h:117:3: note: in expansion of macro 'PARAMS' PARAMS(_fields), ) ^~~~~~ /tmp/B.BDr8ki/BUILD/lttng-modules-2.10.7/probes/../probes/lttng-tracepoint-event-impl.h:51:2: note: in expansion of macro 'LTTNG_TRACEPOINT_EVENT_CLASS' LTTNG_TRACEPOINT_EVENT_CLASS(map, \ ^~~~~~~~~~~~~~~~~~~~~~~~~~~~ /tmp/B.BDr8ki/BUILD/lttng-modules-2.10.7/probes/../probes/lttng-tracepoint-event-impl.h:54:9: note: in expansion of macro 'PARAMS' PARAMS(fields)) \ ^~~~~~ /tmp/B.BDr8ki/BUILD/lttng-modules-2.10.7/probes/../probes/lttng-tracepoint-event-impl.h:97:2: note: in expansion of macro 'LTTNG_TRACEPOINT_EVENT_MAP' LTTNG_TRACEPOINT_EVENT_MAP(name, name, \ ^~~~~~~~~~~~~~~~~~~~~~~~~~ /tmp/B.BDr8ki/BUILD/lttng-modules-2.10.7/probes/../probes/lttng-tracepoint-event-impl.h:100:4: note: in expansion of macro 'PARAMS' PARAMS(fields)) ^~~~~~ /tmp/B.BDr8ki/BUILD/lttng-modules-2.10.7/probes/../instrumentation/events/lttng-module/signal.h:53:1: note: in expansion of macro 'LTTNG_TRACEPOINT_EVENT' LTTNG_TRACEPOINT_EVENT(signal_generate, ^~~~~~~~~~~~~~~~~~~~~~ /tmp/B.BDr8ki/BUILD/lttng-modules-2.10.7/probes/../instrumentation/events/lttng-module/signal.h:60:2: note: in expansion of macro 'TP_FIELDS' TP_FIELDS( ^~~~~~~~~ /tmp/B.BDr8ki/BUILD/lttng-modules-2.10.7/probes/../probes/lttng-tracepoint-event-impl.h:681:2: note: in expansion of macro '_ctf_integer_ext_fetched' _ctf_integer_ext_fetched(_type, _item, _src, _byte_order, _base, _nowrite) ^~~~~~~~~~~~~~~~~~~~~~~~ /tmp/B.BDr8ki/BUILD/lttng-modules-2.10.7/probes/../probes/lttng-tracepoint-event-impl.h:698:2: note: in expansion of macro '_ctf_integer_ext_isuser0' _ctf_integer_ext_isuser##_user(_type, _item, _user_src, _byte_order, _base, _nowrite) ^~~~~~~~~~~~~~~~~~~~~~~ /tmp/B.BDr8ki/BUILD/lttng-modules-2.10.7/probes/../probes/lttng-events-write.h:23:2: note: in expansion of macro '_ctf_integer_ext' _ctf_integer_ext(_type, _item, _src, __BYTE_ORDER, 10, 0, 0) ^~~~~~~~~~~~~~~~ /tmp/B.BDr8ki/BUILD/lttng-modules-2.10.7/probes/../instrumentation/events/lttng-module/signal.h:20:3: note: in expansion of macro 'ctf_integer' ctf_integer(int, code, \ ^~~~~~~~~~~ /tmp/B.BDr8ki/BUILD/lttng-modules-2.10.7/probes/../instrumentation/events/lttng-module/signal.h:62:3: note: in expansion of macro 'LTTNG_FIELDS_SIGINFO' LTTNG_FIELDS_SIGINFO(info) ^~~~~~~~~~~~~~~~~~~~ /tmp/B.BDr8ki/BUILD/lttng-modules-2.10.7/probes/../instrumentation/events/lttng-module/signal.h:23:11: warning: comparison of distinct pointer types lacks a cast ((info == SEND_SIG_PRIV) ? SI_KERNEL : info->si_code)) ^~ /tmp/B.BDr8ki/BUILD/lttng-modules-2.10.7/probes/../probes/lttng-tracepoint-event-impl.h:775:2: note: in definition of macro 'LTTNG_TRACEPOINT_EVENT_CLASS_CODE' _fields \ ^~~~~~~ /tmp/B.BDr8ki/BUILD/lttng-modules-2.10.7/probes/../probes/lttng-tracepoint-event-impl.h:117:3: note: in expansion of macro 'PARAMS' PARAMS(_fields), ) ^~~~~~ /tmp/B.BDr8ki/BUILD/lttng-modules-2.10.7/probes/../probes/lttng-tracepoint-event-impl.h:51:2: note: in expansion of macro 'LTTNG_TRACEPOINT_EVENT_CLASS' LTTNG_TRACEPOINT_EVENT_CLASS(map, \ ^~~~~~~~~~~~~~~~~~~~~~~~~~~~ /tmp/B.BDr8ki/BUILD/lttng-modules-2.10.7/probes/../probes/lttng-tracepoint-event-impl.h:54:9: note: in expansion of macro 'PARAMS' PARAMS(fields)) \ ^~~~~~ /tmp/B.BDr8ki/BUILD/lttng-modules-2.10.7/probes/../probes/lttng-tracepoint-event-impl.h:97:2: note: in expansion of macro 'LTTNG_TRACEPOINT_EVENT_MAP' LTTNG_TRACEPOINT_EVENT_MAP(name, name, \ ^~~~~~~~~~~~~~~~~~~~~~~~~~ /tmp/B.BDr8ki/BUILD/lttng-modules-2.10.7/probes/../probes/lttng-tracepoint-event-impl.h:100:4: note: in expansion of macro 'PARAMS' PARAMS(fields)) ^~~~~~ /tmp/B.BDr8ki/BUILD/lttng-modules-2.10.7/probes/../instrumentation/events/lttng-module/signal.h:53:1: note: in expansion of macro 'LTTNG_TRACEPOINT_EVENT' LTTNG_TRACEPOINT_EVENT(signal_generate, ^~~~~~~~~~~~~~~~~~~~~~ /tmp/B.BDr8ki/BUILD/lttng-modules-2.10.7/probes/../instrumentation/events/lttng-module/signal.h:60:2: note: in expansion of macro 'TP_FIELDS' TP_FIELDS( ^~~~~~~~~ /tmp/B.BDr8ki/BUILD/lttng-modules-2.10.7/probes/../probes/lttng-tracepoint-event-impl.h:681:2: note: in expansion of macro '_ctf_integer_ext_fetched' _ctf_integer_ext_fetched(_type, _item, _src, _byte_order, _base, _nowrite) ^~~~~~~~~~~~~~~~~~~~~~~~ /tmp/B.BDr8ki/BUILD/lttng-modules-2.10.7/probes/../probes/lttng-tracepoint-event-impl.h:698:2: note: in expansion of macro '_ctf_integer_ext_isuser0' _ctf_integer_ext_isuser##_user(_type, _item, _user_src, _byte_order, _base, _nowrite) ^~~~~~~~~~~~~~~~~~~~~~~ /tmp/B.BDr8ki/BUILD/lttng-modules-2.10.7/probes/../probes/lttng-events-write.h:23:2: note: in expansion of macro '_ctf_integer_ext' _ctf_integer_ext(_type, _item, _src, __BYTE_ORDER, 10, 0, 0) ^~~~~~~~~~~~~~~~ /tmp/B.BDr8ki/BUILD/lttng-modules-2.10.7/probes/../instrumentation/events/lttng-module/signal.h:20:3: note: in expansion of macro 'ctf_integer' ctf_integer(int, code, \ ^~~~~~~~~~~ /tmp/B.BDr8ki/BUILD/lttng-modules-2.10.7/probes/../instrumentation/events/lttng-module/signal.h:62:3: note: in expansion of macro 'LTTNG_FIELDS_SIGINFO' LTTNG_FIELDS_SIGINFO(info) ^~~~~~~~~~~~~~~~~~~~ /tmp/B.BDr8ki/BUILD/lttng-modules-2.10.7/probes/../instrumentation/events/lttng-module/signal.h:21:10: warning: comparison of distinct pointer types lacks a cast (info == SEND_SIG_NOINFO || info == SEND_SIG_FORCED) ? \ ^~ /tmp/B.BDr8ki/BUILD/lttng-modules-2.10.7/probes/../probes/lttng-tracepoint-event-impl.h:775:2: note: in definition of macro 'LTTNG_TRACEPOINT_EVENT_CLASS_CODE' _fields \ ^~~~~~~ /tmp/B.BDr8ki/BUILD/lttng-modules-2.10.7/probes/../probes/lttng-tracepoint-event-impl.h:117:3: note: in expansion of macro 'PARAMS' PARAMS(_fields), ) ^~~~~~ /tmp/B.BDr8ki/BUILD/lttng-modules-2.10.7/probes/../probes/lttng-tracepoint-event-impl.h:51:2: note: in expansion of macro 'LTTNG_TRACEPOINT_EVENT_CLASS' LTTNG_TRACEPOINT_EVENT_CLASS(map, \ ^~~~~~~~~~~~~~~~~~~~~~~~~~~~ /tmp/B.BDr8ki/BUILD/lttng-modules-2.10.7/probes/../probes/lttng-tracepoint-event-impl.h:54:9: note: in expansion of macro 'PARAMS' PARAMS(fields)) \ ^~~~~~ /tmp/B.BDr8ki/BUILD/lttng-modules-2.10.7/probes/../probes/lttng-tracepoint-event-impl.h:97:2: note: in expansion of macro 'LTTNG_TRACEPOINT_EVENT_MAP' LTTNG_TRACEPOINT_EVENT_MAP(name, name, \ ^~~~~~~~~~~~~~~~~~~~~~~~~~ /tmp/B.BDr8ki/BUILD/lttng-modules-2.10.7/probes/../probes/lttng-tracepoint-event-impl.h:100:4: note: in expansion of macro 'PARAMS' PARAMS(fields)) ^~~~~~ /tmp/B.BDr8ki/BUILD/lttng-modules-2.10.7/probes/../instrumentation/events/lttng-module/signal.h:53:1: note: in expansion of macro 'LTTNG_TRACEPOINT_EVENT' LTTNG_TRACEPOINT_EVENT(signal_generate, ^~~~~~~~~~~~~~~~~~~~~~ /tmp/B.BDr8ki/BUILD/lttng-modules-2.10.7/probes/../instrumentation/events/lttng-module/signal.h:60:2: note: in expansion of macro 'TP_FIELDS' TP_FIELDS( ^~~~~~~~~ /tmp/B.BDr8ki/BUILD/lttng-modules-2.10.7/probes/../probes/lttng-tracepoint-event-impl.h:681:2: note: in expansion of macro '_ctf_integer_ext_fetched' _ctf_integer_ext_fetched(_type, _item, _src, _byte_order, _base, _nowrite) ^~~~~~~~~~~~~~~~~~~~~~~~ /tmp/B.BDr8ki/BUILD/lttng-modules-2.10.7/probes/../probes/lttng-tracepoint-event-impl.h:698:2: note: in expansion of macro '_ctf_integer_ext_isuser0' _ctf_integer_ext_isuser##_user(_type, _item, _user_src, _byte_order, _base, _nowrite) ^~~~~~~~~~~~~~~~~~~~~~~ /tmp/B.BDr8ki/BUILD/lttng-modules-2.10.7/probes/../probes/lttng-events-write.h:23:2: note: in expansion of macro '_ctf_integer_ext' _ctf_integer_ext(_type, _item, _src, __BYTE_ORDER, 10, 0, 0) ^~~~~~~~~~~~~~~~ /tmp/B.BDr8ki/BUILD/lttng-modules-2.10.7/probes/../instrumentation/events/lttng-module/signal.h:20:3: note: in expansion of macro 'ctf_integer' ctf_integer(int, code, \ ^~~~~~~~~~~ /tmp/B.BDr8ki/BUILD/lttng-modules-2.10.7/probes/../instrumentation/events/lttng-module/signal.h:62:3: note: in expansion of macro 'LTTNG_FIELDS_SIGINFO' LTTNG_FIELDS_SIGINFO(info) ^~~~~~~~~~~~~~~~~~~~ /tmp/B.BDr8ki/BUILD/lttng-modules-2.10.7/probes/../instrumentation/events/lttng-module/signal.h:23:11: warning: comparison of distinct pointer types lacks a cast ((info == SEND_SIG_PRIV) ? SI_KERNEL : info->si_code)) ^~ /tmp/B.BDr8ki/BUILD/lttng-modules-2.10.7/probes/../probes/lttng-tracepoint-event-impl.h:775:2: note: in definition of macro 'LTTNG_TRACEPOINT_EVENT_CLASS_CODE' _fields \ ^~~~~~~ /tmp/B.BDr8ki/BUILD/lttng-modules-2.10.7/probes/../probes/lttng-tracepoint-event-impl.h:117:3: note: in expansion of macro 'PARAMS' PARAMS(_fields), ) ^~~~~~ /tmp/B.BDr8ki/BUILD/lttng-modules-2.10.7/probes/../probes/lttng-tracepoint-event-impl.h:51:2: note: in expansion of macro 'LTTNG_TRACEPOINT_EVENT_CLASS' LTTNG_TRACEPOINT_EVENT_CLASS(map, \ ^~~~~~~~~~~~~~~~~~~~~~~~~~~~ /tmp/B.BDr8ki/BUILD/lttng-modules-2.10.7/probes/../probes/lttng-tracepoint-event-impl.h:54:9: note: in expansion of macro 'PARAMS' PARAMS(fields)) \ ^~~~~~ /tmp/B.BDr8ki/BUILD/lttng-modules-2.10.7/probes/../probes/lttng-tracepoint-event-impl.h:97:2: note: in expansion of macro 'LTTNG_TRACEPOINT_EVENT_MAP' LTTNG_TRACEPOINT_EVENT_MAP(name, name, \ ^~~~~~~~~~~~~~~~~~~~~~~~~~ /tmp/B.BDr8ki/BUILD/lttng-modules-2.10.7/probes/../probes/lttng-tracepoint-event-impl.h:100:4: note: in expansion of macro 'PARAMS' PARAMS(fields)) ^~~~~~ /tmp/B.BDr8ki/BUILD/lttng-modules-2.10.7/probes/../instrumentation/events/lttng-module/signal.h:53:1: note: in expansion of macro 'LTTNG_TRACEPOINT_EVENT' LTTNG_TRACEPOINT_EVENT(signal_generate, ^~~~~~~~~~~~~~~~~~~~~~ /tmp/B.BDr8ki/BUILD/lttng-modules-2.10.7/probes/../instrumentation/events/lttng-module/signal.h:60:2: note: in expansion of macro 'TP_FIELDS' TP_FIELDS( ^~~~~~~~~ /tmp/B.BDr8ki/BUILD/lttng-modules-2.10.7/probes/../probes/lttng-tracepoint-event-impl.h:681:2: note: in expansion of macro '_ctf_integer_ext_fetched' _ctf_integer_ext_fetched(_type, _item, _src, _byte_order, _base, _nowrite) ^~~~~~~~~~~~~~~~~~~~~~~~ /tmp/B.BDr8ki/BUILD/lttng-modules-2.10.7/probes/../probes/lttng-tracepoint-event-impl.h:698:2: note: in expansion of macro '_ctf_integer_ext_isuser0' _ctf_integer_ext_isuser##_user(_type, _item, _user_src, _byte_order, _base, _nowrite) ^~~~~~~~~~~~~~~~~~~~~~~ /tmp/B.BDr8ki/BUILD/lttng-modules-2.10.7/probes/../probes/lttng-events-write.h:23:2: note: in expansion of macro '_ctf_integer_ext' _ctf_integer_ext(_type, _item, _src, __BYTE_ORDER, 10, 0, 0) ^~~~~~~~~~~~~~~~ /tmp/B.BDr8ki/BUILD/lttng-modules-2.10.7/probes/../instrumentation/events/lttng-module/signal.h:20:3: note: in expansion of macro 'ctf_integer' ctf_integer(int, code, \ ^~~~~~~~~~~ /tmp/B.BDr8ki/BUILD/lttng-modules-2.10.7/probes/../instrumentation/events/lttng-module/signal.h:62:3: note: in expansion of macro 'LTTNG_FIELDS_SIGINFO' LTTNG_FIELDS_SIGINFO(info) ^~~~~~~~~~~~~~~~~~~~ /tmp/B.BDr8ki/BUILD/lttng-modules-2.10.7/probes/../instrumentation/events/lttng-module/signal.h:21:10: warning: comparison of distinct pointer types lacks a cast (info == SEND_SIG_NOINFO || info == SEND_SIG_FORCED) ? \ ^~ /tmp/B.BDr8ki/BUILD/lttng-modules-2.10.7/probes/../probes/lttng-tracepoint-event-impl.h:775:2: note: in definition of macro 'LTTNG_TRACEPOINT_EVENT_CLASS_CODE' _fields \ ^~~~~~~ /tmp/B.BDr8ki/BUILD/lttng-modules-2.10.7/probes/../probes/lttng-tracepoint-event-impl.h:117:3: note: in expansion of macro 'PARAMS' PARAMS(_fields), ) ^~~~~~ /tmp/B.BDr8ki/BUILD/lttng-modules-2.10.7/probes/../probes/lttng-tracepoint-event-impl.h:51:2: note: in expansion of macro 'LTTNG_TRACEPOINT_EVENT_CLASS' LTTNG_TRACEPOINT_EVENT_CLASS(map, \ ^~~~~~~~~~~~~~~~~~~~~~~~~~~~ /tmp/B.BDr8ki/BUILD/lttng-modules-2.10.7/probes/../probes/lttng-tracepoint-event-impl.h:54:9: note: in expansion of macro 'PARAMS' PARAMS(fields)) \ ^~~~~~ /tmp/B.BDr8ki/BUILD/lttng-modules-2.10.7/probes/../probes/lttng-tracepoint-event-impl.h:97:2: note: in expansion of macro 'LTTNG_TRACEPOINT_EVENT_MAP' LTTNG_TRACEPOINT_EVENT_MAP(name, name, \ ^~~~~~~~~~~~~~~~~~~~~~~~~~ /tmp/B.BDr8ki/BUILD/lttng-modules-2.10.7/probes/../probes/lttng-tracepoint-event-impl.h:100:4: note: in expansion of macro 'PARAMS' PARAMS(fields)) ^~~~~~ /tmp/B.BDr8ki/BUILD/lttng-modules-2.10.7/probes/../instrumentation/events/lttng-module/signal.h:53:1: note: in expansion of macro 'LTTNG_TRACEPOINT_EVENT' LTTNG_TRACEPOINT_EVENT(signal_generate, ^~~~~~~~~~~~~~~~~~~~~~ /tmp/B.BDr8ki/BUILD/lttng-modules-2.10.7/probes/../instrumentation/events/lttng-module/signal.h:60:2: note: in expansion of macro 'TP_FIELDS' TP_FIELDS( ^~~~~~~~~ /tmp/B.BDr8ki/BUILD/lttng-modules-2.10.7/probes/../probes/lttng-tracepoint-event-impl.h:681:2: note: in expansion of macro '_ctf_integer_ext_fetched' _ctf_integer_ext_fetched(_type, _item, _src, _byte_order, _base, _nowrite) ^~~~~~~~~~~~~~~~~~~~~~~~ /tmp/B.BDr8ki/BUILD/lttng-modules-2.10.7/probes/../probes/lttng-tracepoint-event-impl.h:698:2: note: in expansion of macro '_ctf_integer_ext_isuser0' _ctf_integer_ext_isuser##_user(_type, _item, _user_src, _byte_order, _base, _nowrite) ^~~~~~~~~~~~~~~~~~~~~~~ /tmp/B.BDr8ki/BUILD/lttng-modules-2.10.7/probes/../probes/lttng-events-write.h:23:2: note: in expansion of macro '_ctf_integer_ext' _ctf_integer_ext(_type, _item, _src, __BYTE_ORDER, 10, 0, 0) ^~~~~~~~~~~~~~~~ /tmp/B.BDr8ki/BUILD/lttng-modules-2.10.7/probes/../instrumentation/events/lttng-module/signal.h:20:3: note: in expansion of macro 'ctf_integer' ctf_integer(int, code, \ ^~~~~~~~~~~ /tmp/B.BDr8ki/BUILD/lttng-modules-2.10.7/probes/../instrumentation/events/lttng-module/signal.h:62:3: note: in expansion of macro 'LTTNG_FIELDS_SIGINFO' LTTNG_FIELDS_SIGINFO(info) ^~~~~~~~~~~~~~~~~~~~ /tmp/B.BDr8ki/BUILD/lttng-modules-2.10.7/probes/../instrumentation/events/lttng-module/signal.h:23:11: warning: comparison of distinct pointer types lacks a cast ((info == SEND_SIG_PRIV) ? SI_KERNEL : info->si_code)) ^~ /tmp/B.BDr8ki/BUILD/lttng-modules-2.10.7/probes/../probes/lttng-tracepoint-event-impl.h:775:2: note: in definition of macro 'LTTNG_TRACEPOINT_EVENT_CLASS_CODE' _fields \ ^~~~~~~ /tmp/B.BDr8ki/BUILD/lttng-modules-2.10.7/probes/../probes/lttng-tracepoint-event-impl.h:117:3: note: in expansion of macro 'PARAMS' PARAMS(_fields), ) ^~~~~~ /tmp/B.BDr8ki/BUILD/lttng-modules-2.10.7/probes/../probes/lttng-tracepoint-event-impl.h:51:2: note: in expansion of macro 'LTTNG_TRACEPOINT_EVENT_CLASS' LTTNG_TRACEPOINT_EVENT_CLASS(map, \ ^~~~~~~~~~~~~~~~~~~~~~~~~~~~ /tmp/B.BDr8ki/BUILD/lttng-modules-2.10.7/probes/../probes/lttng-tracepoint-event-impl.h:54:9: note: in expansion of macro 'PARAMS' PARAMS(fields)) \ ^~~~~~ /tmp/B.BDr8ki/BUILD/lttng-modules-2.10.7/probes/../probes/lttng-tracepoint-event-impl.h:97:2: note: in expansion of macro 'LTTNG_TRACEPOINT_EVENT_MAP' LTTNG_TRACEPOINT_EVENT_MAP(name, name, \ ^~~~~~~~~~~~~~~~~~~~~~~~~~ /tmp/B.BDr8ki/BUILD/lttng-modules-2.10.7/probes/../probes/lttng-tracepoint-event-impl.h:100:4: note: in expansion of macro 'PARAMS' PARAMS(fields)) ^~~~~~ /tmp/B.BDr8ki/BUILD/lttng-modules-2.10.7/probes/../instrumentation/events/lttng-module/signal.h:53:1: note: in expansion of macro 'LTTNG_TRACEPOINT_EVENT' LTTNG_TRACEPOINT_EVENT(signal_generate, ^~~~~~~~~~~~~~~~~~~~~~ /tmp/B.BDr8ki/BUILD/lttng-modules-2.10.7/probes/../instrumentation/events/lttng-module/signal.h:60:2: note: in expansion of macro 'TP_FIELDS' TP_FIELDS( ^~~~~~~~~ /tmp/B.BDr8ki/BUILD/lttng-modules-2.10.7/probes/../probes/lttng-tracepoint-event-impl.h:681:2: note: in expansion of macro '_ctf_integer_ext_fetched' _ctf_integer_ext_fetched(_type, _item, _src, _byte_order, _base, _nowrite) ^~~~~~~~~~~~~~~~~~~~~~~~ /tmp/B.BDr8ki/BUILD/lttng-modules-2.10.7/probes/../probes/lttng-tracepoint-event-impl.h:698:2: note: in expansion of macro '_ctf_integer_ext_isuser0' _ctf_integer_ext_isuser##_user(_type, _item, _user_src, _byte_order, _base, _nowrite) ^~~~~~~~~~~~~~~~~~~~~~~ /tmp/B.BDr8ki/BUILD/lttng-modules-2.10.7/probes/../probes/lttng-events-write.h:23:2: note: in expansion of macro '_ctf_integer_ext' _ctf_integer_ext(_type, _item, _src, __BYTE_ORDER, 10, 0, 0) ^~~~~~~~~~~~~~~~ /tmp/B.BDr8ki/BUILD/lttng-modules-2.10.7/probes/../instrumentation/events/lttng-module/signal.h:20:3: note: in expansion of macro 'ctf_integer' ctf_integer(int, code, \ ^~~~~~~~~~~ /tmp/B.BDr8ki/BUILD/lttng-modules-2.10.7/probes/../instrumentation/events/lttng-module/signal.h:62:3: note: in expansion of macro 'LTTNG_FIELDS_SIGINFO' LTTNG_FIELDS_SIGINFO(info) ^~~~~~~~~~~~~~~~~~~~ /tmp/B.BDr8ki/BUILD/lttng-modules-2.10.7/probes/../instrumentation/events/lttng-module/signal.h:21:10: warning: comparison of distinct pointer types lacks a cast (info == SEND_SIG_NOINFO || info == SEND_SIG_FORCED) ? \ ^~ /tmp/B.BDr8ki/BUILD/lttng-modules-2.10.7/probes/../probes/lttng-tracepoint-event-impl.h:775:2: note: in definition of macro 'LTTNG_TRACEPOINT_EVENT_CLASS_CODE' _fields \ ^~~~~~~ /tmp/B.BDr8ki/BUILD/lttng-modules-2.10.7/probes/../probes/lttng-tracepoint-event-impl.h:117:3: note: in expansion of macro 'PARAMS' PARAMS(_fields), ) ^~~~~~ /tmp/B.BDr8ki/BUILD/lttng-modules-2.10.7/probes/../probes/lttng-tracepoint-event-impl.h:51:2: note: in expansion of macro 'LTTNG_TRACEPOINT_EVENT_CLASS' LTTNG_TRACEPOINT_EVENT_CLASS(map, \ ^~~~~~~~~~~~~~~~~~~~~~~~~~~~ /tmp/B.BDr8ki/BUILD/lttng-modules-2.10.7/probes/../probes/lttng-tracepoint-event-impl.h:54:9: note: in expansion of macro 'PARAMS' PARAMS(fields)) \ ^~~~~~ /tmp/B.BDr8ki/BUILD/lttng-modules-2.10.7/probes/../probes/lttng-tracepoint-event-impl.h:97:2: note: in expansion of macro 'LTTNG_TRACEPOINT_EVENT_MAP' LTTNG_TRACEPOINT_EVENT_MAP(name, name, \ ^~~~~~~~~~~~~~~~~~~~~~~~~~ /tmp/B.BDr8ki/BUILD/lttng-modules-2.10.7/probes/../probes/lttng-tracepoint-event-impl.h:100:4: note: in expansion of macro 'PARAMS' PARAMS(fields)) ^~~~~~ /tmp/B.BDr8ki/BUILD/lttng-modules-2.10.7/probes/../instrumentation/events/lttng-module/signal.h:53:1: note: in expansion of macro 'LTTNG_TRACEPOINT_EVENT' LTTNG_TRACEPOINT_EVENT(signal_generate, ^~~~~~~~~~~~~~~~~~~~~~ /tmp/B.BDr8ki/BUILD/lttng-modules-2.10.7/probes/../instrumentation/events/lttng-module/signal.h:60:2: note: in expansion of macro 'TP_FIELDS' TP_FIELDS( ^~~~~~~~~ /tmp/B.BDr8ki/BUILD/lttng-modules-2.10.7/probes/../probes/lttng-tracepoint-event-impl.h:681:2: note: in expansion of macro '_ctf_integer_ext_fetched' _ctf_integer_ext_fetched(_type, _item, _src, _byte_order, _base, _nowrite) ^~~~~~~~~~~~~~~~~~~~~~~~ /tmp/B.BDr8ki/BUILD/lttng-modules-2.10.7/probes/../probes/lttng-tracepoint-event-impl.h:698:2: note: in expansion of macro '_ctf_integer_ext_isuser0' _ctf_integer_ext_isuser##_user(_type, _item, _user_src, _byte_order, _base, _nowrite) ^~~~~~~~~~~~~~~~~~~~~~~ /tmp/B.BDr8ki/BUILD/lttng-modules-2.10.7/probes/../probes/lttng-events-write.h:23:2: note: in expansion of macro '_ctf_integer_ext' _ctf_integer_ext(_type, _item, _src, __BYTE_ORDER, 10, 0, 0) ^~~~~~~~~~~~~~~~ /tmp/B.BDr8ki/BUILD/lttng-modules-2.10.7/probes/../instrumentation/events/lttng-module/signal.h:20:3: note: in expansion of macro 'ctf_integer' ctf_integer(int, code, \ ^~~~~~~~~~~ /tmp/B.BDr8ki/BUILD/lttng-modules-2.10.7/probes/../instrumentation/events/lttng-module/signal.h:62:3: note: in expansion of macro 'LTTNG_FIELDS_SIGINFO' LTTNG_FIELDS_SIGINFO(info) ^~~~~~~~~~~~~~~~~~~~ /tmp/B.BDr8ki/BUILD/lttng-modules-2.10.7/probes/../instrumentation/events/lttng-module/signal.h:23:11: warning: comparison of distinct pointer types lacks a cast ((info == SEND_SIG_PRIV) ? SI_KERNEL : info->si_code)) ^~ /tmp/B.BDr8ki/BUILD/lttng-modules-2.10.7/probes/../probes/lttng-tracepoint-event-impl.h:775:2: note: in definition of macro 'LTTNG_TRACEPOINT_EVENT_CLASS_CODE' _fields \ ^~~~~~~ /tmp/B.BDr8ki/BUILD/lttng-modules-2.10.7/probes/../probes/lttng-tracepoint-event-impl.h:117:3: note: in expansion of macro 'PARAMS' PARAMS(_fields), ) ^~~~~~ /tmp/B.BDr8ki/BUILD/lttng-modules-2.10.7/probes/../probes/lttng-tracepoint-event-impl.h:51:2: note: in expansion of macro 'LTTNG_TRACEPOINT_EVENT_CLASS' LTTNG_TRACEPOINT_EVENT_CLASS(map, \ ^~~~~~~~~~~~~~~~~~~~~~~~~~~~ /tmp/B.BDr8ki/BUILD/lttng-modules-2.10.7/probes/../probes/lttng-tracepoint-event-impl.h:54:9: note: in expansion of macro 'PARAMS' PARAMS(fields)) \ ^~~~~~ /tmp/B.BDr8ki/BUILD/lttng-modules-2.10.7/probes/../probes/lttng-tracepoint-event-impl.h:97:2: note: in expansion of macro 'LTTNG_TRACEPOINT_EVENT_MAP' LTTNG_TRACEPOINT_EVENT_MAP(name, name, \ ^~~~~~~~~~~~~~~~~~~~~~~~~~ /tmp/B.BDr8ki/BUILD/lttng-modules-2.10.7/probes/../probes/lttng-tracepoint-event-impl.h:100:4: note: in expansion of macro 'PARAMS' PARAMS(fields)) ^~~~~~ /tmp/B.BDr8ki/BUILD/lttng-modules-2.10.7/probes/../instrumentation/events/lttng-module/signal.h:53:1: note: in expansion of macro 'LTTNG_TRACEPOINT_EVENT' LTTNG_TRACEPOINT_EVENT(signal_generate, ^~~~~~~~~~~~~~~~~~~~~~ /tmp/B.BDr8ki/BUILD/lttng-modules-2.10.7/probes/../instrumentation/events/lttng-module/signal.h:60:2: note: in expansion of macro 'TP_FIELDS' TP_FIELDS( ^~~~~~~~~ /tmp/B.BDr8ki/BUILD/lttng-modules-2.10.7/probes/../probes/lttng-tracepoint-event-impl.h:681:2: note: in expansion of macro '_ctf_integer_ext_fetched' _ctf_integer_ext_fetched(_type, _item, _src, _byte_order, _base, _nowrite) ^~~~~~~~~~~~~~~~~~~~~~~~ /tmp/B.BDr8ki/BUILD/lttng-modules-2.10.7/probes/../probes/lttng-tracepoint-event-impl.h:698:2: note: in expansion of macro '_ctf_integer_ext_isuser0' _ctf_integer_ext_isuser##_user(_type, _item, _user_src, _byte_order, _base, _nowrite) ^~~~~~~~~~~~~~~~~~~~~~~ /tmp/B.BDr8ki/BUILD/lttng-modules-2.10.7/probes/../probes/lttng-events-write.h:23:2: note: in expansion of macro '_ctf_integer_ext' _ctf_integer_ext(_type, _item, _src, __BYTE_ORDER, 10, 0, 0) ^~~~~~~~~~~~~~~~ /tmp/B.BDr8ki/BUILD/lttng-modules-2.10.7/probes/../instrumentation/events/lttng-module/signal.h:20:3: note: in expansion of macro 'ctf_integer' ctf_integer(int, code, \ ^~~~~~~~~~~ /tmp/B.BDr8ki/BUILD/lttng-modules-2.10.7/probes/../instrumentation/events/lttng-module/signal.h:62:3: note: in expansion of macro 'LTTNG_FIELDS_SIGINFO' LTTNG_FIELDS_SIGINFO(info) ^~~~~~~~~~~~~~~~~~~~ /tmp/B.BDr8ki/BUILD/lttng-modules-2.10.7/probes/../instrumentation/events/lttng-module/signal.h: In function '__event_prepare_filter_stack__signal_deliver': /tmp/B.BDr8ki/BUILD/lttng-modules-2.10.7/probes/../instrumentation/events/lttng-module/signal.h:17:10: warning: comparison of distinct pointer types lacks a cast (info == SEND_SIG_NOINFO || info == SEND_SIG_FORCED || info == SEND_SIG_PRIV) ? \ ^~ /tmp/B.BDr8ki/BUILD/lttng-modules-2.10.7/probes/../probes/lttng-tracepoint-event-impl.h:775:2: note: in definition of macro 'LTTNG_TRACEPOINT_EVENT_CLASS_CODE' _fields \ ^~~~~~~ /tmp/B.BDr8ki/BUILD/lttng-modules-2.10.7/probes/../probes/lttng-tracepoint-event-impl.h:117:3: note: in expansion of macro 'PARAMS' PARAMS(_fields), ) ^~~~~~ /tmp/B.BDr8ki/BUILD/lttng-modules-2.10.7/probes/../probes/lttng-tracepoint-event-impl.h:51:2: note: in expansion of macro 'LTTNG_TRACEPOINT_EVENT_CLASS' LTTNG_TRACEPOINT_EVENT_CLASS(map, \ ^~~~~~~~~~~~~~~~~~~~~~~~~~~~ /tmp/B.BDr8ki/BUILD/lttng-modules-2.10.7/probes/../probes/lttng-tracepoint-event-impl.h:54:9: note: in expansion of macro 'PARAMS' PARAMS(fields)) \ ^~~~~~ /tmp/B.BDr8ki/BUILD/lttng-modules-2.10.7/probes/../probes/lttng-tracepoint-event-impl.h:97:2: note: in expansion of macro 'LTTNG_TRACEPOINT_EVENT_MAP' LTTNG_TRACEPOINT_EVENT_MAP(name, name, \ ^~~~~~~~~~~~~~~~~~~~~~~~~~ /tmp/B.BDr8ki/BUILD/lttng-modules-2.10.7/probes/../probes/lttng-tracepoint-event-impl.h:100:4: note: in expansion of macro 'PARAMS' PARAMS(fields)) ^~~~~~ /tmp/B.BDr8ki/BUILD/lttng-modules-2.10.7/probes/../instrumentation/events/lttng-module/signal.h:85:1: note: in expansion of macro 'LTTNG_TRACEPOINT_EVENT' LTTNG_TRACEPOINT_EVENT(signal_deliver, ^~~~~~~~~~~~~~~~~~~~~~ /tmp/B.BDr8ki/BUILD/lttng-modules-2.10.7/probes/../instrumentation/events/lttng-module/signal.h:91:2: note: in expansion of macro 'TP_FIELDS' TP_FIELDS( ^~~~~~~~~ /tmp/B.BDr8ki/BUILD/lttng-modules-2.10.7/probes/../probes/lttng-tracepoint-event-impl.h:681:2: note: in expansion of macro '_ctf_integer_ext_fetched' _ctf_integer_ext_fetched(_type, _item, _src, _byte_order, _base, _nowrite) ^~~~~~~~~~~~~~~~~~~~~~~~ /tmp/B.BDr8ki/BUILD/lttng-modules-2.10.7/probes/../probes/lttng-tracepoint-event-impl.h:698:2: note: in expansion of macro '_ctf_integer_ext_isuser0' _ctf_integer_ext_isuser##_user(_type, _item, _user_src, _byte_order, _base, _nowrite) ^~~~~~~~~~~~~~~~~~~~~~~ /tmp/B.BDr8ki/BUILD/lttng-modules-2.10.7/probes/../probes/lttng-events-write.h:23:2: note: in expansion of macro '_ctf_integer_ext' _ctf_integer_ext(_type, _item, _src, __BYTE_ORDER, 10, 0, 0) ^~~~~~~~~~~~~~~~ /tmp/B.BDr8ki/BUILD/lttng-modules-2.10.7/probes/../instrumentation/events/lttng-module/signal.h:16:3: note: in expansion of macro 'ctf_integer' ctf_integer(int, errno, \ ^~~~~~~~~~~ /tmp/B.BDr8ki/BUILD/lttng-modules-2.10.7/probes/../instrumentation/events/lttng-module/signal.h:93:3: note: in expansion of macro 'LTTNG_FIELDS_SIGINFO' LTTNG_FIELDS_SIGINFO(info) ^~~~~~~~~~~~~~~~~~~~ /tmp/B.BDr8ki/BUILD/lttng-modules-2.10.7/probes/../instrumentation/events/lttng-module/signal.h:17:40: error: 'SEND_SIG_FORCED' undeclared (first use in this function); did you mean 'SEND_SIG_PRIV'? (info == SEND_SIG_NOINFO || info == SEND_SIG_FORCED || info == SEND_SIG_PRIV) ? \ ^~~~~~~~~~~~~~~ /tmp/B.BDr8ki/BUILD/lttng-modules-2.10.7/probes/../probes/lttng-tracepoint-event-impl.h:775:2: note: in definition of macro 'LTTNG_TRACEPOINT_EVENT_CLASS_CODE' _fields \ ^~~~~~~ /tmp/B.BDr8ki/BUILD/lttng-modules-2.10.7/probes/../probes/lttng-tracepoint-event-impl.h:117:3: note: in expansion of macro 'PARAMS' PARAMS(_fields), ) ^~~~~~ /tmp/B.BDr8ki/BUILD/lttng-modules-2.10.7/probes/../probes/lttng-tracepoint-event-impl.h:51:2: note: in expansion of macro 'LTTNG_TRACEPOINT_EVENT_CLASS' LTTNG_TRACEPOINT_EVENT_CLASS(map, \ ^~~~~~~~~~~~~~~~~~~~~~~~~~~~ /tmp/B.BDr8ki/BUILD/lttng-modules-2.10.7/probes/../probes/lttng-tracepoint-event-impl.h:54:9: note: in expansion of macro 'PARAMS' PARAMS(fields)) \ ^~~~~~ /tmp/B.BDr8ki/BUILD/lttng-modules-2.10.7/probes/../probes/lttng-tracepoint-event-impl.h:97:2: note: in expansion of macro 'LTTNG_TRACEPOINT_EVENT_MAP' LTTNG_TRACEPOINT_EVENT_MAP(name, name, \ ^~~~~~~~~~~~~~~~~~~~~~~~~~ /tmp/B.BDr8ki/BUILD/lttng-modules-2.10.7/probes/../probes/lttng-tracepoint-event-impl.h:100:4: note: in expansion of macro 'PARAMS' PARAMS(fields)) ^~~~~~ /tmp/B.BDr8ki/BUILD/lttng-modules-2.10.7/probes/../instrumentation/events/lttng-module/signal.h:85:1: note: in expansion of macro 'LTTNG_TRACEPOINT_EVENT' LTTNG_TRACEPOINT_EVENT(signal_deliver, ^~~~~~~~~~~~~~~~~~~~~~ /tmp/B.BDr8ki/BUILD/lttng-modules-2.10.7/probes/../instrumentation/events/lttng-module/signal.h:91:2: note: in expansion of macro 'TP_FIELDS' TP_FIELDS( ^~~~~~~~~ /tmp/B.BDr8ki/BUILD/lttng-modules-2.10.7/probes/../probes/lttng-tracepoint-event-impl.h:681:2: note: in expansion of macro '_ctf_integer_ext_fetched' _ctf_integer_ext_fetched(_type, _item, _src, _byte_order, _base, _nowrite) ^~~~~~~~~~~~~~~~~~~~~~~~ /tmp/B.BDr8ki/BUILD/lttng-modules-2.10.7/probes/../probes/lttng-tracepoint-event-impl.h:698:2: note: in expansion of macro '_ctf_integer_ext_isuser0' _ctf_integer_ext_isuser##_user(_type, _item, _user_src, _byte_order, _base, _nowrite) ^~~~~~~~~~~~~~~~~~~~~~~ /tmp/B.BDr8ki/BUILD/lttng-modules-2.10.7/probes/../probes/lttng-events-write.h:23:2: note: in expansion of macro '_ctf_integer_ext' _ctf_integer_ext(_type, _item, _src, __BYTE_ORDER, 10, 0, 0) ^~~~~~~~~~~~~~~~ /tmp/B.BDr8ki/BUILD/lttng-modules-2.10.7/probes/../instrumentation/events/lttng-module/signal.h:16:3: note: in expansion of macro 'ctf_integer' ctf_integer(int, errno, \ ^~~~~~~~~~~ /tmp/B.BDr8ki/BUILD/lttng-modules-2.10.7/probes/../instrumentation/events/lttng-module/signal.h:93:3: note: in expansion of macro 'LTTNG_FIELDS_SIGINFO' LTTNG_FIELDS_SIGINFO(info) ^~~~~~~~~~~~~~~~~~~~ /tmp/B.BDr8ki/BUILD/lttng-modules-2.10.7/probes/../instrumentation/events/lttng-module/signal.h:17:64: warning: comparison of distinct pointer types lacks a cast (info == SEND_SIG_NOINFO || info == SEND_SIG_FORCED || info == SEND_SIG_PRIV) ? \ ^~ /tmp/B.BDr8ki/BUILD/lttng-modules-2.10.7/probes/../probes/lttng-tracepoint-event-impl.h:775:2: note: in definition of macro 'LTTNG_TRACEPOINT_EVENT_CLASS_CODE' _fields \ ^~~~~~~ /tmp/B.BDr8ki/BUILD/lttng-modules-2.10.7/probes/../probes/lttng-tracepoint-event-impl.h:117:3: note: in expansion of macro 'PARAMS' PARAMS(_fields), ) ^~~~~~ /tmp/B.BDr8ki/BUILD/lttng-modules-2.10.7/probes/../probes/lttng-tracepoint-event-impl.h:51:2: note: in expansion of macro 'LTTNG_TRACEPOINT_EVENT_CLASS' LTTNG_TRACEPOINT_EVENT_CLASS(map, \ ^~~~~~~~~~~~~~~~~~~~~~~~~~~~ /tmp/B.BDr8ki/BUILD/lttng-modules-2.10.7/probes/../probes/lttng-tracepoint-event-impl.h:54:9: note: in expansion of macro 'PARAMS' PARAMS(fields)) \ ^~~~~~ /tmp/B.BDr8ki/BUILD/lttng-modules-2.10.7/probes/../probes/lttng-tracepoint-event-impl.h:97:2: note: in expansion of macro 'LTTNG_TRACEPOINT_EVENT_MAP' LTTNG_TRACEPOINT_EVENT_MAP(name, name, \ ^~~~~~~~~~~~~~~~~~~~~~~~~~ /tmp/B.BDr8ki/BUILD/lttng-modules-2.10.7/probes/../probes/lttng-tracepoint-event-impl.h:100:4: note: in expansion of macro 'PARAMS' PARAMS(fields)) ^~~~~~ /tmp/B.BDr8ki/BUILD/lttng-modules-2.10.7/probes/../instrumentation/events/lttng-module/signal.h:85:1: note: in expansion of macro 'LTTNG_TRACEPOINT_EVENT' LTTNG_TRACEPOINT_EVENT(signal_deliver, ^~~~~~~~~~~~~~~~~~~~~~ /tmp/B.BDr8ki/BUILD/lttng-modules-2.10.7/probes/../instrumentation/events/lttng-module/signal.h:91:2: note: in expansion of macro 'TP_FIELDS' TP_FIELDS( ^~~~~~~~~ /tmp/B.BDr8ki/BUILD/lttng-modules-2.10.7/probes/../probes/lttng-tracepoint-event-impl.h:681:2: note: in expansion of macro '_ctf_integer_ext_fetched' _ctf_integer_ext_fetched(_type, _item, _src, _byte_order, _base, _nowrite) ^~~~~~~~~~~~~~~~~~~~~~~~ /tmp/B.BDr8ki/BUILD/lttng-modules-2.10.7/probes/../probes/lttng-tracepoint-event-impl.h:698:2: note: in expansion of macro '_ctf_integer_ext_isuser0' _ctf_integer_ext_isuser##_user(_type, _item, _user_src, _byte_order, _base, _nowrite) ^~~~~~~~~~~~~~~~~~~~~~~ /tmp/B.BDr8ki/BUILD/lttng-modules-2.10.7/probes/../probes/lttng-events-write.h:23:2: note: in expansion of macro '_ctf_integer_ext' _ctf_integer_ext(_type, _item, _src, __BYTE_ORDER, 10, 0, 0) ^~~~~~~~~~~~~~~~ /tmp/B.BDr8ki/BUILD/lttng-modules-2.10.7/probes/../instrumentation/events/lttng-module/signal.h:16:3: note: in expansion of macro 'ctf_integer' ctf_integer(int, errno, \ ^~~~~~~~~~~ /tmp/B.BDr8ki/BUILD/lttng-modules-2.10.7/probes/../instrumentation/events/lttng-module/signal.h:93:3: note: in expansion of macro 'LTTNG_FIELDS_SIGINFO' LTTNG_FIELDS_SIGINFO(info) ^~~~~~~~~~~~~~~~~~~~ /tmp/B.BDr8ki/BUILD/lttng-modules-2.10.7/probes/../instrumentation/events/lttng-module/signal.h:17:10: warning: comparison of distinct pointer types lacks a cast (info == SEND_SIG_NOINFO || info == SEND_SIG_FORCED || info == SEND_SIG_PRIV) ? \ ^~ /tmp/B.BDr8ki/BUILD/lttng-modules-2.10.7/probes/../probes/lttng-tracepoint-event-impl.h:775:2: note: in definition of macro 'LTTNG_TRACEPOINT_EVENT_CLASS_CODE' _fields \ ^~~~~~~ /tmp/B.BDr8ki/BUILD/lttng-modules-2.10.7/probes/../probes/lttng-tracepoint-event-impl.h:117:3: note: in expansion of macro 'PARAMS' PARAMS(_fields), ) ^~~~~~ /tmp/B.BDr8ki/BUILD/lttng-modules-2.10.7/probes/../probes/lttng-tracepoint-event-impl.h:51:2: note: in expansion of macro 'LTTNG_TRACEPOINT_EVENT_CLASS' LTTNG_TRACEPOINT_EVENT_CLASS(map, \ ^~~~~~~~~~~~~~~~~~~~~~~~~~~~ /tmp/B.BDr8ki/BUILD/lttng-modules-2.10.7/probes/../probes/lttng-tracepoint-event-impl.h:54:9: note: in expansion of macro 'PARAMS' PARAMS(fields)) \ ^~~~~~ /tmp/B.BDr8ki/BUILD/lttng-modules-2.10.7/probes/../probes/lttng-tracepoint-event-impl.h:97:2: note: in expansion of macro 'LTTNG_TRACEPOINT_EVENT_MAP' LTTNG_TRACEPOINT_EVENT_MAP(name, name, \ ^~~~~~~~~~~~~~~~~~~~~~~~~~ /tmp/B.BDr8ki/BUILD/lttng-modules-2.10.7/probes/../probes/lttng-tracepoint-event-impl.h:100:4: note: in expansion of macro 'PARAMS' PARAMS(fields)) ^~~~~~ /tmp/B.BDr8ki/BUILD/lttng-modules-2.10.7/probes/../instrumentation/events/lttng-module/signal.h:85:1: note: in expansion of macro 'LTTNG_TRACEPOINT_EVENT' LTTNG_TRACEPOINT_EVENT(signal_deliver, ^~~~~~~~~~~~~~~~~~~~~~ /tmp/B.BDr8ki/BUILD/lttng-modules-2.10.7/probes/../instrumentation/events/lttng-module/signal.h:91:2: note: in expansion of macro 'TP_FIELDS' TP_FIELDS( ^~~~~~~~~ /tmp/B.BDr8ki/BUILD/lttng-modules-2.10.7/probes/../probes/lttng-tracepoint-event-impl.h:681:2: note: in expansion of macro '_ctf_integer_ext_fetched' _ctf_integer_ext_fetched(_type, _item, _src, _byte_order, _base, _nowrite) ^~~~~~~~~~~~~~~~~~~~~~~~ /tmp/B.BDr8ki/BUILD/lttng-modules-2.10.7/probes/../probes/lttng-tracepoint-event-impl.h:698:2: note: in expansion of macro '_ctf_integer_ext_isuser0' _ctf_integer_ext_isuser##_user(_type, _item, _user_src, _byte_order, _base, _nowrite) ^~~~~~~~~~~~~~~~~~~~~~~ /tmp/B.BDr8ki/BUILD/lttng-modules-2.10.7/probes/../probes/lttng-events-write.h:23:2: note: in expansion of macro '_ctf_integer_ext' _ctf_integer_ext(_type, _item, _src, __BYTE_ORDER, 10, 0, 0) ^~~~~~~~~~~~~~~~ /tmp/B.BDr8ki/BUILD/lttng-modules-2.10.7/probes/../instrumentation/events/lttng-module/signal.h:16:3: note: in expansion of macro 'ctf_integer' ctf_integer(int, errno, \ ^~~~~~~~~~~ /tmp/B.BDr8ki/BUILD/lttng-modules-2.10.7/probes/../instrumentation/events/lttng-module/signal.h:93:3: note: in expansion of macro 'LTTNG_FIELDS_SIGINFO' LTTNG_FIELDS_SIGINFO(info) ^~~~~~~~~~~~~~~~~~~~ /tmp/B.BDr8ki/BUILD/lttng-modules-2.10.7/probes/../instrumentation/events/lttng-module/signal.h:17:64: warning: comparison of distinct pointer types lacks a cast (info == SEND_SIG_NOINFO || info == SEND_SIG_FORCED || info == SEND_SIG_PRIV) ? \ ^~ /tmp/B.BDr8ki/BUILD/lttng-modules-2.10.7/probes/../probes/lttng-tracepoint-event-impl.h:775:2: note: in definition of macro 'LTTNG_TRACEPOINT_EVENT_CLASS_CODE' _fields \ ^~~~~~~ /tmp/B.BDr8ki/BUILD/lttng-modules-2.10.7/probes/../probes/lttng-tracepoint-event-impl.h:117:3: note: in expansion of macro 'PARAMS' PARAMS(_fields), ) ^~~~~~ /tmp/B.BDr8ki/BUILD/lttng-modules-2.10.7/probes/../probes/lttng-tracepoint-event-impl.h:51:2: note: in expansion of macro 'LTTNG_TRACEPOINT_EVENT_CLASS' LTTNG_TRACEPOINT_EVENT_CLASS(map, \ ^~~~~~~~~~~~~~~~~~~~~~~~~~~~ /tmp/B.BDr8ki/BUILD/lttng-modules-2.10.7/probes/../probes/lttng-tracepoint-event-impl.h:54:9: note: in expansion of macro 'PARAMS' PARAMS(fields)) \ ^~~~~~ /tmp/B.BDr8ki/BUILD/lttng-modules-2.10.7/probes/../probes/lttng-tracepoint-event-impl.h:97:2: note: in expansion of macro 'LTTNG_TRACEPOINT_EVENT_MAP' LTTNG_TRACEPOINT_EVENT_MAP(name, name, \ ^~~~~~~~~~~~~~~~~~~~~~~~~~ /tmp/B.BDr8ki/BUILD/lttng-modules-2.10.7/probes/../probes/lttng-tracepoint-event-impl.h:100:4: note: in expansion of macro 'PARAMS' PARAMS(fields)) ^~~~~~ /tmp/B.BDr8ki/BUILD/lttng-modules-2.10.7/probes/../instrumentation/events/lttng-module/signal.h:85:1: note: in expansion of macro 'LTTNG_TRACEPOINT_EVENT' LTTNG_TRACEPOINT_EVENT(signal_deliver, ^~~~~~~~~~~~~~~~~~~~~~ /tmp/B.BDr8ki/BUILD/lttng-modules-2.10.7/probes/../instrumentation/events/lttng-module/signal.h:91:2: note: in expansion of macro 'TP_FIELDS' TP_FIELDS( ^~~~~~~~~ /tmp/B.BDr8ki/BUILD/lttng-modules-2.10.7/probes/../probes/lttng-tracepoint-event-impl.h:681:2: note: in expansion of macro '_ctf_integer_ext_fetched' _ctf_integer_ext_fetched(_type, _item, _src, _byte_order, _base, _nowrite) ^~~~~~~~~~~~~~~~~~~~~~~~ /tmp/B.BDr8ki/BUILD/lttng-modules-2.10.7/probes/../probes/lttng-tracepoint-event-impl.h:698:2: note: in expansion of macro '_ctf_integer_ext_isuser0' _ctf_integer_ext_isuser##_user(_type, _item, _user_src, _byte_order, _base, _nowrite) ^~~~~~~~~~~~~~~~~~~~~~~ /tmp/B.BDr8ki/BUILD/lttng-modules-2.10.7/probes/../probes/lttng-events-write.h:23:2: note: in expansion of macro '_ctf_integer_ext' _ctf_integer_ext(_type, _item, _src, __BYTE_ORDER, 10, 0, 0) ^~~~~~~~~~~~~~~~ /tmp/B.BDr8ki/BUILD/lttng-modules-2.10.7/probes/../instrumentation/events/lttng-module/signal.h:16:3: note: in expansion of macro 'ctf_integer' ctf_integer(int, errno, \ ^~~~~~~~~~~ /tmp/B.BDr8ki/BUILD/lttng-modules-2.10.7/probes/../instrumentation/events/lttng-module/signal.h:93:3: note: in expansion of macro 'LTTNG_FIELDS_SIGINFO' LTTNG_FIELDS_SIGINFO(info) ^~~~~~~~~~~~~~~~~~~~ /tmp/B.BDr8ki/BUILD/lttng-modules-2.10.7/probes/../instrumentation/events/lttng-module/signal.h:17:10: warning: comparison of distinct pointer types lacks a cast (info == SEND_SIG_NOINFO || info == SEND_SIG_FORCED || info == SEND_SIG_PRIV) ? \ ^~ /tmp/B.BDr8ki/BUILD/lttng-modules-2.10.7/probes/../probes/lttng-tracepoint-event-impl.h:775:2: note: in definition of macro 'LTTNG_TRACEPOINT_EVENT_CLASS_CODE' _fields \ ^~~~~~~ /tmp/B.BDr8ki/BUILD/lttng-modules-2.10.7/probes/../probes/lttng-tracepoint-event-impl.h:117:3: note: in expansion of macro 'PARAMS' PARAMS(_fields), ) ^~~~~~ /tmp/B.BDr8ki/BUILD/lttng-modules-2.10.7/probes/../probes/lttng-tracepoint-event-impl.h:51:2: note: in expansion of macro 'LTTNG_TRACEPOINT_EVENT_CLASS' LTTNG_TRACEPOINT_EVENT_CLASS(map, \ ^~~~~~~~~~~~~~~~~~~~~~~~~~~~ /tmp/B.BDr8ki/BUILD/lttng-modules-2.10.7/probes/../probes/lttng-tracepoint-event-impl.h:54:9: note: in expansion of macro 'PARAMS' PARAMS(fields)) \ ^~~~~~ /tmp/B.BDr8ki/BUILD/lttng-modules-2.10.7/probes/../probes/lttng-tracepoint-event-impl.h:97:2: note: in expansion of macro 'LTTNG_TRACEPOINT_EVENT_MAP' LTTNG_TRACEPOINT_EVENT_MAP(name, name, \ ^~~~~~~~~~~~~~~~~~~~~~~~~~ /tmp/B.BDr8ki/BUILD/lttng-modules-2.10.7/probes/../probes/lttng-tracepoint-event-impl.h:100:4: note: in expansion of macro 'PARAMS' PARAMS(fields)) ^~~~~~ /tmp/B.BDr8ki/BUILD/lttng-modules-2.10.7/probes/../instrumentation/events/lttng-module/signal.h:85:1: note: in expansion of macro 'LTTNG_TRACEPOINT_EVENT' LTTNG_TRACEPOINT_EVENT(signal_deliver, ^~~~~~~~~~~~~~~~~~~~~~ /tmp/B.BDr8ki/BUILD/lttng-modules-2.10.7/probes/../instrumentation/events/lttng-module/signal.h:91:2: note: in expansion of macro 'TP_FIELDS' TP_FIELDS( ^~~~~~~~~ /tmp/B.BDr8ki/BUILD/lttng-modules-2.10.7/probes/../probes/lttng-tracepoint-event-impl.h:681:2: note: in expansion of macro '_ctf_integer_ext_fetched' _ctf_integer_ext_fetched(_type, _item, _src, _byte_order, _base, _nowrite) ^~~~~~~~~~~~~~~~~~~~~~~~ /tmp/B.BDr8ki/BUILD/lttng-modules-2.10.7/probes/../probes/lttng-tracepoint-event-impl.h:698:2: note: in expansion of macro '_ctf_integer_ext_isuser0' _ctf_integer_ext_isuser##_user(_type, _item, _user_src, _byte_order, _base, _nowrite) ^~~~~~~~~~~~~~~~~~~~~~~ /tmp/B.BDr8ki/BUILD/lttng-modules-2.10.7/probes/../probes/lttng-events-write.h:23:2: note: in expansion of macro '_ctf_integer_ext' _ctf_integer_ext(_type, _item, _src, __BYTE_ORDER, 10, 0, 0) ^~~~~~~~~~~~~~~~ /tmp/B.BDr8ki/BUILD/lttng-modules-2.10.7/probes/../instrumentation/events/lttng-module/signal.h:16:3: note: in expansion of macro 'ctf_integer' ctf_integer(int, errno, \ ^~~~~~~~~~~ /tmp/B.BDr8ki/BUILD/lttng-modules-2.10.7/probes/../instrumentation/events/lttng-module/signal.h:93:3: note: in expansion of macro 'LTTNG_FIELDS_SIGINFO' LTTNG_FIELDS_SIGINFO(info) ^~~~~~~~~~~~~~~~~~~~ /tmp/B.BDr8ki/BUILD/lttng-modules-2.10.7/probes/../instrumentation/events/lttng-module/signal.h:17:64: warning: comparison of distinct pointer types lacks a cast (info == SEND_SIG_NOINFO || info == SEND_SIG_FORCED || info == SEND_SIG_PRIV) ? \ ^~ /tmp/B.BDr8ki/BUILD/lttng-modules-2.10.7/probes/../probes/lttng-tracepoint-event-impl.h:775:2: note: in definition of macro 'LTTNG_TRACEPOINT_EVENT_CLASS_CODE' _fields \ ^~~~~~~ /tmp/B.BDr8ki/BUILD/lttng-modules-2.10.7/probes/../probes/lttng-tracepoint-event-impl.h:117:3: note: in expansion of macro 'PARAMS' PARAMS(_fields), ) ^~~~~~ /tmp/B.BDr8ki/BUILD/lttng-modules-2.10.7/probes/../probes/lttng-tracepoint-event-impl.h:51:2: note: in expansion of macro 'LTTNG_TRACEPOINT_EVENT_CLASS' LTTNG_TRACEPOINT_EVENT_CLASS(map, \ ^~~~~~~~~~~~~~~~~~~~~~~~~~~~ /tmp/B.BDr8ki/BUILD/lttng-modules-2.10.7/probes/../probes/lttng-tracepoint-event-impl.h:54:9: note: in expansion of macro 'PARAMS' PARAMS(fields)) \ ^~~~~~ /tmp/B.BDr8ki/BUILD/lttng-modules-2.10.7/probes/../probes/lttng-tracepoint-event-impl.h:97:2: note: in expansion of macro 'LTTNG_TRACEPOINT_EVENT_MAP' LTTNG_TRACEPOINT_EVENT_MAP(name, name, \ ^~~~~~~~~~~~~~~~~~~~~~~~~~ /tmp/B.BDr8ki/BUILD/lttng-modules-2.10.7/probes/../probes/lttng-tracepoint-event-impl.h:100:4: note: in expansion of macro 'PARAMS' PARAMS(fields)) ^~~~~~ /tmp/B.BDr8ki/BUILD/lttng-modules-2.10.7/probes/../instrumentation/events/lttng-module/signal.h:85:1: note: in expansion of macro 'LTTNG_TRACEPOINT_EVENT' LTTNG_TRACEPOINT_EVENT(signal_deliver, ^~~~~~~~~~~~~~~~~~~~~~ /tmp/B.BDr8ki/BUILD/lttng-modules-2.10.7/probes/../instrumentation/events/lttng-module/signal.h:91:2: note: in expansion of macro 'TP_FIELDS' TP_FIELDS( ^~~~~~~~~ /tmp/B.BDr8ki/BUILD/lttng-modules-2.10.7/probes/../probes/lttng-tracepoint-event-impl.h:681:2: note: in expansion of macro '_ctf_integer_ext_fetched' _ctf_integer_ext_fetched(_type, _item, _src, _byte_order, _base, _nowrite) ^~~~~~~~~~~~~~~~~~~~~~~~ /tmp/B.BDr8ki/BUILD/lttng-modules-2.10.7/probes/../probes/lttng-tracepoint-event-impl.h:698:2: note: in expansion of macro '_ctf_integer_ext_isuser0' _ctf_integer_ext_isuser##_user(_type, _item, _user_src, _byte_order, _base, _nowrite) ^~~~~~~~~~~~~~~~~~~~~~~ /tmp/B.BDr8ki/BUILD/lttng-modules-2.10.7/probes/../probes/lttng-events-write.h:23:2: note: in expansion of macro '_ctf_integer_ext' _ctf_integer_ext(_type, _item, _src, __BYTE_ORDER, 10, 0, 0) ^~~~~~~~~~~~~~~~ /tmp/B.BDr8ki/BUILD/lttng-modules-2.10.7/probes/../instrumentation/events/lttng-module/signal.h:16:3: note: in expansion of macro 'ctf_integer' ctf_integer(int, errno, \ ^~~~~~~~~~~ /tmp/B.BDr8ki/BUILD/lttng-modules-2.10.7/probes/../instrumentation/events/lttng-module/signal.h:93:3: note: in expansion of macro 'LTTNG_FIELDS_SIGINFO' LTTNG_FIELDS_SIGINFO(info) ^~~~~~~~~~~~~~~~~~~~ /tmp/B.BDr8ki/BUILD/lttng-modules-2.10.7/probes/../instrumentation/events/lttng-module/signal.h:17:10: warning: comparison of distinct pointer types lacks a cast (info == SEND_SIG_NOINFO || info == SEND_SIG_FORCED || info == SEND_SIG_PRIV) ? \ ^~ /tmp/B.BDr8ki/BUILD/lttng-modules-2.10.7/probes/../probes/lttng-tracepoint-event-impl.h:775:2: note: in definition of macro 'LTTNG_TRACEPOINT_EVENT_CLASS_CODE' _fields \ ^~~~~~~ /tmp/B.BDr8ki/BUILD/lttng-modules-2.10.7/probes/../probes/lttng-tracepoint-event-impl.h:117:3: note: in expansion of macro 'PARAMS' PARAMS(_fields), ) ^~~~~~ /tmp/B.BDr8ki/BUILD/lttng-modules-2.10.7/probes/../probes/lttng-tracepoint-event-impl.h:51:2: note: in expansion of macro 'LTTNG_TRACEPOINT_EVENT_CLASS' LTTNG_TRACEPOINT_EVENT_CLASS(map, \ ^~~~~~~~~~~~~~~~~~~~~~~~~~~~ /tmp/B.BDr8ki/BUILD/lttng-modules-2.10.7/probes/../probes/lttng-tracepoint-event-impl.h:54:9: note: in expansion of macro 'PARAMS' PARAMS(fields)) \ ^~~~~~ /tmp/B.BDr8ki/BUILD/lttng-modules-2.10.7/probes/../probes/lttng-tracepoint-event-impl.h:97:2: note: in expansion of macro 'LTTNG_TRACEPOINT_EVENT_MAP' LTTNG_TRACEPOINT_EVENT_MAP(name, name, \ ^~~~~~~~~~~~~~~~~~~~~~~~~~ /tmp/B.BDr8ki/BUILD/lttng-modules-2.10.7/probes/../probes/lttng-tracepoint-event-impl.h:100:4: note: in expansion of macro 'PARAMS' PARAMS(fields)) ^~~~~~ /tmp/B.BDr8ki/BUILD/lttng-modules-2.10.7/probes/../instrumentation/events/lttng-module/signal.h:85:1: note: in expansion of macro 'LTTNG_TRACEPOINT_EVENT' LTTNG_TRACEPOINT_EVENT(signal_deliver, ^~~~~~~~~~~~~~~~~~~~~~ /tmp/B.BDr8ki/BUILD/lttng-modules-2.10.7/probes/../instrumentation/events/lttng-module/signal.h:91:2: note: in expansion of macro 'TP_FIELDS' TP_FIELDS( ^~~~~~~~~ /tmp/B.BDr8ki/BUILD/lttng-modules-2.10.7/probes/../probes/lttng-tracepoint-event-impl.h:681:2: note: in expansion of macro '_ctf_integer_ext_fetched' _ctf_integer_ext_fetched(_type, _item, _src, _byte_order, _base, _nowrite) ^~~~~~~~~~~~~~~~~~~~~~~~ /tmp/B.BDr8ki/BUILD/lttng-modules-2.10.7/probes/../probes/lttng-tracepoint-event-impl.h:698:2: note: in expansion of macro '_ctf_integer_ext_isuser0' _ctf_integer_ext_isuser##_user(_type, _item, _user_src, _byte_order, _base, _nowrite) ^~~~~~~~~~~~~~~~~~~~~~~ /tmp/B.BDr8ki/BUILD/lttng-modules-2.10.7/probes/../probes/lttng-events-write.h:23:2: note: in expansion of macro '_ctf_integer_ext' _ctf_integer_ext(_type, _item, _src, __BYTE_ORDER, 10, 0, 0) ^~~~~~~~~~~~~~~~ /tmp/B.BDr8ki/BUILD/lttng-modules-2.10.7/probes/../instrumentation/events/lttng-module/signal.h:16:3: note: in expansion of macro 'ctf_integer' ctf_integer(int, errno, \ ^~~~~~~~~~~ /tmp/B.BDr8ki/BUILD/lttng-modules-2.10.7/probes/../instrumentation/events/lttng-module/signal.h:93:3: note: in expansion of macro 'LTTNG_FIELDS_SIGINFO' LTTNG_FIELDS_SIGINFO(info) ^~~~~~~~~~~~~~~~~~~~ /tmp/B.BDr8ki/BUILD/lttng-modules-2.10.7/probes/../instrumentation/events/lttng-module/signal.h:17:64: warning: comparison of distinct pointer types lacks a cast (info == SEND_SIG_NOINFO || info == SEND_SIG_FORCED || info == SEND_SIG_PRIV) ? \ ^~ /tmp/B.BDr8ki/BUILD/lttng-modules-2.10.7/probes/../probes/lttng-tracepoint-event-impl.h:775:2: note: in definition of macro 'LTTNG_TRACEPOINT_EVENT_CLASS_CODE' _fields \ ^~~~~~~ /tmp/B.BDr8ki/BUILD/lttng-modules-2.10.7/probes/../probes/lttng-tracepoint-event-impl.h:117:3: note: in expansion of macro 'PARAMS' PARAMS(_fields), ) ^~~~~~ /tmp/B.BDr8ki/BUILD/lttng-modules-2.10.7/probes/../probes/lttng-tracepoint-event-impl.h:51:2: note: in expansion of macro 'LTTNG_TRACEPOINT_EVENT_CLASS' LTTNG_TRACEPOINT_EVENT_CLASS(map, \ ^~~~~~~~~~~~~~~~~~~~~~~~~~~~ /tmp/B.BDr8ki/BUILD/lttng-modules-2.10.7/probes/../probes/lttng-tracepoint-event-impl.h:54:9: note: in expansion of macro 'PARAMS' PARAMS(fields)) \ ^~~~~~ /tmp/B.BDr8ki/BUILD/lttng-modules-2.10.7/probes/../probes/lttng-tracepoint-event-impl.h:97:2: note: in expansion of macro 'LTTNG_TRACEPOINT_EVENT_MAP' LTTNG_TRACEPOINT_EVENT_MAP(name, name, \ ^~~~~~~~~~~~~~~~~~~~~~~~~~ /tmp/B.BDr8ki/BUILD/lttng-modules-2.10.7/probes/../probes/lttng-tracepoint-event-impl.h:100:4: note: in expansion of macro 'PARAMS' PARAMS(fields)) ^~~~~~ /tmp/B.BDr8ki/BUILD/lttng-modules-2.10.7/probes/../instrumentation/events/lttng-module/signal.h:85:1: note: in expansion of macro 'LTTNG_TRACEPOINT_EVENT' LTTNG_TRACEPOINT_EVENT(signal_deliver, ^~~~~~~~~~~~~~~~~~~~~~ /tmp/B.BDr8ki/BUILD/lttng-modules-2.10.7/probes/../instrumentation/events/lttng-module/signal.h:91:2: note: in expansion of macro 'TP_FIELDS' TP_FIELDS( ^~~~~~~~~ /tmp/B.BDr8ki/BUILD/lttng-modules-2.10.7/probes/../probes/lttng-tracepoint-event-impl.h:681:2: note: in expansion of macro '_ctf_integer_ext_fetched' _ctf_integer_ext_fetched(_type, _item, _src, _byte_order, _base, _nowrite) ^~~~~~~~~~~~~~~~~~~~~~~~ /tmp/B.BDr8ki/BUILD/lttng-modules-2.10.7/probes/../probes/lttng-tracepoint-event-impl.h:698:2: note: in expansion of macro '_ctf_integer_ext_isuser0' _ctf_integer_ext_isuser##_user(_type, _item, _user_src, _byte_order, _base, _nowrite) ^~~~~~~~~~~~~~~~~~~~~~~ /tmp/B.BDr8ki/BUILD/lttng-modules-2.10.7/probes/../probes/lttng-events-write.h:23:2: note: in expansion of macro '_ctf_integer_ext' _ctf_integer_ext(_type, _item, _src, __BYTE_ORDER, 10, 0, 0) ^~~~~~~~~~~~~~~~ /tmp/B.BDr8ki/BUILD/lttng-modules-2.10.7/probes/../instrumentation/events/lttng-module/signal.h:16:3: note: in expansion of macro 'ctf_integer' ctf_integer(int, errno, \ ^~~~~~~~~~~ /tmp/B.BDr8ki/BUILD/lttng-modules-2.10.7/probes/../instrumentation/events/lttng-module/signal.h:93:3: note: in expansion of macro 'LTTNG_FIELDS_SIGINFO' LTTNG_FIELDS_SIGINFO(info) ^~~~~~~~~~~~~~~~~~~~ /tmp/B.BDr8ki/BUILD/lttng-modules-2.10.7/probes/../instrumentation/events/lttng-module/signal.h:17:10: warning: comparison of distinct pointer types lacks a cast (info == SEND_SIG_NOINFO || info == SEND_SIG_FORCED || info == SEND_SIG_PRIV) ? \ ^~ /tmp/B.BDr8ki/BUILD/lttng-modules-2.10.7/probes/../probes/lttng-tracepoint-event-impl.h:775:2: note: in definition of macro 'LTTNG_TRACEPOINT_EVENT_CLASS_CODE' _fields \ ^~~~~~~ /tmp/B.BDr8ki/BUILD/lttng-modules-2.10.7/probes/../probes/lttng-tracepoint-event-impl.h:117:3: note: in expansion of macro 'PARAMS' PARAMS(_fields), ) ^~~~~~ /tmp/B.BDr8ki/BUILD/lttng-modules-2.10.7/probes/../probes/lttng-tracepoint-event-impl.h:51:2: note: in expansion of macro 'LTTNG_TRACEPOINT_EVENT_CLASS' LTTNG_TRACEPOINT_EVENT_CLASS(map, \ ^~~~~~~~~~~~~~~~~~~~~~~~~~~~ /tmp/B.BDr8ki/BUILD/lttng-modules-2.10.7/probes/../probes/lttng-tracepoint-event-impl.h:54:9: note: in expansion of macro 'PARAMS' PARAMS(fields)) \ ^~~~~~ /tmp/B.BDr8ki/BUILD/lttng-modules-2.10.7/probes/../probes/lttng-tracepoint-event-impl.h:97:2: note: in expansion of macro 'LTTNG_TRACEPOINT_EVENT_MAP' LTTNG_TRACEPOINT_EVENT_MAP(name, name, \ ^~~~~~~~~~~~~~~~~~~~~~~~~~ /tmp/B.BDr8ki/BUILD/lttng-modules-2.10.7/probes/../probes/lttng-tracepoint-event-impl.h:100:4: note: in expansion of macro 'PARAMS' PARAMS(fields)) ^~~~~~ /tmp/B.BDr8ki/BUILD/lttng-modules-2.10.7/probes/../instrumentation/events/lttng-module/signal.h:85:1: note: in expansion of macro 'LTTNG_TRACEPOINT_EVENT' LTTNG_TRACEPOINT_EVENT(signal_deliver, ^~~~~~~~~~~~~~~~~~~~~~ /tmp/B.BDr8ki/BUILD/lttng-modules-2.10.7/probes/../instrumentation/events/lttng-module/signal.h:91:2: note: in expansion of macro 'TP_FIELDS' TP_FIELDS( ^~~~~~~~~ /tmp/B.BDr8ki/BUILD/lttng-modules-2.10.7/probes/../probes/lttng-tracepoint-event-impl.h:681:2: note: in expansion of macro '_ctf_integer_ext_fetched' _ctf_integer_ext_fetched(_type, _item, _src, _byte_order, _base, _nowrite) ^~~~~~~~~~~~~~~~~~~~~~~~ /tmp/B.BDr8ki/BUILD/lttng-modules-2.10.7/probes/../probes/lttng-tracepoint-event-impl.h:698:2: note: in expansion of macro '_ctf_integer_ext_isuser0' _ctf_integer_ext_isuser##_user(_type, _item, _user_src, _byte_order, _base, _nowrite) ^~~~~~~~~~~~~~~~~~~~~~~ /tmp/B.BDr8ki/BUILD/lttng-modules-2.10.7/probes/../probes/lttng-events-write.h:23:2: note: in expansion of macro '_ctf_integer_ext' _ctf_integer_ext(_type, _item, _src, __BYTE_ORDER, 10, 0, 0) ^~~~~~~~~~~~~~~~ /tmp/B.BDr8ki/BUILD/lttng-modules-2.10.7/probes/../instrumentation/events/lttng-module/signal.h:16:3: note: in expansion of macro 'ctf_integer' ctf_integer(int, errno, \ ^~~~~~~~~~~ /tmp/B.BDr8ki/BUILD/lttng-modules-2.10.7/probes/../instrumentation/events/lttng-module/signal.h:93:3: note: in expansion of macro 'LTTNG_FIELDS_SIGINFO' LTTNG_FIELDS_SIGINFO(info) ^~~~~~~~~~~~~~~~~~~~ /tmp/B.BDr8ki/BUILD/lttng-modules-2.10.7/probes/../instrumentation/events/lttng-module/signal.h:17:64: warning: comparison of distinct pointer types lacks a cast (info == SEND_SIG_NOINFO || info == SEND_SIG_FORCED || info == SEND_SIG_PRIV) ? \ ^~ /tmp/B.BDr8ki/BUILD/lttng-modules-2.10.7/probes/../probes/lttng-tracepoint-event-impl.h:775:2: note: in definition of macro 'LTTNG_TRACEPOINT_EVENT_CLASS_CODE' _fields \ ^~~~~~~ /tmp/B.BDr8ki/BUILD/lttng-modules-2.10.7/probes/../probes/lttng-tracepoint-event-impl.h:117:3: note: in expansion of macro 'PARAMS' PARAMS(_fields), ) ^~~~~~ /tmp/B.BDr8ki/BUILD/lttng-modules-2.10.7/probes/../probes/lttng-tracepoint-event-impl.h:51:2: note: in expansion of macro 'LTTNG_TRACEPOINT_EVENT_CLASS' LTTNG_TRACEPOINT_EVENT_CLASS(map, \ ^~~~~~~~~~~~~~~~~~~~~~~~~~~~ /tmp/B.BDr8ki/BUILD/lttng-modules-2.10.7/probes/../probes/lttng-tracepoint-event-impl.h:54:9: note: in expansion of macro 'PARAMS' PARAMS(fields)) \ ^~~~~~ /tmp/B.BDr8ki/BUILD/lttng-modules-2.10.7/probes/../probes/lttng-tracepoint-event-impl.h:97:2: note: in expansion of macro 'LTTNG_TRACEPOINT_EVENT_MAP' LTTNG_TRACEPOINT_EVENT_MAP(name, name, \ ^~~~~~~~~~~~~~~~~~~~~~~~~~ /tmp/B.BDr8ki/BUILD/lttng-modules-2.10.7/probes/../probes/lttng-tracepoint-event-impl.h:100:4: note: in expansion of macro 'PARAMS' PARAMS(fields)) ^~~~~~ /tmp/B.BDr8ki/BUILD/lttng-modules-2.10.7/probes/../instrumentation/events/lttng-module/signal.h:85:1: note: in expansion of macro 'LTTNG_TRACEPOINT_EVENT' LTTNG_TRACEPOINT_EVENT(signal_deliver, ^~~~~~~~~~~~~~~~~~~~~~ /tmp/B.BDr8ki/BUILD/lttng-modules-2.10.7/probes/../instrumentation/events/lttng-module/signal.h:91:2: note: in expansion of macro 'TP_FIELDS' TP_FIELDS( ^~~~~~~~~ /tmp/B.BDr8ki/BUILD/lttng-modules-2.10.7/probes/../probes/lttng-tracepoint-event-impl.h:681:2: note: in expansion of macro '_ctf_integer_ext_fetched' _ctf_integer_ext_fetched(_type, _item, _src, _byte_order, _base, _nowrite) ^~~~~~~~~~~~~~~~~~~~~~~~ /tmp/B.BDr8ki/BUILD/lttng-modules-2.10.7/probes/../probes/lttng-tracepoint-event-impl.h:698:2: note: in expansion of macro '_ctf_integer_ext_isuser0' _ctf_integer_ext_isuser##_user(_type, _item, _user_src, _byte_order, _base, _nowrite) ^~~~~~~~~~~~~~~~~~~~~~~ /tmp/B.BDr8ki/BUILD/lttng-modules-2.10.7/probes/../probes/lttng-events-write.h:23:2: note: in expansion of macro '_ctf_integer_ext' _ctf_integer_ext(_type, _item, _src, __BYTE_ORDER, 10, 0, 0) ^~~~~~~~~~~~~~~~ /tmp/B.BDr8ki/BUILD/lttng-modules-2.10.7/probes/../instrumentation/events/lttng-module/signal.h:16:3: note: in expansion of macro 'ctf_integer' ctf_integer(int, errno, \ ^~~~~~~~~~~ /tmp/B.BDr8ki/BUILD/lttng-modules-2.10.7/probes/../instrumentation/events/lttng-module/signal.h:93:3: note: in expansion of macro 'LTTNG_FIELDS_SIGINFO' LTTNG_FIELDS_SIGINFO(info) ^~~~~~~~~~~~~~~~~~~~ /tmp/B.BDr8ki/BUILD/lttng-modules-2.10.7/probes/../instrumentation/events/lttng-module/signal.h:17:10: warning: comparison of distinct pointer types lacks a cast (info == SEND_SIG_NOINFO || info == SEND_SIG_FORCED || info == SEND_SIG_PRIV) ? \ ^~ /tmp/B.BDr8ki/BUILD/lttng-modules-2.10.7/probes/../probes/lttng-tracepoint-event-impl.h:775:2: note: in definition of macro 'LTTNG_TRACEPOINT_EVENT_CLASS_CODE' _fields \ ^~~~~~~ /tmp/B.BDr8ki/BUILD/lttng-modules-2.10.7/probes/../probes/lttng-tracepoint-event-impl.h:117:3: note: in expansion of macro 'PARAMS' PARAMS(_fields), ) ^~~~~~ /tmp/B.BDr8ki/BUILD/lttng-modules-2.10.7/probes/../probes/lttng-tracepoint-event-impl.h:51:2: note: in expansion of macro 'LTTNG_TRACEPOINT_EVENT_CLASS' LTTNG_TRACEPOINT_EVENT_CLASS(map, \ ^~~~~~~~~~~~~~~~~~~~~~~~~~~~ /tmp/B.BDr8ki/BUILD/lttng-modules-2.10.7/probes/../probes/lttng-tracepoint-event-impl.h:54:9: note: in expansion of macro 'PARAMS' PARAMS(fields)) \ ^~~~~~ /tmp/B.BDr8ki/BUILD/lttng-modules-2.10.7/probes/../probes/lttng-tracepoint-event-impl.h:97:2: note: in expansion of macro 'LTTNG_TRACEPOINT_EVENT_MAP' LTTNG_TRACEPOINT_EVENT_MAP(name, name, \ ^~~~~~~~~~~~~~~~~~~~~~~~~~ /tmp/B.BDr8ki/BUILD/lttng-modules-2.10.7/probes/../probes/lttng-tracepoint-event-impl.h:100:4: note: in expansion of macro 'PARAMS' PARAMS(fields)) ^~~~~~ /tmp/B.BDr8ki/BUILD/lttng-modules-2.10.7/probes/../instrumentation/events/lttng-module/signal.h:85:1: note: in expansion of macro 'LTTNG_TRACEPOINT_EVENT' LTTNG_TRACEPOINT_EVENT(signal_deliver, ^~~~~~~~~~~~~~~~~~~~~~ /tmp/B.BDr8ki/BUILD/lttng-modules-2.10.7/probes/../instrumentation/events/lttng-module/signal.h:91:2: note: in expansion of macro 'TP_FIELDS' TP_FIELDS( ^~~~~~~~~ /tmp/B.BDr8ki/BUILD/lttng-modules-2.10.7/probes/../probes/lttng-tracepoint-event-impl.h:681:2: note: in expansion of macro '_ctf_integer_ext_fetched' _ctf_integer_ext_fetched(_type, _item, _src, _byte_order, _base, _nowrite) ^~~~~~~~~~~~~~~~~~~~~~~~ /tmp/B.BDr8ki/BUILD/lttng-modules-2.10.7/probes/../probes/lttng-tracepoint-event-impl.h:698:2: note: in expansion of macro '_ctf_integer_ext_isuser0' _ctf_integer_ext_isuser##_user(_type, _item, _user_src, _byte_order, _base, _nowrite) ^~~~~~~~~~~~~~~~~~~~~~~ /tmp/B.BDr8ki/BUILD/lttng-modules-2.10.7/probes/../probes/lttng-events-write.h:23:2: note: in expansion of macro '_ctf_integer_ext' _ctf_integer_ext(_type, _item, _src, __BYTE_ORDER, 10, 0, 0) ^~~~~~~~~~~~~~~~ /tmp/B.BDr8ki/BUILD/lttng-modules-2.10.7/probes/../instrumentation/events/lttng-module/signal.h:16:3: note: in expansion of macro 'ctf_integer' ctf_integer(int, errno, \ ^~~~~~~~~~~ /tmp/B.BDr8ki/BUILD/lttng-modules-2.10.7/probes/../instrumentation/events/lttng-module/signal.h:93:3: note: in expansion of macro 'LTTNG_FIELDS_SIGINFO' LTTNG_FIELDS_SIGINFO(info) ^~~~~~~~~~~~~~~~~~~~ /tmp/B.BDr8ki/BUILD/lttng-modules-2.10.7/probes/../instrumentation/events/lttng-module/signal.h:17:64: warning: comparison of distinct pointer types lacks a cast (info == SEND_SIG_NOINFO || info == SEND_SIG_FORCED || info == SEND_SIG_PRIV) ? \ ^~ /tmp/B.BDr8ki/BUILD/lttng-modules-2.10.7/probes/../probes/lttng-tracepoint-event-impl.h:775:2: note: in definition of macro 'LTTNG_TRACEPOINT_EVENT_CLASS_CODE' _fields \ ^~~~~~~ /tmp/B.BDr8ki/BUILD/lttng-modules-2.10.7/probes/../probes/lttng-tracepoint-event-impl.h:117:3: note: in expansion of macro 'PARAMS' PARAMS(_fields), ) ^~~~~~ /tmp/B.BDr8ki/BUILD/lttng-modules-2.10.7/probes/../probes/lttng-tracepoint-event-impl.h:51:2: note: in expansion of macro 'LTTNG_TRACEPOINT_EVENT_CLASS' LTTNG_TRACEPOINT_EVENT_CLASS(map, \ ^~~~~~~~~~~~~~~~~~~~~~~~~~~~ /tmp/B.BDr8ki/BUILD/lttng-modules-2.10.7/probes/../probes/lttng-tracepoint-event-impl.h:54:9: note: in expansion of macro 'PARAMS' PARAMS(fields)) \ ^~~~~~ /tmp/B.BDr8ki/BUILD/lttng-modules-2.10.7/probes/../probes/lttng-tracepoint-event-impl.h:97:2: note: in expansion of macro 'LTTNG_TRACEPOINT_EVENT_MAP' LTTNG_TRACEPOINT_EVENT_MAP(name, name, \ ^~~~~~~~~~~~~~~~~~~~~~~~~~ /tmp/B.BDr8ki/BUILD/lttng-modules-2.10.7/probes/../probes/lttng-tracepoint-event-impl.h:100:4: note: in expansion of macro 'PARAMS' PARAMS(fields)) ^~~~~~ /tmp/B.BDr8ki/BUILD/lttng-modules-2.10.7/probes/../instrumentation/events/lttng-module/signal.h:85:1: note: in expansion of macro 'LTTNG_TRACEPOINT_EVENT' LTTNG_TRACEPOINT_EVENT(signal_deliver, ^~~~~~~~~~~~~~~~~~~~~~ /tmp/B.BDr8ki/BUILD/lttng-modules-2.10.7/probes/../instrumentation/events/lttng-module/signal.h:91:2: note: in expansion of macro 'TP_FIELDS' TP_FIELDS( ^~~~~~~~~ /tmp/B.BDr8ki/BUILD/lttng-modules-2.10.7/probes/../probes/lttng-tracepoint-event-impl.h:681:2: note: in expansion of macro '_ctf_integer_ext_fetched' _ctf_integer_ext_fetched(_type, _item, _src, _byte_order, _base, _nowrite) ^~~~~~~~~~~~~~~~~~~~~~~~ /tmp/B.BDr8ki/BUILD/lttng-modules-2.10.7/probes/../probes/lttng-tracepoint-event-impl.h:698:2: note: in expansion of macro '_ctf_integer_ext_isuser0' _ctf_integer_ext_isuser##_user(_type, _item, _user_src, _byte_order, _base, _nowrite) ^~~~~~~~~~~~~~~~~~~~~~~ /tmp/B.BDr8ki/BUILD/lttng-modules-2.10.7/probes/../probes/lttng-events-write.h:23:2: note: in expansion of macro '_ctf_integer_ext' _ctf_integer_ext(_type, _item, _src, __BYTE_ORDER, 10, 0, 0) ^~~~~~~~~~~~~~~~ /tmp/B.BDr8ki/BUILD/lttng-modules-2.10.7/probes/../instrumentation/events/lttng-module/signal.h:16:3: note: in expansion of macro 'ctf_integer' ctf_integer(int, errno, \ ^~~~~~~~~~~ /tmp/B.BDr8ki/BUILD/lttng-modules-2.10.7/probes/../instrumentation/events/lttng-module/signal.h:93:3: note: in expansion of macro 'LTTNG_FIELDS_SIGINFO' LTTNG_FIELDS_SIGINFO(info) ^~~~~~~~~~~~~~~~~~~~ /tmp/B.BDr8ki/BUILD/lttng-modules-2.10.7/probes/../instrumentation/events/lttng-module/signal.h:17:10: warning: comparison of distinct pointer types lacks a cast (info == SEND_SIG_NOINFO || info == SEND_SIG_FORCED || info == SEND_SIG_PRIV) ? \ ^~ /tmp/B.BDr8ki/BUILD/lttng-modules-2.10.7/probes/../probes/lttng-tracepoint-event-impl.h:775:2: note: in definition of macro 'LTTNG_TRACEPOINT_EVENT_CLASS_CODE' _fields \ ^~~~~~~ /tmp/B.BDr8ki/BUILD/lttng-modules-2.10.7/probes/../probes/lttng-tracepoint-event-impl.h:117:3: note: in expansion of macro 'PARAMS' PARAMS(_fields), ) ^~~~~~ /tmp/B.BDr8ki/BUILD/lttng-modules-2.10.7/probes/../probes/lttng-tracepoint-event-impl.h:51:2: note: in expansion of macro 'LTTNG_TRACEPOINT_EVENT_CLASS' LTTNG_TRACEPOINT_EVENT_CLASS(map, \ ^~~~~~~~~~~~~~~~~~~~~~~~~~~~ /tmp/B.BDr8ki/BUILD/lttng-modules-2.10.7/probes/../probes/lttng-tracepoint-event-impl.h:54:9: note: in expansion of macro 'PARAMS' PARAMS(fields)) \ ^~~~~~ /tmp/B.BDr8ki/BUILD/lttng-modules-2.10.7/probes/../probes/lttng-tracepoint-event-impl.h:97:2: note: in expansion of macro 'LTTNG_TRACEPOINT_EVENT_MAP' LTTNG_TRACEPOINT_EVENT_MAP(name, name, \ ^~~~~~~~~~~~~~~~~~~~~~~~~~ /tmp/B.BDr8ki/BUILD/lttng-modules-2.10.7/probes/../probes/lttng-tracepoint-event-impl.h:100:4: note: in expansion of macro 'PARAMS' PARAMS(fields)) ^~~~~~ /tmp/B.BDr8ki/BUILD/lttng-modules-2.10.7/probes/../instrumentation/events/lttng-module/signal.h:85:1: note: in expansion of macro 'LTTNG_TRACEPOINT_EVENT' LTTNG_TRACEPOINT_EVENT(signal_deliver, ^~~~~~~~~~~~~~~~~~~~~~ /tmp/B.BDr8ki/BUILD/lttng-modules-2.10.7/probes/../instrumentation/events/lttng-module/signal.h:91:2: note: in expansion of macro 'TP_FIELDS' TP_FIELDS( ^~~~~~~~~ /tmp/B.BDr8ki/BUILD/lttng-modules-2.10.7/probes/../probes/lttng-tracepoint-event-impl.h:681:2: note: in expansion of macro '_ctf_integer_ext_fetched' _ctf_integer_ext_fetched(_type, _item, _src, _byte_order, _base, _nowrite) ^~~~~~~~~~~~~~~~~~~~~~~~ /tmp/B.BDr8ki/BUILD/lttng-modules-2.10.7/probes/../probes/lttng-tracepoint-event-impl.h:698:2: note: in expansion of macro '_ctf_integer_ext_isuser0' _ctf_integer_ext_isuser##_user(_type, _item, _user_src, _byte_order, _base, _nowrite) ^~~~~~~~~~~~~~~~~~~~~~~ /tmp/B.BDr8ki/BUILD/lttng-modules-2.10.7/probes/../probes/lttng-events-write.h:23:2: note: in expansion of macro '_ctf_integer_ext' _ctf_integer_ext(_type, _item, _src, __BYTE_ORDER, 10, 0, 0) ^~~~~~~~~~~~~~~~ /tmp/B.BDr8ki/BUILD/lttng-modules-2.10.7/probes/../instrumentation/events/lttng-module/signal.h:16:3: note: in expansion of macro 'ctf_integer' ctf_integer(int, errno, \ ^~~~~~~~~~~ /tmp/B.BDr8ki/BUILD/lttng-modules-2.10.7/probes/../instrumentation/events/lttng-module/signal.h:93:3: note: in expansion of macro 'LTTNG_FIELDS_SIGINFO' LTTNG_FIELDS_SIGINFO(info) ^~~~~~~~~~~~~~~~~~~~ /tmp/B.BDr8ki/BUILD/lttng-modules-2.10.7/probes/../instrumentation/events/lttng-module/signal.h:17:64: warning: comparison of distinct pointer types lacks a cast (info == SEND_SIG_NOINFO || info == SEND_SIG_FORCED || info == SEND_SIG_PRIV) ? \ ^~ /tmp/B.BDr8ki/BUILD/lttng-modules-2.10.7/probes/../probes/lttng-tracepoint-event-impl.h:775:2: note: in definition of macro 'LTTNG_TRACEPOINT_EVENT_CLASS_CODE' _fields \ ^~~~~~~ /tmp/B.BDr8ki/BUILD/lttng-modules-2.10.7/probes/../probes/lttng-tracepoint-event-impl.h:117:3: note: in expansion of macro 'PARAMS' PARAMS(_fields), ) ^~~~~~ /tmp/B.BDr8ki/BUILD/lttng-modules-2.10.7/probes/../probes/lttng-tracepoint-event-impl.h:51:2: note: in expansion of macro 'LTTNG_TRACEPOINT_EVENT_CLASS' LTTNG_TRACEPOINT_EVENT_CLASS(map, \ ^~~~~~~~~~~~~~~~~~~~~~~~~~~~ /tmp/B.BDr8ki/BUILD/lttng-modules-2.10.7/probes/../probes/lttng-tracepoint-event-impl.h:54:9: note: in expansion of macro 'PARAMS' PARAMS(fields)) \ ^~~~~~ /tmp/B.BDr8ki/BUILD/lttng-modules-2.10.7/probes/../probes/lttng-tracepoint-event-impl.h:97:2: note: in expansion of macro 'LTTNG_TRACEPOINT_EVENT_MAP' LTTNG_TRACEPOINT_EVENT_MAP(name, name, \ ^~~~~~~~~~~~~~~~~~~~~~~~~~ /tmp/B.BDr8ki/BUILD/lttng-modules-2.10.7/probes/../probes/lttng-tracepoint-event-impl.h:100:4: note: in expansion of macro 'PARAMS' PARAMS(fields)) ^~~~~~ /tmp/B.BDr8ki/BUILD/lttng-modules-2.10.7/probes/../instrumentation/events/lttng-module/signal.h:85:1: note: in expansion of macro 'LTTNG_TRACEPOINT_EVENT' LTTNG_TRACEPOINT_EVENT(signal_deliver, ^~~~~~~~~~~~~~~~~~~~~~ /tmp/B.BDr8ki/BUILD/lttng-modules-2.10.7/probes/../instrumentation/events/lttng-module/signal.h:91:2: note: in expansion of macro 'TP_FIELDS' TP_FIELDS( ^~~~~~~~~ /tmp/B.BDr8ki/BUILD/lttng-modules-2.10.7/probes/../probes/lttng-tracepoint-event-impl.h:681:2: note: in expansion of macro '_ctf_integer_ext_fetched' _ctf_integer_ext_fetched(_type, _item, _src, _byte_order, _base, _nowrite) ^~~~~~~~~~~~~~~~~~~~~~~~ /tmp/B.BDr8ki/BUILD/lttng-modules-2.10.7/probes/../probes/lttng-tracepoint-event-impl.h:698:2: note: in expansion of macro '_ctf_integer_ext_isuser0' _ctf_integer_ext_isuser##_user(_type, _item, _user_src, _byte_order, _base, _nowrite) ^~~~~~~~~~~~~~~~~~~~~~~ /tmp/B.BDr8ki/BUILD/lttng-modules-2.10.7/probes/../probes/lttng-events-write.h:23:2: note: in expansion of macro '_ctf_integer_ext' _ctf_integer_ext(_type, _item, _src, __BYTE_ORDER, 10, 0, 0) ^~~~~~~~~~~~~~~~ /tmp/B.BDr8ki/BUILD/lttng-modules-2.10.7/probes/../instrumentation/events/lttng-module/signal.h:16:3: note: in expansion of macro 'ctf_integer' ctf_integer(int, errno, \ ^~~~~~~~~~~ /tmp/B.BDr8ki/BUILD/lttng-modules-2.10.7/probes/../instrumentation/events/lttng-module/signal.h:93:3: note: in expansion of macro 'LTTNG_FIELDS_SIGINFO' LTTNG_FIELDS_SIGINFO(info) ^~~~~~~~~~~~~~~~~~~~ /tmp/B.BDr8ki/BUILD/lttng-modules-2.10.7/probes/../instrumentation/events/lttng-module/signal.h:17:10: warning: comparison of distinct pointer types lacks a cast (info == SEND_SIG_NOINFO || info == SEND_SIG_FORCED || info == SEND_SIG_PRIV) ? \ ^~ /tmp/B.BDr8ki/BUILD/lttng-modules-2.10.7/probes/../probes/lttng-tracepoint-event-impl.h:775:2: note: in definition of macro 'LTTNG_TRACEPOINT_EVENT_CLASS_CODE' _fields \ ^~~~~~~ /tmp/B.BDr8ki/BUILD/lttng-modules-2.10.7/probes/../probes/lttng-tracepoint-event-impl.h:117:3: note: in expansion of macro 'PARAMS' PARAMS(_fields), ) ^~~~~~ /tmp/B.BDr8ki/BUILD/lttng-modules-2.10.7/probes/../probes/lttng-tracepoint-event-impl.h:51:2: note: in expansion of macro 'LTTNG_TRACEPOINT_EVENT_CLASS' LTTNG_TRACEPOINT_EVENT_CLASS(map, \ ^~~~~~~~~~~~~~~~~~~~~~~~~~~~ /tmp/B.BDr8ki/BUILD/lttng-modules-2.10.7/probes/../probes/lttng-tracepoint-event-impl.h:54:9: note: in expansion of macro 'PARAMS' PARAMS(fields)) \ ^~~~~~ /tmp/B.BDr8ki/BUILD/lttng-modules-2.10.7/probes/../probes/lttng-tracepoint-event-impl.h:97:2: note: in expansion of macro 'LTTNG_TRACEPOINT_EVENT_MAP' LTTNG_TRACEPOINT_EVENT_MAP(name, name, \ ^~~~~~~~~~~~~~~~~~~~~~~~~~ /tmp/B.BDr8ki/BUILD/lttng-modules-2.10.7/probes/../probes/lttng-tracepoint-event-impl.h:100:4: note: in expansion of macro 'PARAMS' PARAMS(fields)) ^~~~~~ /tmp/B.BDr8ki/BUILD/lttng-modules-2.10.7/probes/../instrumentation/events/lttng-module/signal.h:85:1: note: in expansion of macro 'LTTNG_TRACEPOINT_EVENT' LTTNG_TRACEPOINT_EVENT(signal_deliver, ^~~~~~~~~~~~~~~~~~~~~~ /tmp/B.BDr8ki/BUILD/lttng-modules-2.10.7/probes/../instrumentation/events/lttng-module/signal.h:91:2: note: in expansion of macro 'TP_FIELDS' TP_FIELDS( ^~~~~~~~~ /tmp/B.BDr8ki/BUILD/lttng-modules-2.10.7/probes/../probes/lttng-tracepoint-event-impl.h:681:2: note: in expansion of macro '_ctf_integer_ext_fetched' _ctf_integer_ext_fetched(_type, _item, _src, _byte_order, _base, _nowrite) ^~~~~~~~~~~~~~~~~~~~~~~~ /tmp/B.BDr8ki/BUILD/lttng-modules-2.10.7/probes/../probes/lttng-tracepoint-event-impl.h:698:2: note: in expansion of macro '_ctf_integer_ext_isuser0' _ctf_integer_ext_isuser##_user(_type, _item, _user_src, _byte_order, _base, _nowrite) ^~~~~~~~~~~~~~~~~~~~~~~ /tmp/B.BDr8ki/BUILD/lttng-modules-2.10.7/probes/../probes/lttng-events-write.h:23:2: note: in expansion of macro '_ctf_integer_ext' _ctf_integer_ext(_type, _item, _src, __BYTE_ORDER, 10, 0, 0) ^~~~~~~~~~~~~~~~ /tmp/B.BDr8ki/BUILD/lttng-modules-2.10.7/probes/../instrumentation/events/lttng-module/signal.h:16:3: note: in expansion of macro 'ctf_integer' ctf_integer(int, errno, \ ^~~~~~~~~~~ /tmp/B.BDr8ki/BUILD/lttng-modules-2.10.7/probes/../instrumentation/events/lttng-module/signal.h:93:3: note: in expansion of macro 'LTTNG_FIELDS_SIGINFO' LTTNG_FIELDS_SIGINFO(info) ^~~~~~~~~~~~~~~~~~~~ /tmp/B.BDr8ki/BUILD/lttng-modules-2.10.7/probes/../instrumentation/events/lttng-module/signal.h:17:64: warning: comparison of distinct pointer types lacks a cast (info == SEND_SIG_NOINFO || info == SEND_SIG_FORCED || info == SEND_SIG_PRIV) ? \ ^~ /tmp/B.BDr8ki/BUILD/lttng-modules-2.10.7/probes/../probes/lttng-tracepoint-event-impl.h:775:2: note: in definition of macro 'LTTNG_TRACEPOINT_EVENT_CLASS_CODE' _fields \ ^~~~~~~ /tmp/B.BDr8ki/BUILD/lttng-modules-2.10.7/probes/../probes/lttng-tracepoint-event-impl.h:117:3: note: in expansion of macro 'PARAMS' PARAMS(_fields), ) ^~~~~~ /tmp/B.BDr8ki/BUILD/lttng-modules-2.10.7/probes/../probes/lttng-tracepoint-event-impl.h:51:2: note: in expansion of macro 'LTTNG_TRACEPOINT_EVENT_CLASS' LTTNG_TRACEPOINT_EVENT_CLASS(map, \ ^~~~~~~~~~~~~~~~~~~~~~~~~~~~ /tmp/B.BDr8ki/BUILD/lttng-modules-2.10.7/probes/../probes/lttng-tracepoint-event-impl.h:54:9: note: in expansion of macro 'PARAMS' PARAMS(fields)) \ ^~~~~~ /tmp/B.BDr8ki/BUILD/lttng-modules-2.10.7/probes/../probes/lttng-tracepoint-event-impl.h:97:2: note: in expansion of macro 'LTTNG_TRACEPOINT_EVENT_MAP' LTTNG_TRACEPOINT_EVENT_MAP(name, name, \ ^~~~~~~~~~~~~~~~~~~~~~~~~~ /tmp/B.BDr8ki/BUILD/lttng-modules-2.10.7/probes/../probes/lttng-tracepoint-event-impl.h:100:4: note: in expansion of macro 'PARAMS' PARAMS(fields)) ^~~~~~ /tmp/B.BDr8ki/BUILD/lttng-modules-2.10.7/probes/../instrumentation/events/lttng-module/signal.h:85:1: note: in expansion of macro 'LTTNG_TRACEPOINT_EVENT' LTTNG_TRACEPOINT_EVENT(signal_deliver, ^~~~~~~~~~~~~~~~~~~~~~ /tmp/B.BDr8ki/BUILD/lttng-modules-2.10.7/probes/../instrumentation/events/lttng-module/signal.h:91:2: note: in expansion of macro 'TP_FIELDS' TP_FIELDS( ^~~~~~~~~ /tmp/B.BDr8ki/BUILD/lttng-modules-2.10.7/probes/../probes/lttng-tracepoint-event-impl.h:681:2: note: in expansion of macro '_ctf_integer_ext_fetched' _ctf_integer_ext_fetched(_type, _item, _src, _byte_order, _base, _nowrite) ^~~~~~~~~~~~~~~~~~~~~~~~ /tmp/B.BDr8ki/BUILD/lttng-modules-2.10.7/probes/../probes/lttng-tracepoint-event-impl.h:698:2: note: in expansion of macro '_ctf_integer_ext_isuser0' _ctf_integer_ext_isuser##_user(_type, _item, _user_src, _byte_order, _base, _nowrite) ^~~~~~~~~~~~~~~~~~~~~~~ /tmp/B.BDr8ki/BUILD/lttng-modules-2.10.7/probes/../probes/lttng-events-write.h:23:2: note: in expansion of macro '_ctf_integer_ext' _ctf_integer_ext(_type, _item, _src, __BYTE_ORDER, 10, 0, 0) ^~~~~~~~~~~~~~~~ /tmp/B.BDr8ki/BUILD/lttng-modules-2.10.7/probes/../instrumentation/events/lttng-module/signal.h:16:3: note: in expansion of macro 'ctf_integer' ctf_integer(int, errno, \ ^~~~~~~~~~~ /tmp/B.BDr8ki/BUILD/lttng-modules-2.10.7/probes/../instrumentation/events/lttng-module/signal.h:93:3: note: in expansion of macro 'LTTNG_FIELDS_SIGINFO' LTTNG_FIELDS_SIGINFO(info) ^~~~~~~~~~~~~~~~~~~~ /tmp/B.BDr8ki/BUILD/lttng-modules-2.10.7/probes/../instrumentation/events/lttng-module/signal.h:21:10: warning: comparison of distinct pointer types lacks a cast (info == SEND_SIG_NOINFO || info == SEND_SIG_FORCED) ? \ ^~ /tmp/B.BDr8ki/BUILD/lttng-modules-2.10.7/probes/../probes/lttng-tracepoint-event-impl.h:775:2: note: in definition of macro 'LTTNG_TRACEPOINT_EVENT_CLASS_CODE' _fields \ ^~~~~~~ /tmp/B.BDr8ki/BUILD/lttng-modules-2.10.7/probes/../probes/lttng-tracepoint-event-impl.h:117:3: note: in expansion of macro 'PARAMS' PARAMS(_fields), ) ^~~~~~ /tmp/B.BDr8ki/BUILD/lttng-modules-2.10.7/probes/../probes/lttng-tracepoint-event-impl.h:51:2: note: in expansion of macro 'LTTNG_TRACEPOINT_EVENT_CLASS' LTTNG_TRACEPOINT_EVENT_CLASS(map, \ ^~~~~~~~~~~~~~~~~~~~~~~~~~~~ /tmp/B.BDr8ki/BUILD/lttng-modules-2.10.7/probes/../probes/lttng-tracepoint-event-impl.h:54:9: note: in expansion of macro 'PARAMS' PARAMS(fields)) \ ^~~~~~ /tmp/B.BDr8ki/BUILD/lttng-modules-2.10.7/probes/../probes/lttng-tracepoint-event-impl.h:97:2: note: in expansion of macro 'LTTNG_TRACEPOINT_EVENT_MAP' LTTNG_TRACEPOINT_EVENT_MAP(name, name, \ ^~~~~~~~~~~~~~~~~~~~~~~~~~ /tmp/B.BDr8ki/BUILD/lttng-modules-2.10.7/probes/../probes/lttng-tracepoint-event-impl.h:100:4: note: in expansion of macro 'PARAMS' PARAMS(fields)) ^~~~~~ /tmp/B.BDr8ki/BUILD/lttng-modules-2.10.7/probes/../instrumentation/events/lttng-module/signal.h:85:1: note: in expansion of macro 'LTTNG_TRACEPOINT_EVENT' LTTNG_TRACEPOINT_EVENT(signal_deliver, ^~~~~~~~~~~~~~~~~~~~~~ /tmp/B.BDr8ki/BUILD/lttng-modules-2.10.7/probes/../instrumentation/events/lttng-module/signal.h:91:2: note: in expansion of macro 'TP_FIELDS' TP_FIELDS( ^~~~~~~~~ /tmp/B.BDr8ki/BUILD/lttng-modules-2.10.7/probes/../probes/lttng-tracepoint-event-impl.h:681:2: note: in expansion of macro '_ctf_integer_ext_fetched' _ctf_integer_ext_fetched(_type, _item, _src, _byte_order, _base, _nowrite) ^~~~~~~~~~~~~~~~~~~~~~~~ /tmp/B.BDr8ki/BUILD/lttng-modules-2.10.7/probes/../probes/lttng-tracepoint-event-impl.h:698:2: note: in expansion of macro '_ctf_integer_ext_isuser0' _ctf_integer_ext_isuser##_user(_type, _item, _user_src, _byte_order, _base, _nowrite) ^~~~~~~~~~~~~~~~~~~~~~~ /tmp/B.BDr8ki/BUILD/lttng-modules-2.10.7/probes/../probes/lttng-events-write.h:23:2: note: in expansion of macro '_ctf_integer_ext' _ctf_integer_ext(_type, _item, _src, __BYTE_ORDER, 10, 0, 0) ^~~~~~~~~~~~~~~~ /tmp/B.BDr8ki/BUILD/lttng-modules-2.10.7/probes/../instrumentation/events/lttng-module/signal.h:20:3: note: in expansion of macro 'ctf_integer' ctf_integer(int, code, \ ^~~~~~~~~~~ /tmp/B.BDr8ki/BUILD/lttng-modules-2.10.7/probes/../instrumentation/events/lttng-module/signal.h:93:3: note: in expansion of macro 'LTTNG_FIELDS_SIGINFO' LTTNG_FIELDS_SIGINFO(info) ^~~~~~~~~~~~~~~~~~~~ /tmp/B.BDr8ki/BUILD/lttng-modules-2.10.7/probes/../instrumentation/events/lttng-module/signal.h:23:11: warning: comparison of distinct pointer types lacks a cast ((info == SEND_SIG_PRIV) ? SI_KERNEL : info->si_code)) ^~ /tmp/B.BDr8ki/BUILD/lttng-modules-2.10.7/probes/../probes/lttng-tracepoint-event-impl.h:775:2: note: in definition of macro 'LTTNG_TRACEPOINT_EVENT_CLASS_CODE' _fields \ ^~~~~~~ /tmp/B.BDr8ki/BUILD/lttng-modules-2.10.7/probes/../probes/lttng-tracepoint-event-impl.h:117:3: note: in expansion of macro 'PARAMS' PARAMS(_fields), ) ^~~~~~ /tmp/B.BDr8ki/BUILD/lttng-modules-2.10.7/probes/../probes/lttng-tracepoint-event-impl.h:51:2: note: in expansion of macro 'LTTNG_TRACEPOINT_EVENT_CLASS' LTTNG_TRACEPOINT_EVENT_CLASS(map, \ ^~~~~~~~~~~~~~~~~~~~~~~~~~~~ /tmp/B.BDr8ki/BUILD/lttng-modules-2.10.7/probes/../probes/lttng-tracepoint-event-impl.h:54:9: note: in expansion of macro 'PARAMS' PARAMS(fields)) \ ^~~~~~ /tmp/B.BDr8ki/BUILD/lttng-modules-2.10.7/probes/../probes/lttng-tracepoint-event-impl.h:97:2: note: in expansion of macro 'LTTNG_TRACEPOINT_EVENT_MAP' LTTNG_TRACEPOINT_EVENT_MAP(name, name, \ ^~~~~~~~~~~~~~~~~~~~~~~~~~ /tmp/B.BDr8ki/BUILD/lttng-modules-2.10.7/probes/../probes/lttng-tracepoint-event-impl.h:100:4: note: in expansion of macro 'PARAMS' PARAMS(fields)) ^~~~~~ /tmp/B.BDr8ki/BUILD/lttng-modules-2.10.7/probes/../instrumentation/events/lttng-module/signal.h:85:1: note: in expansion of macro 'LTTNG_TRACEPOINT_EVENT' LTTNG_TRACEPOINT_EVENT(signal_deliver, ^~~~~~~~~~~~~~~~~~~~~~ /tmp/B.BDr8ki/BUILD/lttng-modules-2.10.7/probes/../instrumentation/events/lttng-module/signal.h:91:2: note: in expansion of macro 'TP_FIELDS' TP_FIELDS( ^~~~~~~~~ /tmp/B.BDr8ki/BUILD/lttng-modules-2.10.7/probes/../probes/lttng-tracepoint-event-impl.h:681:2: note: in expansion of macro '_ctf_integer_ext_fetched' _ctf_integer_ext_fetched(_type, _item, _src, _byte_order, _base, _nowrite) ^~~~~~~~~~~~~~~~~~~~~~~~ /tmp/B.BDr8ki/BUILD/lttng-modules-2.10.7/probes/../probes/lttng-tracepoint-event-impl.h:698:2: note: in expansion of macro '_ctf_integer_ext_isuser0' _ctf_integer_ext_isuser##_user(_type, _item, _user_src, _byte_order, _base, _nowrite) ^~~~~~~~~~~~~~~~~~~~~~~ /tmp/B.BDr8ki/BUILD/lttng-modules-2.10.7/probes/../probes/lttng-events-write.h:23:2: note: in expansion of macro '_ctf_integer_ext' _ctf_integer_ext(_type, _item, _src, __BYTE_ORDER, 10, 0, 0) ^~~~~~~~~~~~~~~~ /tmp/B.BDr8ki/BUILD/lttng-modules-2.10.7/probes/../instrumentation/events/lttng-module/signal.h:20:3: note: in expansion of macro 'ctf_integer' ctf_integer(int, code, \ ^~~~~~~~~~~ /tmp/B.BDr8ki/BUILD/lttng-modules-2.10.7/probes/../instrumentation/events/lttng-module/signal.h:93:3: note: in expansion of macro 'LTTNG_FIELDS_SIGINFO' LTTNG_FIELDS_SIGINFO(info) ^~~~~~~~~~~~~~~~~~~~ /tmp/B.BDr8ki/BUILD/lttng-modules-2.10.7/probes/../instrumentation/events/lttng-module/signal.h:21:10: warning: comparison of distinct pointer types lacks a cast (info == SEND_SIG_NOINFO || info == SEND_SIG_FORCED) ? \ ^~ /tmp/B.BDr8ki/BUILD/lttng-modules-2.10.7/probes/../probes/lttng-tracepoint-event-impl.h:775:2: note: in definition of macro 'LTTNG_TRACEPOINT_EVENT_CLASS_CODE' _fields \ ^~~~~~~ /tmp/B.BDr8ki/BUILD/lttng-modules-2.10.7/probes/../probes/lttng-tracepoint-event-impl.h:117:3: note: in expansion of macro 'PARAMS' PARAMS(_fields), ) ^~~~~~ /tmp/B.BDr8ki/BUILD/lttng-modules-2.10.7/probes/../probes/lttng-tracepoint-event-impl.h:51:2: note: in expansion of macro 'LTTNG_TRACEPOINT_EVENT_CLASS' LTTNG_TRACEPOINT_EVENT_CLASS(map, \ ^~~~~~~~~~~~~~~~~~~~~~~~~~~~ /tmp/B.BDr8ki/BUILD/lttng-modules-2.10.7/probes/../probes/lttng-tracepoint-event-impl.h:54:9: note: in expansion of macro 'PARAMS' PARAMS(fields)) \ ^~~~~~ /tmp/B.BDr8ki/BUILD/lttng-modules-2.10.7/probes/../probes/lttng-tracepoint-event-impl.h:97:2: note: in expansion of macro 'LTTNG_TRACEPOINT_EVENT_MAP' LTTNG_TRACEPOINT_EVENT_MAP(name, name, \ ^~~~~~~~~~~~~~~~~~~~~~~~~~ /tmp/B.BDr8ki/BUILD/lttng-modules-2.10.7/probes/../probes/lttng-tracepoint-event-impl.h:100:4: note: in expansion of macro 'PARAMS' PARAMS(fields)) ^~~~~~ /tmp/B.BDr8ki/BUILD/lttng-modules-2.10.7/probes/../instrumentation/events/lttng-module/signal.h:85:1: note: in expansion of macro 'LTTNG_TRACEPOINT_EVENT' LTTNG_TRACEPOINT_EVENT(signal_deliver, ^~~~~~~~~~~~~~~~~~~~~~ /tmp/B.BDr8ki/BUILD/lttng-modules-2.10.7/probes/../instrumentation/events/lttng-module/signal.h:91:2: note: in expansion of macro 'TP_FIELDS' TP_FIELDS( ^~~~~~~~~ /tmp/B.BDr8ki/BUILD/lttng-modules-2.10.7/probes/../probes/lttng-tracepoint-event-impl.h:681:2: note: in expansion of macro '_ctf_integer_ext_fetched' _ctf_integer_ext_fetched(_type, _item, _src, _byte_order, _base, _nowrite) ^~~~~~~~~~~~~~~~~~~~~~~~ /tmp/B.BDr8ki/BUILD/lttng-modules-2.10.7/probes/../probes/lttng-tracepoint-event-impl.h:698:2: note: in expansion of macro '_ctf_integer_ext_isuser0' _ctf_integer_ext_isuser##_user(_type, _item, _user_src, _byte_order, _base, _nowrite) ^~~~~~~~~~~~~~~~~~~~~~~ /tmp/B.BDr8ki/BUILD/lttng-modules-2.10.7/probes/../probes/lttng-events-write.h:23:2: note: in expansion of macro '_ctf_integer_ext' _ctf_integer_ext(_type, _item, _src, __BYTE_ORDER, 10, 0, 0) ^~~~~~~~~~~~~~~~ /tmp/B.BDr8ki/BUILD/lttng-modules-2.10.7/probes/../instrumentation/events/lttng-module/signal.h:20:3: note: in expansion of macro 'ctf_integer' ctf_integer(int, code, \ ^~~~~~~~~~~ /tmp/B.BDr8ki/BUILD/lttng-modules-2.10.7/probes/../instrumentation/events/lttng-module/signal.h:93:3: note: in expansion of macro 'LTTNG_FIELDS_SIGINFO' LTTNG_FIELDS_SIGINFO(info) ^~~~~~~~~~~~~~~~~~~~ /tmp/B.BDr8ki/BUILD/lttng-modules-2.10.7/probes/../instrumentation/events/lttng-module/signal.h:23:11: warning: comparison of distinct pointer types lacks a cast ((info == SEND_SIG_PRIV) ? SI_KERNEL : info->si_code)) ^~ /tmp/B.BDr8ki/BUILD/lttng-modules-2.10.7/probes/../probes/lttng-tracepoint-event-impl.h:775:2: note: in definition of macro 'LTTNG_TRACEPOINT_EVENT_CLASS_CODE' _fields \ ^~~~~~~ /tmp/B.BDr8ki/BUILD/lttng-modules-2.10.7/probes/../probes/lttng-tracepoint-event-impl.h:117:3: note: in expansion of macro 'PARAMS' PARAMS(_fields), ) ^~~~~~ /tmp/B.BDr8ki/BUILD/lttng-modules-2.10.7/probes/../probes/lttng-tracepoint-event-impl.h:51:2: note: in expansion of macro 'LTTNG_TRACEPOINT_EVENT_CLASS' LTTNG_TRACEPOINT_EVENT_CLASS(map, \ ^~~~~~~~~~~~~~~~~~~~~~~~~~~~ /tmp/B.BDr8ki/BUILD/lttng-modules-2.10.7/probes/../probes/lttng-tracepoint-event-impl.h:54:9: note: in expansion of macro 'PARAMS' PARAMS(fields)) \ ^~~~~~ /tmp/B.BDr8ki/BUILD/lttng-modules-2.10.7/probes/../probes/lttng-tracepoint-event-impl.h:97:2: note: in expansion of macro 'LTTNG_TRACEPOINT_EVENT_MAP' LTTNG_TRACEPOINT_EVENT_MAP(name, name, \ ^~~~~~~~~~~~~~~~~~~~~~~~~~ /tmp/B.BDr8ki/BUILD/lttng-modules-2.10.7/probes/../probes/lttng-tracepoint-event-impl.h:100:4: note: in expansion of macro 'PARAMS' PARAMS(fields)) ^~~~~~ /tmp/B.BDr8ki/BUILD/lttng-modules-2.10.7/probes/../instrumentation/events/lttng-module/signal.h:85:1: note: in expansion of macro 'LTTNG_TRACEPOINT_EVENT' LTTNG_TRACEPOINT_EVENT(signal_deliver, ^~~~~~~~~~~~~~~~~~~~~~ /tmp/B.BDr8ki/BUILD/lttng-modules-2.10.7/probes/../instrumentation/events/lttng-module/signal.h:91:2: note: in expansion of macro 'TP_FIELDS' TP_FIELDS( ^~~~~~~~~ /tmp/B.BDr8ki/BUILD/lttng-modules-2.10.7/probes/../probes/lttng-tracepoint-event-impl.h:681:2: note: in expansion of macro '_ctf_integer_ext_fetched' _ctf_integer_ext_fetched(_type, _item, _src, _byte_order, _base, _nowrite) ^~~~~~~~~~~~~~~~~~~~~~~~ /tmp/B.BDr8ki/BUILD/lttng-modules-2.10.7/probes/../probes/lttng-tracepoint-event-impl.h:698:2: note: in expansion of macro '_ctf_integer_ext_isuser0' _ctf_integer_ext_isuser##_user(_type, _item, _user_src, _byte_order, _base, _nowrite) ^~~~~~~~~~~~~~~~~~~~~~~ /tmp/B.BDr8ki/BUILD/lttng-modules-2.10.7/probes/../probes/lttng-events-write.h:23:2: note: in expansion of macro '_ctf_integer_ext' _ctf_integer_ext(_type, _item, _src, __BYTE_ORDER, 10, 0, 0) ^~~~~~~~~~~~~~~~ /tmp/B.BDr8ki/BUILD/lttng-modules-2.10.7/probes/../instrumentation/events/lttng-module/signal.h:20:3: note: in expansion of macro 'ctf_integer' ctf_integer(int, code, \ ^~~~~~~~~~~ /tmp/B.BDr8ki/BUILD/lttng-modules-2.10.7/probes/../instrumentation/events/lttng-module/signal.h:93:3: note: in expansion of macro 'LTTNG_FIELDS_SIGINFO' LTTNG_FIELDS_SIGINFO(info) ^~~~~~~~~~~~~~~~~~~~ /tmp/B.BDr8ki/BUILD/lttng-modules-2.10.7/probes/../instrumentation/events/lttng-module/signal.h:21:10: warning: comparison of distinct pointer types lacks a cast (info == SEND_SIG_NOINFO || info == SEND_SIG_FORCED) ? \ ^~ /tmp/B.BDr8ki/BUILD/lttng-modules-2.10.7/probes/../probes/lttng-tracepoint-event-impl.h:775:2: note: in definition of macro 'LTTNG_TRACEPOINT_EVENT_CLASS_CODE' _fields \ ^~~~~~~ /tmp/B.BDr8ki/BUILD/lttng-modules-2.10.7/probes/../probes/lttng-tracepoint-event-impl.h:117:3: note: in expansion of macro 'PARAMS' PARAMS(_fields), ) ^~~~~~ /tmp/B.BDr8ki/BUILD/lttng-modules-2.10.7/probes/../probes/lttng-tracepoint-event-impl.h:51:2: note: in expansion of macro 'LTTNG_TRACEPOINT_EVENT_CLASS' LTTNG_TRACEPOINT_EVENT_CLASS(map, \ ^~~~~~~~~~~~~~~~~~~~~~~~~~~~ /tmp/B.BDr8ki/BUILD/lttng-modules-2.10.7/probes/../probes/lttng-tracepoint-event-impl.h:54:9: note: in expansion of macro 'PARAMS' PARAMS(fields)) \ ^~~~~~ /tmp/B.BDr8ki/BUILD/lttng-modules-2.10.7/probes/../probes/lttng-tracepoint-event-impl.h:97:2: note: in expansion of macro 'LTTNG_TRACEPOINT_EVENT_MAP' LTTNG_TRACEPOINT_EVENT_MAP(name, name, \ ^~~~~~~~~~~~~~~~~~~~~~~~~~ /tmp/B.BDr8ki/BUILD/lttng-modules-2.10.7/probes/../probes/lttng-tracepoint-event-impl.h:100:4: note: in expansion of macro 'PARAMS' PARAMS(fields)) ^~~~~~ /tmp/B.BDr8ki/BUILD/lttng-modules-2.10.7/probes/../instrumentation/events/lttng-module/signal.h:85:1: note: in expansion of macro 'LTTNG_TRACEPOINT_EVENT' LTTNG_TRACEPOINT_EVENT(signal_deliver, ^~~~~~~~~~~~~~~~~~~~~~ /tmp/B.BDr8ki/BUILD/lttng-modules-2.10.7/probes/../instrumentation/events/lttng-module/signal.h:91:2: note: in expansion of macro 'TP_FIELDS' TP_FIELDS( ^~~~~~~~~ /tmp/B.BDr8ki/BUILD/lttng-modules-2.10.7/probes/../probes/lttng-tracepoint-event-impl.h:681:2: note: in expansion of macro '_ctf_integer_ext_fetched' _ctf_integer_ext_fetched(_type, _item, _src, _byte_order, _base, _nowrite) ^~~~~~~~~~~~~~~~~~~~~~~~ /tmp/B.BDr8ki/BUILD/lttng-modules-2.10.7/probes/../probes/lttng-tracepoint-event-impl.h:698:2: note: in expansion of macro '_ctf_integer_ext_isuser0' _ctf_integer_ext_isuser##_user(_type, _item, _user_src, _byte_order, _base, _nowrite) ^~~~~~~~~~~~~~~~~~~~~~~ /tmp/B.BDr8ki/BUILD/lttng-modules-2.10.7/probes/../probes/lttng-events-write.h:23:2: note: in expansion of macro '_ctf_integer_ext' _ctf_integer_ext(_type, _item, _src, __BYTE_ORDER, 10, 0, 0) ^~~~~~~~~~~~~~~~ /tmp/B.BDr8ki/BUILD/lttng-modules-2.10.7/probes/../instrumentation/events/lttng-module/signal.h:20:3: note: in expansion of macro 'ctf_integer' ctf_integer(int, code, \ ^~~~~~~~~~~ /tmp/B.BDr8ki/BUILD/lttng-modules-2.10.7/probes/../instrumentation/events/lttng-module/signal.h:93:3: note: in expansion of macro 'LTTNG_FIELDS_SIGINFO' LTTNG_FIELDS_SIGINFO(info) ^~~~~~~~~~~~~~~~~~~~ /tmp/B.BDr8ki/BUILD/lttng-modules-2.10.7/probes/../instrumentation/events/lttng-module/signal.h:23:11: warning: comparison of distinct pointer types lacks a cast ((info == SEND_SIG_PRIV) ? SI_KERNEL : info->si_code)) ^~ /tmp/B.BDr8ki/BUILD/lttng-modules-2.10.7/probes/../probes/lttng-tracepoint-event-impl.h:775:2: note: in definition of macro 'LTTNG_TRACEPOINT_EVENT_CLASS_CODE' _fields \ ^~~~~~~ /tmp/B.BDr8ki/BUILD/lttng-modules-2.10.7/probes/../probes/lttng-tracepoint-event-impl.h:117:3: note: in expansion of macro 'PARAMS' PARAMS(_fields), ) ^~~~~~ /tmp/B.BDr8ki/BUILD/lttng-modules-2.10.7/probes/../probes/lttng-tracepoint-event-impl.h:51:2: note: in expansion of macro 'LTTNG_TRACEPOINT_EVENT_CLASS' LTTNG_TRACEPOINT_EVENT_CLASS(map, \ ^~~~~~~~~~~~~~~~~~~~~~~~~~~~ /tmp/B.BDr8ki/BUILD/lttng-modules-2.10.7/probes/../probes/lttng-tracepoint-event-impl.h:54:9: note: in expansion of macro 'PARAMS' PARAMS(fields)) \ ^~~~~~ /tmp/B.BDr8ki/BUILD/lttng-modules-2.10.7/probes/../probes/lttng-tracepoint-event-impl.h:97:2: note: in expansion of macro 'LTTNG_TRACEPOINT_EVENT_MAP' LTTNG_TRACEPOINT_EVENT_MAP(name, name, \ ^~~~~~~~~~~~~~~~~~~~~~~~~~ /tmp/B.BDr8ki/BUILD/lttng-modules-2.10.7/probes/../probes/lttng-tracepoint-event-impl.h:100:4: note: in expansion of macro 'PARAMS' PARAMS(fields)) ^~~~~~ /tmp/B.BDr8ki/BUILD/lttng-modules-2.10.7/probes/../instrumentation/events/lttng-module/signal.h:85:1: note: in expansion of macro 'LTTNG_TRACEPOINT_EVENT' LTTNG_TRACEPOINT_EVENT(signal_deliver, ^~~~~~~~~~~~~~~~~~~~~~ /tmp/B.BDr8ki/BUILD/lttng-modules-2.10.7/probes/../instrumentation/events/lttng-module/signal.h:91:2: note: in expansion of macro 'TP_FIELDS' TP_FIELDS( ^~~~~~~~~ /tmp/B.BDr8ki/BUILD/lttng-modules-2.10.7/probes/../probes/lttng-tracepoint-event-impl.h:681:2: note: in expansion of macro '_ctf_integer_ext_fetched' _ctf_integer_ext_fetched(_type, _item, _src, _byte_order, _base, _nowrite) ^~~~~~~~~~~~~~~~~~~~~~~~ /tmp/B.BDr8ki/BUILD/lttng-modules-2.10.7/probes/../probes/lttng-tracepoint-event-impl.h:698:2: note: in expansion of macro '_ctf_integer_ext_isuser0' _ctf_integer_ext_isuser##_user(_type, _item, _user_src, _byte_order, _base, _nowrite) ^~~~~~~~~~~~~~~~~~~~~~~ /tmp/B.BDr8ki/BUILD/lttng-modules-2.10.7/probes/../probes/lttng-events-write.h:23:2: note: in expansion of macro '_ctf_integer_ext' _ctf_integer_ext(_type, _item, _src, __BYTE_ORDER, 10, 0, 0) ^~~~~~~~~~~~~~~~ /tmp/B.BDr8ki/BUILD/lttng-modules-2.10.7/probes/../instrumentation/events/lttng-module/signal.h:20:3: note: in expansion of macro 'ctf_integer' ctf_integer(int, code, \ ^~~~~~~~~~~ /tmp/B.BDr8ki/BUILD/lttng-modules-2.10.7/probes/../instrumentation/events/lttng-module/signal.h:93:3: note: in expansion of macro 'LTTNG_FIELDS_SIGINFO' LTTNG_FIELDS_SIGINFO(info) ^~~~~~~~~~~~~~~~~~~~ /tmp/B.BDr8ki/BUILD/lttng-modules-2.10.7/probes/../instrumentation/events/lttng-module/signal.h:21:10: warning: comparison of distinct pointer types lacks a cast (info == SEND_SIG_NOINFO || info == SEND_SIG_FORCED) ? \ ^~ /tmp/B.BDr8ki/BUILD/lttng-modules-2.10.7/probes/../probes/lttng-tracepoint-event-impl.h:775:2: note: in definition of macro 'LTTNG_TRACEPOINT_EVENT_CLASS_CODE' _fields \ ^~~~~~~ /tmp/B.BDr8ki/BUILD/lttng-modules-2.10.7/probes/../probes/lttng-tracepoint-event-impl.h:117:3: note: in expansion of macro 'PARAMS' PARAMS(_fields), ) ^~~~~~ /tmp/B.BDr8ki/BUILD/lttng-modules-2.10.7/probes/../probes/lttng-tracepoint-event-impl.h:51:2: note: in expansion of macro 'LTTNG_TRACEPOINT_EVENT_CLASS' LTTNG_TRACEPOINT_EVENT_CLASS(map, \ ^~~~~~~~~~~~~~~~~~~~~~~~~~~~ /tmp/B.BDr8ki/BUILD/lttng-modules-2.10.7/probes/../probes/lttng-tracepoint-event-impl.h:54:9: note: in expansion of macro 'PARAMS' PARAMS(fields)) \ ^~~~~~ /tmp/B.BDr8ki/BUILD/lttng-modules-2.10.7/probes/../probes/lttng-tracepoint-event-impl.h:97:2: note: in expansion of macro 'LTTNG_TRACEPOINT_EVENT_MAP' LTTNG_TRACEPOINT_EVENT_MAP(name, name, \ ^~~~~~~~~~~~~~~~~~~~~~~~~~ /tmp/B.BDr8ki/BUILD/lttng-modules-2.10.7/probes/../probes/lttng-tracepoint-event-impl.h:100:4: note: in expansion of macro 'PARAMS' PARAMS(fields)) ^~~~~~ /tmp/B.BDr8ki/BUILD/lttng-modules-2.10.7/probes/../instrumentation/events/lttng-module/signal.h:85:1: note: in expansion of macro 'LTTNG_TRACEPOINT_EVENT' LTTNG_TRACEPOINT_EVENT(signal_deliver, ^~~~~~~~~~~~~~~~~~~~~~ /tmp/B.BDr8ki/BUILD/lttng-modules-2.10.7/probes/../instrumentation/events/lttng-module/signal.h:91:2: note: in expansion of macro 'TP_FIELDS' TP_FIELDS( ^~~~~~~~~ /tmp/B.BDr8ki/BUILD/lttng-modules-2.10.7/probes/../probes/lttng-tracepoint-event-impl.h:681:2: note: in expansion of macro '_ctf_integer_ext_fetched' _ctf_integer_ext_fetched(_type, _item, _src, _byte_order, _base, _nowrite) ^~~~~~~~~~~~~~~~~~~~~~~~ /tmp/B.BDr8ki/BUILD/lttng-modules-2.10.7/probes/../probes/lttng-tracepoint-event-impl.h:698:2: note: in expansion of macro '_ctf_integer_ext_isuser0' _ctf_integer_ext_isuser##_user(_type, _item, _user_src, _byte_order, _base, _nowrite) ^~~~~~~~~~~~~~~~~~~~~~~ /tmp/B.BDr8ki/BUILD/lttng-modules-2.10.7/probes/../probes/lttng-events-write.h:23:2: note: in expansion of macro '_ctf_integer_ext' _ctf_integer_ext(_type, _item, _src, __BYTE_ORDER, 10, 0, 0) ^~~~~~~~~~~~~~~~ /tmp/B.BDr8ki/BUILD/lttng-modules-2.10.7/probes/../instrumentation/events/lttng-module/signal.h:20:3: note: in expansion of macro 'ctf_integer' ctf_integer(int, code, \ ^~~~~~~~~~~ /tmp/B.BDr8ki/BUILD/lttng-modules-2.10.7/probes/../instrumentation/events/lttng-module/signal.h:93:3: note: in expansion of macro 'LTTNG_FIELDS_SIGINFO' LTTNG_FIELDS_SIGINFO(info) ^~~~~~~~~~~~~~~~~~~~ /tmp/B.BDr8ki/BUILD/lttng-modules-2.10.7/probes/../instrumentation/events/lttng-module/signal.h:23:11: warning: comparison of distinct pointer types lacks a cast ((info == SEND_SIG_PRIV) ? SI_KERNEL : info->si_code)) ^~ /tmp/B.BDr8ki/BUILD/lttng-modules-2.10.7/probes/../probes/lttng-tracepoint-event-impl.h:775:2: note: in definition of macro 'LTTNG_TRACEPOINT_EVENT_CLASS_CODE' _fields \ ^~~~~~~ /tmp/B.BDr8ki/BUILD/lttng-modules-2.10.7/probes/../probes/lttng-tracepoint-event-impl.h:117:3: note: in expansion of macro 'PARAMS' PARAMS(_fields), ) ^~~~~~ /tmp/B.BDr8ki/BUILD/lttng-modules-2.10.7/probes/../probes/lttng-tracepoint-event-impl.h:51:2: note: in expansion of macro 'LTTNG_TRACEPOINT_EVENT_CLASS' LTTNG_TRACEPOINT_EVENT_CLASS(map, \ ^~~~~~~~~~~~~~~~~~~~~~~~~~~~ /tmp/B.BDr8ki/BUILD/lttng-modules-2.10.7/probes/../probes/lttng-tracepoint-event-impl.h:54:9: note: in expansion of macro 'PARAMS' PARAMS(fields)) \ ^~~~~~ /tmp/B.BDr8ki/BUILD/lttng-modules-2.10.7/probes/../probes/lttng-tracepoint-event-impl.h:97:2: note: in expansion of macro 'LTTNG_TRACEPOINT_EVENT_MAP' LTTNG_TRACEPOINT_EVENT_MAP(name, name, \ ^~~~~~~~~~~~~~~~~~~~~~~~~~ /tmp/B.BDr8ki/BUILD/lttng-modules-2.10.7/probes/../probes/lttng-tracepoint-event-impl.h:100:4: note: in expansion of macro 'PARAMS' PARAMS(fields)) ^~~~~~ /tmp/B.BDr8ki/BUILD/lttng-modules-2.10.7/probes/../instrumentation/events/lttng-module/signal.h:85:1: note: in expansion of macro 'LTTNG_TRACEPOINT_EVENT' LTTNG_TRACEPOINT_EVENT(signal_deliver, ^~~~~~~~~~~~~~~~~~~~~~ /tmp/B.BDr8ki/BUILD/lttng-modules-2.10.7/probes/../instrumentation/events/lttng-module/signal.h:91:2: note: in expansion of macro 'TP_FIELDS' TP_FIELDS( ^~~~~~~~~ /tmp/B.BDr8ki/BUILD/lttng-modules-2.10.7/probes/../probes/lttng-tracepoint-event-impl.h:681:2: note: in expansion of macro '_ctf_integer_ext_fetched' _ctf_integer_ext_fetched(_type, _item, _src, _byte_order, _base, _nowrite) ^~~~~~~~~~~~~~~~~~~~~~~~ /tmp/B.BDr8ki/BUILD/lttng-modules-2.10.7/probes/../probes/lttng-tracepoint-event-impl.h:698:2: note: in expansion of macro '_ctf_integer_ext_isuser0' _ctf_integer_ext_isuser##_user(_type, _item, _user_src, _byte_order, _base, _nowrite) ^~~~~~~~~~~~~~~~~~~~~~~ /tmp/B.BDr8ki/BUILD/lttng-modules-2.10.7/probes/../probes/lttng-events-write.h:23:2: note: in expansion of macro '_ctf_integer_ext' _ctf_integer_ext(_type, _item, _src, __BYTE_ORDER, 10, 0, 0) ^~~~~~~~~~~~~~~~ /tmp/B.BDr8ki/BUILD/lttng-modules-2.10.7/probes/../instrumentation/events/lttng-module/signal.h:20:3: note: in expansion of macro 'ctf_integer' ctf_integer(int, code, \ ^~~~~~~~~~~ /tmp/B.BDr8ki/BUILD/lttng-modules-2.10.7/probes/../instrumentation/events/lttng-module/signal.h:93:3: note: in expansion of macro 'LTTNG_FIELDS_SIGINFO' LTTNG_FIELDS_SIGINFO(info) ^~~~~~~~~~~~~~~~~~~~ /tmp/B.BDr8ki/BUILD/lttng-modules-2.10.7/probes/../instrumentation/events/lttng-module/signal.h:21:10: warning: comparison of distinct pointer types lacks a cast (info == SEND_SIG_NOINFO || info == SEND_SIG_FORCED) ? \ ^~ /tmp/B.BDr8ki/BUILD/lttng-modules-2.10.7/probes/../probes/lttng-tracepoint-event-impl.h:775:2: note: in definition of macro 'LTTNG_TRACEPOINT_EVENT_CLASS_CODE' _fields \ ^~~~~~~ /tmp/B.BDr8ki/BUILD/lttng-modules-2.10.7/probes/../probes/lttng-tracepoint-event-impl.h:117:3: note: in expansion of macro 'PARAMS' PARAMS(_fields), ) ^~~~~~ /tmp/B.BDr8ki/BUILD/lttng-modules-2.10.7/probes/../probes/lttng-tracepoint-event-impl.h:51:2: note: in expansion of macro 'LTTNG_TRACEPOINT_EVENT_CLASS' LTTNG_TRACEPOINT_EVENT_CLASS(map, \ ^~~~~~~~~~~~~~~~~~~~~~~~~~~~ /tmp/B.BDr8ki/BUILD/lttng-modules-2.10.7/probes/../probes/lttng-tracepoint-event-impl.h:54:9: note: in expansion of macro 'PARAMS' PARAMS(fields)) \ ^~~~~~ /tmp/B.BDr8ki/BUILD/lttng-modules-2.10.7/probes/../probes/lttng-tracepoint-event-impl.h:97:2: note: in expansion of macro 'LTTNG_TRACEPOINT_EVENT_MAP' LTTNG_TRACEPOINT_EVENT_MAP(name, name, \ ^~~~~~~~~~~~~~~~~~~~~~~~~~ /tmp/B.BDr8ki/BUILD/lttng-modules-2.10.7/probes/../probes/lttng-tracepoint-event-impl.h:100:4: note: in expansion of macro 'PARAMS' PARAMS(fields)) ^~~~~~ /tmp/B.BDr8ki/BUILD/lttng-modules-2.10.7/probes/../instrumentation/events/lttng-module/signal.h:85:1: note: in expansion of macro 'LTTNG_TRACEPOINT_EVENT' LTTNG_TRACEPOINT_EVENT(signal_deliver, ^~~~~~~~~~~~~~~~~~~~~~ /tmp/B.BDr8ki/BUILD/lttng-modules-2.10.7/probes/../instrumentation/events/lttng-module/signal.h:91:2: note: in expansion of macro 'TP_FIELDS' TP_FIELDS( ^~~~~~~~~ /tmp/B.BDr8ki/BUILD/lttng-modules-2.10.7/probes/../probes/lttng-tracepoint-event-impl.h:681:2: note: in expansion of macro '_ctf_integer_ext_fetched' _ctf_integer_ext_fetched(_type, _item, _src, _byte_order, _base, _nowrite) ^~~~~~~~~~~~~~~~~~~~~~~~ /tmp/B.BDr8ki/BUILD/lttng-modules-2.10.7/probes/../probes/lttng-tracepoint-event-impl.h:698:2: note: in expansion of macro '_ctf_integer_ext_isuser0' _ctf_integer_ext_isuser##_user(_type, _item, _user_src, _byte_order, _base, _nowrite) ^~~~~~~~~~~~~~~~~~~~~~~ /tmp/B.BDr8ki/BUILD/lttng-modules-2.10.7/probes/../probes/lttng-events-write.h:23:2: note: in expansion of macro '_ctf_integer_ext' _ctf_integer_ext(_type, _item, _src, __BYTE_ORDER, 10, 0, 0) ^~~~~~~~~~~~~~~~ /tmp/B.BDr8ki/BUILD/lttng-modules-2.10.7/probes/../instrumentation/events/lttng-module/signal.h:20:3: note: in expansion of macro 'ctf_integer' ctf_integer(int, code, \ ^~~~~~~~~~~ /tmp/B.BDr8ki/BUILD/lttng-modules-2.10.7/probes/../instrumentation/events/lttng-module/signal.h:93:3: note: in expansion of macro 'LTTNG_FIELDS_SIGINFO' LTTNG_FIELDS_SIGINFO(info) ^~~~~~~~~~~~~~~~~~~~ /tmp/B.BDr8ki/BUILD/lttng-modules-2.10.7/probes/../instrumentation/events/lttng-module/signal.h:23:11: warning: comparison of distinct pointer types lacks a cast ((info == SEND_SIG_PRIV) ? SI_KERNEL : info->si_code)) ^~ /tmp/B.BDr8ki/BUILD/lttng-modules-2.10.7/probes/../probes/lttng-tracepoint-event-impl.h:775:2: note: in definition of macro 'LTTNG_TRACEPOINT_EVENT_CLASS_CODE' _fields \ ^~~~~~~ /tmp/B.BDr8ki/BUILD/lttng-modules-2.10.7/probes/../probes/lttng-tracepoint-event-impl.h:117:3: note: in expansion of macro 'PARAMS' PARAMS(_fields), ) ^~~~~~ /tmp/B.BDr8ki/BUILD/lttng-modules-2.10.7/probes/../probes/lttng-tracepoint-event-impl.h:51:2: note: in expansion of macro 'LTTNG_TRACEPOINT_EVENT_CLASS' LTTNG_TRACEPOINT_EVENT_CLASS(map, \ ^~~~~~~~~~~~~~~~~~~~~~~~~~~~ /tmp/B.BDr8ki/BUILD/lttng-modules-2.10.7/probes/../probes/lttng-tracepoint-event-impl.h:54:9: note: in expansion of macro 'PARAMS' PARAMS(fields)) \ ^~~~~~ /tmp/B.BDr8ki/BUILD/lttng-modules-2.10.7/probes/../probes/lttng-tracepoint-event-impl.h:97:2: note: in expansion of macro 'LTTNG_TRACEPOINT_EVENT_MAP' LTTNG_TRACEPOINT_EVENT_MAP(name, name, \ ^~~~~~~~~~~~~~~~~~~~~~~~~~ /tmp/B.BDr8ki/BUILD/lttng-modules-2.10.7/probes/../probes/lttng-tracepoint-event-impl.h:100:4: note: in expansion of macro 'PARAMS' PARAMS(fields)) ^~~~~~ /tmp/B.BDr8ki/BUILD/lttng-modules-2.10.7/probes/../instrumentation/events/lttng-module/signal.h:85:1: note: in expansion of macro 'LTTNG_TRACEPOINT_EVENT' LTTNG_TRACEPOINT_EVENT(signal_deliver, ^~~~~~~~~~~~~~~~~~~~~~ /tmp/B.BDr8ki/BUILD/lttng-modules-2.10.7/probes/../instrumentation/events/lttng-module/signal.h:91:2: note: in expansion of macro 'TP_FIELDS' TP_FIELDS( ^~~~~~~~~ /tmp/B.BDr8ki/BUILD/lttng-modules-2.10.7/probes/../probes/lttng-tracepoint-event-impl.h:681:2: note: in expansion of macro '_ctf_integer_ext_fetched' _ctf_integer_ext_fetched(_type, _item, _src, _byte_order, _base, _nowrite) ^~~~~~~~~~~~~~~~~~~~~~~~ /tmp/B.BDr8ki/BUILD/lttng-modules-2.10.7/probes/../probes/lttng-tracepoint-event-impl.h:698:2: note: in expansion of macro '_ctf_integer_ext_isuser0' _ctf_integer_ext_isuser##_user(_type, _item, _user_src, _byte_order, _base, _nowrite) ^~~~~~~~~~~~~~~~~~~~~~~ /tmp/B.BDr8ki/BUILD/lttng-modules-2.10.7/probes/../probes/lttng-events-write.h:23:2: note: in expansion of macro '_ctf_integer_ext' _ctf_integer_ext(_type, _item, _src, __BYTE_ORDER, 10, 0, 0) ^~~~~~~~~~~~~~~~ /tmp/B.BDr8ki/BUILD/lttng-modules-2.10.7/probes/../instrumentation/events/lttng-module/signal.h:20:3: note: in expansion of macro 'ctf_integer' ctf_integer(int, code, \ ^~~~~~~~~~~ /tmp/B.BDr8ki/BUILD/lttng-modules-2.10.7/probes/../instrumentation/events/lttng-module/signal.h:93:3: note: in expansion of macro 'LTTNG_FIELDS_SIGINFO' LTTNG_FIELDS_SIGINFO(info) ^~~~~~~~~~~~~~~~~~~~ /tmp/B.BDr8ki/BUILD/lttng-modules-2.10.7/probes/../instrumentation/events/lttng-module/signal.h:21:10: warning: comparison of distinct pointer types lacks a cast (info == SEND_SIG_NOINFO || info == SEND_SIG_FORCED) ? \ ^~ /tmp/B.BDr8ki/BUILD/lttng-modules-2.10.7/probes/../probes/lttng-tracepoint-event-impl.h:775:2: note: in definition of macro 'LTTNG_TRACEPOINT_EVENT_CLASS_CODE' _fields \ ^~~~~~~ /tmp/B.BDr8ki/BUILD/lttng-modules-2.10.7/probes/../probes/lttng-tracepoint-event-impl.h:117:3: note: in expansion of macro 'PARAMS' PARAMS(_fields), ) ^~~~~~ /tmp/B.BDr8ki/BUILD/lttng-modules-2.10.7/probes/../probes/lttng-tracepoint-event-impl.h:51:2: note: in expansion of macro 'LTTNG_TRACEPOINT_EVENT_CLASS' LTTNG_TRACEPOINT_EVENT_CLASS(map, \ ^~~~~~~~~~~~~~~~~~~~~~~~~~~~ /tmp/B.BDr8ki/BUILD/lttng-modules-2.10.7/probes/../probes/lttng-tracepoint-event-impl.h:54:9: note: in expansion of macro 'PARAMS' PARAMS(fields)) \ ^~~~~~ /tmp/B.BDr8ki/BUILD/lttng-modules-2.10.7/probes/../probes/lttng-tracepoint-event-impl.h:97:2: note: in expansion of macro 'LTTNG_TRACEPOINT_EVENT_MAP' LTTNG_TRACEPOINT_EVENT_MAP(name, name, \ ^~~~~~~~~~~~~~~~~~~~~~~~~~ /tmp/B.BDr8ki/BUILD/lttng-modules-2.10.7/probes/../probes/lttng-tracepoint-event-impl.h:100:4: note: in expansion of macro 'PARAMS' PARAMS(fields)) ^~~~~~ /tmp/B.BDr8ki/BUILD/lttng-modules-2.10.7/probes/../instrumentation/events/lttng-module/signal.h:85:1: note: in expansion of macro 'LTTNG_TRACEPOINT_EVENT' LTTNG_TRACEPOINT_EVENT(signal_deliver, ^~~~~~~~~~~~~~~~~~~~~~ /tmp/B.BDr8ki/BUILD/lttng-modules-2.10.7/probes/../instrumentation/events/lttng-module/signal.h:91:2: note: in expansion of macro 'TP_FIELDS' TP_FIELDS( ^~~~~~~~~ /tmp/B.BDr8ki/BUILD/lttng-modules-2.10.7/probes/../probes/lttng-tracepoint-event-impl.h:681:2: note: in expansion of macro '_ctf_integer_ext_fetched' _ctf_integer_ext_fetched(_type, _item, _src, _byte_order, _base, _nowrite) ^~~~~~~~~~~~~~~~~~~~~~~~ /tmp/B.BDr8ki/BUILD/lttng-modules-2.10.7/probes/../probes/lttng-tracepoint-event-impl.h:698:2: note: in expansion of macro '_ctf_integer_ext_isuser0' _ctf_integer_ext_isuser##_user(_type, _item, _user_src, _byte_order, _base, _nowrite) ^~~~~~~~~~~~~~~~~~~~~~~ /tmp/B.BDr8ki/BUILD/lttng-modules-2.10.7/probes/../probes/lttng-events-write.h:23:2: note: in expansion of macro '_ctf_integer_ext' _ctf_integer_ext(_type, _item, _src, __BYTE_ORDER, 10, 0, 0) ^~~~~~~~~~~~~~~~ /tmp/B.BDr8ki/BUILD/lttng-modules-2.10.7/probes/../instrumentation/events/lttng-module/signal.h:20:3: note: in expansion of macro 'ctf_integer' ctf_integer(int, code, \ ^~~~~~~~~~~ /tmp/B.BDr8ki/BUILD/lttng-modules-2.10.7/probes/../instrumentation/events/lttng-module/signal.h:93:3: note: in expansion of macro 'LTTNG_FIELDS_SIGINFO' LTTNG_FIELDS_SIGINFO(info) ^~~~~~~~~~~~~~~~~~~~ /tmp/B.BDr8ki/BUILD/lttng-modules-2.10.7/probes/../instrumentation/events/lttng-module/signal.h:23:11: warning: comparison of distinct pointer types lacks a cast ((info == SEND_SIG_PRIV) ? SI_KERNEL : info->si_code)) ^~ /tmp/B.BDr8ki/BUILD/lttng-modules-2.10.7/probes/../probes/lttng-tracepoint-event-impl.h:775:2: note: in definition of macro 'LTTNG_TRACEPOINT_EVENT_CLASS_CODE' _fields \ ^~~~~~~ /tmp/B.BDr8ki/BUILD/lttng-modules-2.10.7/probes/../probes/lttng-tracepoint-event-impl.h:117:3: note: in expansion of macro 'PARAMS' PARAMS(_fields), ) ^~~~~~ /tmp/B.BDr8ki/BUILD/lttng-modules-2.10.7/probes/../probes/lttng-tracepoint-event-impl.h:51:2: note: in expansion of macro 'LTTNG_TRACEPOINT_EVENT_CLASS' LTTNG_TRACEPOINT_EVENT_CLASS(map, \ ^~~~~~~~~~~~~~~~~~~~~~~~~~~~ /tmp/B.BDr8ki/BUILD/lttng-modules-2.10.7/probes/../probes/lttng-tracepoint-event-impl.h:54:9: note: in expansion of macro 'PARAMS' PARAMS(fields)) \ ^~~~~~ /tmp/B.BDr8ki/BUILD/lttng-modules-2.10.7/probes/../probes/lttng-tracepoint-event-impl.h:97:2: note: in expansion of macro 'LTTNG_TRACEPOINT_EVENT_MAP' LTTNG_TRACEPOINT_EVENT_MAP(name, name, \ ^~~~~~~~~~~~~~~~~~~~~~~~~~ /tmp/B.BDr8ki/BUILD/lttng-modules-2.10.7/probes/../probes/lttng-tracepoint-event-impl.h:100:4: note: in expansion of macro 'PARAMS' PARAMS(fields)) ^~~~~~ /tmp/B.BDr8ki/BUILD/lttng-modules-2.10.7/probes/../instrumentation/events/lttng-module/signal.h:85:1: note: in expansion of macro 'LTTNG_TRACEPOINT_EVENT' LTTNG_TRACEPOINT_EVENT(signal_deliver, ^~~~~~~~~~~~~~~~~~~~~~ /tmp/B.BDr8ki/BUILD/lttng-modules-2.10.7/probes/../instrumentation/events/lttng-module/signal.h:91:2: note: in expansion of macro 'TP_FIELDS' TP_FIELDS( ^~~~~~~~~ /tmp/B.BDr8ki/BUILD/lttng-modules-2.10.7/probes/../probes/lttng-tracepoint-event-impl.h:681:2: note: in expansion of macro '_ctf_integer_ext_fetched' _ctf_integer_ext_fetched(_type, _item, _src, _byte_order, _base, _nowrite) ^~~~~~~~~~~~~~~~~~~~~~~~ /tmp/B.BDr8ki/BUILD/lttng-modules-2.10.7/probes/../probes/lttng-tracepoint-event-impl.h:698:2: note: in expansion of macro '_ctf_integer_ext_isuser0' _ctf_integer_ext_isuser##_user(_type, _item, _user_src, _byte_order, _base, _nowrite) ^~~~~~~~~~~~~~~~~~~~~~~ /tmp/B.BDr8ki/BUILD/lttng-modules-2.10.7/probes/../probes/lttng-events-write.h:23:2: note: in expansion of macro '_ctf_integer_ext' _ctf_integer_ext(_type, _item, _src, __BYTE_ORDER, 10, 0, 0) ^~~~~~~~~~~~~~~~ /tmp/B.BDr8ki/BUILD/lttng-modules-2.10.7/probes/../instrumentation/events/lttng-module/signal.h:20:3: note: in expansion of macro 'ctf_integer' ctf_integer(int, code, \ ^~~~~~~~~~~ /tmp/B.BDr8ki/BUILD/lttng-modules-2.10.7/probes/../instrumentation/events/lttng-module/signal.h:93:3: note: in expansion of macro 'LTTNG_FIELDS_SIGINFO' LTTNG_FIELDS_SIGINFO(info) ^~~~~~~~~~~~~~~~~~~~ /tmp/B.BDr8ki/BUILD/lttng-modules-2.10.7/probes/../instrumentation/events/lttng-module/signal.h:21:10: warning: comparison of distinct pointer types lacks a cast (info == SEND_SIG_NOINFO || info == SEND_SIG_FORCED) ? \ ^~ /tmp/B.BDr8ki/BUILD/lttng-modules-2.10.7/probes/../probes/lttng-tracepoint-event-impl.h:775:2: note: in definition of macro 'LTTNG_TRACEPOINT_EVENT_CLASS_CODE' _fields \ ^~~~~~~ /tmp/B.BDr8ki/BUILD/lttng-modules-2.10.7/probes/../probes/lttng-tracepoint-event-impl.h:117:3: note: in expansion of macro 'PARAMS' PARAMS(_fields), ) ^~~~~~ /tmp/B.BDr8ki/BUILD/lttng-modules-2.10.7/probes/../probes/lttng-tracepoint-event-impl.h:51:2: note: in expansion of macro 'LTTNG_TRACEPOINT_EVENT_CLASS' LTTNG_TRACEPOINT_EVENT_CLASS(map, \ ^~~~~~~~~~~~~~~~~~~~~~~~~~~~ /tmp/B.BDr8ki/BUILD/lttng-modules-2.10.7/probes/../probes/lttng-tracepoint-event-impl.h:54:9: note: in expansion of macro 'PARAMS' PARAMS(fields)) \ ^~~~~~ /tmp/B.BDr8ki/BUILD/lttng-modules-2.10.7/probes/../probes/lttng-tracepoint-event-impl.h:97:2: note: in expansion of macro 'LTTNG_TRACEPOINT_EVENT_MAP' LTTNG_TRACEPOINT_EVENT_MAP(name, name, \ ^~~~~~~~~~~~~~~~~~~~~~~~~~ /tmp/B.BDr8ki/BUILD/lttng-modules-2.10.7/probes/../probes/lttng-tracepoint-event-impl.h:100:4: note: in expansion of macro 'PARAMS' PARAMS(fields)) ^~~~~~ /tmp/B.BDr8ki/BUILD/lttng-modules-2.10.7/probes/../instrumentation/events/lttng-module/signal.h:85:1: note: in expansion of macro 'LTTNG_TRACEPOINT_EVENT' LTTNG_TRACEPOINT_EVENT(signal_deliver, ^~~~~~~~~~~~~~~~~~~~~~ /tmp/B.BDr8ki/BUILD/lttng-modules-2.10.7/probes/../instrumentation/events/lttng-module/signal.h:91:2: note: in expansion of macro 'TP_FIELDS' TP_FIELDS( ^~~~~~~~~ /tmp/B.BDr8ki/BUILD/lttng-modules-2.10.7/probes/../probes/lttng-tracepoint-event-impl.h:681:2: note: in expansion of macro '_ctf_integer_ext_fetched' _ctf_integer_ext_fetched(_type, _item, _src, _byte_order, _base, _nowrite) ^~~~~~~~~~~~~~~~~~~~~~~~ /tmp/B.BDr8ki/BUILD/lttng-modules-2.10.7/probes/../probes/lttng-tracepoint-event-impl.h:698:2: note: in expansion of macro '_ctf_integer_ext_isuser0' _ctf_integer_ext_isuser##_user(_type, _item, _user_src, _byte_order, _base, _nowrite) ^~~~~~~~~~~~~~~~~~~~~~~ /tmp/B.BDr8ki/BUILD/lttng-modules-2.10.7/probes/../probes/lttng-events-write.h:23:2: note: in expansion of macro '_ctf_integer_ext' _ctf_integer_ext(_type, _item, _src, __BYTE_ORDER, 10, 0, 0) ^~~~~~~~~~~~~~~~ /tmp/B.BDr8ki/BUILD/lttng-modules-2.10.7/probes/../instrumentation/events/lttng-module/signal.h:20:3: note: in expansion of macro 'ctf_integer' ctf_integer(int, code, \ ^~~~~~~~~~~ /tmp/B.BDr8ki/BUILD/lttng-modules-2.10.7/probes/../instrumentation/events/lttng-module/signal.h:93:3: note: in expansion of macro 'LTTNG_FIELDS_SIGINFO' LTTNG_FIELDS_SIGINFO(info) ^~~~~~~~~~~~~~~~~~~~ /tmp/B.BDr8ki/BUILD/lttng-modules-2.10.7/probes/../instrumentation/events/lttng-module/signal.h:23:11: warning: comparison of distinct pointer types lacks a cast ((info == SEND_SIG_PRIV) ? SI_KERNEL : info->si_code)) ^~ /tmp/B.BDr8ki/BUILD/lttng-modules-2.10.7/probes/../probes/lttng-tracepoint-event-impl.h:775:2: note: in definition of macro 'LTTNG_TRACEPOINT_EVENT_CLASS_CODE' _fields \ ^~~~~~~ /tmp/B.BDr8ki/BUILD/lttng-modules-2.10.7/probes/../probes/lttng-tracepoint-event-impl.h:117:3: note: in expansion of macro 'PARAMS' PARAMS(_fields), ) ^~~~~~ /tmp/B.BDr8ki/BUILD/lttng-modules-2.10.7/probes/../probes/lttng-tracepoint-event-impl.h:51:2: note: in expansion of macro 'LTTNG_TRACEPOINT_EVENT_CLASS' LTTNG_TRACEPOINT_EVENT_CLASS(map, \ ^~~~~~~~~~~~~~~~~~~~~~~~~~~~ /tmp/B.BDr8ki/BUILD/lttng-modules-2.10.7/probes/../probes/lttng-tracepoint-event-impl.h:54:9: note: in expansion of macro 'PARAMS' PARAMS(fields)) \ ^~~~~~ /tmp/B.BDr8ki/BUILD/lttng-modules-2.10.7/probes/../probes/lttng-tracepoint-event-impl.h:97:2: note: in expansion of macro 'LTTNG_TRACEPOINT_EVENT_MAP' LTTNG_TRACEPOINT_EVENT_MAP(name, name, \ ^~~~~~~~~~~~~~~~~~~~~~~~~~ /tmp/B.BDr8ki/BUILD/lttng-modules-2.10.7/probes/../probes/lttng-tracepoint-event-impl.h:100:4: note: in expansion of macro 'PARAMS' PARAMS(fields)) ^~~~~~ /tmp/B.BDr8ki/BUILD/lttng-modules-2.10.7/probes/../instrumentation/events/lttng-module/signal.h:85:1: note: in expansion of macro 'LTTNG_TRACEPOINT_EVENT' LTTNG_TRACEPOINT_EVENT(signal_deliver, ^~~~~~~~~~~~~~~~~~~~~~ /tmp/B.BDr8ki/BUILD/lttng-modules-2.10.7/probes/../instrumentation/events/lttng-module/signal.h:91:2: note: in expansion of macro 'TP_FIELDS' TP_FIELDS( ^~~~~~~~~ /tmp/B.BDr8ki/BUILD/lttng-modules-2.10.7/probes/../probes/lttng-tracepoint-event-impl.h:681:2: note: in expansion of macro '_ctf_integer_ext_fetched' _ctf_integer_ext_fetched(_type, _item, _src, _byte_order, _base, _nowrite) ^~~~~~~~~~~~~~~~~~~~~~~~ /tmp/B.BDr8ki/BUILD/lttng-modules-2.10.7/probes/../probes/lttng-tracepoint-event-impl.h:698:2: note: in expansion of macro '_ctf_integer_ext_isuser0' _ctf_integer_ext_isuser##_user(_type, _item, _user_src, _byte_order, _base, _nowrite) ^~~~~~~~~~~~~~~~~~~~~~~ /tmp/B.BDr8ki/BUILD/lttng-modules-2.10.7/probes/../probes/lttng-events-write.h:23:2: note: in expansion of macro '_ctf_integer_ext' _ctf_integer_ext(_type, _item, _src, __BYTE_ORDER, 10, 0, 0) ^~~~~~~~~~~~~~~~ /tmp/B.BDr8ki/BUILD/lttng-modules-2.10.7/probes/../instrumentation/events/lttng-module/signal.h:20:3: note: in expansion of macro 'ctf_integer' ctf_integer(int, code, \ ^~~~~~~~~~~ /tmp/B.BDr8ki/BUILD/lttng-modules-2.10.7/probes/../instrumentation/events/lttng-module/signal.h:93:3: note: in expansion of macro 'LTTNG_FIELDS_SIGINFO' LTTNG_FIELDS_SIGINFO(info) ^~~~~~~~~~~~~~~~~~~~ /tmp/B.BDr8ki/BUILD/lttng-modules-2.10.7/probes/../instrumentation/events/lttng-module/signal.h:21:10: warning: comparison of distinct pointer types lacks a cast (info == SEND_SIG_NOINFO || info == SEND_SIG_FORCED) ? \ ^~ /tmp/B.BDr8ki/BUILD/lttng-modules-2.10.7/probes/../probes/lttng-tracepoint-event-impl.h:775:2: note: in definition of macro 'LTTNG_TRACEPOINT_EVENT_CLASS_CODE' _fields \ ^~~~~~~ /tmp/B.BDr8ki/BUILD/lttng-modules-2.10.7/probes/../probes/lttng-tracepoint-event-impl.h:117:3: note: in expansion of macro 'PARAMS' PARAMS(_fields), ) ^~~~~~ /tmp/B.BDr8ki/BUILD/lttng-modules-2.10.7/probes/../probes/lttng-tracepoint-event-impl.h:51:2: note: in expansion of macro 'LTTNG_TRACEPOINT_EVENT_CLASS' LTTNG_TRACEPOINT_EVENT_CLASS(map, \ ^~~~~~~~~~~~~~~~~~~~~~~~~~~~ /tmp/B.BDr8ki/BUILD/lttng-modules-2.10.7/probes/../probes/lttng-tracepoint-event-impl.h:54:9: note: in expansion of macro 'PARAMS' PARAMS(fields)) \ ^~~~~~ /tmp/B.BDr8ki/BUILD/lttng-modules-2.10.7/probes/../probes/lttng-tracepoint-event-impl.h:97:2: note: in expansion of macro 'LTTNG_TRACEPOINT_EVENT_MAP' LTTNG_TRACEPOINT_EVENT_MAP(name, name, \ ^~~~~~~~~~~~~~~~~~~~~~~~~~ /tmp/B.BDr8ki/BUILD/lttng-modules-2.10.7/probes/../probes/lttng-tracepoint-event-impl.h:100:4: note: in expansion of macro 'PARAMS' PARAMS(fields)) ^~~~~~ /tmp/B.BDr8ki/BUILD/lttng-modules-2.10.7/probes/../instrumentation/events/lttng-module/signal.h:85:1: note: in expansion of macro 'LTTNG_TRACEPOINT_EVENT' LTTNG_TRACEPOINT_EVENT(signal_deliver, ^~~~~~~~~~~~~~~~~~~~~~ /tmp/B.BDr8ki/BUILD/lttng-modules-2.10.7/probes/../instrumentation/events/lttng-module/signal.h:91:2: note: in expansion of macro 'TP_FIELDS' TP_FIELDS( ^~~~~~~~~ /tmp/B.BDr8ki/BUILD/lttng-modules-2.10.7/probes/../probes/lttng-tracepoint-event-impl.h:681:2: note: in expansion of macro '_ctf_integer_ext_fetched' _ctf_integer_ext_fetched(_type, _item, _src, _byte_order, _base, _nowrite) ^~~~~~~~~~~~~~~~~~~~~~~~ /tmp/B.BDr8ki/BUILD/lttng-modules-2.10.7/probes/../probes/lttng-tracepoint-event-impl.h:698:2: note: in expansion of macro '_ctf_integer_ext_isuser0' _ctf_integer_ext_isuser##_user(_type, _item, _user_src, _byte_order, _base, _nowrite) ^~~~~~~~~~~~~~~~~~~~~~~ /tmp/B.BDr8ki/BUILD/lttng-modules-2.10.7/probes/../probes/lttng-events-write.h:23:2: note: in expansion of macro '_ctf_integer_ext' _ctf_integer_ext(_type, _item, _src, __BYTE_ORDER, 10, 0, 0) ^~~~~~~~~~~~~~~~ /tmp/B.BDr8ki/BUILD/lttng-modules-2.10.7/probes/../instrumentation/events/lttng-module/signal.h:20:3: note: in expansion of macro 'ctf_integer' ctf_integer(int, code, \ ^~~~~~~~~~~ /tmp/B.BDr8ki/BUILD/lttng-modules-2.10.7/probes/../instrumentation/events/lttng-module/signal.h:93:3: note: in expansion of macro 'LTTNG_FIELDS_SIGINFO' LTTNG_FIELDS_SIGINFO(info) ^~~~~~~~~~~~~~~~~~~~ /tmp/B.BDr8ki/BUILD/lttng-modules-2.10.7/probes/../instrumentation/events/lttng-module/signal.h:23:11: warning: comparison of distinct pointer types lacks a cast ((info == SEND_SIG_PRIV) ? SI_KERNEL : info->si_code)) ^~ /tmp/B.BDr8ki/BUILD/lttng-modules-2.10.7/probes/../probes/lttng-tracepoint-event-impl.h:775:2: note: in definition of macro 'LTTNG_TRACEPOINT_EVENT_CLASS_CODE' _fields \ ^~~~~~~ /tmp/B.BDr8ki/BUILD/lttng-modules-2.10.7/probes/../probes/lttng-tracepoint-event-impl.h:117:3: note: in expansion of macro 'PARAMS' PARAMS(_fields), ) ^~~~~~ /tmp/B.BDr8ki/BUILD/lttng-modules-2.10.7/probes/../probes/lttng-tracepoint-event-impl.h:51:2: note: in expansion of macro 'LTTNG_TRACEPOINT_EVENT_CLASS' LTTNG_TRACEPOINT_EVENT_CLASS(map, \ ^~~~~~~~~~~~~~~~~~~~~~~~~~~~ /tmp/B.BDr8ki/BUILD/lttng-modules-2.10.7/probes/../probes/lttng-tracepoint-event-impl.h:54:9: note: in expansion of macro 'PARAMS' PARAMS(fields)) \ ^~~~~~ /tmp/B.BDr8ki/BUILD/lttng-modules-2.10.7/probes/../probes/lttng-tracepoint-event-impl.h:97:2: note: in expansion of macro 'LTTNG_TRACEPOINT_EVENT_MAP' LTTNG_TRACEPOINT_EVENT_MAP(name, name, \ ^~~~~~~~~~~~~~~~~~~~~~~~~~ /tmp/B.BDr8ki/BUILD/lttng-modules-2.10.7/probes/../probes/lttng-tracepoint-event-impl.h:100:4: note: in expansion of macro 'PARAMS' PARAMS(fields)) ^~~~~~ /tmp/B.BDr8ki/BUILD/lttng-modules-2.10.7/probes/../instrumentation/events/lttng-module/signal.h:85:1: note: in expansion of macro 'LTTNG_TRACEPOINT_EVENT' LTTNG_TRACEPOINT_EVENT(signal_deliver, ^~~~~~~~~~~~~~~~~~~~~~ /tmp/B.BDr8ki/BUILD/lttng-modules-2.10.7/probes/../instrumentation/events/lttng-module/signal.h:91:2: note: in expansion of macro 'TP_FIELDS' TP_FIELDS( ^~~~~~~~~ /tmp/B.BDr8ki/BUILD/lttng-modules-2.10.7/probes/../probes/lttng-tracepoint-event-impl.h:681:2: note: in expansion of macro '_ctf_integer_ext_fetched' _ctf_integer_ext_fetched(_type, _item, _src, _byte_order, _base, _nowrite) ^~~~~~~~~~~~~~~~~~~~~~~~ /tmp/B.BDr8ki/BUILD/lttng-modules-2.10.7/probes/../probes/lttng-tracepoint-event-impl.h:698:2: note: in expansion of macro '_ctf_integer_ext_isuser0' _ctf_integer_ext_isuser##_user(_type, _item, _user_src, _byte_order, _base, _nowrite) ^~~~~~~~~~~~~~~~~~~~~~~ /tmp/B.BDr8ki/BUILD/lttng-modules-2.10.7/probes/../probes/lttng-events-write.h:23:2: note: in expansion of macro '_ctf_integer_ext' _ctf_integer_ext(_type, _item, _src, __BYTE_ORDER, 10, 0, 0) ^~~~~~~~~~~~~~~~ /tmp/B.BDr8ki/BUILD/lttng-modules-2.10.7/probes/../instrumentation/events/lttng-module/signal.h:20:3: note: in expansion of macro 'ctf_integer' ctf_integer(int, code, \ ^~~~~~~~~~~ /tmp/B.BDr8ki/BUILD/lttng-modules-2.10.7/probes/../instrumentation/events/lttng-module/signal.h:93:3: note: in expansion of macro 'LTTNG_FIELDS_SIGINFO' LTTNG_FIELDS_SIGINFO(info) ^~~~~~~~~~~~~~~~~~~~ In file included from /tmp/B.BDr8ki/BUILD/lttng-modules-2.10.7/probes/../probes/define_trace.h:100, from /tmp/B.BDr8ki/BUILD/lttng-modules-2.10.7/probes/../instrumentation/events/lttng-module/signal.h:153, from /tmp/B.BDr8ki/BUILD/lttng-modules-2.10.7/probes/lttng-probe-signal.c:39: /tmp/B.BDr8ki/BUILD/lttng-modules-2.10.7/probes/../instrumentation/events/lttng-module/signal.h: In function '__event_probe__signal_generate': /tmp/B.BDr8ki/BUILD/lttng-modules-2.10.7/probes/../instrumentation/events/lttng-module/signal.h:17:10: warning: comparison of distinct pointer types lacks a cast (info == SEND_SIG_NOINFO || info == SEND_SIG_FORCED || info == SEND_SIG_PRIV) ? \ ^~ /tmp/B.BDr8ki/BUILD/lttng-modules-2.10.7/probes/../probes/lttng-tracepoint-event-impl.h:1184:2: note: in definition of macro 'LTTNG_TRACEPOINT_EVENT_CLASS_CODE' _fields \ ^~~~~~~ /tmp/B.BDr8ki/BUILD/lttng-modules-2.10.7/probes/../probes/lttng-tracepoint-event-impl.h:117:3: note: in expansion of macro 'PARAMS' PARAMS(_fields), ) ^~~~~~ /tmp/B.BDr8ki/BUILD/lttng-modules-2.10.7/probes/../probes/lttng-tracepoint-event-impl.h:51:2: note: in expansion of macro 'LTTNG_TRACEPOINT_EVENT_CLASS' LTTNG_TRACEPOINT_EVENT_CLASS(map, \ ^~~~~~~~~~~~~~~~~~~~~~~~~~~~ /tmp/B.BDr8ki/BUILD/lttng-modules-2.10.7/probes/../probes/lttng-tracepoint-event-impl.h:54:9: note: in expansion of macro 'PARAMS' PARAMS(fields)) \ ^~~~~~ /tmp/B.BDr8ki/BUILD/lttng-modules-2.10.7/probes/../probes/lttng-tracepoint-event-impl.h:97:2: note: in expansion of macro 'LTTNG_TRACEPOINT_EVENT_MAP' LTTNG_TRACEPOINT_EVENT_MAP(name, name, \ ^~~~~~~~~~~~~~~~~~~~~~~~~~ /tmp/B.BDr8ki/BUILD/lttng-modules-2.10.7/probes/../probes/lttng-tracepoint-event-impl.h:100:4: note: in expansion of macro 'PARAMS' PARAMS(fields)) ^~~~~~ /tmp/B.BDr8ki/BUILD/lttng-modules-2.10.7/probes/../instrumentation/events/lttng-module/signal.h:53:1: note: in expansion of macro 'LTTNG_TRACEPOINT_EVENT' LTTNG_TRACEPOINT_EVENT(signal_generate, ^~~~~~~~~~~~~~~~~~~~~~ /tmp/B.BDr8ki/BUILD/lttng-modules-2.10.7/probes/../instrumentation/events/lttng-module/signal.h:60:2: note: in expansion of macro 'TP_FIELDS' TP_FIELDS( ^~~~~~~~~ /tmp/B.BDr8ki/BUILD/lttng-modules-2.10.7/probes/../probes/lttng-tracepoint-event-impl.h:889:2: note: in expansion of macro '_ctf_integer_ext_fetched' _ctf_integer_ext_fetched(_type, _item, _src, _byte_order, _base, _nowrite) ^~~~~~~~~~~~~~~~~~~~~~~~ /tmp/B.BDr8ki/BUILD/lttng-modules-2.10.7/probes/../probes/lttng-tracepoint-event-impl.h:906:2: note: in expansion of macro '_ctf_integer_ext_isuser0' _ctf_integer_ext_isuser##_user(_type, _item, _user_src, _byte_order, _base, _nowrite) ^~~~~~~~~~~~~~~~~~~~~~~ /tmp/B.BDr8ki/BUILD/lttng-modules-2.10.7/probes/../probes/lttng-events-write.h:23:2: note: in expansion of macro '_ctf_integer_ext' _ctf_integer_ext(_type, _item, _src, __BYTE_ORDER, 10, 0, 0) ^~~~~~~~~~~~~~~~ /tmp/B.BDr8ki/BUILD/lttng-modules-2.10.7/probes/../instrumentation/events/lttng-module/signal.h:16:3: note: in expansion of macro 'ctf_integer' ctf_integer(int, errno, \ ^~~~~~~~~~~ /tmp/B.BDr8ki/BUILD/lttng-modules-2.10.7/probes/../instrumentation/events/lttng-module/signal.h:62:3: note: in expansion of macro 'LTTNG_FIELDS_SIGINFO' LTTNG_FIELDS_SIGINFO(info) ^~~~~~~~~~~~~~~~~~~~ /tmp/B.BDr8ki/BUILD/lttng-modules-2.10.7/probes/../instrumentation/events/lttng-module/signal.h:17:40: error: 'SEND_SIG_FORCED' undeclared (first use in this function); did you mean 'SEND_SIG_PRIV'? (info == SEND_SIG_NOINFO || info == SEND_SIG_FORCED || info == SEND_SIG_PRIV) ? \ ^~~~~~~~~~~~~~~ /tmp/B.BDr8ki/BUILD/lttng-modules-2.10.7/probes/../probes/lttng-tracepoint-event-impl.h:1184:2: note: in definition of macro 'LTTNG_TRACEPOINT_EVENT_CLASS_CODE' _fields \ ^~~~~~~ /tmp/B.BDr8ki/BUILD/lttng-modules-2.10.7/probes/../probes/lttng-tracepoint-event-impl.h:117:3: note: in expansion of macro 'PARAMS' PARAMS(_fields), ) ^~~~~~ /tmp/B.BDr8ki/BUILD/lttng-modules-2.10.7/probes/../probes/lttng-tracepoint-event-impl.h:51:2: note: in expansion of macro 'LTTNG_TRACEPOINT_EVENT_CLASS' LTTNG_TRACEPOINT_EVENT_CLASS(map, \ ^~~~~~~~~~~~~~~~~~~~~~~~~~~~ /tmp/B.BDr8ki/BUILD/lttng-modules-2.10.7/probes/../probes/lttng-tracepoint-event-impl.h:54:9: note: in expansion of macro 'PARAMS' PARAMS(fields)) \ ^~~~~~ /tmp/B.BDr8ki/BUILD/lttng-modules-2.10.7/probes/../probes/lttng-tracepoint-event-impl.h:97:2: note: in expansion of macro 'LTTNG_TRACEPOINT_EVENT_MAP' LTTNG_TRACEPOINT_EVENT_MAP(name, name, \ ^~~~~~~~~~~~~~~~~~~~~~~~~~ /tmp/B.BDr8ki/BUILD/lttng-modules-2.10.7/probes/../probes/lttng-tracepoint-event-impl.h:100:4: note: in expansion of macro 'PARAMS' PARAMS(fields)) ^~~~~~ /tmp/B.BDr8ki/BUILD/lttng-modules-2.10.7/probes/../instrumentation/events/lttng-module/signal.h:53:1: note: in expansion of macro 'LTTNG_TRACEPOINT_EVENT' LTTNG_TRACEPOINT_EVENT(signal_generate, ^~~~~~~~~~~~~~~~~~~~~~ /tmp/B.BDr8ki/BUILD/lttng-modules-2.10.7/probes/../instrumentation/events/lttng-module/signal.h:60:2: note: in expansion of macro 'TP_FIELDS' TP_FIELDS( ^~~~~~~~~ /tmp/B.BDr8ki/BUILD/lttng-modules-2.10.7/probes/../probes/lttng-tracepoint-event-impl.h:889:2: note: in expansion of macro '_ctf_integer_ext_fetched' _ctf_integer_ext_fetched(_type, _item, _src, _byte_order, _base, _nowrite) ^~~~~~~~~~~~~~~~~~~~~~~~ /tmp/B.BDr8ki/BUILD/lttng-modules-2.10.7/probes/../probes/lttng-tracepoint-event-impl.h:906:2: note: in expansion of macro '_ctf_integer_ext_isuser0' _ctf_integer_ext_isuser##_user(_type, _item, _user_src, _byte_order, _base, _nowrite) ^~~~~~~~~~~~~~~~~~~~~~~ /tmp/B.BDr8ki/BUILD/lttng-modules-2.10.7/probes/../probes/lttng-events-write.h:23:2: note: in expansion of macro '_ctf_integer_ext' _ctf_integer_ext(_type, _item, _src, __BYTE_ORDER, 10, 0, 0) ^~~~~~~~~~~~~~~~ /tmp/B.BDr8ki/BUILD/lttng-modules-2.10.7/probes/../instrumentation/events/lttng-module/signal.h:16:3: note: in expansion of macro 'ctf_integer' ctf_integer(int, errno, \ ^~~~~~~~~~~ /tmp/B.BDr8ki/BUILD/lttng-modules-2.10.7/probes/../instrumentation/events/lttng-module/signal.h:62:3: note: in expansion of macro 'LTTNG_FIELDS_SIGINFO' LTTNG_FIELDS_SIGINFO(info) ^~~~~~~~~~~~~~~~~~~~ /tmp/B.BDr8ki/BUILD/lttng-modules-2.10.7/probes/../instrumentation/events/lttng-module/signal.h:17:64: warning: comparison of distinct pointer types lacks a cast (info == SEND_SIG_NOINFO || info == SEND_SIG_FORCED || info == SEND_SIG_PRIV) ? \ ^~ /tmp/B.BDr8ki/BUILD/lttng-modules-2.10.7/probes/../probes/lttng-tracepoint-event-impl.h:1184:2: note: in definition of macro 'LTTNG_TRACEPOINT_EVENT_CLASS_CODE' _fields \ ^~~~~~~ /tmp/B.BDr8ki/BUILD/lttng-modules-2.10.7/probes/../probes/lttng-tracepoint-event-impl.h:117:3: note: in expansion of macro 'PARAMS' PARAMS(_fields), ) ^~~~~~ /tmp/B.BDr8ki/BUILD/lttng-modules-2.10.7/probes/../probes/lttng-tracepoint-event-impl.h:51:2: note: in expansion of macro 'LTTNG_TRACEPOINT_EVENT_CLASS' LTTNG_TRACEPOINT_EVENT_CLASS(map, \ ^~~~~~~~~~~~~~~~~~~~~~~~~~~~ /tmp/B.BDr8ki/BUILD/lttng-modules-2.10.7/probes/../probes/lttng-tracepoint-event-impl.h:54:9: note: in expansion of macro 'PARAMS' PARAMS(fields)) \ ^~~~~~ /tmp/B.BDr8ki/BUILD/lttng-modules-2.10.7/probes/../probes/lttng-tracepoint-event-impl.h:97:2: note: in expansion of macro 'LTTNG_TRACEPOINT_EVENT_MAP' LTTNG_TRACEPOINT_EVENT_MAP(name, name, \ ^~~~~~~~~~~~~~~~~~~~~~~~~~ /tmp/B.BDr8ki/BUILD/lttng-modules-2.10.7/probes/../probes/lttng-tracepoint-event-impl.h:100:4: note: in expansion of macro 'PARAMS' PARAMS(fields)) ^~~~~~ /tmp/B.BDr8ki/BUILD/lttng-modules-2.10.7/probes/../instrumentation/events/lttng-module/signal.h:53:1: note: in expansion of macro 'LTTNG_TRACEPOINT_EVENT' LTTNG_TRACEPOINT_EVENT(signal_generate, ^~~~~~~~~~~~~~~~~~~~~~ /tmp/B.BDr8ki/BUILD/lttng-modules-2.10.7/probes/../instrumentation/events/lttng-module/signal.h:60:2: note: in expansion of macro 'TP_FIELDS' TP_FIELDS( ^~~~~~~~~ /tmp/B.BDr8ki/BUILD/lttng-modules-2.10.7/probes/../probes/lttng-tracepoint-event-impl.h:889:2: note: in expansion of macro '_ctf_integer_ext_fetched' _ctf_integer_ext_fetched(_type, _item, _src, _byte_order, _base, _nowrite) ^~~~~~~~~~~~~~~~~~~~~~~~ /tmp/B.BDr8ki/BUILD/lttng-modules-2.10.7/probes/../probes/lttng-tracepoint-event-impl.h:906:2: note: in expansion of macro '_ctf_integer_ext_isuser0' _ctf_integer_ext_isuser##_user(_type, _item, _user_src, _byte_order, _base, _nowrite) ^~~~~~~~~~~~~~~~~~~~~~~ /tmp/B.BDr8ki/BUILD/lttng-modules-2.10.7/probes/../probes/lttng-events-write.h:23:2: note: in expansion of macro '_ctf_integer_ext' _ctf_integer_ext(_type, _item, _src, __BYTE_ORDER, 10, 0, 0) ^~~~~~~~~~~~~~~~ /tmp/B.BDr8ki/BUILD/lttng-modules-2.10.7/probes/../instrumentation/events/lttng-module/signal.h:16:3: note: in expansion of macro 'ctf_integer' ctf_integer(int, errno, \ ^~~~~~~~~~~ /tmp/B.BDr8ki/BUILD/lttng-modules-2.10.7/probes/../instrumentation/events/lttng-module/signal.h:62:3: note: in expansion of macro 'LTTNG_FIELDS_SIGINFO' LTTNG_FIELDS_SIGINFO(info) ^~~~~~~~~~~~~~~~~~~~ /tmp/B.BDr8ki/BUILD/lttng-modules-2.10.7/probes/../instrumentation/events/lttng-module/signal.h:21:10: warning: comparison of distinct pointer types lacks a cast (info == SEND_SIG_NOINFO || info == SEND_SIG_FORCED) ? \ ^~ /tmp/B.BDr8ki/BUILD/lttng-modules-2.10.7/probes/../probes/lttng-tracepoint-event-impl.h:1184:2: note: in definition of macro 'LTTNG_TRACEPOINT_EVENT_CLASS_CODE' _fields \ ^~~~~~~ /tmp/B.BDr8ki/BUILD/lttng-modules-2.10.7/probes/../probes/lttng-tracepoint-event-impl.h:117:3: note: in expansion of macro 'PARAMS' PARAMS(_fields), ) ^~~~~~ /tmp/B.BDr8ki/BUILD/lttng-modules-2.10.7/probes/../probes/lttng-tracepoint-event-impl.h:51:2: note: in expansion of macro 'LTTNG_TRACEPOINT_EVENT_CLASS' LTTNG_TRACEPOINT_EVENT_CLASS(map, \ ^~~~~~~~~~~~~~~~~~~~~~~~~~~~ /tmp/B.BDr8ki/BUILD/lttng-modules-2.10.7/probes/../probes/lttng-tracepoint-event-impl.h:54:9: note: in expansion of macro 'PARAMS' PARAMS(fields)) \ ^~~~~~ /tmp/B.BDr8ki/BUILD/lttng-modules-2.10.7/probes/../probes/lttng-tracepoint-event-impl.h:97:2: note: in expansion of macro 'LTTNG_TRACEPOINT_EVENT_MAP' LTTNG_TRACEPOINT_EVENT_MAP(name, name, \ ^~~~~~~~~~~~~~~~~~~~~~~~~~ /tmp/B.BDr8ki/BUILD/lttng-modules-2.10.7/probes/../probes/lttng-tracepoint-event-impl.h:100:4: note: in expansion of macro 'PARAMS' PARAMS(fields)) ^~~~~~ /tmp/B.BDr8ki/BUILD/lttng-modules-2.10.7/probes/../instrumentation/events/lttng-module/signal.h:53:1: note: in expansion of macro 'LTTNG_TRACEPOINT_EVENT' LTTNG_TRACEPOINT_EVENT(signal_generate, ^~~~~~~~~~~~~~~~~~~~~~ /tmp/B.BDr8ki/BUILD/lttng-modules-2.10.7/probes/../instrumentation/events/lttng-module/signal.h:60:2: note: in expansion of macro 'TP_FIELDS' TP_FIELDS( ^~~~~~~~~ /tmp/B.BDr8ki/BUILD/lttng-modules-2.10.7/probes/../probes/lttng-tracepoint-event-impl.h:889:2: note: in expansion of macro '_ctf_integer_ext_fetched' _ctf_integer_ext_fetched(_type, _item, _src, _byte_order, _base, _nowrite) ^~~~~~~~~~~~~~~~~~~~~~~~ /tmp/B.BDr8ki/BUILD/lttng-modules-2.10.7/probes/../probes/lttng-tracepoint-event-impl.h:906:2: note: in expansion of macro '_ctf_integer_ext_isuser0' _ctf_integer_ext_isuser##_user(_type, _item, _user_src, _byte_order, _base, _nowrite) ^~~~~~~~~~~~~~~~~~~~~~~ /tmp/B.BDr8ki/BUILD/lttng-modules-2.10.7/probes/../probes/lttng-events-write.h:23:2: note: in expansion of macro '_ctf_integer_ext' _ctf_integer_ext(_type, _item, _src, __BYTE_ORDER, 10, 0, 0) ^~~~~~~~~~~~~~~~ /tmp/B.BDr8ki/BUILD/lttng-modules-2.10.7/probes/../instrumentation/events/lttng-module/signal.h:20:3: note: in expansion of macro 'ctf_integer' ctf_integer(int, code, \ ^~~~~~~~~~~ /tmp/B.BDr8ki/BUILD/lttng-modules-2.10.7/probes/../instrumentation/events/lttng-module/signal.h:62:3: note: in expansion of macro 'LTTNG_FIELDS_SIGINFO' LTTNG_FIELDS_SIGINFO(info) ^~~~~~~~~~~~~~~~~~~~ /tmp/B.BDr8ki/BUILD/lttng-modules-2.10.7/probes/../instrumentation/events/lttng-module/signal.h:23:11: warning: comparison of distinct pointer types lacks a cast ((info == SEND_SIG_PRIV) ? SI_KERNEL : info->si_code)) ^~ /tmp/B.BDr8ki/BUILD/lttng-modules-2.10.7/probes/../probes/lttng-tracepoint-event-impl.h:1184:2: note: in definition of macro 'LTTNG_TRACEPOINT_EVENT_CLASS_CODE' _fields \ ^~~~~~~ /tmp/B.BDr8ki/BUILD/lttng-modules-2.10.7/probes/../probes/lttng-tracepoint-event-impl.h:117:3: note: in expansion of macro 'PARAMS' PARAMS(_fields), ) ^~~~~~ /tmp/B.BDr8ki/BUILD/lttng-modules-2.10.7/probes/../probes/lttng-tracepoint-event-impl.h:51:2: note: in expansion of macro 'LTTNG_TRACEPOINT_EVENT_CLASS' LTTNG_TRACEPOINT_EVENT_CLASS(map, \ ^~~~~~~~~~~~~~~~~~~~~~~~~~~~ /tmp/B.BDr8ki/BUILD/lttng-modules-2.10.7/probes/../probes/lttng-tracepoint-event-impl.h:54:9: note: in expansion of macro 'PARAMS' PARAMS(fields)) \ ^~~~~~ /tmp/B.BDr8ki/BUILD/lttng-modules-2.10.7/probes/../probes/lttng-tracepoint-event-impl.h:97:2: note: in expansion of macro 'LTTNG_TRACEPOINT_EVENT_MAP' LTTNG_TRACEPOINT_EVENT_MAP(name, name, \ ^~~~~~~~~~~~~~~~~~~~~~~~~~ /tmp/B.BDr8ki/BUILD/lttng-modules-2.10.7/probes/../probes/lttng-tracepoint-event-impl.h:100:4: note: in expansion of macro 'PARAMS' PARAMS(fields)) ^~~~~~ /tmp/B.BDr8ki/BUILD/lttng-modules-2.10.7/probes/../instrumentation/events/lttng-module/signal.h:53:1: note: in expansion of macro 'LTTNG_TRACEPOINT_EVENT' LTTNG_TRACEPOINT_EVENT(signal_generate, ^~~~~~~~~~~~~~~~~~~~~~ /tmp/B.BDr8ki/BUILD/lttng-modules-2.10.7/probes/../instrumentation/events/lttng-module/signal.h:60:2: note: in expansion of macro 'TP_FIELDS' TP_FIELDS( ^~~~~~~~~ /tmp/B.BDr8ki/BUILD/lttng-modules-2.10.7/probes/../probes/lttng-tracepoint-event-impl.h:889:2: note: in expansion of macro '_ctf_integer_ext_fetched' _ctf_integer_ext_fetched(_type, _item, _src, _byte_order, _base, _nowrite) ^~~~~~~~~~~~~~~~~~~~~~~~ /tmp/B.BDr8ki/BUILD/lttng-modules-2.10.7/probes/../probes/lttng-tracepoint-event-impl.h:906:2: note: in expansion of macro '_ctf_integer_ext_isuser0' _ctf_integer_ext_isuser##_user(_type, _item, _user_src, _byte_order, _base, _nowrite) ^~~~~~~~~~~~~~~~~~~~~~~ /tmp/B.BDr8ki/BUILD/lttng-modules-2.10.7/probes/../probes/lttng-events-write.h:23:2: note: in expansion of macro '_ctf_integer_ext' _ctf_integer_ext(_type, _item, _src, __BYTE_ORDER, 10, 0, 0) ^~~~~~~~~~~~~~~~ /tmp/B.BDr8ki/BUILD/lttng-modules-2.10.7/probes/../instrumentation/events/lttng-module/signal.h:20:3: note: in expansion of macro 'ctf_integer' ctf_integer(int, code, \ ^~~~~~~~~~~ /tmp/B.BDr8ki/BUILD/lttng-modules-2.10.7/probes/../instrumentation/events/lttng-module/signal.h:62:3: note: in expansion of macro 'LTTNG_FIELDS_SIGINFO' LTTNG_FIELDS_SIGINFO(info) ^~~~~~~~~~~~~~~~~~~~ /tmp/B.BDr8ki/BUILD/lttng-modules-2.10.7/probes/../instrumentation/events/lttng-module/signal.h: In function '__event_probe__signal_deliver': /tmp/B.BDr8ki/BUILD/lttng-modules-2.10.7/probes/../instrumentation/events/lttng-module/signal.h:17:10: warning: comparison of distinct pointer types lacks a cast (info == SEND_SIG_NOINFO || info == SEND_SIG_FORCED || info == SEND_SIG_PRIV) ? \ ^~ /tmp/B.BDr8ki/BUILD/lttng-modules-2.10.7/probes/../probes/lttng-tracepoint-event-impl.h:1184:2: note: in definition of macro 'LTTNG_TRACEPOINT_EVENT_CLASS_CODE' _fields \ ^~~~~~~ /tmp/B.BDr8ki/BUILD/lttng-modules-2.10.7/probes/../probes/lttng-tracepoint-event-impl.h:117:3: note: in expansion of macro 'PARAMS' PARAMS(_fields), ) ^~~~~~ /tmp/B.BDr8ki/BUILD/lttng-modules-2.10.7/probes/../probes/lttng-tracepoint-event-impl.h:51:2: note: in expansion of macro 'LTTNG_TRACEPOINT_EVENT_CLASS' LTTNG_TRACEPOINT_EVENT_CLASS(map, \ ^~~~~~~~~~~~~~~~~~~~~~~~~~~~ /tmp/B.BDr8ki/BUILD/lttng-modules-2.10.7/probes/../probes/lttng-tracepoint-event-impl.h:54:9: note: in expansion of macro 'PARAMS' PARAMS(fields)) \ ^~~~~~ /tmp/B.BDr8ki/BUILD/lttng-modules-2.10.7/probes/../probes/lttng-tracepoint-event-impl.h:97:2: note: in expansion of macro 'LTTNG_TRACEPOINT_EVENT_MAP' LTTNG_TRACEPOINT_EVENT_MAP(name, name, \ ^~~~~~~~~~~~~~~~~~~~~~~~~~ /tmp/B.BDr8ki/BUILD/lttng-modules-2.10.7/probes/../probes/lttng-tracepoint-event-impl.h:100:4: note: in expansion of macro 'PARAMS' PARAMS(fields)) ^~~~~~ /tmp/B.BDr8ki/BUILD/lttng-modules-2.10.7/probes/../instrumentation/events/lttng-module/signal.h:85:1: note: in expansion of macro 'LTTNG_TRACEPOINT_EVENT' LTTNG_TRACEPOINT_EVENT(signal_deliver, ^~~~~~~~~~~~~~~~~~~~~~ /tmp/B.BDr8ki/BUILD/lttng-modules-2.10.7/probes/../instrumentation/events/lttng-module/signal.h:91:2: note: in expansion of macro 'TP_FIELDS' TP_FIELDS( ^~~~~~~~~ /tmp/B.BDr8ki/BUILD/lttng-modules-2.10.7/probes/../probes/lttng-tracepoint-event-impl.h:889:2: note: in expansion of macro '_ctf_integer_ext_fetched' _ctf_integer_ext_fetched(_type, _item, _src, _byte_order, _base, _nowrite) ^~~~~~~~~~~~~~~~~~~~~~~~ /tmp/B.BDr8ki/BUILD/lttng-modules-2.10.7/probes/../probes/lttng-tracepoint-event-impl.h:906:2: note: in expansion of macro '_ctf_integer_ext_isuser0' _ctf_integer_ext_isuser##_user(_type, _item, _user_src, _byte_order, _base, _nowrite) ^~~~~~~~~~~~~~~~~~~~~~~ /tmp/B.BDr8ki/BUILD/lttng-modules-2.10.7/probes/../probes/lttng-events-write.h:23:2: note: in expansion of macro '_ctf_integer_ext' _ctf_integer_ext(_type, _item, _src, __BYTE_ORDER, 10, 0, 0) ^~~~~~~~~~~~~~~~ /tmp/B.BDr8ki/BUILD/lttng-modules-2.10.7/probes/../instrumentation/events/lttng-module/signal.h:16:3: note: in expansion of macro 'ctf_integer' ctf_integer(int, errno, \ ^~~~~~~~~~~ /tmp/B.BDr8ki/BUILD/lttng-modules-2.10.7/probes/../instrumentation/events/lttng-module/signal.h:93:3: note: in expansion of macro 'LTTNG_FIELDS_SIGINFO' LTTNG_FIELDS_SIGINFO(info) ^~~~~~~~~~~~~~~~~~~~ /tmp/B.BDr8ki/BUILD/lttng-modules-2.10.7/probes/../instrumentation/events/lttng-module/signal.h:17:40: error: 'SEND_SIG_FORCED' undeclared (first use in this function); did you mean 'SEND_SIG_PRIV'? (info == SEND_SIG_NOINFO || info == SEND_SIG_FORCED || info == SEND_SIG_PRIV) ? \ ^~~~~~~~~~~~~~~ /tmp/B.BDr8ki/BUILD/lttng-modules-2.10.7/probes/../probes/lttng-tracepoint-event-impl.h:1184:2: note: in definition of macro 'LTTNG_TRACEPOINT_EVENT_CLASS_CODE' _fields \ ^~~~~~~ /tmp/B.BDr8ki/BUILD/lttng-modules-2.10.7/probes/../probes/lttng-tracepoint-event-impl.h:117:3: note: in expansion of macro 'PARAMS' PARAMS(_fields), ) ^~~~~~ /tmp/B.BDr8ki/BUILD/lttng-modules-2.10.7/probes/../probes/lttng-tracepoint-event-impl.h:51:2: note: in expansion of macro 'LTTNG_TRACEPOINT_EVENT_CLASS' LTTNG_TRACEPOINT_EVENT_CLASS(map, \ ^~~~~~~~~~~~~~~~~~~~~~~~~~~~ /tmp/B.BDr8ki/BUILD/lttng-modules-2.10.7/probes/../probes/lttng-tracepoint-event-impl.h:54:9: note: in expansion of macro 'PARAMS' PARAMS(fields)) \ ^~~~~~ /tmp/B.BDr8ki/BUILD/lttng-modules-2.10.7/probes/../probes/lttng-tracepoint-event-impl.h:97:2: note: in expansion of macro 'LTTNG_TRACEPOINT_EVENT_MAP' LTTNG_TRACEPOINT_EVENT_MAP(name, name, \ ^~~~~~~~~~~~~~~~~~~~~~~~~~ /tmp/B.BDr8ki/BUILD/lttng-modules-2.10.7/probes/../probes/lttng-tracepoint-event-impl.h:100:4: note: in expansion of macro 'PARAMS' PARAMS(fields)) ^~~~~~ /tmp/B.BDr8ki/BUILD/lttng-modules-2.10.7/probes/../instrumentation/events/lttng-module/signal.h:85:1: note: in expansion of macro 'LTTNG_TRACEPOINT_EVENT' LTTNG_TRACEPOINT_EVENT(signal_deliver, ^~~~~~~~~~~~~~~~~~~~~~ /tmp/B.BDr8ki/BUILD/lttng-modules-2.10.7/probes/../instrumentation/events/lttng-module/signal.h:91:2: note: in expansion of macro 'TP_FIELDS' TP_FIELDS( ^~~~~~~~~ /tmp/B.BDr8ki/BUILD/lttng-modules-2.10.7/probes/../probes/lttng-tracepoint-event-impl.h:889:2: note: in expansion of macro '_ctf_integer_ext_fetched' _ctf_integer_ext_fetched(_type, _item, _src, _byte_order, _base, _nowrite) ^~~~~~~~~~~~~~~~~~~~~~~~ /tmp/B.BDr8ki/BUILD/lttng-modules-2.10.7/probes/../probes/lttng-tracepoint-event-impl.h:906:2: note: in expansion of macro '_ctf_integer_ext_isuser0' _ctf_integer_ext_isuser##_user(_type, _item, _user_src, _byte_order, _base, _nowrite) ^~~~~~~~~~~~~~~~~~~~~~~ /tmp/B.BDr8ki/BUILD/lttng-modules-2.10.7/probes/../probes/lttng-events-write.h:23:2: note: in expansion of macro '_ctf_integer_ext' _ctf_integer_ext(_type, _item, _src, __BYTE_ORDER, 10, 0, 0) ^~~~~~~~~~~~~~~~ /tmp/B.BDr8ki/BUILD/lttng-modules-2.10.7/probes/../instrumentation/events/lttng-module/signal.h:16:3: note: in expansion of macro 'ctf_integer' ctf_integer(int, errno, \ ^~~~~~~~~~~ /tmp/B.BDr8ki/BUILD/lttng-modules-2.10.7/probes/../instrumentation/events/lttng-module/signal.h:93:3: note: in expansion of macro 'LTTNG_FIELDS_SIGINFO' LTTNG_FIELDS_SIGINFO(info) ^~~~~~~~~~~~~~~~~~~~ /tmp/B.BDr8ki/BUILD/lttng-modules-2.10.7/probes/../instrumentation/events/lttng-module/signal.h:17:64: warning: comparison of distinct pointer types lacks a cast (info == SEND_SIG_NOINFO || info == SEND_SIG_FORCED || info == SEND_SIG_PRIV) ? \ ^~ /tmp/B.BDr8ki/BUILD/lttng-modules-2.10.7/probes/../probes/lttng-tracepoint-event-impl.h:1184:2: note: in definition of macro 'LTTNG_TRACEPOINT_EVENT_CLASS_CODE' _fields \ ^~~~~~~ /tmp/B.BDr8ki/BUILD/lttng-modules-2.10.7/probes/../probes/lttng-tracepoint-event-impl.h:117:3: note: in expansion of macro 'PARAMS' PARAMS(_fields), ) ^~~~~~ /tmp/B.BDr8ki/BUILD/lttng-modules-2.10.7/probes/../probes/lttng-tracepoint-event-impl.h:51:2: note: in expansion of macro 'LTTNG_TRACEPOINT_EVENT_CLASS' LTTNG_TRACEPOINT_EVENT_CLASS(map, \ ^~~~~~~~~~~~~~~~~~~~~~~~~~~~ /tmp/B.BDr8ki/BUILD/lttng-modules-2.10.7/probes/../probes/lttng-tracepoint-event-impl.h:54:9: note: in expansion of macro 'PARAMS' PARAMS(fields)) \ ^~~~~~ /tmp/B.BDr8ki/BUILD/lttng-modules-2.10.7/probes/../probes/lttng-tracepoint-event-impl.h:97:2: note: in expansion of macro 'LTTNG_TRACEPOINT_EVENT_MAP' LTTNG_TRACEPOINT_EVENT_MAP(name, name, \ ^~~~~~~~~~~~~~~~~~~~~~~~~~ /tmp/B.BDr8ki/BUILD/lttng-modules-2.10.7/probes/../probes/lttng-tracepoint-event-impl.h:100:4: note: in expansion of macro 'PARAMS' PARAMS(fields)) ^~~~~~ /tmp/B.BDr8ki/BUILD/lttng-modules-2.10.7/probes/../instrumentation/events/lttng-module/signal.h:85:1: note: in expansion of macro 'LTTNG_TRACEPOINT_EVENT' LTTNG_TRACEPOINT_EVENT(signal_deliver, ^~~~~~~~~~~~~~~~~~~~~~ /tmp/B.BDr8ki/BUILD/lttng-modules-2.10.7/probes/../instrumentation/events/lttng-module/signal.h:91:2: note: in expansion of macro 'TP_FIELDS' TP_FIELDS( ^~~~~~~~~ /tmp/B.BDr8ki/BUILD/lttng-modules-2.10.7/probes/../probes/lttng-tracepoint-event-impl.h:889:2: note: in expansion of macro '_ctf_integer_ext_fetched' _ctf_integer_ext_fetched(_type, _item, _src, _byte_order, _base, _nowrite) ^~~~~~~~~~~~~~~~~~~~~~~~ /tmp/B.BDr8ki/BUILD/lttng-modules-2.10.7/probes/../probes/lttng-tracepoint-event-impl.h:906:2: note: in expansion of macro '_ctf_integer_ext_isuser0' _ctf_integer_ext_isuser##_user(_type, _item, _user_src, _byte_order, _base, _nowrite) ^~~~~~~~~~~~~~~~~~~~~~~ /tmp/B.BDr8ki/BUILD/lttng-modules-2.10.7/probes/../probes/lttng-events-write.h:23:2: note: in expansion of macro '_ctf_integer_ext' _ctf_integer_ext(_type, _item, _src, __BYTE_ORDER, 10, 0, 0) ^~~~~~~~~~~~~~~~ /tmp/B.BDr8ki/BUILD/lttng-modules-2.10.7/probes/../instrumentation/events/lttng-module/signal.h:16:3: note: in expansion of macro 'ctf_integer' ctf_integer(int, errno, \ ^~~~~~~~~~~ /tmp/B.BDr8ki/BUILD/lttng-modules-2.10.7/probes/../instrumentation/events/lttng-module/signal.h:93:3: note: in expansion of macro 'LTTNG_FIELDS_SIGINFO' LTTNG_FIELDS_SIGINFO(info) ^~~~~~~~~~~~~~~~~~~~ /tmp/B.BDr8ki/BUILD/lttng-modules-2.10.7/probes/../instrumentation/events/lttng-module/signal.h:21:10: warning: comparison of distinct pointer types lacks a cast (info == SEND_SIG_NOINFO || info == SEND_SIG_FORCED) ? \ ^~ /tmp/B.BDr8ki/BUILD/lttng-modules-2.10.7/probes/../probes/lttng-tracepoint-event-impl.h:1184:2: note: in definition of macro 'LTTNG_TRACEPOINT_EVENT_CLASS_CODE' _fields \ ^~~~~~~ /tmp/B.BDr8ki/BUILD/lttng-modules-2.10.7/probes/../probes/lttng-tracepoint-event-impl.h:117:3: note: in expansion of macro 'PARAMS' PARAMS(_fields), ) ^~~~~~ /tmp/B.BDr8ki/BUILD/lttng-modules-2.10.7/probes/../probes/lttng-tracepoint-event-impl.h:51:2: note: in expansion of macro 'LTTNG_TRACEPOINT_EVENT_CLASS' LTTNG_TRACEPOINT_EVENT_CLASS(map, \ ^~~~~~~~~~~~~~~~~~~~~~~~~~~~ /tmp/B.BDr8ki/BUILD/lttng-modules-2.10.7/probes/../probes/lttng-tracepoint-event-impl.h:54:9: note: in expansion of macro 'PARAMS' PARAMS(fields)) \ ^~~~~~ /tmp/B.BDr8ki/BUILD/lttng-modules-2.10.7/probes/../probes/lttng-tracepoint-event-impl.h:97:2: note: in expansion of macro 'LTTNG_TRACEPOINT_EVENT_MAP' LTTNG_TRACEPOINT_EVENT_MAP(name, name, \ ^~~~~~~~~~~~~~~~~~~~~~~~~~ /tmp/B.BDr8ki/BUILD/lttng-modules-2.10.7/probes/../probes/lttng-tracepoint-event-impl.h:100:4: note: in expansion of macro 'PARAMS' PARAMS(fields)) ^~~~~~ /tmp/B.BDr8ki/BUILD/lttng-modules-2.10.7/probes/../instrumentation/events/lttng-module/signal.h:85:1: note: in expansion of macro 'LTTNG_TRACEPOINT_EVENT' LTTNG_TRACEPOINT_EVENT(signal_deliver, ^~~~~~~~~~~~~~~~~~~~~~ /tmp/B.BDr8ki/BUILD/lttng-modules-2.10.7/probes/../instrumentation/events/lttng-module/signal.h:91:2: note: in expansion of macro 'TP_FIELDS' TP_FIELDS( ^~~~~~~~~ /tmp/B.BDr8ki/BUILD/lttng-modules-2.10.7/probes/../probes/lttng-tracepoint-event-impl.h:889:2: note: in expansion of macro '_ctf_integer_ext_fetched' _ctf_integer_ext_fetched(_type, _item, _src, _byte_order, _base, _nowrite) ^~~~~~~~~~~~~~~~~~~~~~~~ /tmp/B.BDr8ki/BUILD/lttng-modules-2.10.7/probes/../probes/lttng-tracepoint-event-impl.h:906:2: note: in expansion of macro '_ctf_integer_ext_isuser0' _ctf_integer_ext_isuser##_user(_type, _item, _user_src, _byte_order, _base, _nowrite) ^~~~~~~~~~~~~~~~~~~~~~~ /tmp/B.BDr8ki/BUILD/lttng-modules-2.10.7/probes/../probes/lttng-events-write.h:23:2: note: in expansion of macro '_ctf_integer_ext' _ctf_integer_ext(_type, _item, _src, __BYTE_ORDER, 10, 0, 0) ^~~~~~~~~~~~~~~~ /tmp/B.BDr8ki/BUILD/lttng-modules-2.10.7/probes/../instrumentation/events/lttng-module/signal.h:20:3: note: in expansion of macro 'ctf_integer' ctf_integer(int, code, \ ^~~~~~~~~~~ /tmp/B.BDr8ki/BUILD/lttng-modules-2.10.7/probes/../instrumentation/events/lttng-module/signal.h:93:3: note: in expansion of macro 'LTTNG_FIELDS_SIGINFO' LTTNG_FIELDS_SIGINFO(info) ^~~~~~~~~~~~~~~~~~~~ /tmp/B.BDr8ki/BUILD/lttng-modules-2.10.7/probes/../instrumentation/events/lttng-module/signal.h:23:11: warning: comparison of distinct pointer types lacks a cast ((info == SEND_SIG_PRIV) ? SI_KERNEL : info->si_code)) ^~ /tmp/B.BDr8ki/BUILD/lttng-modules-2.10.7/probes/../probes/lttng-tracepoint-event-impl.h:1184:2: note: in definition of macro 'LTTNG_TRACEPOINT_EVENT_CLASS_CODE' _fields \ ^~~~~~~ /tmp/B.BDr8ki/BUILD/lttng-modules-2.10.7/probes/../probes/lttng-tracepoint-event-impl.h:117:3: note: in expansion of macro 'PARAMS' PARAMS(_fields), ) ^~~~~~ /tmp/B.BDr8ki/BUILD/lttng-modules-2.10.7/probes/../probes/lttng-tracepoint-event-impl.h:51:2: note: in expansion of macro 'LTTNG_TRACEPOINT_EVENT_CLASS' LTTNG_TRACEPOINT_EVENT_CLASS(map, \ ^~~~~~~~~~~~~~~~~~~~~~~~~~~~ /tmp/B.BDr8ki/BUILD/lttng-modules-2.10.7/probes/../probes/lttng-tracepoint-event-impl.h:54:9: note: in expansion of macro 'PARAMS' PARAMS(fields)) \ ^~~~~~ /tmp/B.BDr8ki/BUILD/lttng-modules-2.10.7/probes/../probes/lttng-tracepoint-event-impl.h:97:2: note: in expansion of macro 'LTTNG_TRACEPOINT_EVENT_MAP' LTTNG_TRACEPOINT_EVENT_MAP(name, name, \ ^~~~~~~~~~~~~~~~~~~~~~~~~~ /tmp/B.BDr8ki/BUILD/lttng-modules-2.10.7/probes/../probes/lttng-tracepoint-event-impl.h:100:4: note: in expansion of macro 'PARAMS' PARAMS(fields)) ^~~~~~ /tmp/B.BDr8ki/BUILD/lttng-modules-2.10.7/probes/../instrumentation/events/lttng-module/signal.h:85:1: note: in expansion of macro 'LTTNG_TRACEPOINT_EVENT' LTTNG_TRACEPOINT_EVENT(signal_deliver, ^~~~~~~~~~~~~~~~~~~~~~ /tmp/B.BDr8ki/BUILD/lttng-modules-2.10.7/probes/../instrumentation/events/lttng-module/signal.h:91:2: note: in expansion of macro 'TP_FIELDS' TP_FIELDS( ^~~~~~~~~ /tmp/B.BDr8ki/BUILD/lttng-modules-2.10.7/probes/../probes/lttng-tracepoint-event-impl.h:889:2: note: in expansion of macro '_ctf_integer_ext_fetched' _ctf_integer_ext_fetched(_type, _item, _src, _byte_order, _base, _nowrite) ^~~~~~~~~~~~~~~~~~~~~~~~ /tmp/B.BDr8ki/BUILD/lttng-modules-2.10.7/probes/../probes/lttng-tracepoint-event-impl.h:906:2: note: in expansion of macro '_ctf_integer_ext_isuser0' _ctf_integer_ext_isuser##_user(_type, _item, _user_src, _byte_order, _base, _nowrite) ^~~~~~~~~~~~~~~~~~~~~~~ /tmp/B.BDr8ki/BUILD/lttng-modules-2.10.7/probes/../probes/lttng-events-write.h:23:2: note: in expansion of macro '_ctf_integer_ext' _ctf_integer_ext(_type, _item, _src, __BYTE_ORDER, 10, 0, 0) ^~~~~~~~~~~~~~~~ /tmp/B.BDr8ki/BUILD/lttng-modules-2.10.7/probes/../instrumentation/events/lttng-module/signal.h:20:3: note: in expansion of macro 'ctf_integer' ctf_integer(int, code, \ ^~~~~~~~~~~ /tmp/B.BDr8ki/BUILD/lttng-modules-2.10.7/probes/../instrumentation/events/lttng-module/signal.h:93:3: note: in expansion of macro 'LTTNG_FIELDS_SIGINFO' LTTNG_FIELDS_SIGINFO(info) ^~~~~~~~~~~~~~~~~~~~ make[3]: *** [scripts/Makefile.build:297: /tmp/B.BDr8ki/BUILD/lttng-modules-2.10.7/probes/lttng-probe-signal.o] Error 1 make[3]: *** Waiting for unfinished jobs.... CC [M] /tmp/B.BDr8ki/BUILD/lttng-modules-2.10.7/probes/lttng-probe-kvm-x86-mmu.o CC [M] /tmp/B.BDr8ki/BUILD/lttng-modules-2.10.7/lttng-context-hostname.o CC [M] /tmp/B.BDr8ki/BUILD/lttng-modules-2.10.7/probes/lttng.o CC [M] /tmp/B.BDr8ki/BUILD/lttng-modules-2.10.7/wrapper/trace-clock.o CC [M] /tmp/B.BDr8ki/BUILD/lttng-modules-2.10.7/probes/lttng-probe-napi.o CC [M] /tmp/B.BDr8ki/BUILD/lttng-modules-2.10.7/wrapper/page_alloc.o CC [M] /tmp/B.BDr8ki/BUILD/lttng-modules-2.10.7/lttng-filter.o CC [M] /tmp/B.BDr8ki/BUILD/lttng-modules-2.10.7/probes/lttng-probe-skb.o CC [M] /tmp/B.BDr8ki/BUILD/lttng-modules-2.10.7/probes/lttng-probe-kvm-x86.o CC [M] /tmp/B.BDr8ki/BUILD/lttng-modules-2.10.7/lttng-tracker-pid.o CC [M] /tmp/B.BDr8ki/BUILD/lttng-modules-2.10.7/lttng-filter-interpreter.o CC [M] /tmp/B.BDr8ki/BUILD/lttng-modules-2.10.7/lttng-filter-specialize.o CC [M] /tmp/B.BDr8ki/BUILD/lttng-modules-2.10.7/lttng-tp-mempool.o CC [M] /tmp/B.BDr8ki/BUILD/lttng-modules-2.10.7/probes/lttng-probe-block.o make[2]: *** [scripts/Makefile.build:516: /tmp/B.BDr8ki/BUILD/lttng-modules-2.10.7/probes] Error 2 make[2]: *** Waiting for unfinished jobs.... CC [M] /tmp/B.BDr8ki/BUILD/lttng-modules-2.10.7/lttng-filter-validator.o CC [M] /tmp/B.BDr8ki/BUILD/lttng-modules-2.10.7/probes/lttng-probe-user.o CC [M] /tmp/B.BDr8ki/BUILD/lttng-modules-2.10.7/wrapper/irqdesc.o CC [M] /tmp/B.BDr8ki/BUILD/lttng-modules-2.10.7/lttng-tracepoint.o /tmp/B.BDr8ki/BUILD/lttng-modules-2.10.7/lttng-tracepoint.c: In function 'lttng_tracepoint_coming': /tmp/B.BDr8ki/BUILD/lttng-modules-2.10.7/lttng-tracepoint.c:244:6: warning: assignment to 'struct tracepoint *' from 'tracepoint_ptr_t' {aka 'const int'} makes pointer from integer without a cast [-Wint-conversion] tp = tp_mod->mod->tracepoints_ptrs[i]; ^ /tmp/B.BDr8ki/BUILD/lttng-modules-2.10.7/lttng-tracepoint.c: In function 'lttng_tracepoint_going': /tmp/B.BDr8ki/BUILD/lttng-modules-2.10.7/lttng-tracepoint.c:285:6: warning: assignment to 'struct tracepoint *' from 'tracepoint_ptr_t' {aka 'const int'} makes pointer from integer without a cast [-Wint-conversion] tp = tp_mod->mod->tracepoints_ptrs[i]; ^ CC [M] /tmp/B.BDr8ki/BUILD/lttng-modules-2.10.7/lttng-context-perf-counters.o CC [M] /tmp/B.BDr8ki/BUILD/lttng-modules-2.10.7/wrapper/fdtable.o CC [M] /tmp/B.BDr8ki/BUILD/lttng-modules-2.10.7/lttng-statedump-impl.o CC [M] /tmp/B.BDr8ki/BUILD/lttng-modules-2.10.7/lttng-syscalls.o make[1]: *** [Makefile:1563: _module_/tmp/B.BDr8ki/BUILD/lttng-modules-2.10.7] Error 2 make: *** [Makefile:111: modules] Error 2 error: Bad exit status from /tmp/B.BDr8ki/BUILD/tmp/rpm-tmp.9137 (%build) RPM build errors: Bad exit status from /tmp/B.BDr8ki/BUILD/tmp/rpm-tmp.9137 (%build) ended at: Wed Jan 2 11:04:03 2019, done in 0:01:01.229499 error: No files produced. + chmod -R u+rwX /tmp/B.BDr8ki/BUILD + rm -rf /tmp/B.BDr8ki/tmp /tmp/B.BDr8ki/BUILD + rm -rf /tmp/B.BDr8ki Begin-PLD-Builder-Info Build-Time: user:109.59s sys:9.13s real:67.77s (faults io:0 non-io:2263784) End-PLD-Builder-Info
[Back to list of logs] [View rpm -qa of builder]