FailedOk

th/SRPMS[OK]
th/x32[OK]
th/i686[OK]
th/x86_64[OK]

ac/SRPMS[OK]
ac/i386[OK]
ac/i586[OK]
ac/i686[OK]
ac/alpha[OK]
ac/amd64[OK]
ac/athlon[OK]
ac/ppc[OK]
ac/sparc[OK]
ac/sparc64[OK]

Advanced Search
main()
Powered by PLD Linux
(c) 2002-2020 PLD Team
$Revision: 1.37 $
Powered by foobar.
Your IP: 34.201.9.19

mbrowse cac4e272-9d42-4250-8bb0-a6af84e26d17

Status:Failed
Source URL:https://buildlogs.pld-linux.org/pld/th/x32/FAIL/mbrowse,cac4e272-9d42-4250-8bb0-a6af84e26d17.bz2
text/plain URL:View!
full text:View!
rpm -qa of builder:View!
Date:2020/10/05 09:35:24
Runtime:0:00:05.098341

Toc:

  • error 1
  • collect2: error: ld returned 1 exit status
  • error 2
  • make[2]: *** [Makefile:356: mbrowse] Error 1
  • error 3
  • make[1]: *** [Makefile:357: all-recursive] Error 1
  • error 4
  • error: Bad exit status from /tmp/B.YZF6Wh/BUILD/tmp/rpm-tmp.17974 (%build)
  • error 5
  • RPM build errors:
  • error 6
  • error: No files produced.

Content:

config.status: executing depfiles commands
+ /usr/bin/make -Otarget -j9
/usr/bin/make  all-recursive
Making all in src
make[2]: Entering directory '/tmp/B.YZF6Wh/BUILD/mbrowse-0.3.1/src'
x86_64-pld-linux-gnux32-gcc -DHAVE_CONFIG_H -I. -I.. -I/usr/include/gtk-1.2 -I/usr/include/glib-1.2 -I/usr/libx32/glib/include -I/usr/include -DHAVE_NETSNMP    -O2 -fwrapv -pipe -Wformat -Werror=format-security -gdwarf-4 -fno-debug-types-section -fvar-tracking-assignments -g2 -Wp,-D_FORTIFY_SOURCE=2 -fstack-protector-strong --param=ssp-buffer-size=4 -Werror=trampolines -fPIC -mtune=generic -march=x86-64 -gdwarf-4 -fno-debug-types-section -fvar-tracking-assignments -g2  -Wall -MT main.o -MD -MP -MF .deps/main.Tpo -c -o main.o main.c
mv -f .deps/main.Tpo .deps/main.Po
make[2]: Leaving directory '/tmp/B.YZF6Wh/BUILD/mbrowse-0.3.1/src'
make[2]: Entering directory '/tmp/B.YZF6Wh/BUILD/mbrowse-0.3.1/src'
x86_64-pld-linux-gnux32-gcc -DHAVE_CONFIG_H -I. -I.. -I/usr/include/gtk-1.2 -I/usr/include/glib-1.2 -I/usr/libx32/glib/include -I/usr/include -DHAVE_NETSNMP    -O2 -fwrapv -pipe -Wformat -Werror=format-security -gdwarf-4 -fno-debug-types-section -fvar-tracking-assignments -g2 -Wp,-D_FORTIFY_SOURCE=2 -fstack-protector-strong --param=ssp-buffer-size=4 -Werror=trampolines -fPIC -mtune=generic -march=x86-64 -gdwarf-4 -fno-debug-types-section -fvar-tracking-assignments -g2  -Wall -MT bookmarks.o -MD -MP -MF .deps/bookmarks.Tpo -c -o bookmarks.o bookmarks.c
mv -f .deps/bookmarks.Tpo .deps/bookmarks.Po
make[2]: Leaving directory '/tmp/B.YZF6Wh/BUILD/mbrowse-0.3.1/src'
make[2]: Entering directory '/tmp/B.YZF6Wh/BUILD/mbrowse-0.3.1/src'
x86_64-pld-linux-gnux32-gcc -DHAVE_CONFIG_H -I. -I.. -I/usr/include/gtk-1.2 -I/usr/include/glib-1.2 -I/usr/libx32/glib/include -I/usr/include -DHAVE_NETSNMP    -O2 -fwrapv -pipe -Wformat -Werror=format-security -gdwarf-4 -fno-debug-types-section -fvar-tracking-assignments -g2 -Wp,-D_FORTIFY_SOURCE=2 -fstack-protector-strong --param=ssp-buffer-size=4 -Werror=trampolines -fPIC -mtune=generic -march=x86-64 -gdwarf-4 -fno-debug-types-section -fvar-tracking-assignments -g2  -Wall -MT snmpstuff.o -MD -MP -MF .deps/snmpstuff.Tpo -c -o snmpstuff.o snmpstuff.c
snmpstuff.c: In function 'mbrowse_create_snmp_session':
snmpstuff.c:66:3: warning: 'remote_port' is deprecated [-Wdeprecated-declarations]
   66 |   session->remote_port = config->snmp_port;
      |   ^~~~~~~
In file included from /usr/include/net-snmp/definitions.h:22,
                 from /usr/include/net-snmp/net-snmp-includes.h:24,
                 from callbacks.h:7,
                 from snmpstuff.c:25:
/usr/include/net-snmp/types.h:307:21: note: declared here
  307 |     u_short         remote_port NETSNMP_ATTRIBUTE_DEPRECATED;
      |                     ^~~~~~~~~~~
snmpstuff.c:69:26: warning: pointer targets in assignment from 'char *' to 'u_char *' {aka 'unsigned char *'} differ in signedness [-Wpointer-sign]
   69 |       session->community = get_writecomm();
      |                          ^
snmpstuff.c:73:26: warning: pointer targets in assignment from 'char *' to 'u_char *' {aka 'unsigned char *'} differ in signedness [-Wpointer-sign]
   73 |       session->community = get_readcomm();
      |                          ^
snmpstuff.c:76:42: warning: pointer targets in passing argument 1 of 'strlen' differ in signedness [-Wpointer-sign]
   76 |   session->community_len = strlen(session->community);
      |                                   ~~~~~~~^~~~~~~~~~~
      |                                          |
      |                                          u_char * {aka unsigned char *}
In file included from snmpstuff.c:23:
/usr/include/string.h:391:35: note: expected 'const char *' but argument is of type 'u_char *' {aka 'unsigned char *'}
  391 | extern size_t strlen (const char *__s)
      |                       ~~~~~~~~~~~~^~~
snmpstuff.c: In function 'snmpget':
snmpstuff.c:139:5: warning: this 'else' clause does not guard... [-Wmisleading-indentation]
  139 |   } else
      |     ^~~~
snmpstuff.c:142:5: note: ...this statement, but the latter is misleadingly indented as if it were guarded by the 'else'
  142 |     status = snmp_synch_response(ss, pdu, &response);
      |     ^~~~~~
mv -f .deps/snmpstuff.Tpo .deps/snmpstuff.Po
make[2]: Leaving directory '/tmp/B.YZF6Wh/BUILD/mbrowse-0.3.1/src'
make[2]: Entering directory '/tmp/B.YZF6Wh/BUILD/mbrowse-0.3.1/src'
x86_64-pld-linux-gnux32-gcc -DHAVE_CONFIG_H -I. -I.. -I/usr/include/gtk-1.2 -I/usr/include/glib-1.2 -I/usr/libx32/glib/include -I/usr/include -DHAVE_NETSNMP    -O2 -fwrapv -pipe -Wformat -Werror=format-security -gdwarf-4 -fno-debug-types-section -fvar-tracking-assignments -g2 -Wp,-D_FORTIFY_SOURCE=2 -fstack-protector-strong --param=ssp-buffer-size=4 -Werror=trampolines -fPIC -mtune=generic -march=x86-64 -gdwarf-4 -fno-debug-types-section -fvar-tracking-assignments -g2  -Wall -MT mibtree.o -MD -MP -MF .deps/mibtree.Tpo -c -o mibtree.o mibtree.c
mv -f .deps/mibtree.Tpo .deps/mibtree.Po
make[2]: Leaving directory '/tmp/B.YZF6Wh/BUILD/mbrowse-0.3.1/src'
make[2]: Entering directory '/tmp/B.YZF6Wh/BUILD/mbrowse-0.3.1/src'
x86_64-pld-linux-gnux32-gcc -DHAVE_CONFIG_H -I. -I.. -I/usr/include/gtk-1.2 -I/usr/include/glib-1.2 -I/usr/libx32/glib/include -I/usr/include -DHAVE_NETSNMP    -O2 -fwrapv -pipe -Wformat -Werror=format-security -gdwarf-4 -fno-debug-types-section -fvar-tracking-assignments -g2 -Wp,-D_FORTIFY_SOURCE=2 -fstack-protector-strong --param=ssp-buffer-size=4 -Werror=trampolines -fPIC -mtune=generic -march=x86-64 -gdwarf-4 -fno-debug-types-section -fvar-tracking-assignments -g2  -Wall -MT search.o -MD -MP -MF .deps/search.Tpo -c -o search.o search.c
mv -f .deps/search.Tpo .deps/search.Po
make[2]: Leaving directory '/tmp/B.YZF6Wh/BUILD/mbrowse-0.3.1/src'
make[2]: Entering directory '/tmp/B.YZF6Wh/BUILD/mbrowse-0.3.1/src'
x86_64-pld-linux-gnux32-gcc -DHAVE_CONFIG_H -I. -I.. -I/usr/include/gtk-1.2 -I/usr/include/glib-1.2 -I/usr/libx32/glib/include -I/usr/include -DHAVE_NETSNMP    -O2 -fwrapv -pipe -Wformat -Werror=format-security -gdwarf-4 -fno-debug-types-section -fvar-tracking-assignments -g2 -Wp,-D_FORTIFY_SOURCE=2 -fstack-protector-strong --param=ssp-buffer-size=4 -Werror=trampolines -fPIC -mtune=generic -march=x86-64 -gdwarf-4 -fno-debug-types-section -fvar-tracking-assignments -g2  -Wall -MT callbacks.o -MD -MP -MF .deps/callbacks.Tpo -c -o callbacks.o callbacks.c
callbacks.c: In function 'on_get_butt_clicked':
callbacks.c:113:19: warning: variable 'mwid' set but not used [-Wunused-but-set-variable]
  113 |   main_widgets_t *mwid;
      |                   ^~~~
callbacks.c: In function 'on_walk_butt_clicked':
callbacks.c:134:19: warning: variable 'mwid' set but not used [-Wunused-but-set-variable]
  134 |   main_widgets_t *mwid;
      |                   ^~~~
callbacks.c: In function 'on_set_butt_clicked':
callbacks.c:179:19: warning: variable 'mwid' set but not used [-Wunused-but-set-variable]
  179 |   main_widgets_t *mwid;
      |                   ^~~~
callbacks.c: In function 'oid_entry_changed':
callbacks.c:258:17: warning: variable 'selection' set but not used [-Wunused-but-set-variable]
  258 |   GtkCTreeNode *selection = NULL;
      |                 ^~~~~~~~~
mv -f .deps/callbacks.Tpo .deps/callbacks.Po
make[2]: Leaving directory '/tmp/B.YZF6Wh/BUILD/mbrowse-0.3.1/src'
make[2]: Entering directory '/tmp/B.YZF6Wh/BUILD/mbrowse-0.3.1/src'
x86_64-pld-linux-gnux32-gcc -DHAVE_CONFIG_H -I. -I.. -I/usr/include/gtk-1.2 -I/usr/include/glib-1.2 -I/usr/libx32/glib/include -I/usr/include -DHAVE_NETSNMP    -O2 -fwrapv -pipe -Wformat -Werror=format-security -gdwarf-4 -fno-debug-types-section -fvar-tracking-assignments -g2 -Wp,-D_FORTIFY_SOURCE=2 -fstack-protector-strong --param=ssp-buffer-size=4 -Werror=trampolines -fPIC -mtune=generic -march=x86-64 -gdwarf-4 -fno-debug-types-section -fvar-tracking-assignments -g2  -Wall -MT details.o -MD -MP -MF .deps/details.Tpo -c -o details.o details.c
mv -f .deps/details.Tpo .deps/details.Po
make[2]: Leaving directory '/tmp/B.YZF6Wh/BUILD/mbrowse-0.3.1/src'
make[2]: Entering directory '/tmp/B.YZF6Wh/BUILD/mbrowse-0.3.1/src'
x86_64-pld-linux-gnux32-gcc -DHAVE_CONFIG_H -I. -I.. -I/usr/include/gtk-1.2 -I/usr/include/glib-1.2 -I/usr/libx32/glib/include -I/usr/include -DHAVE_NETSNMP    -O2 -fwrapv -pipe -Wformat -Werror=format-security -gdwarf-4 -fno-debug-types-section -fvar-tracking-assignments -g2 -Wp,-D_FORTIFY_SOURCE=2 -fstack-protector-strong --param=ssp-buffer-size=4 -Werror=trampolines -fPIC -mtune=generic -march=x86-64 -gdwarf-4 -fno-debug-types-section -fvar-tracking-assignments -g2  -Wall -MT interface.o -MD -MP -MF .deps/interface.Tpo -c -o interface.o interface.c
mv -f .deps/interface.Tpo .deps/interface.Po
make[2]: Leaving directory '/tmp/B.YZF6Wh/BUILD/mbrowse-0.3.1/src'
make[2]: Entering directory '/tmp/B.YZF6Wh/BUILD/mbrowse-0.3.1/src'
x86_64-pld-linux-gnux32-gcc -DHAVE_CONFIG_H -I. -I.. -I/usr/include/gtk-1.2 -I/usr/include/glib-1.2 -I/usr/libx32/glib/include -I/usr/include -DHAVE_NETSNMP    -O2 -fwrapv -pipe -Wformat -Werror=format-security -gdwarf-4 -fno-debug-types-section -fvar-tracking-assignments -g2 -Wp,-D_FORTIFY_SOURCE=2 -fstack-protector-strong --param=ssp-buffer-size=4 -Werror=trampolines -fPIC -mtune=generic -march=x86-64 -gdwarf-4 -fno-debug-types-section -fvar-tracking-assignments -g2  -Wall -MT configuration.o -MD -MP -MF .deps/configuration.Tpo -c -o configuration.o configuration.c
In file included from /usr/include/string.h:519,
                 from configuration.c:20:
In function 'strncpy',
    inlined from 'load_config' at configuration.c:166:3:
/usr/include/bits/string_fortified.h:106:10: warning: '__builtin_strncpy' specified bound 1023 equals destination size [-Wstringop-truncation]
  106 |   return __builtin___strncpy_chk (__dest, __src, __len, __bos (__dest));
      |          ^~~~~~~~~~~~~~~~~~~~~~~~~~~~~~~~~~~~~~~~~~~~~~~~~~~~~~~~~~~~~~
mv -f .deps/configuration.Tpo .deps/configuration.Po
make[2]: Leaving directory '/tmp/B.YZF6Wh/BUILD/mbrowse-0.3.1/src'
make[2]: Entering directory '/tmp/B.YZF6Wh/BUILD/mbrowse-0.3.1/src'
x86_64-pld-linux-gnux32-gcc  -O2 -fwrapv -pipe -Wformat -Werror=format-security -gdwarf-4 -fno-debug-types-section -fvar-tracking-assignments -g2 -Wp,-D_FORTIFY_SOURCE=2 -fstack-protector-strong --param=ssp-buffer-size=4 -Werror=trampolines -fPIC -mtune=generic -march=x86-64 -gdwarf-4 -fno-debug-types-section -fvar-tracking-assignments -g2  -Wall   -o mbrowse main.o interface.o details.o callbacks.o snmpstuff.o bookmarks.o mibtree.o configuration.o search.o -lgtk -lgdk -rdynamic -lgmodule -lglib -ldl -lXi -lXext -lX11 -lm -L/usr/libx32 -lnetsnmp -lm -lcom_err -lkrb5 -lssh2 -lssl -lssl -lcrypto 
/usr/bin/ld: bookmarks.o:/tmp/B.YZF6Wh/BUILD/mbrowse-0.3.1/src/bookmarks.c:35: multiple definition of `bookmark_items'; callbacks.o:/tmp/B.YZF6Wh/BUILD/mbrowse-0.3.1/src/callbacks.c:36: first defined here
collect2: error: ld returned 1 exit status
make[2]: *** [Makefile:356: mbrowse] Error 1
make[2]: Leaving directory '/tmp/B.YZF6Wh/BUILD/mbrowse-0.3.1/src'
make[1]: *** [Makefile:357: all-recursive] Error 1
make: *** [Makefile:298: all] Error 2
error: Bad exit status from /tmp/B.YZF6Wh/BUILD/tmp/rpm-tmp.17974 (%build)


RPM build errors:
    Bad exit status from /tmp/B.YZF6Wh/BUILD/tmp/rpm-tmp.17974 (%build)
ended at: Mon Oct  5 09:35:24 2020, done in 0:00:05.098341
error: No files produced.
+ chmod -R u+rwX /tmp/B.YZF6Wh/BUILD
+ rm -rf /tmp/B.YZF6Wh/tmp /tmp/B.YZF6Wh/BUILD
+ rm -rf /tmp/B.YZF6Wh
Begin-PLD-Builder-Info
Build-Time: user:7.37s sys:0.78s real:7.90s (faults io:2 non-io:320701)

End-PLD-Builder-Info
[Back to list of logs] [View rpm -qa of builder]