FailedOk

th/SRPMS[OK]
th/x32[OK]
th/i686[OK]
th/x86_64[OK]

ac/SRPMS[OK]
ac/i386[OK]
ac/i586[OK]
ac/i686[OK]
ac/alpha[OK]
ac/amd64[OK]
ac/athlon[OK]
ac/ppc[OK]
ac/sparc[OK]
ac/sparc64[OK]

Advanced Search
main()
Powered by PLD Linux
(c) 2002-2017 PLD Team
$Revision: 1.37 $
Powered by Real Operating System.
Your IP: 54.83.122.227

mozjs52 6f596468-e935-468a-bd69-37f8defbad0d

Status:Failed
Source URL:ftp://buildlogs.pld-linux.org/th/x32/FAIL/mozjs52,6f596468-e935-468a-bd69-37f8defbad0d.bz2
text/plain URL:View!
full text:View!
rpm -qa of builder:View!
Date:2017/10/11 21:16:45
Runtime:0:00:50.714280

Toc:

  • error 1
  • /usr/include/bits/sysctl.h:19:3: error: #error "sysctl system call is unsupported in x32 kernel"
  • error 2
  • error: Bad exit status from /tmp/B.FvamER/BUILD/tmp/rpm-tmp.66828 (%build)
  • error 3
  • RPM build errors:
  • error 4
  • error: No files produced.

Content:

make[3]: Entering directory '/tmp/B.FvamER/BUILD/firefox-52.4.0esr/js/src/js/src'
jsautokw.h
/tmp/B.FvamER/BUILD/firefox-52.4.0esr/_virtualenv/bin/python -m mozbuild.action.file_generate /tmp/B.FvamER/BUILD/firefox-52.4.0esr/js/src/jsautokw.py main jsautokw.h .deps/jsautokw.h.pp /tmp/B.FvamER/BUILD/firefox-52.4.0esr/js/src/vm/Keywords.h
make[3]: Leaving directory '/tmp/B.FvamER/BUILD/firefox-52.4.0esr/js/src/js/src'
make[3]: Entering directory '/tmp/B.FvamER/BUILD/firefox-52.4.0esr/js/src/js/src'
selfhosted.out.h
/tmp/B.FvamER/BUILD/firefox-52.4.0esr/_virtualenv/bin/python -m mozbuild.action.file_generate /tmp/B.FvamER/BUILD/firefox-52.4.0esr/js/src/builtin/embedjs.py generate_selfhosted selfhosted.out.h .deps/selfhosted.out.h.pp /tmp/B.FvamER/BUILD/firefox-52.4.0esr/js/src/js.msg /tmp/B.FvamER/BUILD/firefox-52.4.0esr/js/src/builtin/TypedObjectConstants.h /tmp/B.FvamER/BUILD/firefox-52.4.0esr/js/src/builtin/SelfHostingDefines.h /tmp/B.FvamER/BUILD/firefox-52.4.0esr/js/src/builtin/Utilities.js /tmp/B.FvamER/BUILD/firefox-52.4.0esr/js/src/builtin/Array.js /tmp/B.FvamER/BUILD/firefox-52.4.0esr/js/src/builtin/Classes.js /tmp/B.FvamER/BUILD/firefox-52.4.0esr/js/src/builtin/Date.js /tmp/B.FvamER/BUILD/firefox-52.4.0esr/js/src/builtin/Error.js /tmp/B.FvamER/BUILD/firefox-52.4.0esr/js/src/builtin/Function.js /tmp/B.FvamER/BUILD/firefox-52.4.0esr/js/src/builtin/Generator.js /tmp/B.FvamER/BUILD/firefox-52.4.0esr/js/src/builtin/Intl.js /tmp/B.FvamER/BUILD/firefox-52.4.0esr/js/src/builtin/IntlData.js /tmp/B.FvamER/BUILD/firefox-52.4.0esr/js/src/builtin/Iterator.js /tmp/B.FvamER/BUILD/firefox-52.4.0esr/js/src/builtin/Map.js /tmp/B.FvamER/BUILD/firefox-52.4.0esr/js/src/builtin/Module.js /tmp/B.FvamER/BUILD/firefox-52.4.0esr/js/src/builtin/Number.js /tmp/B.FvamER/BUILD/firefox-52.4.0esr/js/src/builtin/Object.js /tmp/B.FvamER/BUILD/firefox-52.4.0esr/js/src/builtin/Reflect.js /tmp/B.FvamER/BUILD/firefox-52.4.0esr/js/src/builtin/RegExp.js /tmp/B.FvamER/BUILD/firefox-52.4.0esr/js/src/builtin/RegExpGlobalReplaceOpt.h.js /tmp/B.FvamER/BUILD/firefox-52.4.0esr/js/src/builtin/RegExpLocalReplaceOpt.h.js /tmp/B.FvamER/BUILD/firefox-52.4.0esr/js/src/builtin/String.js /tmp/B.FvamER/BUILD/firefox-52.4.0esr/js/src/builtin/Set.js /tmp/B.FvamER/BUILD/firefox-52.4.0esr/js/src/builtin/Sorting.js /tmp/B.FvamER/BUILD/firefox-52.4.0esr/js/src/builtin/TypedArray.js /tmp/B.FvamER/BUILD/firefox-52.4.0esr/js/src/builtin/TypedObject.js /tmp/B.FvamER/BUILD/firefox-52.4.0esr/js/src/builtin/WeakMap.js /tmp/B.FvamER/BUILD/firefox-52.4.0esr/js/src/builtin/WeakSet.js /tmp/B.FvamER/BUILD/firefox-52.4.0esr/js/src/builtin/Promise.js
/usr/bin/x86_64-pld-linux-gnux32-g++ -std=gnu++11 -E -o self-hosting-preprocessed.pp -DHAVE_SINCOS=1 -DHAVE_POSIX_FALLOCATE=1 -DXP_UNIX=1 -DEXPOSE_INTL_API=1 -DJS_NUNBOX32=1 -DNO_NSPR_10_SUPPORT=1 -DHAVE_LIBM=1 -DHAVE_STDINT_H=1 -DHAVE_POSIX_MEMALIGN=1 -DHAVE___CXA_DEMANGLE=1 -DHAVE_CLOCK_MONOTONIC=1 -DHAVE_GETC_UNLOCKED=1 -DHAVE_SYS_QUEUE_H=1 -DMALLOC_H=<malloc.h> -DHAVE_PTHREAD_GETNAME_NP=1 -DHAVE_LANGINFO_CODESET=1 -DSTDC_HEADERS=1 -DHAVE_SYS_MOUNT_H=1 -DHAVE_MALLOC_H=1 -DTRIMMED=1 -DHAVE_MALLOC_USABLE_SIZE=1 -DJS_CODEGEN_X64=1 -D_REENTRANT=1 -DHAVE_ALLOCA_H=1 -DMOZ_DLL_SUFFIX=".so" -DMOZ_MEMORY=1 -DHAVE_STRNDUP=1 -DRELEASE_OR_BETA=1 -DCROSS_COMPILE= -DMOZILLA_UAVERSION="52.0" -DHAVE_POSIX_FADVISE=1 -DHAVE_GETOPT_H=1 -DHAVE_CPP_DYNAMIC_CAST_TO_VOID_PTR=1 -DHAVE_THREAD_TLS_KEYWORD=1 -DENABLE_INTL_API=1 -DHAVE_TM_ZONE_TM_GMTOFF=1 -DVA_COPY=va_copy -DHAVE_MEMALIGN=1 -DHAVE_LOCALECONV=1 -DMOZILLA_VERSION_U=52.4.0 -DHAVE_CPUID_H=1 -DHAVE_SYS_QUOTA_H=1 -DMOZ_BUILD_APP=js -DMOZJS_MAJOR_VERSION=52 -DHAVE_SETLOCALE=1 -DHAVE_SYS_STATFS_H=1 -DSPIDERMONKEY_PROMISE=1 -DMOZILLA_VERSION="52.4.0" -DHAVE_VISIBILITY_ATTRIBUTE=1 -DHAVE_MBRTOWC=1 -DHAVE_INTTYPES_H=1 -DHAVE_UNISTD_H=1 -DMOZ_MEMORY_LINUX=1 -DHAVE_LINUX_RTNETLINK_H=1 -DHAVE_VISIBILITY_HIDDEN_ATTRIBUTE=1 -DHAVE_LINUX_IF_ADDR_H=1 -DHAVE_I18N_LC_MESSAGES=1 -DD_INO=d_ino -DJS_TRACE_LOGGING=1 -DHAVE_LINUX_PERF_EVENT_H=1 -DHAVE_DLOPEN=1 -DHAVE_GMTIME_R=1 -DJS_DEFAULT_JITREPORT_GRANULARITY=3 -DHAVE_SYS_VFS_H=1 -DHAVE_WCRTOMB=1 -DJS_CPU_X64=1 -DCPP_THROW_NEW=throw() -DHAVE_SYS_TYPES_H=1 -DGTEST_HAS_RTTI=0 -DHAVE_SSIZE_T=1 -DHAVE_DIRENT_H=1 -DHAVE_NL_TYPES_H=1 -DXP_LINUX=1 -DHAVE_RES_NINIT=1 -DHAVE_CPP_AMBIGUITY_RESOLVING_USING=1 -DHAVE_LINUX_QUOTA_H=1 -DHAVE_VA_COPY=1 -DNDEBUG=1 -DHAVE_NETINET_IN_H=1 -DMOZJS_MINOR_VERSION=4 -DHAVE_SYS_STATVFS_H=1 -DHAVE_BYTESWAP_H=1 -DENABLE_TESTS=1 -DMOZ_UPDATE_CHANNEL=default -DHAVE_VALLOC=1 -DMALLOC_USABLE_SIZE_CONST_PTR= -DEDITLINE=1 -DHAVE_LOCALTIME_R=1 -DHAVE_VA_LIST_AS_ARRAY=1 self-hosting-cpp-input.cpp
make[3]: Leaving directory '/tmp/B.FvamER/BUILD/firefox-52.4.0esr/js/src/js/src'
make[3]: Entering directory '/tmp/B.FvamER/BUILD/firefox-52.4.0esr/js/src/js/src'
../../config/nsinstall -R -m 644 'js-config.h' '../../dist/include'
make[3]: Leaving directory '/tmp/B.FvamER/BUILD/firefox-52.4.0esr/js/src/js/src'
make[3]: Nothing to be done for 'export'.
make[3]: Nothing to be done for 'export'.
make[3]: Entering directory '/tmp/B.FvamER/BUILD/firefox-52.4.0esr/js/src/js/src/shell'
shellmoduleloader.out.h
/tmp/B.FvamER/BUILD/firefox-52.4.0esr/_virtualenv/bin/python -m mozbuild.action.file_generate /tmp/B.FvamER/BUILD/firefox-52.4.0esr/js/src/builtin/embedjs.py generate_shellmoduleloader shellmoduleloader.out.h .deps/shellmoduleloader.out.h.pp /tmp/B.FvamER/BUILD/firefox-52.4.0esr/js/src/js.msg /tmp/B.FvamER/BUILD/firefox-52.4.0esr/js/src/shell/ModuleLoader.js
/usr/bin/x86_64-pld-linux-gnux32-g++ -std=gnu++11 -E -o self-hosting-preprocessed.pp -DHAVE_SINCOS=1 -DHAVE_POSIX_FALLOCATE=1 -DXP_UNIX=1 -DEXPOSE_INTL_API=1 -DJS_NUNBOX32=1 -DNO_NSPR_10_SUPPORT=1 -DHAVE_LIBM=1 -DHAVE_STDINT_H=1 -DHAVE_POSIX_MEMALIGN=1 -DHAVE___CXA_DEMANGLE=1 -DHAVE_CLOCK_MONOTONIC=1 -DHAVE_GETC_UNLOCKED=1 -DHAVE_SYS_QUEUE_H=1 -DMALLOC_H=<malloc.h> -DHAVE_PTHREAD_GETNAME_NP=1 -DHAVE_LANGINFO_CODESET=1 -DSTDC_HEADERS=1 -DHAVE_SYS_MOUNT_H=1 -DHAVE_MALLOC_H=1 -DTRIMMED=1 -DHAVE_MALLOC_USABLE_SIZE=1 -DJS_CODEGEN_X64=1 -D_REENTRANT=1 -DHAVE_ALLOCA_H=1 -DMOZ_DLL_SUFFIX=".so" -DMOZ_MEMORY=1 -DHAVE_STRNDUP=1 -DRELEASE_OR_BETA=1 -DCROSS_COMPILE= -DMOZILLA_UAVERSION="52.0" -DHAVE_POSIX_FADVISE=1 -DHAVE_GETOPT_H=1 -DHAVE_CPP_DYNAMIC_CAST_TO_VOID_PTR=1 -DHAVE_THREAD_TLS_KEYWORD=1 -DENABLE_INTL_API=1 -DHAVE_TM_ZONE_TM_GMTOFF=1 -DVA_COPY=va_copy -DHAVE_MEMALIGN=1 -DHAVE_LOCALECONV=1 -DMOZILLA_VERSION_U=52.4.0 -DHAVE_CPUID_H=1 -DHAVE_SYS_QUOTA_H=1 -DMOZ_BUILD_APP=js -DMOZJS_MAJOR_VERSION=52 -DHAVE_SETLOCALE=1 -DHAVE_SYS_STATFS_H=1 -DSPIDERMONKEY_PROMISE=1 -DMOZILLA_VERSION="52.4.0" -DHAVE_VISIBILITY_ATTRIBUTE=1 -DHAVE_MBRTOWC=1 -DHAVE_INTTYPES_H=1 -DHAVE_UNISTD_H=1 -DMOZ_MEMORY_LINUX=1 -DHAVE_LINUX_RTNETLINK_H=1 -DHAVE_VISIBILITY_HIDDEN_ATTRIBUTE=1 -DHAVE_LINUX_IF_ADDR_H=1 -DHAVE_I18N_LC_MESSAGES=1 -DD_INO=d_ino -DJS_TRACE_LOGGING=1 -DHAVE_LINUX_PERF_EVENT_H=1 -DHAVE_DLOPEN=1 -DHAVE_GMTIME_R=1 -DJS_DEFAULT_JITREPORT_GRANULARITY=3 -DHAVE_SYS_VFS_H=1 -DHAVE_WCRTOMB=1 -DJS_CPU_X64=1 -DCPP_THROW_NEW=throw() -DHAVE_SYS_TYPES_H=1 -DGTEST_HAS_RTTI=0 -DHAVE_SSIZE_T=1 -DHAVE_DIRENT_H=1 -DHAVE_NL_TYPES_H=1 -DXP_LINUX=1 -DHAVE_RES_NINIT=1 -DHAVE_CPP_AMBIGUITY_RESOLVING_USING=1 -DHAVE_LINUX_QUOTA_H=1 -DHAVE_VA_COPY=1 -DNDEBUG=1 -DHAVE_NETINET_IN_H=1 -DMOZJS_MINOR_VERSION=4 -DHAVE_SYS_STATVFS_H=1 -DHAVE_BYTESWAP_H=1 -DENABLE_TESTS=1 -DMOZ_UPDATE_CHANNEL=default -DHAVE_VALLOC=1 -DMALLOC_USABLE_SIZE_CONST_PTR= -DEDITLINE=1 -DHAVE_LOCALTIME_R=1 -DHAVE_VA_LIST_AS_ARRAY=1 self-hosting-cpp-input.cpp
make[3]: Leaving directory '/tmp/B.FvamER/BUILD/firefox-52.4.0esr/js/src/js/src/shell'
/usr/bin/make recurse_compile
make[3]: Entering directory '/tmp/B.FvamER/BUILD/firefox-52.4.0esr/js/src/mozglue/misc'
mkdir -p '.deps/'
make[3]: Leaving directory '/tmp/B.FvamER/BUILD/firefox-52.4.0esr/js/src/mozglue/misc'
make[3]: Entering directory '/tmp/B.FvamER/BUILD/firefox-52.4.0esr/js/src/mfbt'
mkdir -p '.deps/'
make[3]: Leaving directory '/tmp/B.FvamER/BUILD/firefox-52.4.0esr/js/src/mfbt'
make[3]: Nothing to be done for 'host'.
make[3]: Entering directory '/tmp/B.FvamER/BUILD/firefox-52.4.0esr/js/src/memory/mozalloc'
mkdir -p '.deps/'
make[3]: Leaving directory '/tmp/B.FvamER/BUILD/firefox-52.4.0esr/js/src/memory/mozalloc'
make[3]: Entering directory '/tmp/B.FvamER/BUILD/firefox-52.4.0esr/js/src/modules/fdlibm/src'
mkdir -p '.deps/'
make[3]: Leaving directory '/tmp/B.FvamER/BUILD/firefox-52.4.0esr/js/src/modules/fdlibm/src'
make[3]: Entering directory '/tmp/B.FvamER/BUILD/firefox-52.4.0esr/js/src/memory/fallible'
mkdir -p '.deps/'
make[3]: Leaving directory '/tmp/B.FvamER/BUILD/firefox-52.4.0esr/js/src/memory/fallible'
make[3]: Entering directory '/tmp/B.FvamER/BUILD/firefox-52.4.0esr/js/src/memory/mozjemalloc'
mkdir -p '.deps/'
make[3]: Leaving directory '/tmp/B.FvamER/BUILD/firefox-52.4.0esr/js/src/memory/mozjemalloc'
make[3]: Entering directory '/tmp/B.FvamER/BUILD/firefox-52.4.0esr/js/src/memory/fallible'
/usr/bin/x86_64-pld-linux-gnux32-g++ -std=gnu++11 -o fallible.o -c  -I/tmp/B.FvamER/BUILD/firefox-52.4.0esr/js/src/dist/system_wrappers -include /tmp/B.FvamER/BUILD/firefox-52.4.0esr/config/gcc_hidden.h -DNDEBUG=1 -DTRIMMED=1 -I/tmp/B.FvamER/BUILD/firefox-52.4.0esr/memory/fallible -I/tmp/B.FvamER/BUILD/firefox-52.4.0esr/js/src/memory/fallible  -I/tmp/B.FvamER/BUILD/firefox-52.4.0esr/js/src/dist/include  -I/usr/include/nspr        -fPIC  -DMOZILLA_CLIENT -include /tmp/B.FvamER/BUILD/firefox-52.4.0esr/js/src/js/src/js-confdefs.h -MD -MP -MF .deps/fallible.o.pp  -Wall -Wc++11-compat -Wempty-body -Wignored-qualifiers -Woverloaded-virtual -Wpointer-arith -Wsign-compare -Wtype-limits -Wunreachable-code -Wwrite-strings -Wno-invalid-offsetof -Wc++14-compat -Wc++1z-compat -Wimplicit-fallthrough -Wno-error=maybe-uninitialized -Wno-error=deprecated-declarations -Wno-error=array-bounds -fno-lifetime-dse -O2 -fwrapv -pipe -Wformat -Werror=format-security -gdwarf-4 -fno-debug-types-section -fvar-tracking-assignments -g2 -Wp,-D_FORTIFY_SOURCE=2 -fstack-protector-strong --param=ssp-buffer-size=4 -fPIC -mtune=generic -march=x86-64 -gdwarf-4 -fno-debug-types-section -fvar-tracking-assignments -g2 -fno-rtti -fno-exceptions -fno-math-errno -pthread -pipe  -g -freorder-blocks -fomit-frame-pointer    /tmp/B.FvamER/BUILD/firefox-52.4.0esr/memory/fallible/fallible.cpp
make[3]: Leaving directory '/tmp/B.FvamER/BUILD/firefox-52.4.0esr/js/src/memory/fallible'
make[3]: Entering directory '/tmp/B.FvamER/BUILD/firefox-52.4.0esr/js/src/config/external/zlib'
libzlib.a.desc
rm -f libzlib.a
/tmp/B.FvamER/BUILD/firefox-52.4.0esr/_virtualenv/bin/python /tmp/B.FvamER/BUILD/firefox-52.4.0esr/config/expandlibs_gen.py -o libzlib.a.desc   
make[3]: Leaving directory '/tmp/B.FvamER/BUILD/firefox-52.4.0esr/js/src/config/external/zlib'
make[3]: Entering directory '/tmp/B.FvamER/BUILD/firefox-52.4.0esr/js/src/config/external/nspr'
libnspr.a.desc
rm -f libnspr.a
/tmp/B.FvamER/BUILD/firefox-52.4.0esr/_virtualenv/bin/python /tmp/B.FvamER/BUILD/firefox-52.4.0esr/config/expandlibs_gen.py -o libnspr.a.desc   
make[3]: Leaving directory '/tmp/B.FvamER/BUILD/firefox-52.4.0esr/js/src/config/external/nspr'
make[3]: Entering directory '/tmp/B.FvamER/BUILD/firefox-52.4.0esr/js/src/modules/fdlibm/src'
/usr/bin/x86_64-pld-linux-gnux32-g++ -std=gnu++11 -o e_acos.o -c  -I/tmp/B.FvamER/BUILD/firefox-52.4.0esr/js/src/dist/system_wrappers -include /tmp/B.FvamER/BUILD/firefox-52.4.0esr/config/gcc_hidden.h -DNDEBUG=1 -DTRIMMED=1 -DMOZ_HAS_MOZGLUE -I/tmp/B.FvamER/BUILD/firefox-52.4.0esr/modules/fdlibm/src -I/tmp/B.FvamER/BUILD/firefox-52.4.0esr/js/src/modules/fdlibm/src  -I/tmp/B.FvamER/BUILD/firefox-52.4.0esr/js/src/dist/include  -I/usr/include/nspr        -fPIC  -DMOZILLA_CLIENT -include /tmp/B.FvamER/BUILD/firefox-52.4.0esr/js/src/js/src/js-confdefs.h -MD -MP -MF .deps/e_acos.o.pp  -Wall -Wc++11-compat -Wempty-body -Wignored-qualifiers -Woverloaded-virtual -Wpointer-arith -Wsign-compare -Wtype-limits -Wunreachable-code -Wwrite-strings -Wno-invalid-offsetof -Wc++14-compat -Wc++1z-compat -Wimplicit-fallthrough -Wno-error=maybe-uninitialized -Wno-error=deprecated-declarations -Wno-error=array-bounds -fno-lifetime-dse -O2 -fwrapv -pipe -Wformat -Werror=format-security -gdwarf-4 -fno-debug-types-section -fvar-tracking-assignments -g2 -Wp,-D_FORTIFY_SOURCE=2 -fstack-protector-strong --param=ssp-buffer-size=4 -fPIC -mtune=generic -march=x86-64 -gdwarf-4 -fno-debug-types-section -fvar-tracking-assignments -g2 -fno-rtti -fno-exceptions -fno-math-errno -pthread -pipe  -g -freorder-blocks -fomit-frame-pointer  -Wno-parentheses -Wno-sign-compare  /tmp/B.FvamER/BUILD/firefox-52.4.0esr/modules/fdlibm/src/e_acos.cpp
make[3]: Leaving directory '/tmp/B.FvamER/BUILD/firefox-52.4.0esr/js/src/modules/fdlibm/src'
make[3]: Entering directory '/tmp/B.FvamER/BUILD/firefox-52.4.0esr/js/src/mozglue/misc'
/usr/bin/x86_64-pld-linux-gnux32-g++ -std=gnu++11 -o StackWalk.o -c  -I/tmp/B.FvamER/BUILD/firefox-52.4.0esr/js/src/dist/system_wrappers -include /tmp/B.FvamER/BUILD/firefox-52.4.0esr/config/gcc_hidden.h -DNDEBUG=1 -DTRIMMED=1 -DIMPL_MFBT -DMOZ_HAS_MOZGLUE -I/tmp/B.FvamER/BUILD/firefox-52.4.0esr/mozglue/misc -I/tmp/B.FvamER/BUILD/firefox-52.4.0esr/js/src/mozglue/misc  -I/tmp/B.FvamER/BUILD/firefox-52.4.0esr/js/src/dist/include  -I/usr/include/nspr        -fPIC  -DMOZILLA_CLIENT -include /tmp/B.FvamER/BUILD/firefox-52.4.0esr/js/src/js/src/js-confdefs.h -MD -MP -MF .deps/StackWalk.o.pp  -Wall -Wc++11-compat -Wempty-body -Wignored-qualifiers -Woverloaded-virtual -Wpointer-arith -Wsign-compare -Wtype-limits -Wunreachable-code -Wwrite-strings -Wno-invalid-offsetof -Wc++14-compat -Wc++1z-compat -Wimplicit-fallthrough -Wno-error=maybe-uninitialized -Wno-error=deprecated-declarations -Wno-error=array-bounds -fno-lifetime-dse -O2 -fwrapv -pipe -Wformat -Werror=format-security -gdwarf-4 -fno-debug-types-section -fvar-tracking-assignments -g2 -Wp,-D_FORTIFY_SOURCE=2 -fstack-protector-strong --param=ssp-buffer-size=4 -fPIC -mtune=generic -march=x86-64 -gdwarf-4 -fno-debug-types-section -fvar-tracking-assignments -g2 -fno-rtti -fno-exceptions -fno-math-errno -pthread -pipe  -g -freorder-blocks -fomit-frame-pointer    /tmp/B.FvamER/BUILD/firefox-52.4.0esr/mozglue/misc/StackWalk.cpp
make[3]: Leaving directory '/tmp/B.FvamER/BUILD/firefox-52.4.0esr/js/src/mozglue/misc'
make[3]: Entering directory '/tmp/B.FvamER/BUILD/firefox-52.4.0esr/js/src/config/external/icu'
libicu.a.desc
rm -f libicu.a
/tmp/B.FvamER/BUILD/firefox-52.4.0esr/_virtualenv/bin/python /tmp/B.FvamER/BUILD/firefox-52.4.0esr/config/expandlibs_gen.py -o libicu.a.desc   
make[3]: Leaving directory '/tmp/B.FvamER/BUILD/firefox-52.4.0esr/js/src/config/external/icu'
make[3]: Entering directory '/tmp/B.FvamER/BUILD/firefox-52.4.0esr/js/src/memory/fallible'
libfallible.a.desc
rm -f libfallible.a
/tmp/B.FvamER/BUILD/firefox-52.4.0esr/_virtualenv/bin/python /tmp/B.FvamER/BUILD/firefox-52.4.0esr/config/expandlibs_gen.py -o libfallible.a.desc fallible.o  
make[3]: Leaving directory '/tmp/B.FvamER/BUILD/firefox-52.4.0esr/js/src/memory/fallible'
make[3]: Entering directory '/tmp/B.FvamER/BUILD/firefox-52.4.0esr/js/src/modules/fdlibm/src'
/usr/bin/x86_64-pld-linux-gnux32-g++ -std=gnu++11 -o e_acosh.o -c  -I/tmp/B.FvamER/BUILD/firefox-52.4.0esr/js/src/dist/system_wrappers -include /tmp/B.FvamER/BUILD/firefox-52.4.0esr/config/gcc_hidden.h -DNDEBUG=1 -DTRIMMED=1 -DMOZ_HAS_MOZGLUE -I/tmp/B.FvamER/BUILD/firefox-52.4.0esr/modules/fdlibm/src -I/tmp/B.FvamER/BUILD/firefox-52.4.0esr/js/src/modules/fdlibm/src  -I/tmp/B.FvamER/BUILD/firefox-52.4.0esr/js/src/dist/include  -I/usr/include/nspr        -fPIC  -DMOZILLA_CLIENT -include /tmp/B.FvamER/BUILD/firefox-52.4.0esr/js/src/js/src/js-confdefs.h -MD -MP -MF .deps/e_acosh.o.pp  -Wall -Wc++11-compat -Wempty-body -Wignored-qualifiers -Woverloaded-virtual -Wpointer-arith -Wsign-compare -Wtype-limits -Wunreachable-code -Wwrite-strings -Wno-invalid-offsetof -Wc++14-compat -Wc++1z-compat -Wimplicit-fallthrough -Wno-error=maybe-uninitialized -Wno-error=deprecated-declarations -Wno-error=array-bounds -fno-lifetime-dse -O2 -fwrapv -pipe -Wformat -Werror=format-security -gdwarf-4 -fno-debug-types-section -fvar-tracking-assignments -g2 -Wp,-D_FORTIFY_SOURCE=2 -fstack-protector-strong --param=ssp-buffer-size=4 -fPIC -mtune=generic -march=x86-64 -gdwarf-4 -fno-debug-types-section -fvar-tracking-assignments -g2 -fno-rtti -fno-exceptions -fno-math-errno -pthread -pipe  -g -freorder-blocks -fomit-frame-pointer  -Wno-parentheses -Wno-sign-compare  /tmp/B.FvamER/BUILD/firefox-52.4.0esr/modules/fdlibm/src/e_acosh.cpp
make[3]: Leaving directory '/tmp/B.FvamER/BUILD/firefox-52.4.0esr/js/src/modules/fdlibm/src'
make[3]: Entering directory '/tmp/B.FvamER/BUILD/firefox-52.4.0esr/js/src/memory/mozalloc'
/usr/bin/x86_64-pld-linux-gnux32-g++ -std=gnu++11 -o Unified_cpp_memory_mozalloc0.o -c   -DNDEBUG=1 -DTRIMMED=1 -D_GNU_SOURCE -DIMPL_MFBT -DMOZ_HAS_MOZGLUE -I/tmp/B.FvamER/BUILD/firefox-52.4.0esr/memory/mozalloc -I/tmp/B.FvamER/BUILD/firefox-52.4.0esr/js/src/memory/mozalloc -I/tmp/B.FvamER/BUILD/firefox-52.4.0esr/js/src/xpcom -I/tmp/B.FvamER/BUILD/firefox-52.4.0esr/memory/build -I/tmp/B.FvamER/BUILD/firefox-52.4.0esr/js/src/dist/include  -I/usr/include/nspr        -fPIC  -DMOZILLA_CLIENT -include /tmp/B.FvamER/BUILD/firefox-52.4.0esr/js/src/js/src/js-confdefs.h -MD -MP -MF .deps/Unified_cpp_memory_mozalloc0.o.pp  -Wall -Wc++11-compat -Wempty-body -Wignored-qualifiers -Woverloaded-virtual -Wpointer-arith -Wsign-compare -Wtype-limits -Wunreachable-code -Wwrite-strings -Wno-invalid-offsetof -Wc++14-compat -Wc++1z-compat -Wimplicit-fallthrough -Wno-error=maybe-uninitialized -Wno-error=deprecated-declarations -Wno-error=array-bounds -fno-lifetime-dse -O2 -fwrapv -pipe -Wformat -Werror=format-security -gdwarf-4 -fno-debug-types-section -fvar-tracking-assignments -g2 -Wp,-D_FORTIFY_SOURCE=2 -fstack-protector-strong --param=ssp-buffer-size=4 -fPIC -mtune=generic -march=x86-64 -gdwarf-4 -fno-debug-types-section -fvar-tracking-assignments -g2 -fno-rtti -fno-exceptions -fno-math-errno -pthread -pipe  -g -freorder-blocks -fomit-frame-pointer    /tmp/B.FvamER/BUILD/firefox-52.4.0esr/js/src/memory/mozalloc/Unified_cpp_memory_mozalloc0.cpp
In file included from /tmp/B.FvamER/BUILD/firefox-52.4.0esr/memory/mozalloc/mozalloc.cpp:69:0,
                 from /tmp/B.FvamER/BUILD/firefox-52.4.0esr/js/src/memory/mozalloc/Unified_cpp_memory_mozalloc0.cpp:2:
/tmp/B.FvamER/BUILD/firefox-52.4.0esr/js/src/dist/include/mozilla/mozalloc.h:180:52: warning: dynamic exception specifications are deprecated in C++11 [-Wdeprecated]
 #define MOZALLOC_THROW_BAD_ALLOC_IF_HAS_EXCEPTIONS throw(std::bad_alloc)
                                                    ^
/tmp/B.FvamER/BUILD/firefox-52.4.0esr/js/src/dist/include/mozilla/mozalloc.h:183:34: note: in expansion of macro 'MOZALLOC_THROW_BAD_ALLOC_IF_HAS_EXCEPTIONS'
 #define MOZALLOC_THROW_BAD_ALLOC MOZALLOC_THROW_BAD_ALLOC_IF_HAS_EXCEPTIONS
                                  ^~~~~~~~~~~~~~~~~~~~~~~~~~~~~~~~~~~~~~~~~~
/tmp/B.FvamER/BUILD/firefox-52.4.0esr/js/src/dist/include/mozilla/mozalloc.h:192:33: note: in expansion of macro 'MOZALLOC_THROW_BAD_ALLOC'
 void* operator new(size_t size) MOZALLOC_THROW_BAD_ALLOC
                                 ^~~~~~~~~~~~~~~~~~~~~~~~
/tmp/B.FvamER/BUILD/firefox-52.4.0esr/js/src/dist/include/mozilla/mozalloc.h:180:52: warning: dynamic exception specifications are deprecated in C++11 [-Wdeprecated]
 #define MOZALLOC_THROW_BAD_ALLOC_IF_HAS_EXCEPTIONS throw(std::bad_alloc)
                                                    ^
/tmp/B.FvamER/BUILD/firefox-52.4.0esr/js/src/dist/include/mozilla/mozalloc.h:183:34: note: in expansion of macro 'MOZALLOC_THROW_BAD_ALLOC_IF_HAS_EXCEPTIONS'
 #define MOZALLOC_THROW_BAD_ALLOC MOZALLOC_THROW_BAD_ALLOC_IF_HAS_EXCEPTIONS
                                  ^~~~~~~~~~~~~~~~~~~~~~~~~~~~~~~~~~~~~~~~~~
/tmp/B.FvamER/BUILD/firefox-52.4.0esr/js/src/dist/include/mozilla/mozalloc.h:204:35: note: in expansion of macro 'MOZALLOC_THROW_BAD_ALLOC'
 void* operator new[](size_t size) MOZALLOC_THROW_BAD_ALLOC
                                   ^~~~~~~~~~~~~~~~~~~~~~~~
make[3]: Leaving directory '/tmp/B.FvamER/BUILD/firefox-52.4.0esr/js/src/memory/mozalloc'
make[3]: Entering directory '/tmp/B.FvamER/BUILD/firefox-52.4.0esr/js/src/memory/mozjemalloc'
/usr/bin/x86_64-pld-linux-gnux32-gcc -std=gnu99 -o jemalloc.o -c -I/tmp/B.FvamER/BUILD/firefox-52.4.0esr/js/src/dist/system_wrappers -include /tmp/B.FvamER/BUILD/firefox-52.4.0esr/config/gcc_hidden.h -DNDEBUG=1 -DTRIMMED=1 -DMOZ_JEMALLOC_HARD_ASSERTS -Dabort=moz_abort -DMOZ_JEMALLOC_IMPL -DMOZ_HAS_MOZGLUE -I/tmp/B.FvamER/BUILD/firefox-52.4.0esr/memory/mozjemalloc -I/tmp/B.FvamER/BUILD/firefox-52.4.0esr/js/src/memory/mozjemalloc -I/tmp/B.FvamER/BUILD/firefox-52.4.0esr/memory/build -I/tmp/B.FvamER/BUILD/firefox-52.4.0esr/js/src/dist/include  -I/usr/include/nspr        -fPIC  -include /tmp/B.FvamER/BUILD/firefox-52.4.0esr/js/src/js/src/js-confdefs.h -DMOZILLA_CLIENT -MD -MP -MF .deps/jemalloc.o.pp  -Wall -Wempty-body -Wignored-qualifiers -Wpointer-arith -Wsign-compare -Wtype-limits -Wunreachable-code -Wno-error=maybe-uninitialized -Wno-error=deprecated-declarations -Wno-error=array-bounds -fno-lifetime-dse -O2 -fwrapv -pipe -Wformat -Werror=format-security -gdwarf-4 -fno-debug-types-section -fvar-tracking-assignments -g2 -Wp,-D_FORTIFY_SOURCE=2 -fstack-protector-strong --param=ssp-buffer-size=4 -fPIC -mtune=generic -march=x86-64 -gdwarf-4 -fno-debug-types-section -fvar-tracking-assignments -g2 -fno-math-errno -pthread -pipe  -g -freorder-blocks -fomit-frame-pointer  -Wno-unused  /tmp/B.FvamER/BUILD/firefox-52.4.0esr/memory/mozjemalloc/jemalloc.c
In file included from /usr/include/sys/sysctl.h:63:0,
                 from /tmp/B.FvamER/BUILD/firefox-52.4.0esr/js/src/dist/system_wrappers/sys/sysctl.h:3,
                 from /tmp/B.FvamER/BUILD/firefox-52.4.0esr/memory/mozjemalloc/jemalloc.c:335:
/usr/include/bits/sysctl.h:19:3: error: #error "sysctl system call is unsupported in x32 kernel"
 # error "sysctl system call is unsupported in x32 kernel"
   ^~~~~
make[3]: *** [/tmp/B.FvamER/BUILD/firefox-52.4.0esr/config/rules.mk:883: jemalloc.o] Error 1
make[3]: Leaving directory '/tmp/B.FvamER/BUILD/firefox-52.4.0esr/js/src/memory/mozjemalloc'
make[2]: *** [/tmp/B.FvamER/BUILD/firefox-52.4.0esr/config/recurse.mk:71: memory/mozjemalloc/target] Error 2
make[2]: *** Waiting for unfinished jobs....
make[3]: Entering directory '/tmp/B.FvamER/BUILD/firefox-52.4.0esr/js/src/modules/fdlibm/src'
/usr/bin/x86_64-pld-linux-gnux32-g++ -std=gnu++11 -o e_asin.o -c  -I/tmp/B.FvamER/BUILD/firefox-52.4.0esr/js/src/dist/system_wrappers -include /tmp/B.FvamER/BUILD/firefox-52.4.0esr/config/gcc_hidden.h -DNDEBUG=1 -DTRIMMED=1 -DMOZ_HAS_MOZGLUE -I/tmp/B.FvamER/BUILD/firefox-52.4.0esr/modules/fdlibm/src -I/tmp/B.FvamER/BUILD/firefox-52.4.0esr/js/src/modules/fdlibm/src  -I/tmp/B.FvamER/BUILD/firefox-52.4.0esr/js/src/dist/include  -I/usr/include/nspr        -fPIC  -DMOZILLA_CLIENT -include /tmp/B.FvamER/BUILD/firefox-52.4.0esr/js/src/js/src/js-confdefs.h -MD -MP -MF .deps/e_asin.o.pp  -Wall -Wc++11-compat -Wempty-body -Wignored-qualifiers -Woverloaded-virtual -Wpointer-arith -Wsign-compare -Wtype-limits -Wunreachable-code -Wwrite-strings -Wno-invalid-offsetof -Wc++14-compat -Wc++1z-compat -Wimplicit-fallthrough -Wno-error=maybe-uninitialized -Wno-error=deprecated-declarations -Wno-error=array-bounds -fno-lifetime-dse -O2 -fwrapv -pipe -Wformat -Werror=format-security -gdwarf-4 -fno-debug-types-section -fvar-tracking-assignments -g2 -Wp,-D_FORTIFY_SOURCE=2 -fstack-protector-strong --param=ssp-buffer-size=4 -fPIC -mtune=generic -march=x86-64 -gdwarf-4 -fno-debug-types-section -fvar-tracking-assignments -g2 -fno-rtti -fno-exceptions -fno-math-errno -pthread -pipe  -g -freorder-blocks -fomit-frame-pointer  -Wno-parentheses -Wno-sign-compare  /tmp/B.FvamER/BUILD/firefox-52.4.0esr/modules/fdlibm/src/e_asin.cpp
make[3]: Leaving directory '/tmp/B.FvamER/BUILD/firefox-52.4.0esr/js/src/modules/fdlibm/src'
make[3]: Entering directory '/tmp/B.FvamER/BUILD/firefox-52.4.0esr/js/src/modules/fdlibm/src'
/usr/bin/x86_64-pld-linux-gnux32-g++ -std=gnu++11 -o e_atanh.o -c  -I/tmp/B.FvamER/BUILD/firefox-52.4.0esr/js/src/dist/system_wrappers -include /tmp/B.FvamER/BUILD/firefox-52.4.0esr/config/gcc_hidden.h -DNDEBUG=1 -DTRIMMED=1 -DMOZ_HAS_MOZGLUE -I/tmp/B.FvamER/BUILD/firefox-52.4.0esr/modules/fdlibm/src -I/tmp/B.FvamER/BUILD/firefox-52.4.0esr/js/src/modules/fdlibm/src  -I/tmp/B.FvamER/BUILD/firefox-52.4.0esr/js/src/dist/include  -I/usr/include/nspr        -fPIC  -DMOZILLA_CLIENT -include /tmp/B.FvamER/BUILD/firefox-52.4.0esr/js/src/js/src/js-confdefs.h -MD -MP -MF .deps/e_atanh.o.pp  -Wall -Wc++11-compat -Wempty-body -Wignored-qualifiers -Woverloaded-virtual -Wpointer-arith -Wsign-compare -Wtype-limits -Wunreachable-code -Wwrite-strings -Wno-invalid-offsetof -Wc++14-compat -Wc++1z-compat -Wimplicit-fallthrough -Wno-error=maybe-uninitialized -Wno-error=deprecated-declarations -Wno-error=array-bounds -fno-lifetime-dse -O2 -fwrapv -pipe -Wformat -Werror=format-security -gdwarf-4 -fno-debug-types-section -fvar-tracking-assignments -g2 -Wp,-D_FORTIFY_SOURCE=2 -fstack-protector-strong --param=ssp-buffer-size=4 -fPIC -mtune=generic -march=x86-64 -gdwarf-4 -fno-debug-types-section -fvar-tracking-assignments -g2 -fno-rtti -fno-exceptions -fno-math-errno -pthread -pipe  -g -freorder-blocks -fomit-frame-pointer  -Wno-parentheses -Wno-sign-compare  /tmp/B.FvamER/BUILD/firefox-52.4.0esr/modules/fdlibm/src/e_atanh.cpp
make[3]: Leaving directory '/tmp/B.FvamER/BUILD/firefox-52.4.0esr/js/src/modules/fdlibm/src'
make[3]: Entering directory '/tmp/B.FvamER/BUILD/firefox-52.4.0esr/js/src/mozglue/misc'
/usr/bin/x86_64-pld-linux-gnux32-g++ -std=gnu++11 -o TimeStamp.o -c  -I/tmp/B.FvamER/BUILD/firefox-52.4.0esr/js/src/dist/system_wrappers -include /tmp/B.FvamER/BUILD/firefox-52.4.0esr/config/gcc_hidden.h -DNDEBUG=1 -DTRIMMED=1 -DIMPL_MFBT -DMOZ_HAS_MOZGLUE -I/tmp/B.FvamER/BUILD/firefox-52.4.0esr/mozglue/misc -I/tmp/B.FvamER/BUILD/firefox-52.4.0esr/js/src/mozglue/misc  -I/tmp/B.FvamER/BUILD/firefox-52.4.0esr/js/src/dist/include  -I/usr/include/nspr        -fPIC  -DMOZILLA_CLIENT -include /tmp/B.FvamER/BUILD/firefox-52.4.0esr/js/src/js/src/js-confdefs.h -MD -MP -MF .deps/TimeStamp.o.pp  -Wall -Wc++11-compat -Wempty-body -Wignored-qualifiers -Woverloaded-virtual -Wpointer-arith -Wsign-compare -Wtype-limits -Wunreachable-code -Wwrite-strings -Wno-invalid-offsetof -Wc++14-compat -Wc++1z-compat -Wimplicit-fallthrough -Wno-error=maybe-uninitialized -Wno-error=deprecated-declarations -Wno-error=array-bounds -fno-lifetime-dse -O2 -fwrapv -pipe -Wformat -Werror=format-security -gdwarf-4 -fno-debug-types-section -fvar-tracking-assignments -g2 -Wp,-D_FORTIFY_SOURCE=2 -fstack-protector-strong --param=ssp-buffer-size=4 -fPIC -mtune=generic -march=x86-64 -gdwarf-4 -fno-debug-types-section -fvar-tracking-assignments -g2 -fno-rtti -fno-exceptions -fno-math-errno -pthread -pipe  -g -freorder-blocks -fomit-frame-pointer    /tmp/B.FvamER/BUILD/firefox-52.4.0esr/mozglue/misc/TimeStamp.cpp
make[3]: Leaving directory '/tmp/B.FvamER/BUILD/firefox-52.4.0esr/js/src/mozglue/misc'
make[3]: Entering directory '/tmp/B.FvamER/BUILD/firefox-52.4.0esr/js/src/modules/fdlibm/src'
/usr/bin/x86_64-pld-linux-gnux32-g++ -std=gnu++11 -o e_cosh.o -c  -I/tmp/B.FvamER/BUILD/firefox-52.4.0esr/js/src/dist/system_wrappers -include /tmp/B.FvamER/BUILD/firefox-52.4.0esr/config/gcc_hidden.h -DNDEBUG=1 -DTRIMMED=1 -DMOZ_HAS_MOZGLUE -I/tmp/B.FvamER/BUILD/firefox-52.4.0esr/modules/fdlibm/src -I/tmp/B.FvamER/BUILD/firefox-52.4.0esr/js/src/modules/fdlibm/src  -I/tmp/B.FvamER/BUILD/firefox-52.4.0esr/js/src/dist/include  -I/usr/include/nspr        -fPIC  -DMOZILLA_CLIENT -include /tmp/B.FvamER/BUILD/firefox-52.4.0esr/js/src/js/src/js-confdefs.h -MD -MP -MF .deps/e_cosh.o.pp  -Wall -Wc++11-compat -Wempty-body -Wignored-qualifiers -Woverloaded-virtual -Wpointer-arith -Wsign-compare -Wtype-limits -Wunreachable-code -Wwrite-strings -Wno-invalid-offsetof -Wc++14-compat -Wc++1z-compat -Wimplicit-fallthrough -Wno-error=maybe-uninitialized -Wno-error=deprecated-declarations -Wno-error=array-bounds -fno-lifetime-dse -O2 -fwrapv -pipe -Wformat -Werror=format-security -gdwarf-4 -fno-debug-types-section -fvar-tracking-assignments -g2 -Wp,-D_FORTIFY_SOURCE=2 -fstack-protector-strong --param=ssp-buffer-size=4 -fPIC -mtune=generic -march=x86-64 -gdwarf-4 -fno-debug-types-section -fvar-tracking-assignments -g2 -fno-rtti -fno-exceptions -fno-math-errno -pthread -pipe  -g -freorder-blocks -fomit-frame-pointer  -Wno-parentheses -Wno-sign-compare  /tmp/B.FvamER/BUILD/firefox-52.4.0esr/modules/fdlibm/src/e_cosh.cpp
make[3]: Leaving directory '/tmp/B.FvamER/BUILD/firefox-52.4.0esr/js/src/modules/fdlibm/src'
make[3]: Entering directory '/tmp/B.FvamER/BUILD/firefox-52.4.0esr/js/src/modules/fdlibm/src'
/usr/bin/x86_64-pld-linux-gnux32-g++ -std=gnu++11 -o e_atan2.o -c  -I/tmp/B.FvamER/BUILD/firefox-52.4.0esr/js/src/dist/system_wrappers -include /tmp/B.FvamER/BUILD/firefox-52.4.0esr/config/gcc_hidden.h -DNDEBUG=1 -DTRIMMED=1 -DMOZ_HAS_MOZGLUE -I/tmp/B.FvamER/BUILD/firefox-52.4.0esr/modules/fdlibm/src -I/tmp/B.FvamER/BUILD/firefox-52.4.0esr/js/src/modules/fdlibm/src  -I/tmp/B.FvamER/BUILD/firefox-52.4.0esr/js/src/dist/include  -I/usr/include/nspr        -fPIC  -DMOZILLA_CLIENT -include /tmp/B.FvamER/BUILD/firefox-52.4.0esr/js/src/js/src/js-confdefs.h -MD -MP -MF .deps/e_atan2.o.pp  -Wall -Wc++11-compat -Wempty-body -Wignored-qualifiers -Woverloaded-virtual -Wpointer-arith -Wsign-compare -Wtype-limits -Wunreachable-code -Wwrite-strings -Wno-invalid-offsetof -Wc++14-compat -Wc++1z-compat -Wimplicit-fallthrough -Wno-error=maybe-uninitialized -Wno-error=deprecated-declarations -Wno-error=array-bounds -fno-lifetime-dse -O2 -fwrapv -pipe -Wformat -Werror=format-security -gdwarf-4 -fno-debug-types-section -fvar-tracking-assignments -g2 -Wp,-D_FORTIFY_SOURCE=2 -fstack-protector-strong --param=ssp-buffer-size=4 -fPIC -mtune=generic -march=x86-64 -gdwarf-4 -fno-debug-types-section -fvar-tracking-assignments -g2 -fno-rtti -fno-exceptions -fno-math-errno -pthread -pipe  -g -freorder-blocks -fomit-frame-pointer  -Wno-parentheses -Wno-sign-compare  /tmp/B.FvamER/BUILD/firefox-52.4.0esr/modules/fdlibm/src/e_atan2.cpp
make[3]: Leaving directory '/tmp/B.FvamER/BUILD/firefox-52.4.0esr/js/src/modules/fdlibm/src'
make[3]: Entering directory '/tmp/B.FvamER/BUILD/firefox-52.4.0esr/js/src/memory/mozalloc'
libmemory_mozalloc.a
rm -f libmemory_mozalloc.a libmemory_mozalloc.a.desc
/tmp/B.FvamER/BUILD/firefox-52.4.0esr/_virtualenv/bin/python /tmp/B.FvamER/BUILD/firefox-52.4.0esr/config/expandlibs_exec.py --extract -- ar crs libmemory_mozalloc.a Unified_cpp_memory_mozalloc0.o  
make[3]: Leaving directory '/tmp/B.FvamER/BUILD/firefox-52.4.0esr/js/src/memory/mozalloc'
make[3]: Entering directory '/tmp/B.FvamER/BUILD/firefox-52.4.0esr/js/src/modules/fdlibm/src'
/usr/bin/x86_64-pld-linux-gnux32-g++ -std=gnu++11 -o e_exp.o -c  -I/tmp/B.FvamER/BUILD/firefox-52.4.0esr/js/src/dist/system_wrappers -include /tmp/B.FvamER/BUILD/firefox-52.4.0esr/config/gcc_hidden.h -DNDEBUG=1 -DTRIMMED=1 -DMOZ_HAS_MOZGLUE -I/tmp/B.FvamER/BUILD/firefox-52.4.0esr/modules/fdlibm/src -I/tmp/B.FvamER/BUILD/firefox-52.4.0esr/js/src/modules/fdlibm/src  -I/tmp/B.FvamER/BUILD/firefox-52.4.0esr/js/src/dist/include  -I/usr/include/nspr        -fPIC  -DMOZILLA_CLIENT -include /tmp/B.FvamER/BUILD/firefox-52.4.0esr/js/src/js/src/js-confdefs.h -MD -MP -MF .deps/e_exp.o.pp  -Wall -Wc++11-compat -Wempty-body -Wignored-qualifiers -Woverloaded-virtual -Wpointer-arith -Wsign-compare -Wtype-limits -Wunreachable-code -Wwrite-strings -Wno-invalid-offsetof -Wc++14-compat -Wc++1z-compat -Wimplicit-fallthrough -Wno-error=maybe-uninitialized -Wno-error=deprecated-declarations -Wno-error=array-bounds -fno-lifetime-dse -O2 -fwrapv -pipe -Wformat -Werror=format-security -gdwarf-4 -fno-debug-types-section -fvar-tracking-assignments -g2 -Wp,-D_FORTIFY_SOURCE=2 -fstack-protector-strong --param=ssp-buffer-size=4 -fPIC -mtune=generic -march=x86-64 -gdwarf-4 -fno-debug-types-section -fvar-tracking-assignments -g2 -fno-rtti -fno-exceptions -fno-math-errno -pthread -pipe  -g -freorder-blocks -fomit-frame-pointer  -Wno-parentheses -Wno-sign-compare  /tmp/B.FvamER/BUILD/firefox-52.4.0esr/modules/fdlibm/src/e_exp.cpp
make[3]: Leaving directory '/tmp/B.FvamER/BUILD/firefox-52.4.0esr/js/src/modules/fdlibm/src'
make[3]: Entering directory '/tmp/B.FvamER/BUILD/firefox-52.4.0esr/js/src/modules/fdlibm/src'
/usr/bin/x86_64-pld-linux-gnux32-g++ -std=gnu++11 -o e_log.o -c  -I/tmp/B.FvamER/BUILD/firefox-52.4.0esr/js/src/dist/system_wrappers -include /tmp/B.FvamER/BUILD/firefox-52.4.0esr/config/gcc_hidden.h -DNDEBUG=1 -DTRIMMED=1 -DMOZ_HAS_MOZGLUE -I/tmp/B.FvamER/BUILD/firefox-52.4.0esr/modules/fdlibm/src -I/tmp/B.FvamER/BUILD/firefox-52.4.0esr/js/src/modules/fdlibm/src  -I/tmp/B.FvamER/BUILD/firefox-52.4.0esr/js/src/dist/include  -I/usr/include/nspr        -fPIC  -DMOZILLA_CLIENT -include /tmp/B.FvamER/BUILD/firefox-52.4.0esr/js/src/js/src/js-confdefs.h -MD -MP -MF .deps/e_log.o.pp  -Wall -Wc++11-compat -Wempty-body -Wignored-qualifiers -Woverloaded-virtual -Wpointer-arith -Wsign-compare -Wtype-limits -Wunreachable-code -Wwrite-strings -Wno-invalid-offsetof -Wc++14-compat -Wc++1z-compat -Wimplicit-fallthrough -Wno-error=maybe-uninitialized -Wno-error=deprecated-declarations -Wno-error=array-bounds -fno-lifetime-dse -O2 -fwrapv -pipe -Wformat -Werror=format-security -gdwarf-4 -fno-debug-types-section -fvar-tracking-assignments -g2 -Wp,-D_FORTIFY_SOURCE=2 -fstack-protector-strong --param=ssp-buffer-size=4 -fPIC -mtune=generic -march=x86-64 -gdwarf-4 -fno-debug-types-section -fvar-tracking-assignments -g2 -fno-rtti -fno-exceptions -fno-math-errno -pthread -pipe  -g -freorder-blocks -fomit-frame-pointer  -Wno-parentheses -Wno-sign-compare  /tmp/B.FvamER/BUILD/firefox-52.4.0esr/modules/fdlibm/src/e_log.cpp
make[3]: Leaving directory '/tmp/B.FvamER/BUILD/firefox-52.4.0esr/js/src/modules/fdlibm/src'
make[3]: Entering directory '/tmp/B.FvamER/BUILD/firefox-52.4.0esr/js/src/modules/fdlibm/src'
/usr/bin/x86_64-pld-linux-gnux32-g++ -std=gnu++11 -o e_hypot.o -c  -I/tmp/B.FvamER/BUILD/firefox-52.4.0esr/js/src/dist/system_wrappers -include /tmp/B.FvamER/BUILD/firefox-52.4.0esr/config/gcc_hidden.h -DNDEBUG=1 -DTRIMMED=1 -DMOZ_HAS_MOZGLUE -I/tmp/B.FvamER/BUILD/firefox-52.4.0esr/modules/fdlibm/src -I/tmp/B.FvamER/BUILD/firefox-52.4.0esr/js/src/modules/fdlibm/src  -I/tmp/B.FvamER/BUILD/firefox-52.4.0esr/js/src/dist/include  -I/usr/include/nspr        -fPIC  -DMOZILLA_CLIENT -include /tmp/B.FvamER/BUILD/firefox-52.4.0esr/js/src/js/src/js-confdefs.h -MD -MP -MF .deps/e_hypot.o.pp  -Wall -Wc++11-compat -Wempty-body -Wignored-qualifiers -Woverloaded-virtual -Wpointer-arith -Wsign-compare -Wtype-limits -Wunreachable-code -Wwrite-strings -Wno-invalid-offsetof -Wc++14-compat -Wc++1z-compat -Wimplicit-fallthrough -Wno-error=maybe-uninitialized -Wno-error=deprecated-declarations -Wno-error=array-bounds -fno-lifetime-dse -O2 -fwrapv -pipe -Wformat -Werror=format-security -gdwarf-4 -fno-debug-types-section -fvar-tracking-assignments -g2 -Wp,-D_FORTIFY_SOURCE=2 -fstack-protector-strong --param=ssp-buffer-size=4 -fPIC -mtune=generic -march=x86-64 -gdwarf-4 -fno-debug-types-section -fvar-tracking-assignments -g2 -fno-rtti -fno-exceptions -fno-math-errno -pthread -pipe  -g -freorder-blocks -fomit-frame-pointer  -Wno-parentheses -Wno-sign-compare  /tmp/B.FvamER/BUILD/firefox-52.4.0esr/modules/fdlibm/src/e_hypot.cpp
make[3]: Leaving directory '/tmp/B.FvamER/BUILD/firefox-52.4.0esr/js/src/modules/fdlibm/src'
make[3]: Entering directory '/tmp/B.FvamER/BUILD/firefox-52.4.0esr/js/src/modules/fdlibm/src'
/usr/bin/x86_64-pld-linux-gnux32-g++ -std=gnu++11 -o e_log10.o -c  -I/tmp/B.FvamER/BUILD/firefox-52.4.0esr/js/src/dist/system_wrappers -include /tmp/B.FvamER/BUILD/firefox-52.4.0esr/config/gcc_hidden.h -DNDEBUG=1 -DTRIMMED=1 -DMOZ_HAS_MOZGLUE -I/tmp/B.FvamER/BUILD/firefox-52.4.0esr/modules/fdlibm/src -I/tmp/B.FvamER/BUILD/firefox-52.4.0esr/js/src/modules/fdlibm/src  -I/tmp/B.FvamER/BUILD/firefox-52.4.0esr/js/src/dist/include  -I/usr/include/nspr        -fPIC  -DMOZILLA_CLIENT -include /tmp/B.FvamER/BUILD/firefox-52.4.0esr/js/src/js/src/js-confdefs.h -MD -MP -MF .deps/e_log10.o.pp  -Wall -Wc++11-compat -Wempty-body -Wignored-qualifiers -Woverloaded-virtual -Wpointer-arith -Wsign-compare -Wtype-limits -Wunreachable-code -Wwrite-strings -Wno-invalid-offsetof -Wc++14-compat -Wc++1z-compat -Wimplicit-fallthrough -Wno-error=maybe-uninitialized -Wno-error=deprecated-declarations -Wno-error=array-bounds -fno-lifetime-dse -O2 -fwrapv -pipe -Wformat -Werror=format-security -gdwarf-4 -fno-debug-types-section -fvar-tracking-assignments -g2 -Wp,-D_FORTIFY_SOURCE=2 -fstack-protector-strong --param=ssp-buffer-size=4 -fPIC -mtune=generic -march=x86-64 -gdwarf-4 -fno-debug-types-section -fvar-tracking-assignments -g2 -fno-rtti -fno-exceptions -fno-math-errno -pthread -pipe  -g -freorder-blocks -fomit-frame-pointer  -Wno-parentheses -Wno-sign-compare  /tmp/B.FvamER/BUILD/firefox-52.4.0esr/modules/fdlibm/src/e_log10.cpp
make[3]: Leaving directory '/tmp/B.FvamER/BUILD/firefox-52.4.0esr/js/src/modules/fdlibm/src'
make[3]: Entering directory '/tmp/B.FvamER/BUILD/firefox-52.4.0esr/js/src/memory/mozalloc'
libmemory_mozalloc.a.desc
/tmp/B.FvamER/BUILD/firefox-52.4.0esr/_virtualenv/bin/python /tmp/B.FvamER/BUILD/firefox-52.4.0esr/config/expandlibs_gen.py -o libmemory_mozalloc.a.desc Unified_cpp_memory_mozalloc0.o  
make[3]: Leaving directory '/tmp/B.FvamER/BUILD/firefox-52.4.0esr/js/src/memory/mozalloc'
make[3]: Entering directory '/tmp/B.FvamER/BUILD/firefox-52.4.0esr/js/src/modules/fdlibm/src'
/usr/bin/x86_64-pld-linux-gnux32-g++ -std=gnu++11 -o e_log2.o -c  -I/tmp/B.FvamER/BUILD/firefox-52.4.0esr/js/src/dist/system_wrappers -include /tmp/B.FvamER/BUILD/firefox-52.4.0esr/config/gcc_hidden.h -DNDEBUG=1 -DTRIMMED=1 -DMOZ_HAS_MOZGLUE -I/tmp/B.FvamER/BUILD/firefox-52.4.0esr/modules/fdlibm/src -I/tmp/B.FvamER/BUILD/firefox-52.4.0esr/js/src/modules/fdlibm/src  -I/tmp/B.FvamER/BUILD/firefox-52.4.0esr/js/src/dist/include  -I/usr/include/nspr        -fPIC  -DMOZILLA_CLIENT -include /tmp/B.FvamER/BUILD/firefox-52.4.0esr/js/src/js/src/js-confdefs.h -MD -MP -MF .deps/e_log2.o.pp  -Wall -Wc++11-compat -Wempty-body -Wignored-qualifiers -Woverloaded-virtual -Wpointer-arith -Wsign-compare -Wtype-limits -Wunreachable-code -Wwrite-strings -Wno-invalid-offsetof -Wc++14-compat -Wc++1z-compat -Wimplicit-fallthrough -Wno-error=maybe-uninitialized -Wno-error=deprecated-declarations -Wno-error=array-bounds -fno-lifetime-dse -O2 -fwrapv -pipe -Wformat -Werror=format-security -gdwarf-4 -fno-debug-types-section -fvar-tracking-assignments -g2 -Wp,-D_FORTIFY_SOURCE=2 -fstack-protector-strong --param=ssp-buffer-size=4 -fPIC -mtune=generic -march=x86-64 -gdwarf-4 -fno-debug-types-section -fvar-tracking-assignments -g2 -fno-rtti -fno-exceptions -fno-math-errno -pthread -pipe  -g -freorder-blocks -fomit-frame-pointer  -Wno-parentheses -Wno-sign-compare  /tmp/B.FvamER/BUILD/firefox-52.4.0esr/modules/fdlibm/src/e_log2.cpp
make[3]: Leaving directory '/tmp/B.FvamER/BUILD/firefox-52.4.0esr/js/src/modules/fdlibm/src'
make[3]: Entering directory '/tmp/B.FvamER/BUILD/firefox-52.4.0esr/js/src/modules/fdlibm/src'
/usr/bin/x86_64-pld-linux-gnux32-g++ -std=gnu++11 -o e_sinh.o -c  -I/tmp/B.FvamER/BUILD/firefox-52.4.0esr/js/src/dist/system_wrappers -include /tmp/B.FvamER/BUILD/firefox-52.4.0esr/config/gcc_hidden.h -DNDEBUG=1 -DTRIMMED=1 -DMOZ_HAS_MOZGLUE -I/tmp/B.FvamER/BUILD/firefox-52.4.0esr/modules/fdlibm/src -I/tmp/B.FvamER/BUILD/firefox-52.4.0esr/js/src/modules/fdlibm/src  -I/tmp/B.FvamER/BUILD/firefox-52.4.0esr/js/src/dist/include  -I/usr/include/nspr        -fPIC  -DMOZILLA_CLIENT -include /tmp/B.FvamER/BUILD/firefox-52.4.0esr/js/src/js/src/js-confdefs.h -MD -MP -MF .deps/e_sinh.o.pp  -Wall -Wc++11-compat -Wempty-body -Wignored-qualifiers -Woverloaded-virtual -Wpointer-arith -Wsign-compare -Wtype-limits -Wunreachable-code -Wwrite-strings -Wno-invalid-offsetof -Wc++14-compat -Wc++1z-compat -Wimplicit-fallthrough -Wno-error=maybe-uninitialized -Wno-error=deprecated-declarations -Wno-error=array-bounds -fno-lifetime-dse -O2 -fwrapv -pipe -Wformat -Werror=format-security -gdwarf-4 -fno-debug-types-section -fvar-tracking-assignments -g2 -Wp,-D_FORTIFY_SOURCE=2 -fstack-protector-strong --param=ssp-buffer-size=4 -fPIC -mtune=generic -march=x86-64 -gdwarf-4 -fno-debug-types-section -fvar-tracking-assignments -g2 -fno-rtti -fno-exceptions -fno-math-errno -pthread -pipe  -g -freorder-blocks -fomit-frame-pointer  -Wno-parentheses -Wno-sign-compare  /tmp/B.FvamER/BUILD/firefox-52.4.0esr/modules/fdlibm/src/e_sinh.cpp
make[3]: Leaving directory '/tmp/B.FvamER/BUILD/firefox-52.4.0esr/js/src/modules/fdlibm/src'
make[3]: Entering directory '/tmp/B.FvamER/BUILD/firefox-52.4.0esr/js/src/mozglue/misc'
/usr/bin/x86_64-pld-linux-gnux32-g++ -std=gnu++11 -o TimeStamp_posix.o -c  -I/tmp/B.FvamER/BUILD/firefox-52.4.0esr/js/src/dist/system_wrappers -include /tmp/B.FvamER/BUILD/firefox-52.4.0esr/config/gcc_hidden.h -DNDEBUG=1 -DTRIMMED=1 -DIMPL_MFBT -DMOZ_HAS_MOZGLUE -I/tmp/B.FvamER/BUILD/firefox-52.4.0esr/mozglue/misc -I/tmp/B.FvamER/BUILD/firefox-52.4.0esr/js/src/mozglue/misc  -I/tmp/B.FvamER/BUILD/firefox-52.4.0esr/js/src/dist/include  -I/usr/include/nspr        -fPIC  -DMOZILLA_CLIENT -include /tmp/B.FvamER/BUILD/firefox-52.4.0esr/js/src/js/src/js-confdefs.h -MD -MP -MF .deps/TimeStamp_posix.o.pp  -Wall -Wc++11-compat -Wempty-body -Wignored-qualifiers -Woverloaded-virtual -Wpointer-arith -Wsign-compare -Wtype-limits -Wunreachable-code -Wwrite-strings -Wno-invalid-offsetof -Wc++14-compat -Wc++1z-compat -Wimplicit-fallthrough -Wno-error=maybe-uninitialized -Wno-error=deprecated-declarations -Wno-error=array-bounds -fno-lifetime-dse -O2 -fwrapv -pipe -Wformat -Werror=format-security -gdwarf-4 -fno-debug-types-section -fvar-tracking-assignments -g2 -Wp,-D_FORTIFY_SOURCE=2 -fstack-protector-strong --param=ssp-buffer-size=4 -fPIC -mtune=generic -march=x86-64 -gdwarf-4 -fno-debug-types-section -fvar-tracking-assignments -g2 -fno-rtti -fno-exceptions -fno-math-errno -pthread -pipe  -g -freorder-blocks -fomit-frame-pointer    /tmp/B.FvamER/BUILD/firefox-52.4.0esr/mozglue/misc/TimeStamp_posix.cpp
make[3]: Leaving directory '/tmp/B.FvamER/BUILD/firefox-52.4.0esr/js/src/mozglue/misc'
make[3]: Entering directory '/tmp/B.FvamER/BUILD/firefox-52.4.0esr/js/src/modules/fdlibm/src'
/usr/bin/x86_64-pld-linux-gnux32-g++ -std=gnu++11 -o k_exp.o -c  -I/tmp/B.FvamER/BUILD/firefox-52.4.0esr/js/src/dist/system_wrappers -include /tmp/B.FvamER/BUILD/firefox-52.4.0esr/config/gcc_hidden.h -DNDEBUG=1 -DTRIMMED=1 -DMOZ_HAS_MOZGLUE -I/tmp/B.FvamER/BUILD/firefox-52.4.0esr/modules/fdlibm/src -I/tmp/B.FvamER/BUILD/firefox-52.4.0esr/js/src/modules/fdlibm/src  -I/tmp/B.FvamER/BUILD/firefox-52.4.0esr/js/src/dist/include  -I/usr/include/nspr        -fPIC  -DMOZILLA_CLIENT -include /tmp/B.FvamER/BUILD/firefox-52.4.0esr/js/src/js/src/js-confdefs.h -MD -MP -MF .deps/k_exp.o.pp  -Wall -Wc++11-compat -Wempty-body -Wignored-qualifiers -Woverloaded-virtual -Wpointer-arith -Wsign-compare -Wtype-limits -Wunreachable-code -Wwrite-strings -Wno-invalid-offsetof -Wc++14-compat -Wc++1z-compat -Wimplicit-fallthrough -Wno-error=maybe-uninitialized -Wno-error=deprecated-declarations -Wno-error=array-bounds -fno-lifetime-dse -O2 -fwrapv -pipe -Wformat -Werror=format-security -gdwarf-4 -fno-debug-types-section -fvar-tracking-assignments -g2 -Wp,-D_FORTIFY_SOURCE=2 -fstack-protector-strong --param=ssp-buffer-size=4 -fPIC -mtune=generic -march=x86-64 -gdwarf-4 -fno-debug-types-section -fvar-tracking-assignments -g2 -fno-rtti -fno-exceptions -fno-math-errno -pthread -pipe  -g -freorder-blocks -fomit-frame-pointer  -Wno-parentheses -Wno-sign-compare  /tmp/B.FvamER/BUILD/firefox-52.4.0esr/modules/fdlibm/src/k_exp.cpp
make[3]: Leaving directory '/tmp/B.FvamER/BUILD/firefox-52.4.0esr/js/src/modules/fdlibm/src'
make[3]: Entering directory '/tmp/B.FvamER/BUILD/firefox-52.4.0esr/js/src/modules/fdlibm/src'
/usr/bin/x86_64-pld-linux-gnux32-g++ -std=gnu++11 -o e_sqrt.o -c  -I/tmp/B.FvamER/BUILD/firefox-52.4.0esr/js/src/dist/system_wrappers -include /tmp/B.FvamER/BUILD/firefox-52.4.0esr/config/gcc_hidden.h -DNDEBUG=1 -DTRIMMED=1 -DMOZ_HAS_MOZGLUE -I/tmp/B.FvamER/BUILD/firefox-52.4.0esr/modules/fdlibm/src -I/tmp/B.FvamER/BUILD/firefox-52.4.0esr/js/src/modules/fdlibm/src  -I/tmp/B.FvamER/BUILD/firefox-52.4.0esr/js/src/dist/include  -I/usr/include/nspr        -fPIC  -DMOZILLA_CLIENT -include /tmp/B.FvamER/BUILD/firefox-52.4.0esr/js/src/js/src/js-confdefs.h -MD -MP -MF .deps/e_sqrt.o.pp  -Wall -Wc++11-compat -Wempty-body -Wignored-qualifiers -Woverloaded-virtual -Wpointer-arith -Wsign-compare -Wtype-limits -Wunreachable-code -Wwrite-strings -Wno-invalid-offsetof -Wc++14-compat -Wc++1z-compat -Wimplicit-fallthrough -Wno-error=maybe-uninitialized -Wno-error=deprecated-declarations -Wno-error=array-bounds -fno-lifetime-dse -O2 -fwrapv -pipe -Wformat -Werror=format-security -gdwarf-4 -fno-debug-types-section -fvar-tracking-assignments -g2 -Wp,-D_FORTIFY_SOURCE=2 -fstack-protector-strong --param=ssp-buffer-size=4 -fPIC -mtune=generic -march=x86-64 -gdwarf-4 -fno-debug-types-section -fvar-tracking-assignments -g2 -fno-rtti -fno-exceptions -fno-math-errno -pthread -pipe  -g -freorder-blocks -fomit-frame-pointer  -Wno-parentheses -Wno-sign-compare  /tmp/B.FvamER/BUILD/firefox-52.4.0esr/modules/fdlibm/src/e_sqrt.cpp
make[3]: Leaving directory '/tmp/B.FvamER/BUILD/firefox-52.4.0esr/js/src/modules/fdlibm/src'
make[3]: Entering directory '/tmp/B.FvamER/BUILD/firefox-52.4.0esr/js/src/modules/fdlibm/src'
/usr/bin/x86_64-pld-linux-gnux32-g++ -std=gnu++11 -o s_asinh.o -c  -I/tmp/B.FvamER/BUILD/firefox-52.4.0esr/js/src/dist/system_wrappers -include /tmp/B.FvamER/BUILD/firefox-52.4.0esr/config/gcc_hidden.h -DNDEBUG=1 -DTRIMMED=1 -DMOZ_HAS_MOZGLUE -I/tmp/B.FvamER/BUILD/firefox-52.4.0esr/modules/fdlibm/src -I/tmp/B.FvamER/BUILD/firefox-52.4.0esr/js/src/modules/fdlibm/src  -I/tmp/B.FvamER/BUILD/firefox-52.4.0esr/js/src/dist/include  -I/usr/include/nspr        -fPIC  -DMOZILLA_CLIENT -include /tmp/B.FvamER/BUILD/firefox-52.4.0esr/js/src/js/src/js-confdefs.h -MD -MP -MF .deps/s_asinh.o.pp  -Wall -Wc++11-compat -Wempty-body -Wignored-qualifiers -Woverloaded-virtual -Wpointer-arith -Wsign-compare -Wtype-limits -Wunreachable-code -Wwrite-strings -Wno-invalid-offsetof -Wc++14-compat -Wc++1z-compat -Wimplicit-fallthrough -Wno-error=maybe-uninitialized -Wno-error=deprecated-declarations -Wno-error=array-bounds -fno-lifetime-dse -O2 -fwrapv -pipe -Wformat -Werror=format-security -gdwarf-4 -fno-debug-types-section -fvar-tracking-assignments -g2 -Wp,-D_FORTIFY_SOURCE=2 -fstack-protector-strong --param=ssp-buffer-size=4 -fPIC -mtune=generic -march=x86-64 -gdwarf-4 -fno-debug-types-section -fvar-tracking-assignments -g2 -fno-rtti -fno-exceptions -fno-math-errno -pthread -pipe  -g -freorder-blocks -fomit-frame-pointer  -Wno-parentheses -Wno-sign-compare  /tmp/B.FvamER/BUILD/firefox-52.4.0esr/modules/fdlibm/src/s_asinh.cpp
make[3]: Leaving directory '/tmp/B.FvamER/BUILD/firefox-52.4.0esr/js/src/modules/fdlibm/src'
make[3]: Entering directory '/tmp/B.FvamER/BUILD/firefox-52.4.0esr/js/src/modules/fdlibm/src'
/usr/bin/x86_64-pld-linux-gnux32-g++ -std=gnu++11 -o e_pow.o -c  -I/tmp/B.FvamER/BUILD/firefox-52.4.0esr/js/src/dist/system_wrappers -include /tmp/B.FvamER/BUILD/firefox-52.4.0esr/config/gcc_hidden.h -DNDEBUG=1 -DTRIMMED=1 -DMOZ_HAS_MOZGLUE -I/tmp/B.FvamER/BUILD/firefox-52.4.0esr/modules/fdlibm/src -I/tmp/B.FvamER/BUILD/firefox-52.4.0esr/js/src/modules/fdlibm/src  -I/tmp/B.FvamER/BUILD/firefox-52.4.0esr/js/src/dist/include  -I/usr/include/nspr        -fPIC  -DMOZILLA_CLIENT -include /tmp/B.FvamER/BUILD/firefox-52.4.0esr/js/src/js/src/js-confdefs.h -MD -MP -MF .deps/e_pow.o.pp  -Wall -Wc++11-compat -Wempty-body -Wignored-qualifiers -Woverloaded-virtual -Wpointer-arith -Wsign-compare -Wtype-limits -Wunreachable-code -Wwrite-strings -Wno-invalid-offsetof -Wc++14-compat -Wc++1z-compat -Wimplicit-fallthrough -Wno-error=maybe-uninitialized -Wno-error=deprecated-declarations -Wno-error=array-bounds -fno-lifetime-dse -O2 -fwrapv -pipe -Wformat -Werror=format-security -gdwarf-4 -fno-debug-types-section -fvar-tracking-assignments -g2 -Wp,-D_FORTIFY_SOURCE=2 -fstack-protector-strong --param=ssp-buffer-size=4 -fPIC -mtune=generic -march=x86-64 -gdwarf-4 -fno-debug-types-section -fvar-tracking-assignments -g2 -fno-rtti -fno-exceptions -fno-math-errno -pthread -pipe  -g -freorder-blocks -fomit-frame-pointer  -Wno-parentheses -Wno-sign-compare  /tmp/B.FvamER/BUILD/firefox-52.4.0esr/modules/fdlibm/src/e_pow.cpp
make[3]: Leaving directory '/tmp/B.FvamER/BUILD/firefox-52.4.0esr/js/src/modules/fdlibm/src'
make[3]: Entering directory '/tmp/B.FvamER/BUILD/firefox-52.4.0esr/js/src/mozglue/misc'
libmozglue_misc.a.desc
rm -f libmozglue_misc.a
/tmp/B.FvamER/BUILD/firefox-52.4.0esr/_virtualenv/bin/python /tmp/B.FvamER/BUILD/firefox-52.4.0esr/config/expandlibs_gen.py -o libmozglue_misc.a.desc StackWalk.o TimeStamp.o TimeStamp_posix.o  
make[3]: Leaving directory '/tmp/B.FvamER/BUILD/firefox-52.4.0esr/js/src/mozglue/misc'
make[3]: Entering directory '/tmp/B.FvamER/BUILD/firefox-52.4.0esr/js/src/modules/fdlibm/src'
/usr/bin/x86_64-pld-linux-gnux32-g++ -std=gnu++11 -o s_atan.o -c  -I/tmp/B.FvamER/BUILD/firefox-52.4.0esr/js/src/dist/system_wrappers -include /tmp/B.FvamER/BUILD/firefox-52.4.0esr/config/gcc_hidden.h -DNDEBUG=1 -DTRIMMED=1 -DMOZ_HAS_MOZGLUE -I/tmp/B.FvamER/BUILD/firefox-52.4.0esr/modules/fdlibm/src -I/tmp/B.FvamER/BUILD/firefox-52.4.0esr/js/src/modules/fdlibm/src  -I/tmp/B.FvamER/BUILD/firefox-52.4.0esr/js/src/dist/include  -I/usr/include/nspr        -fPIC  -DMOZILLA_CLIENT -include /tmp/B.FvamER/BUILD/firefox-52.4.0esr/js/src/js/src/js-confdefs.h -MD -MP -MF .deps/s_atan.o.pp  -Wall -Wc++11-compat -Wempty-body -Wignored-qualifiers -Woverloaded-virtual -Wpointer-arith -Wsign-compare -Wtype-limits -Wunreachable-code -Wwrite-strings -Wno-invalid-offsetof -Wc++14-compat -Wc++1z-compat -Wimplicit-fallthrough -Wno-error=maybe-uninitialized -Wno-error=deprecated-declarations -Wno-error=array-bounds -fno-lifetime-dse -O2 -fwrapv -pipe -Wformat -Werror=format-security -gdwarf-4 -fno-debug-types-section -fvar-tracking-assignments -g2 -Wp,-D_FORTIFY_SOURCE=2 -fstack-protector-strong --param=ssp-buffer-size=4 -fPIC -mtune=generic -march=x86-64 -gdwarf-4 -fno-debug-types-section -fvar-tracking-assignments -g2 -fno-rtti -fno-exceptions -fno-math-errno -pthread -pipe  -g -freorder-blocks -fomit-frame-pointer  -Wno-parentheses -Wno-sign-compare  /tmp/B.FvamER/BUILD/firefox-52.4.0esr/modules/fdlibm/src/s_atan.cpp
make[3]: Leaving directory '/tmp/B.FvamER/BUILD/firefox-52.4.0esr/js/src/modules/fdlibm/src'
make[3]: Entering directory '/tmp/B.FvamER/BUILD/firefox-52.4.0esr/js/src/modules/fdlibm/src'
/usr/bin/x86_64-pld-linux-gnux32-g++ -std=gnu++11 -o s_ceil.o -c  -I/tmp/B.FvamER/BUILD/firefox-52.4.0esr/js/src/dist/system_wrappers -include /tmp/B.FvamER/BUILD/firefox-52.4.0esr/config/gcc_hidden.h -DNDEBUG=1 -DTRIMMED=1 -DMOZ_HAS_MOZGLUE -I/tmp/B.FvamER/BUILD/firefox-52.4.0esr/modules/fdlibm/src -I/tmp/B.FvamER/BUILD/firefox-52.4.0esr/js/src/modules/fdlibm/src  -I/tmp/B.FvamER/BUILD/firefox-52.4.0esr/js/src/dist/include  -I/usr/include/nspr        -fPIC  -DMOZILLA_CLIENT -include /tmp/B.FvamER/BUILD/firefox-52.4.0esr/js/src/js/src/js-confdefs.h -MD -MP -MF .deps/s_ceil.o.pp  -Wall -Wc++11-compat -Wempty-body -Wignored-qualifiers -Woverloaded-virtual -Wpointer-arith -Wsign-compare -Wtype-limits -Wunreachable-code -Wwrite-strings -Wno-invalid-offsetof -Wc++14-compat -Wc++1z-compat -Wimplicit-fallthrough -Wno-error=maybe-uninitialized -Wno-error=deprecated-declarations -Wno-error=array-bounds -fno-lifetime-dse -O2 -fwrapv -pipe -Wformat -Werror=format-security -gdwarf-4 -fno-debug-types-section -fvar-tracking-assignments -g2 -Wp,-D_FORTIFY_SOURCE=2 -fstack-protector-strong --param=ssp-buffer-size=4 -fPIC -mtune=generic -march=x86-64 -gdwarf-4 -fno-debug-types-section -fvar-tracking-assignments -g2 -fno-rtti -fno-exceptions -fno-math-errno -pthread -pipe  -g -freorder-blocks -fomit-frame-pointer  -Wno-parentheses -Wno-sign-compare  /tmp/B.FvamER/BUILD/firefox-52.4.0esr/modules/fdlibm/src/s_ceil.cpp
make[3]: Leaving directory '/tmp/B.FvamER/BUILD/firefox-52.4.0esr/js/src/modules/fdlibm/src'
make[3]: Entering directory '/tmp/B.FvamER/BUILD/firefox-52.4.0esr/js/src/modules/fdlibm/src'
/usr/bin/x86_64-pld-linux-gnux32-g++ -std=gnu++11 -o s_cbrt.o -c  -I/tmp/B.FvamER/BUILD/firefox-52.4.0esr/js/src/dist/system_wrappers -include /tmp/B.FvamER/BUILD/firefox-52.4.0esr/config/gcc_hidden.h -DNDEBUG=1 -DTRIMMED=1 -DMOZ_HAS_MOZGLUE -I/tmp/B.FvamER/BUILD/firefox-52.4.0esr/modules/fdlibm/src -I/tmp/B.FvamER/BUILD/firefox-52.4.0esr/js/src/modules/fdlibm/src  -I/tmp/B.FvamER/BUILD/firefox-52.4.0esr/js/src/dist/include  -I/usr/include/nspr        -fPIC  -DMOZILLA_CLIENT -include /tmp/B.FvamER/BUILD/firefox-52.4.0esr/js/src/js/src/js-confdefs.h -MD -MP -MF .deps/s_cbrt.o.pp  -Wall -Wc++11-compat -Wempty-body -Wignored-qualifiers -Woverloaded-virtual -Wpointer-arith -Wsign-compare -Wtype-limits -Wunreachable-code -Wwrite-strings -Wno-invalid-offsetof -Wc++14-compat -Wc++1z-compat -Wimplicit-fallthrough -Wno-error=maybe-uninitialized -Wno-error=deprecated-declarations -Wno-error=array-bounds -fno-lifetime-dse -O2 -fwrapv -pipe -Wformat -Werror=format-security -gdwarf-4 -fno-debug-types-section -fvar-tracking-assignments -g2 -Wp,-D_FORTIFY_SOURCE=2 -fstack-protector-strong --param=ssp-buffer-size=4 -fPIC -mtune=generic -march=x86-64 -gdwarf-4 -fno-debug-types-section -fvar-tracking-assignments -g2 -fno-rtti -fno-exceptions -fno-math-errno -pthread -pipe  -g -freorder-blocks -fomit-frame-pointer  -Wno-parentheses -Wno-sign-compare  /tmp/B.FvamER/BUILD/firefox-52.4.0esr/modules/fdlibm/src/s_cbrt.cpp
make[3]: Leaving directory '/tmp/B.FvamER/BUILD/firefox-52.4.0esr/js/src/modules/fdlibm/src'
make[3]: Entering directory '/tmp/B.FvamER/BUILD/firefox-52.4.0esr/js/src/modules/fdlibm/src'
/usr/bin/x86_64-pld-linux-gnux32-g++ -std=gnu++11 -o s_ceilf.o -c  -I/tmp/B.FvamER/BUILD/firefox-52.4.0esr/js/src/dist/system_wrappers -include /tmp/B.FvamER/BUILD/firefox-52.4.0esr/config/gcc_hidden.h -DNDEBUG=1 -DTRIMMED=1 -DMOZ_HAS_MOZGLUE -I/tmp/B.FvamER/BUILD/firefox-52.4.0esr/modules/fdlibm/src -I/tmp/B.FvamER/BUILD/firefox-52.4.0esr/js/src/modules/fdlibm/src  -I/tmp/B.FvamER/BUILD/firefox-52.4.0esr/js/src/dist/include  -I/usr/include/nspr        -fPIC  -DMOZILLA_CLIENT -include /tmp/B.FvamER/BUILD/firefox-52.4.0esr/js/src/js/src/js-confdefs.h -MD -MP -MF .deps/s_ceilf.o.pp  -Wall -Wc++11-compat -Wempty-body -Wignored-qualifiers -Woverloaded-virtual -Wpointer-arith -Wsign-compare -Wtype-limits -Wunreachable-code -Wwrite-strings -Wno-invalid-offsetof -Wc++14-compat -Wc++1z-compat -Wimplicit-fallthrough -Wno-error=maybe-uninitialized -Wno-error=deprecated-declarations -Wno-error=array-bounds -fno-lifetime-dse -O2 -fwrapv -pipe -Wformat -Werror=format-security -gdwarf-4 -fno-debug-types-section -fvar-tracking-assignments -g2 -Wp,-D_FORTIFY_SOURCE=2 -fstack-protector-strong --param=ssp-buffer-size=4 -fPIC -mtune=generic -march=x86-64 -gdwarf-4 -fno-debug-types-section -fvar-tracking-assignments -g2 -fno-rtti -fno-exceptions -fno-math-errno -pthread -pipe  -g -freorder-blocks -fomit-frame-pointer  -Wno-parentheses -Wno-sign-compare  /tmp/B.FvamER/BUILD/firefox-52.4.0esr/modules/fdlibm/src/s_ceilf.cpp
make[3]: Leaving directory '/tmp/B.FvamER/BUILD/firefox-52.4.0esr/js/src/modules/fdlibm/src'
make[3]: Entering directory '/tmp/B.FvamER/BUILD/firefox-52.4.0esr/js/src/modules/fdlibm/src'
/usr/bin/x86_64-pld-linux-gnux32-g++ -std=gnu++11 -o s_copysign.o -c  -I/tmp/B.FvamER/BUILD/firefox-52.4.0esr/js/src/dist/system_wrappers -include /tmp/B.FvamER/BUILD/firefox-52.4.0esr/config/gcc_hidden.h -DNDEBUG=1 -DTRIMMED=1 -DMOZ_HAS_MOZGLUE -I/tmp/B.FvamER/BUILD/firefox-52.4.0esr/modules/fdlibm/src -I/tmp/B.FvamER/BUILD/firefox-52.4.0esr/js/src/modules/fdlibm/src  -I/tmp/B.FvamER/BUILD/firefox-52.4.0esr/js/src/dist/include  -I/usr/include/nspr        -fPIC  -DMOZILLA_CLIENT -include /tmp/B.FvamER/BUILD/firefox-52.4.0esr/js/src/js/src/js-confdefs.h -MD -MP -MF .deps/s_copysign.o.pp  -Wall -Wc++11-compat -Wempty-body -Wignored-qualifiers -Woverloaded-virtual -Wpointer-arith -Wsign-compare -Wtype-limits -Wunreachable-code -Wwrite-strings -Wno-invalid-offsetof -Wc++14-compat -Wc++1z-compat -Wimplicit-fallthrough -Wno-error=maybe-uninitialized -Wno-error=deprecated-declarations -Wno-error=array-bounds -fno-lifetime-dse -O2 -fwrapv -pipe -Wformat -Werror=format-security -gdwarf-4 -fno-debug-types-section -fvar-tracking-assignments -g2 -Wp,-D_FORTIFY_SOURCE=2 -fstack-protector-strong --param=ssp-buffer-size=4 -fPIC -mtune=generic -march=x86-64 -gdwarf-4 -fno-debug-types-section -fvar-tracking-assignments -g2 -fno-rtti -fno-exceptions -fno-math-errno -pthread -pipe  -g -freorder-blocks -fomit-frame-pointer  -Wno-parentheses -Wno-sign-compare  /tmp/B.FvamER/BUILD/firefox-52.4.0esr/modules/fdlibm/src/s_copysign.cpp
make[3]: Leaving directory '/tmp/B.FvamER/BUILD/firefox-52.4.0esr/js/src/modules/fdlibm/src'
make[3]: Entering directory '/tmp/B.FvamER/BUILD/firefox-52.4.0esr/js/src/modules/fdlibm/src'
/usr/bin/x86_64-pld-linux-gnux32-g++ -std=gnu++11 -o s_fabs.o -c  -I/tmp/B.FvamER/BUILD/firefox-52.4.0esr/js/src/dist/system_wrappers -include /tmp/B.FvamER/BUILD/firefox-52.4.0esr/config/gcc_hidden.h -DNDEBUG=1 -DTRIMMED=1 -DMOZ_HAS_MOZGLUE -I/tmp/B.FvamER/BUILD/firefox-52.4.0esr/modules/fdlibm/src -I/tmp/B.FvamER/BUILD/firefox-52.4.0esr/js/src/modules/fdlibm/src  -I/tmp/B.FvamER/BUILD/firefox-52.4.0esr/js/src/dist/include  -I/usr/include/nspr        -fPIC  -DMOZILLA_CLIENT -include /tmp/B.FvamER/BUILD/firefox-52.4.0esr/js/src/js/src/js-confdefs.h -MD -MP -MF .deps/s_fabs.o.pp  -Wall -Wc++11-compat -Wempty-body -Wignored-qualifiers -Woverloaded-virtual -Wpointer-arith -Wsign-compare -Wtype-limits -Wunreachable-code -Wwrite-strings -Wno-invalid-offsetof -Wc++14-compat -Wc++1z-compat -Wimplicit-fallthrough -Wno-error=maybe-uninitialized -Wno-error=deprecated-declarations -Wno-error=array-bounds -fno-lifetime-dse -O2 -fwrapv -pipe -Wformat -Werror=format-security -gdwarf-4 -fno-debug-types-section -fvar-tracking-assignments -g2 -Wp,-D_FORTIFY_SOURCE=2 -fstack-protector-strong --param=ssp-buffer-size=4 -fPIC -mtune=generic -march=x86-64 -gdwarf-4 -fno-debug-types-section -fvar-tracking-assignments -g2 -fno-rtti -fno-exceptions -fno-math-errno -pthread -pipe  -g -freorder-blocks -fomit-frame-pointer  -Wno-parentheses -Wno-sign-compare  /tmp/B.FvamER/BUILD/firefox-52.4.0esr/modules/fdlibm/src/s_fabs.cpp
make[3]: Leaving directory '/tmp/B.FvamER/BUILD/firefox-52.4.0esr/js/src/modules/fdlibm/src'
make[3]: Entering directory '/tmp/B.FvamER/BUILD/firefox-52.4.0esr/js/src/modules/fdlibm/src'
/usr/bin/x86_64-pld-linux-gnux32-g++ -std=gnu++11 -o s_floor.o -c  -I/tmp/B.FvamER/BUILD/firefox-52.4.0esr/js/src/dist/system_wrappers -include /tmp/B.FvamER/BUILD/firefox-52.4.0esr/config/gcc_hidden.h -DNDEBUG=1 -DTRIMMED=1 -DMOZ_HAS_MOZGLUE -I/tmp/B.FvamER/BUILD/firefox-52.4.0esr/modules/fdlibm/src -I/tmp/B.FvamER/BUILD/firefox-52.4.0esr/js/src/modules/fdlibm/src  -I/tmp/B.FvamER/BUILD/firefox-52.4.0esr/js/src/dist/include  -I/usr/include/nspr        -fPIC  -DMOZILLA_CLIENT -include /tmp/B.FvamER/BUILD/firefox-52.4.0esr/js/src/js/src/js-confdefs.h -MD -MP -MF .deps/s_floor.o.pp  -Wall -Wc++11-compat -Wempty-body -Wignored-qualifiers -Woverloaded-virtual -Wpointer-arith -Wsign-compare -Wtype-limits -Wunreachable-code -Wwrite-strings -Wno-invalid-offsetof -Wc++14-compat -Wc++1z-compat -Wimplicit-fallthrough -Wno-error=maybe-uninitialized -Wno-error=deprecated-declarations -Wno-error=array-bounds -fno-lifetime-dse -O2 -fwrapv -pipe -Wformat -Werror=format-security -gdwarf-4 -fno-debug-types-section -fvar-tracking-assignments -g2 -Wp,-D_FORTIFY_SOURCE=2 -fstack-protector-strong --param=ssp-buffer-size=4 -fPIC -mtune=generic -march=x86-64 -gdwarf-4 -fno-debug-types-section -fvar-tracking-assignments -g2 -fno-rtti -fno-exceptions -fno-math-errno -pthread -pipe  -g -freorder-blocks -fomit-frame-pointer  -Wno-parentheses -Wno-sign-compare  /tmp/B.FvamER/BUILD/firefox-52.4.0esr/modules/fdlibm/src/s_floor.cpp
make[3]: Leaving directory '/tmp/B.FvamER/BUILD/firefox-52.4.0esr/js/src/modules/fdlibm/src'
make[3]: Entering directory '/tmp/B.FvamER/BUILD/firefox-52.4.0esr/js/src/modules/fdlibm/src'
/usr/bin/x86_64-pld-linux-gnux32-g++ -std=gnu++11 -o s_expm1.o -c  -I/tmp/B.FvamER/BUILD/firefox-52.4.0esr/js/src/dist/system_wrappers -include /tmp/B.FvamER/BUILD/firefox-52.4.0esr/config/gcc_hidden.h -DNDEBUG=1 -DTRIMMED=1 -DMOZ_HAS_MOZGLUE -I/tmp/B.FvamER/BUILD/firefox-52.4.0esr/modules/fdlibm/src -I/tmp/B.FvamER/BUILD/firefox-52.4.0esr/js/src/modules/fdlibm/src  -I/tmp/B.FvamER/BUILD/firefox-52.4.0esr/js/src/dist/include  -I/usr/include/nspr        -fPIC  -DMOZILLA_CLIENT -include /tmp/B.FvamER/BUILD/firefox-52.4.0esr/js/src/js/src/js-confdefs.h -MD -MP -MF .deps/s_expm1.o.pp  -Wall -Wc++11-compat -Wempty-body -Wignored-qualifiers -Woverloaded-virtual -Wpointer-arith -Wsign-compare -Wtype-limits -Wunreachable-code -Wwrite-strings -Wno-invalid-offsetof -Wc++14-compat -Wc++1z-compat -Wimplicit-fallthrough -Wno-error=maybe-uninitialized -Wno-error=deprecated-declarations -Wno-error=array-bounds -fno-lifetime-dse -O2 -fwrapv -pipe -Wformat -Werror=format-security -gdwarf-4 -fno-debug-types-section -fvar-tracking-assignments -g2 -Wp,-D_FORTIFY_SOURCE=2 -fstack-protector-strong --param=ssp-buffer-size=4 -fPIC -mtune=generic -march=x86-64 -gdwarf-4 -fno-debug-types-section -fvar-tracking-assignments -g2 -fno-rtti -fno-exceptions -fno-math-errno -pthread -pipe  -g -freorder-blocks -fomit-frame-pointer  -Wno-parentheses -Wno-sign-compare  /tmp/B.FvamER/BUILD/firefox-52.4.0esr/modules/fdlibm/src/s_expm1.cpp
make[3]: Leaving directory '/tmp/B.FvamER/BUILD/firefox-52.4.0esr/js/src/modules/fdlibm/src'
make[3]: Entering directory '/tmp/B.FvamER/BUILD/firefox-52.4.0esr/js/src/modules/fdlibm/src'
/usr/bin/x86_64-pld-linux-gnux32-g++ -std=gnu++11 -o s_floorf.o -c  -I/tmp/B.FvamER/BUILD/firefox-52.4.0esr/js/src/dist/system_wrappers -include /tmp/B.FvamER/BUILD/firefox-52.4.0esr/config/gcc_hidden.h -DNDEBUG=1 -DTRIMMED=1 -DMOZ_HAS_MOZGLUE -I/tmp/B.FvamER/BUILD/firefox-52.4.0esr/modules/fdlibm/src -I/tmp/B.FvamER/BUILD/firefox-52.4.0esr/js/src/modules/fdlibm/src  -I/tmp/B.FvamER/BUILD/firefox-52.4.0esr/js/src/dist/include  -I/usr/include/nspr        -fPIC  -DMOZILLA_CLIENT -include /tmp/B.FvamER/BUILD/firefox-52.4.0esr/js/src/js/src/js-confdefs.h -MD -MP -MF .deps/s_floorf.o.pp  -Wall -Wc++11-compat -Wempty-body -Wignored-qualifiers -Woverloaded-virtual -Wpointer-arith -Wsign-compare -Wtype-limits -Wunreachable-code -Wwrite-strings -Wno-invalid-offsetof -Wc++14-compat -Wc++1z-compat -Wimplicit-fallthrough -Wno-error=maybe-uninitialized -Wno-error=deprecated-declarations -Wno-error=array-bounds -fno-lifetime-dse -O2 -fwrapv -pipe -Wformat -Werror=format-security -gdwarf-4 -fno-debug-types-section -fvar-tracking-assignments -g2 -Wp,-D_FORTIFY_SOURCE=2 -fstack-protector-strong --param=ssp-buffer-size=4 -fPIC -mtune=generic -march=x86-64 -gdwarf-4 -fno-debug-types-section -fvar-tracking-assignments -g2 -fno-rtti -fno-exceptions -fno-math-errno -pthread -pipe  -g -freorder-blocks -fomit-frame-pointer  -Wno-parentheses -Wno-sign-compare  /tmp/B.FvamER/BUILD/firefox-52.4.0esr/modules/fdlibm/src/s_floorf.cpp
make[3]: Leaving directory '/tmp/B.FvamER/BUILD/firefox-52.4.0esr/js/src/modules/fdlibm/src'
make[3]: Entering directory '/tmp/B.FvamER/BUILD/firefox-52.4.0esr/js/src/modules/fdlibm/src'
/usr/bin/x86_64-pld-linux-gnux32-g++ -std=gnu++11 -o s_log1p.o -c  -I/tmp/B.FvamER/BUILD/firefox-52.4.0esr/js/src/dist/system_wrappers -include /tmp/B.FvamER/BUILD/firefox-52.4.0esr/config/gcc_hidden.h -DNDEBUG=1 -DTRIMMED=1 -DMOZ_HAS_MOZGLUE -I/tmp/B.FvamER/BUILD/firefox-52.4.0esr/modules/fdlibm/src -I/tmp/B.FvamER/BUILD/firefox-52.4.0esr/js/src/modules/fdlibm/src  -I/tmp/B.FvamER/BUILD/firefox-52.4.0esr/js/src/dist/include  -I/usr/include/nspr        -fPIC  -DMOZILLA_CLIENT -include /tmp/B.FvamER/BUILD/firefox-52.4.0esr/js/src/js/src/js-confdefs.h -MD -MP -MF .deps/s_log1p.o.pp  -Wall -Wc++11-compat -Wempty-body -Wignored-qualifiers -Woverloaded-virtual -Wpointer-arith -Wsign-compare -Wtype-limits -Wunreachable-code -Wwrite-strings -Wno-invalid-offsetof -Wc++14-compat -Wc++1z-compat -Wimplicit-fallthrough -Wno-error=maybe-uninitialized -Wno-error=deprecated-declarations -Wno-error=array-bounds -fno-lifetime-dse -O2 -fwrapv -pipe -Wformat -Werror=format-security -gdwarf-4 -fno-debug-types-section -fvar-tracking-assignments -g2 -Wp,-D_FORTIFY_SOURCE=2 -fstack-protector-strong --param=ssp-buffer-size=4 -fPIC -mtune=generic -march=x86-64 -gdwarf-4 -fno-debug-types-section -fvar-tracking-assignments -g2 -fno-rtti -fno-exceptions -fno-math-errno -pthread -pipe  -g -freorder-blocks -fomit-frame-pointer  -Wno-parentheses -Wno-sign-compare  /tmp/B.FvamER/BUILD/firefox-52.4.0esr/modules/fdlibm/src/s_log1p.cpp
make[3]: Leaving directory '/tmp/B.FvamER/BUILD/firefox-52.4.0esr/js/src/modules/fdlibm/src'
make[3]: Entering directory '/tmp/B.FvamER/BUILD/firefox-52.4.0esr/js/src/mfbt'
/usr/bin/x86_64-pld-linux-gnux32-g++ -std=gnu++11 -o Unified_cpp_mfbt1.o -c  -I/tmp/B.FvamER/BUILD/firefox-52.4.0esr/js/src/dist/system_wrappers -include /tmp/B.FvamER/BUILD/firefox-52.4.0esr/config/gcc_hidden.h -DNDEBUG=1 -DTRIMMED=1 -DIMPL_MFBT -I/tmp/B.FvamER/BUILD/firefox-52.4.0esr/mfbt -I/tmp/B.FvamER/BUILD/firefox-52.4.0esr/js/src/mfbt  -I/tmp/B.FvamER/BUILD/firefox-52.4.0esr/js/src/dist/include  -I/usr/include/nspr        -fPIC  -DMOZILLA_CLIENT -include /tmp/B.FvamER/BUILD/firefox-52.4.0esr/js/src/js/src/js-confdefs.h -MD -MP -MF .deps/Unified_cpp_mfbt1.o.pp  -Wall -Wc++11-compat -Wempty-body -Wignored-qualifiers -Woverloaded-virtual -Wpointer-arith -Wsign-compare -Wtype-limits -Wunreachable-code -Wwrite-strings -Wno-invalid-offsetof -Wc++14-compat -Wc++1z-compat -Wimplicit-fallthrough -Wno-error=maybe-uninitialized -Wno-error=deprecated-declarations -Wno-error=array-bounds -fno-lifetime-dse -O2 -fwrapv -pipe -Wformat -Werror=format-security -gdwarf-4 -fno-debug-types-section -fvar-tracking-assignments -g2 -Wp,-D_FORTIFY_SOURCE=2 -fstack-protector-strong --param=ssp-buffer-size=4 -fPIC -mtune=generic -march=x86-64 -gdwarf-4 -fno-debug-types-section -fvar-tracking-assignments -g2 -fno-rtti -fno-exceptions -fno-math-errno -pthread -pipe  -g -freorder-blocks -fomit-frame-pointer  -Wno-error=shadow  /tmp/B.FvamER/BUILD/firefox-52.4.0esr/js/src/mfbt/Unified_cpp_mfbt1.cpp
make[3]: Leaving directory '/tmp/B.FvamER/BUILD/firefox-52.4.0esr/js/src/mfbt'
make[3]: Entering directory '/tmp/B.FvamER/BUILD/firefox-52.4.0esr/js/src/modules/fdlibm/src'
/usr/bin/x86_64-pld-linux-gnux32-g++ -std=gnu++11 -o s_nearbyint.o -c  -I/tmp/B.FvamER/BUILD/firefox-52.4.0esr/js/src/dist/system_wrappers -include /tmp/B.FvamER/BUILD/firefox-52.4.0esr/config/gcc_hidden.h -DNDEBUG=1 -DTRIMMED=1 -DMOZ_HAS_MOZGLUE -I/tmp/B.FvamER/BUILD/firefox-52.4.0esr/modules/fdlibm/src -I/tmp/B.FvamER/BUILD/firefox-52.4.0esr/js/src/modules/fdlibm/src  -I/tmp/B.FvamER/BUILD/firefox-52.4.0esr/js/src/dist/include  -I/usr/include/nspr        -fPIC  -DMOZILLA_CLIENT -include /tmp/B.FvamER/BUILD/firefox-52.4.0esr/js/src/js/src/js-confdefs.h -MD -MP -MF .deps/s_nearbyint.o.pp  -Wall -Wc++11-compat -Wempty-body -Wignored-qualifiers -Woverloaded-virtual -Wpointer-arith -Wsign-compare -Wtype-limits -Wunreachable-code -Wwrite-strings -Wno-invalid-offsetof -Wc++14-compat -Wc++1z-compat -Wimplicit-fallthrough -Wno-error=maybe-uninitialized -Wno-error=deprecated-declarations -Wno-error=array-bounds -fno-lifetime-dse -O2 -fwrapv -pipe -Wformat -Werror=format-security -gdwarf-4 -fno-debug-types-section -fvar-tracking-assignments -g2 -Wp,-D_FORTIFY_SOURCE=2 -fstack-protector-strong --param=ssp-buffer-size=4 -fPIC -mtune=generic -march=x86-64 -gdwarf-4 -fno-debug-types-section -fvar-tracking-assignments -g2 -fno-rtti -fno-exceptions -fno-math-errno -pthread -pipe  -g -freorder-blocks -fomit-frame-pointer  -Wno-parentheses -Wno-sign-compare  /tmp/B.FvamER/BUILD/firefox-52.4.0esr/modules/fdlibm/src/s_nearbyint.cpp
make[3]: Leaving directory '/tmp/B.FvamER/BUILD/firefox-52.4.0esr/js/src/modules/fdlibm/src'
make[3]: Entering directory '/tmp/B.FvamER/BUILD/firefox-52.4.0esr/js/src/modules/fdlibm/src'
/usr/bin/x86_64-pld-linux-gnux32-g++ -std=gnu++11 -o s_rintf.o -c  -I/tmp/B.FvamER/BUILD/firefox-52.4.0esr/js/src/dist/system_wrappers -include /tmp/B.FvamER/BUILD/firefox-52.4.0esr/config/gcc_hidden.h -DNDEBUG=1 -DTRIMMED=1 -DMOZ_HAS_MOZGLUE -I/tmp/B.FvamER/BUILD/firefox-52.4.0esr/modules/fdlibm/src -I/tmp/B.FvamER/BUILD/firefox-52.4.0esr/js/src/modules/fdlibm/src  -I/tmp/B.FvamER/BUILD/firefox-52.4.0esr/js/src/dist/include  -I/usr/include/nspr        -fPIC  -DMOZILLA_CLIENT -include /tmp/B.FvamER/BUILD/firefox-52.4.0esr/js/src/js/src/js-confdefs.h -MD -MP -MF .deps/s_rintf.o.pp  -Wall -Wc++11-compat -Wempty-body -Wignored-qualifiers -Woverloaded-virtual -Wpointer-arith -Wsign-compare -Wtype-limits -Wunreachable-code -Wwrite-strings -Wno-invalid-offsetof -Wc++14-compat -Wc++1z-compat -Wimplicit-fallthrough -Wno-error=maybe-uninitialized -Wno-error=deprecated-declarations -Wno-error=array-bounds -fno-lifetime-dse -O2 -fwrapv -pipe -Wformat -Werror=format-security -gdwarf-4 -fno-debug-types-section -fvar-tracking-assignments -g2 -Wp,-D_FORTIFY_SOURCE=2 -fstack-protector-strong --param=ssp-buffer-size=4 -fPIC -mtune=generic -march=x86-64 -gdwarf-4 -fno-debug-types-section -fvar-tracking-assignments -g2 -fno-rtti -fno-exceptions -fno-math-errno -pthread -pipe  -g -freorder-blocks -fomit-frame-pointer  -Wno-parentheses -Wno-sign-compare  /tmp/B.FvamER/BUILD/firefox-52.4.0esr/modules/fdlibm/src/s_rintf.cpp
make[3]: Leaving directory '/tmp/B.FvamER/BUILD/firefox-52.4.0esr/js/src/modules/fdlibm/src'
make[3]: Entering directory '/tmp/B.FvamER/BUILD/firefox-52.4.0esr/js/src/modules/fdlibm/src'
/usr/bin/x86_64-pld-linux-gnux32-g++ -std=gnu++11 -o s_rint.o -c  -I/tmp/B.FvamER/BUILD/firefox-52.4.0esr/js/src/dist/system_wrappers -include /tmp/B.FvamER/BUILD/firefox-52.4.0esr/config/gcc_hidden.h -DNDEBUG=1 -DTRIMMED=1 -DMOZ_HAS_MOZGLUE -I/tmp/B.FvamER/BUILD/firefox-52.4.0esr/modules/fdlibm/src -I/tmp/B.FvamER/BUILD/firefox-52.4.0esr/js/src/modules/fdlibm/src  -I/tmp/B.FvamER/BUILD/firefox-52.4.0esr/js/src/dist/include  -I/usr/include/nspr        -fPIC  -DMOZILLA_CLIENT -include /tmp/B.FvamER/BUILD/firefox-52.4.0esr/js/src/js/src/js-confdefs.h -MD -MP -MF .deps/s_rint.o.pp  -Wall -Wc++11-compat -Wempty-body -Wignored-qualifiers -Woverloaded-virtual -Wpointer-arith -Wsign-compare -Wtype-limits -Wunreachable-code -Wwrite-strings -Wno-invalid-offsetof -Wc++14-compat -Wc++1z-compat -Wimplicit-fallthrough -Wno-error=maybe-uninitialized -Wno-error=deprecated-declarations -Wno-error=array-bounds -fno-lifetime-dse -O2 -fwrapv -pipe -Wformat -Werror=format-security -gdwarf-4 -fno-debug-types-section -fvar-tracking-assignments -g2 -Wp,-D_FORTIFY_SOURCE=2 -fstack-protector-strong --param=ssp-buffer-size=4 -fPIC -mtune=generic -march=x86-64 -gdwarf-4 -fno-debug-types-section -fvar-tracking-assignments -g2 -fno-rtti -fno-exceptions -fno-math-errno -pthread -pipe  -g -freorder-blocks -fomit-frame-pointer  -Wno-parentheses -Wno-sign-compare  /tmp/B.FvamER/BUILD/firefox-52.4.0esr/modules/fdlibm/src/s_rint.cpp
make[3]: Leaving directory '/tmp/B.FvamER/BUILD/firefox-52.4.0esr/js/src/modules/fdlibm/src'
make[3]: Entering directory '/tmp/B.FvamER/BUILD/firefox-52.4.0esr/js/src/modules/fdlibm/src'
/usr/bin/x86_64-pld-linux-gnux32-g++ -std=gnu++11 -o s_scalbn.o -c  -I/tmp/B.FvamER/BUILD/firefox-52.4.0esr/js/src/dist/system_wrappers -include /tmp/B.FvamER/BUILD/firefox-52.4.0esr/config/gcc_hidden.h -DNDEBUG=1 -DTRIMMED=1 -DMOZ_HAS_MOZGLUE -I/tmp/B.FvamER/BUILD/firefox-52.4.0esr/modules/fdlibm/src -I/tmp/B.FvamER/BUILD/firefox-52.4.0esr/js/src/modules/fdlibm/src  -I/tmp/B.FvamER/BUILD/firefox-52.4.0esr/js/src/dist/include  -I/usr/include/nspr        -fPIC  -DMOZILLA_CLIENT -include /tmp/B.FvamER/BUILD/firefox-52.4.0esr/js/src/js/src/js-confdefs.h -MD -MP -MF .deps/s_scalbn.o.pp  -Wall -Wc++11-compat -Wempty-body -Wignored-qualifiers -Woverloaded-virtual -Wpointer-arith -Wsign-compare -Wtype-limits -Wunreachable-code -Wwrite-strings -Wno-invalid-offsetof -Wc++14-compat -Wc++1z-compat -Wimplicit-fallthrough -Wno-error=maybe-uninitialized -Wno-error=deprecated-declarations -Wno-error=array-bounds -fno-lifetime-dse -O2 -fwrapv -pipe -Wformat -Werror=format-security -gdwarf-4 -fno-debug-types-section -fvar-tracking-assignments -g2 -Wp,-D_FORTIFY_SOURCE=2 -fstack-protector-strong --param=ssp-buffer-size=4 -fPIC -mtune=generic -march=x86-64 -gdwarf-4 -fno-debug-types-section -fvar-tracking-assignments -g2 -fno-rtti -fno-exceptions -fno-math-errno -pthread -pipe  -g -freorder-blocks -fomit-frame-pointer  -Wno-parentheses -Wno-sign-compare  /tmp/B.FvamER/BUILD/firefox-52.4.0esr/modules/fdlibm/src/s_scalbn.cpp
make[3]: Leaving directory '/tmp/B.FvamER/BUILD/firefox-52.4.0esr/js/src/modules/fdlibm/src'
make[3]: Entering directory '/tmp/B.FvamER/BUILD/firefox-52.4.0esr/js/src/modules/fdlibm/src'
/usr/bin/x86_64-pld-linux-gnux32-g++ -std=gnu++11 -o s_tanh.o -c  -I/tmp/B.FvamER/BUILD/firefox-52.4.0esr/js/src/dist/system_wrappers -include /tmp/B.FvamER/BUILD/firefox-52.4.0esr/config/gcc_hidden.h -DNDEBUG=1 -DTRIMMED=1 -DMOZ_HAS_MOZGLUE -I/tmp/B.FvamER/BUILD/firefox-52.4.0esr/modules/fdlibm/src -I/tmp/B.FvamER/BUILD/firefox-52.4.0esr/js/src/modules/fdlibm/src  -I/tmp/B.FvamER/BUILD/firefox-52.4.0esr/js/src/dist/include  -I/usr/include/nspr        -fPIC  -DMOZILLA_CLIENT -include /tmp/B.FvamER/BUILD/firefox-52.4.0esr/js/src/js/src/js-confdefs.h -MD -MP -MF .deps/s_tanh.o.pp  -Wall -Wc++11-compat -Wempty-body -Wignored-qualifiers -Woverloaded-virtual -Wpointer-arith -Wsign-compare -Wtype-limits -Wunreachable-code -Wwrite-strings -Wno-invalid-offsetof -Wc++14-compat -Wc++1z-compat -Wimplicit-fallthrough -Wno-error=maybe-uninitialized -Wno-error=deprecated-declarations -Wno-error=array-bounds -fno-lifetime-dse -O2 -fwrapv -pipe -Wformat -Werror=format-security -gdwarf-4 -fno-debug-types-section -fvar-tracking-assignments -g2 -Wp,-D_FORTIFY_SOURCE=2 -fstack-protector-strong --param=ssp-buffer-size=4 -fPIC -mtune=generic -march=x86-64 -gdwarf-4 -fno-debug-types-section -fvar-tracking-assignments -g2 -fno-rtti -fno-exceptions -fno-math-errno -pthread -pipe  -g -freorder-blocks -fomit-frame-pointer  -Wno-parentheses -Wno-sign-compare  /tmp/B.FvamER/BUILD/firefox-52.4.0esr/modules/fdlibm/src/s_tanh.cpp
make[3]: Leaving directory '/tmp/B.FvamER/BUILD/firefox-52.4.0esr/js/src/modules/fdlibm/src'
make[3]: Entering directory '/tmp/B.FvamER/BUILD/firefox-52.4.0esr/js/src/mfbt'
/usr/bin/x86_64-pld-linux-gnux32-g++ -std=gnu++11 -o Compression.o -c  -I/tmp/B.FvamER/BUILD/firefox-52.4.0esr/js/src/dist/system_wrappers -include /tmp/B.FvamER/BUILD/firefox-52.4.0esr/config/gcc_hidden.h -DNDEBUG=1 -DTRIMMED=1 -DIMPL_MFBT -I/tmp/B.FvamER/BUILD/firefox-52.4.0esr/mfbt -I/tmp/B.FvamER/BUILD/firefox-52.4.0esr/js/src/mfbt  -I/tmp/B.FvamER/BUILD/firefox-52.4.0esr/js/src/dist/include  -I/usr/include/nspr        -fPIC  -DMOZILLA_CLIENT -include /tmp/B.FvamER/BUILD/firefox-52.4.0esr/js/src/js/src/js-confdefs.h -MD -MP -MF .deps/Compression.o.pp  -Wall -Wc++11-compat -Wempty-body -Wignored-qualifiers -Woverloaded-virtual -Wpointer-arith -Wsign-compare -Wtype-limits -Wunreachable-code -Wwrite-strings -Wno-invalid-offsetof -Wc++14-compat -Wc++1z-compat -Wimplicit-fallthrough -Wno-error=maybe-uninitialized -Wno-error=deprecated-declarations -Wno-error=array-bounds -fno-lifetime-dse -O2 -fwrapv -pipe -Wformat -Werror=format-security -gdwarf-4 -fno-debug-types-section -fvar-tracking-assignments -g2 -Wp,-D_FORTIFY_SOURCE=2 -fstack-protector-strong --param=ssp-buffer-size=4 -fPIC -mtune=generic -march=x86-64 -gdwarf-4 -fno-debug-types-section -fvar-tracking-assignments -g2 -fno-rtti -fno-exceptions -fno-math-errno -pthread -pipe  -g -freorder-blocks -fomit-frame-pointer  -Wno-error=shadow -Wno-unused-function /tmp/B.FvamER/BUILD/firefox-52.4.0esr/mfbt/Compression.cpp
make[3]: Leaving directory '/tmp/B.FvamER/BUILD/firefox-52.4.0esr/js/src/mfbt'
make[3]: Entering directory '/tmp/B.FvamER/BUILD/firefox-52.4.0esr/js/src/modules/fdlibm/src'
/usr/bin/x86_64-pld-linux-gnux32-g++ -std=gnu++11 -o s_trunc.o -c  -I/tmp/B.FvamER/BUILD/firefox-52.4.0esr/js/src/dist/system_wrappers -include /tmp/B.FvamER/BUILD/firefox-52.4.0esr/config/gcc_hidden.h -DNDEBUG=1 -DTRIMMED=1 -DMOZ_HAS_MOZGLUE -I/tmp/B.FvamER/BUILD/firefox-52.4.0esr/modules/fdlibm/src -I/tmp/B.FvamER/BUILD/firefox-52.4.0esr/js/src/modules/fdlibm/src  -I/tmp/B.FvamER/BUILD/firefox-52.4.0esr/js/src/dist/include  -I/usr/include/nspr        -fPIC  -DMOZILLA_CLIENT -include /tmp/B.FvamER/BUILD/firefox-52.4.0esr/js/src/js/src/js-confdefs.h -MD -MP -MF .deps/s_trunc.o.pp  -Wall -Wc++11-compat -Wempty-body -Wignored-qualifiers -Woverloaded-virtual -Wpointer-arith -Wsign-compare -Wtype-limits -Wunreachable-code -Wwrite-strings -Wno-invalid-offsetof -Wc++14-compat -Wc++1z-compat -Wimplicit-fallthrough -Wno-error=maybe-uninitialized -Wno-error=deprecated-declarations -Wno-error=array-bounds -fno-lifetime-dse -O2 -fwrapv -pipe -Wformat -Werror=format-security -gdwarf-4 -fno-debug-types-section -fvar-tracking-assignments -g2 -Wp,-D_FORTIFY_SOURCE=2 -fstack-protector-strong --param=ssp-buffer-size=4 -fPIC -mtune=generic -march=x86-64 -gdwarf-4 -fno-debug-types-section -fvar-tracking-assignments -g2 -fno-rtti -fno-exceptions -fno-math-errno -pthread -pipe  -g -freorder-blocks -fomit-frame-pointer  -Wno-parentheses -Wno-sign-compare  /tmp/B.FvamER/BUILD/firefox-52.4.0esr/modules/fdlibm/src/s_trunc.cpp
make[3]: Leaving directory '/tmp/B.FvamER/BUILD/firefox-52.4.0esr/js/src/modules/fdlibm/src'
make[3]: Entering directory '/tmp/B.FvamER/BUILD/firefox-52.4.0esr/js/src/modules/fdlibm/src'
/usr/bin/x86_64-pld-linux-gnux32-g++ -std=gnu++11 -o s_truncf.o -c  -I/tmp/B.FvamER/BUILD/firefox-52.4.0esr/js/src/dist/system_wrappers -include /tmp/B.FvamER/BUILD/firefox-52.4.0esr/config/gcc_hidden.h -DNDEBUG=1 -DTRIMMED=1 -DMOZ_HAS_MOZGLUE -I/tmp/B.FvamER/BUILD/firefox-52.4.0esr/modules/fdlibm/src -I/tmp/B.FvamER/BUILD/firefox-52.4.0esr/js/src/modules/fdlibm/src  -I/tmp/B.FvamER/BUILD/firefox-52.4.0esr/js/src/dist/include  -I/usr/include/nspr        -fPIC  -DMOZILLA_CLIENT -include /tmp/B.FvamER/BUILD/firefox-52.4.0esr/js/src/js/src/js-confdefs.h -MD -MP -MF .deps/s_truncf.o.pp  -Wall -Wc++11-compat -Wempty-body -Wignored-qualifiers -Woverloaded-virtual -Wpointer-arith -Wsign-compare -Wtype-limits -Wunreachable-code -Wwrite-strings -Wno-invalid-offsetof -Wc++14-compat -Wc++1z-compat -Wimplicit-fallthrough -Wno-error=maybe-uninitialized -Wno-error=deprecated-declarations -Wno-error=array-bounds -fno-lifetime-dse -O2 -fwrapv -pipe -Wformat -Werror=format-security -gdwarf-4 -fno-debug-types-section -fvar-tracking-assignments -g2 -Wp,-D_FORTIFY_SOURCE=2 -fstack-protector-strong --param=ssp-buffer-size=4 -fPIC -mtune=generic -march=x86-64 -gdwarf-4 -fno-debug-types-section -fvar-tracking-assignments -g2 -fno-rtti -fno-exceptions -fno-math-errno -pthread -pipe  -g -freorder-blocks -fomit-frame-pointer  -Wno-parentheses -Wno-sign-compare  /tmp/B.FvamER/BUILD/firefox-52.4.0esr/modules/fdlibm/src/s_truncf.cpp
make[3]: Leaving directory '/tmp/B.FvamER/BUILD/firefox-52.4.0esr/js/src/modules/fdlibm/src'
make[3]: Entering directory '/tmp/B.FvamER/BUILD/firefox-52.4.0esr/js/src/modules/fdlibm/src'
libmodules_fdlibm_src.a.desc
rm -f libmodules_fdlibm_src.a
/tmp/B.FvamER/BUILD/firefox-52.4.0esr/_virtualenv/bin/python /tmp/B.FvamER/BUILD/firefox-52.4.0esr/config/expandlibs_gen.py -o libmodules_fdlibm_src.a.desc e_acos.o e_acosh.o e_asin.o e_atan2.o e_atanh.o e_cosh.o e_exp.o e_hypot.o e_log.o e_log10.o e_log2.o e_pow.o e_sinh.o e_sqrt.o k_exp.o s_asinh.o s_atan.o s_cbrt.o s_ceil.o s_ceilf.o s_copysign.o s_expm1.o s_fabs.o s_floor.o s_floorf.o s_log1p.o s_nearbyint.o s_rint.o s_rintf.o s_scalbn.o s_tanh.o s_trunc.o s_truncf.o  
make[3]: Leaving directory '/tmp/B.FvamER/BUILD/firefox-52.4.0esr/js/src/modules/fdlibm/src'
make[3]: Entering directory '/tmp/B.FvamER/BUILD/firefox-52.4.0esr/js/src/mfbt'
/usr/bin/x86_64-pld-linux-gnux32-g++ -std=gnu++11 -o Decimal.o -c  -I/tmp/B.FvamER/BUILD/firefox-52.4.0esr/js/src/dist/system_wrappers -include /tmp/B.FvamER/BUILD/firefox-52.4.0esr/config/gcc_hidden.h -DNDEBUG=1 -DTRIMMED=1 -DIMPL_MFBT -I/tmp/B.FvamER/BUILD/firefox-52.4.0esr/mfbt -I/tmp/B.FvamER/BUILD/firefox-52.4.0esr/js/src/mfbt  -I/tmp/B.FvamER/BUILD/firefox-52.4.0esr/js/src/dist/include  -I/usr/include/nspr        -fPIC  -DMOZILLA_CLIENT -include /tmp/B.FvamER/BUILD/firefox-52.4.0esr/js/src/js/src/js-confdefs.h -MD -MP -MF .deps/Decimal.o.pp  -Wall -Wc++11-compat -Wempty-body -Wignored-qualifiers -Woverloaded-virtual -Wpointer-arith -Wsign-compare -Wtype-limits -Wunreachable-code -Wwrite-strings -Wno-invalid-offsetof -Wc++14-compat -Wc++1z-compat -Wimplicit-fallthrough -Wno-error=maybe-uninitialized -Wno-error=deprecated-declarations -Wno-error=array-bounds -fno-lifetime-dse -O2 -fwrapv -pipe -Wformat -Werror=format-security -gdwarf-4 -fno-debug-types-section -fvar-tracking-assignments -g2 -Wp,-D_FORTIFY_SOURCE=2 -fstack-protector-strong --param=ssp-buffer-size=4 -fPIC -mtune=generic -march=x86-64 -gdwarf-4 -fno-debug-types-section -fvar-tracking-assignments -g2 -fno-rtti -fno-exceptions -fno-math-errno -pthread -pipe  -g -freorder-blocks -fomit-frame-pointer  -Wno-error=shadow  /tmp/B.FvamER/BUILD/firefox-52.4.0esr/mfbt/decimal/Decimal.cpp
make[3]: Leaving directory '/tmp/B.FvamER/BUILD/firefox-52.4.0esr/js/src/mfbt'
make[3]: Entering directory '/tmp/B.FvamER/BUILD/firefox-52.4.0esr/js/src/mfbt'
/usr/bin/x86_64-pld-linux-gnux32-g++ -std=gnu++11 -o Unified_cpp_mfbt0.o -c  -I/tmp/B.FvamER/BUILD/firefox-52.4.0esr/js/src/dist/system_wrappers -include /tmp/B.FvamER/BUILD/firefox-52.4.0esr/config/gcc_hidden.h -DNDEBUG=1 -DTRIMMED=1 -DIMPL_MFBT -I/tmp/B.FvamER/BUILD/firefox-52.4.0esr/mfbt -I/tmp/B.FvamER/BUILD/firefox-52.4.0esr/js/src/mfbt  -I/tmp/B.FvamER/BUILD/firefox-52.4.0esr/js/src/dist/include  -I/usr/include/nspr        -fPIC  -DMOZILLA_CLIENT -include /tmp/B.FvamER/BUILD/firefox-52.4.0esr/js/src/js/src/js-confdefs.h -MD -MP -MF .deps/Unified_cpp_mfbt0.o.pp  -Wall -Wc++11-compat -Wempty-body -Wignored-qualifiers -Woverloaded-virtual -Wpointer-arith -Wsign-compare -Wtype-limits -Wunreachable-code -Wwrite-strings -Wno-invalid-offsetof -Wc++14-compat -Wc++1z-compat -Wimplicit-fallthrough -Wno-error=maybe-uninitialized -Wno-error=deprecated-declarations -Wno-error=array-bounds -fno-lifetime-dse -O2 -fwrapv -pipe -Wformat -Werror=format-security -gdwarf-4 -fno-debug-types-section -fvar-tracking-assignments -g2 -Wp,-D_FORTIFY_SOURCE=2 -fstack-protector-strong --param=ssp-buffer-size=4 -fPIC -mtune=generic -march=x86-64 -gdwarf-4 -fno-debug-types-section -fvar-tracking-assignments -g2 -fno-rtti -fno-exceptions -fno-math-errno -pthread -pipe  -g -freorder-blocks -fomit-frame-pointer  -Wno-error=shadow  /tmp/B.FvamER/BUILD/firefox-52.4.0esr/js/src/mfbt/Unified_cpp_mfbt0.cpp
make[3]: Leaving directory '/tmp/B.FvamER/BUILD/firefox-52.4.0esr/js/src/mfbt'
make[3]: Entering directory '/tmp/B.FvamER/BUILD/firefox-52.4.0esr/js/src/mfbt'
libmfbt.a.desc
rm -f libmfbt.a
/tmp/B.FvamER/BUILD/firefox-52.4.0esr/_virtualenv/bin/python /tmp/B.FvamER/BUILD/firefox-52.4.0esr/config/expandlibs_gen.py -o libmfbt.a.desc Compression.o Decimal.o Unified_cpp_mfbt0.o Unified_cpp_mfbt1.o  
make[3]: Leaving directory '/tmp/B.FvamER/BUILD/firefox-52.4.0esr/js/src/mfbt'
make[1]: *** [/tmp/B.FvamER/BUILD/firefox-52.4.0esr/config/recurse.mk:33: compile] Error 2
make: *** [/tmp/B.FvamER/BUILD/firefox-52.4.0esr/config/rules.mk:523: default] Error 2
error: Bad exit status from /tmp/B.FvamER/BUILD/tmp/rpm-tmp.66828 (%build)


RPM build errors:
    Bad exit status from /tmp/B.FvamER/BUILD/tmp/rpm-tmp.66828 (%build)
ended at: Wed Oct 11 21:16:32 2017, done in 0:00:50.714280
error: No files produced.
+ chmod -R u+rwX /tmp/B.FvamER/BUILD
+ rm -rf /tmp/B.FvamER/tmp /tmp/B.FvamER/BUILD
+ rm -rf /tmp/B.FvamER
Begin-PLD-Builder-Info
Build-Time: user:39.35s sys:19.58s real:79.47s (faults io:46 non-io:817008)

End-PLD-Builder-Info
[Back to list of logs] [View rpm -qa of builder]