FailedOk

th/SRPMS[OK]
th/x32[OK]
th/i686[OK]
th/x86_64[OK]

ac/SRPMS[OK]
ac/i386[OK]
ac/i586[OK]
ac/i686[OK]
ac/alpha[OK]
ac/amd64[OK]
ac/athlon[OK]
ac/ppc[OK]
ac/sparc[OK]
ac/sparc64[OK]

Advanced Search
main()
Powered by PLD Linux
(c) 2002-2018 PLD Team
$Revision: 1.37 $
Powered by ELF.
Your IP: 54.221.75.115

mstflint df7c6696-5939-414f-b034-080daaec2347

Status:Failed
Source URL:ftp://buildlogs.pld-linux.org/th/x32/FAIL/mstflint,df7c6696-5939-414f-b034-080daaec2347.bz2
text/plain URL:View!
rpm -qa of builder:View!
Date:2018/10/31 21:46:59
Runtime:0:00:49.621171

Toc:

  • prep
  • Executing(%prep): /bin/sh -e /tmp/B.B1V4OG/BUILD/tmp/rpm-tmp.68115
  • build
  • Executing(%build): /bin/sh -e /tmp/B.B1V4OG/BUILD/tmp/rpm-tmp.82078
  • error 1
  • cx5fw_layouts.c:594:16: error: format '%lx' expects argument of type 'long unsigned int', but argument 3 has type 'u_int64_t' {aka 'const long long unsigned int'} [-Werror=format=]
  • error 2
  • cx5fw_layouts.c:665:16: error: format '%lx' expects argument of type 'long unsigned int', but argument 3 has type 'u_int64_t' {aka 'const long long unsigned int'} [-Werror=format=]
  • error 3
  • make[2]: *** [Makefile:427: cx5fw_layouts.lo] Error 1
  • error 4
  • cx4fw_layouts.c:63:14: error: format '%lx' expects argument of type 'long unsigned int', but argument 3 has type 'long long unsigned int' [-Werror=format=]
  • error 5
  • cx4fw_layouts.c:110:14: error: format '%lx' expects argument of type 'long unsigned int', but argument 3 has type 'u_int64_t' {aka 'const long long unsigned int'} [-Werror=format=]
  • error 6
  • cx4fw_layouts.c:194:14: error: format '%lx' expects argument of type 'long unsigned int', but argument 3 has type 'u_int64_t' {aka 'const long long unsigned int'} [-Werror=format=]
  • error 7
  • make[2]: *** [Makefile:427: cx4fw_layouts.lo] Error 1
  • error 8
  • cibfw_layouts.c:79:14: error: format '%lx' expects argument of type 'long unsigned int', but argument 3 has type 'long long unsigned int' [-Werror=format=]
  • error 9
  • cibfw_layouts.c:205:14: error: format '%lx' expects argument of type 'long unsigned int', but argument 3 has type 'u_int64_t' {aka 'const long long unsigned int'} [-Werror=format=]
  • error 10
  • cibfw_layouts.c:649:14: error: format '%lx' expects argument of type 'long unsigned int', but argument 3 has type 'u_int64_t' {aka 'const long long unsigned int'} [-Werror=format=]
  • error 11
  • make[2]: *** [Makefile:427: cibfw_layouts.lo] Error 1
  • error 12
  • reg_access_hca_layouts.c:674:14: error: format '%lx' expects argument of type 'long unsigned int', but argument 3 has type 'long long unsigned int' [-Werror=format=]
  • error 13
  • reg_access_hca_layouts.c:834:14: error: format '%lx' expects argument of type 'long unsigned int', but argument 3 has type 'u_int64_t' {aka 'const long long unsigned int'} [-Werror=format=]
  • error 14
  • reg_access_hca_layouts.c:836:14: error: format '%lx' expects argument of type 'long unsigned int', but argument 3 has type 'u_int64_t' {aka 'const long long unsigned int'} [-Werror=format=]
  • error 15
  • reg_access_hca_layouts.c:838:14: error: format '%lx' expects argument of type 'long unsigned int', but argument 3 has type 'u_int64_t' {aka 'const long long unsigned int'} [-Werror=format=]
  • error 16
  • reg_access_hca_layouts.c:1327:14: error: format '%lx' expects argument of type 'long unsigned int', but argument 3 has type 'u_int64_t' {aka 'const long long unsigned int'} [-Werror=format=]
  • error 17
  • reg_access_hca_layouts.c:1329:14: error: format '%lx' expects argument of type 'long unsigned int', but argument 3 has type 'u_int64_t' {aka 'const long long unsigned int'} [-Werror=format=]
  • error 18
  • make[2]: *** [Makefile:427: reg_access_hca_layouts.lo] Error 1
  • error 19
  • tools_open_layouts.c:1414:14: error: format '%lx' expects argument of type 'long unsigned int', but argument 3 has type 'long long unsigned int' [-Werror=format=]
  • error 20
  • tools_open_layouts.c:2306:14: error: format '%lx' expects argument of type 'long unsigned int', but argument 3 has type 'u_int64_t' {aka 'const long long unsigned int'} [-Werror=format=]
  • error 21
  • make[2]: *** [Makefile:427: tools_open_layouts.lo] Error 1
  • error 22
  • make[1]: *** [Makefile:522: all-recursive] Error 1
  • error 23
  • error: Bad exit status from /tmp/B.B1V4OG/BUILD/tmp/rpm-tmp.82078 (%build)
  • error 24
  • RPM build errors:
  • error 25
  • error: No files produced.

Content:

request from: baggins
checking if we should skip the build
started at: Wed Oct 31 21:46:06 2018
killing old processes on a builder
sending signal 9 to pid -1
Killed
cleaning up /tmp
fetching https://srcbuilder.pld-linux.org/th//srpms/df7c6696-5939-414f-b034-080daaec2347/mstflint-4.10.0-1.src.rpm
fetched 3893757 bytes, 2965.9 K/s
installing srpm: mstflint-4.10.0-1.src.rpm
+ install -d /tmp/B.B1V4OG/BUILD /tmp/B.B1V4OG/RPMS
+ LC_ALL=en_US.UTF-8
+ rpm -qp --changelog mstflint-4.10.0-1.src.rpm
* Wed Oct 31 2018 PLD Linux Team <feedback@pld-linux.org>
- For complete changelog see: http://git.pld-linux.org/?p=packages/mstflint.git;a=log;h=master
* Wed Oct 31 2018 Jan Rękorajski <baggins@pld-linux.org> 4cccf41
- up to 4.10.0-3 * Sat Sep 15 2018 Arkadiusz Miśkiewicz <arekm@maven.pl> bb73b61
- release 3 (by relup.sh) + rpm -Uhv --nodeps --define '_topdir /tmp/B.B1V4OG' --define '_specdir %{_topdir}' --define '_sourcedir %{_specdir}' --define '_rpmdir %{_topdir}/RPMS' --define '_builddir %{_topdir}/BUILD' mstflint-4.10.0-1.src.rpm Preparing... ################################################## mstflint ################################################## + rm -f mstflint-4.10.0-1.src.rpm + install -m 700 -d /tmp/B.B1V4OG/BUILD/tmp + TMPDIR=/tmp/B.B1V4OG/BUILD/tmp + exec nice -n 0 rpmbuild -bp --short-circuit --nodeps --define '_topdir /tmp/B.B1V4OG' --define '_specdir %{_topdir}' --define '_sourcedir %{_specdir}' --define '_rpmdir %{_topdir}/RPMS' --define '_builddir %{_topdir}/BUILD' --target x32-pld-linux --define 'prep exit 0' /tmp/B.B1V4OG/mstflint.spec Building target platforms: x32-pld-linux checking BuildConflict-ing packages no BuildConflicts found checking BR rpm: Building target platforms: x32-pld-linux no BR needed building RPM using: set -ex; : build-id: df7c6696-5939-414f-b034-080daaec2347; TMPDIR=/tmp/B.B1V4OG/BUILD/tmp exec nice -n 0 rpmbuild -bb --define '_smp_mflags -j9' --define '_make_opts -Otarget' --define '_pld_builder 1' --define '_topdir /tmp/B.B1V4OG' --define '_specdir %{_topdir}' --define '_sourcedir %{_specdir}' --define '_rpmdir %{_topdir}/RPMS' --define '_builddir %{_topdir}/BUILD' --target x32-pld-linux /tmp/B.B1V4OG/mstflint.spec + : build-id: df7c6696-5939-414f-b034-080daaec2347 + TMPDIR=/tmp/B.B1V4OG/BUILD/tmp + exec nice -n 0 rpmbuild -bb --define '_smp_mflags -j9' --define '_make_opts -Otarget' --define '_pld_builder 1' --define '_topdir /tmp/B.B1V4OG' --define '_specdir %{_topdir}' --define '_sourcedir %{_specdir}' --define '_rpmdir %{_topdir}/RPMS' --define '_builddir %{_topdir}/BUILD' --target x32-pld-linux /tmp/B.B1V4OG/mstflint.spec Building target platforms: x32-pld-linux Executing(%prep): /bin/sh -e /tmp/B.B1V4OG/BUILD/tmp/rpm-tmp.68115 + umask 022 + cd /tmp/B.B1V4OG/BUILD + cd /tmp/B.B1V4OG/BUILD + rm -rf mstflint-4.10.0 + /usr/bin/gzip -dc /tmp/B.B1V4OG/mstflint-4.10.0-3.tar.gz + /bin/tar -xf - + STATUS=0 + '[' 0 -ne 0 ']' + cd mstflint-4.10.0 + /bin/id -u + '[' 1000 '=' 0 ']' + /bin/id -u + '[' 1000 '=' 0 ']' + /bin/chmod -Rf a+rX,u+w,g-w,o-w . + echo 'Patch #0 (openssl-1.1.patch):' Patch #0 (openssl-1.1.patch): + '[' -f /tmp/B.B1V4OG/openssl-1.1.patch ']' + /bin/cat /tmp/B.B1V4OG/openssl-1.1.patch + /usr/bin/patch -s -p1 + exit 0 Executing(%build): /bin/sh -e /tmp/B.B1V4OG/BUILD/tmp/rpm-tmp.82078 HOME=/home/users/builder PATH=/home/users/builder/GNUstep/Tools:/usr/local/bin:/usr/bin:/bin TMPDIR=/tmp/B.B1V4OG/BUILD/tmp + umask 022 + cd /tmp/B.B1V4OG/BUILD + cd mstflint-4.10.0 + ./configure 'LDFLAGS=-Wl,--as-needed -Wl,--no-copy-dt-needed-entries -Wl,-z,relro -Wl,-z,combreloc ' 'CFLAGS=-O2 -fwrapv -pipe -Wformat -Werror=format-security -gdwarf-4 -fno-debug-types-section -fvar-tracking-assignments -g2 -Wp,-D_FORTIFY_SOURCE=2 -fstack-protector-strong --param=ssp-buffer-size=4 -fPIC -mtune=generic -march=x86-64 -gdwarf-4 -fno-debug-types-section -fvar-tracking-assignments -g2 ' 'CXXFLAGS=-O2 -fwrapv -pipe -Wformat -Werror=format-security -gdwarf-4 -fno-debug-types-section -fvar-tracking-assignments -g2 -Wp,-D_FORTIFY_SOURCE=2 -fstack-protector-strong --param=ssp-buffer-size=4 -fPIC -mtune=generic -march=x86-64 -gdwarf-4 -fno-debug-types-section -fvar-tracking-assignments -g2 ' 'FFLAGS=-O2 -fwrapv -pipe -Wformat -Werror=format-security -gdwarf-4 -fno-debug-types-section -fvar-tracking-assignments -g2 -Wp,-D_FORTIFY_SOURCE=2 -fstack-protector-strong --param=ssp-buffer-size=4 -fPIC -mtune=generic -march=x86-64 -gdwarf-4 -fno-debug-types-section -fvar-tracking-assignments -g2 ' 'FCFLAGS=-O2 -fwrapv -pipe -Wformat -Werror=format-security -gdwarf-4 -fno-debug-types-section -fvar-tracking-assignments -g2 -Wp,-D_FORTIFY_SOURCE=2 -fstack-protector-strong --param=ssp-buffer-size=4 -fPIC -mtune=generic -march=x86-64 -gdwarf-4 -fno-debug-types-section -fvar-tracking-assignments -g2 ' 'CPPFLAGS=' 'CC=x86_64-pld-linux-gnux32-gcc' 'CXX=x86_64-pld-linux-gnux32-g++' '--host=x86_64-pld-linux-gnux32' '--build=x86_64-pld-linux-gnux32' '--prefix=/usr' '--exec-prefix=/usr' '--bindir=/usr/bin' '--sbindir=/usr/sbin' '--sysconfdir=/etc' '--datadir=/usr/share' '--includedir=/usr/include' '--libdir=/usr/libx32' '--libexecdir=/usr/libexec' '--localstatedir=/var' '--sharedstatedir=/var/lib' '--mandir=/usr/share/man' '--infodir=/usr/share/info' '--x-libraries=/usr/libx32' --enable-cs --enable-fw-mgr --enable-xml2 --enable-openssl checking for a BSD-compatible install... /usr/bin/install -c checking whether build environment is sane... yes checking for a thread-safe mkdir -p... /bin/mkdir -p checking for gawk... gawk checking whether make sets $(MAKE)... yes checking whether make supports nested variables... yes checking for x86_64-pld-linux-gnux32-gcc... x86_64-pld-linux-gnux32-gcc checking whether the C compiler works... yes checking for C compiler default output file name... a.out checking for suffix of executables... checking whether we are cross compiling... no checking for suffix of object files... o checking whether we are using the GNU C compiler... yes checking whether x86_64-pld-linux-gnux32-gcc accepts -g... yes checking for x86_64-pld-linux-gnux32-gcc option to accept ISO C89... none needed checking for style of include used by make... GNU checking dependency style of x86_64-pld-linux-gnux32-gcc... gcc3 checking whether we are using the GNU C++ compiler... yes checking whether x86_64-pld-linux-gnux32-g++ accepts -g... yes checking dependency style of x86_64-pld-linux-gnux32-g++... gcc3 checking for x86_64-pld-linux-gnux32-ar... no checking for x86_64-pld-linux-gnux32-lib... no checking for x86_64-pld-linux-gnux32-link... no checking for ar... ar checking the archiver (ar) interface... ar checking build system type... x86_64-pld-linux-gnux32 checking host system type... x86_64-pld-linux-gnux32 checking how to print strings... print -r checking for a sed that does not truncate output... /bin/sed checking for grep that handles long lines and -e... /bin/grep checking for egrep... /bin/grep -E checking for fgrep... /bin/grep -F checking for ld used by x86_64-pld-linux-gnux32-gcc... /usr/bin/ld checking if the linker (/usr/bin/ld) is GNU ld... yes checking for BSD- or MS-compatible name lister (nm)... /usr/bin/nm -B checking the name lister (/usr/bin/nm -B) interface... BSD nm checking whether ln -s works... yes checking the maximum length of command line arguments... 1572864 checking whether the shell understands some XSI constructs... yes checking whether the shell understands "+="... yes checking how to convert x86_64-pld-linux-gnux32 file names to x86_64-pld-linux-gnux32 format... func_convert_file_noop checking how to convert x86_64-pld-linux-gnux32 file names to toolchain format... func_convert_file_noop checking for /usr/bin/ld option to reload object files... -r checking for x86_64-pld-linux-gnux32-objdump... no checking for objdump... objdump checking how to recognize dependent libraries... pass_all checking for x86_64-pld-linux-gnux32-dlltool... no checking for dlltool... no checking how to associate runtime and link libraries... print -r -- checking for x86_64-pld-linux-gnux32-ar... ar checking for archiver @FILE support... @ checking for x86_64-pld-linux-gnux32-strip... no checking for strip... strip checking for x86_64-pld-linux-gnux32-ranlib... no checking for ranlib... ranlib checking command to parse /usr/bin/nm -B output from x86_64-pld-linux-gnux32-gcc object... ok checking for sysroot... no checking for x86_64-pld-linux-gnux32-mt... no checking for mt... no checking if : is a manifest tool... no checking how to run the C preprocessor... x86_64-pld-linux-gnux32-gcc -E checking for ANSI C header files... yes checking for sys/types.h... yes checking for sys/stat.h... yes checking for stdlib.h... yes checking for string.h... yes checking for memory.h... yes checking for strings.h... yes checking for inttypes.h... yes checking for stdint.h... yes checking for unistd.h... yes checking for dlfcn.h... yes checking for objdir... .libs checking if x86_64-pld-linux-gnux32-gcc supports -fno-rtti -fno-exceptions... no checking for x86_64-pld-linux-gnux32-gcc option to produce PIC... -fPIC -DPIC checking if x86_64-pld-linux-gnux32-gcc PIC flag -fPIC -DPIC works... yes checking if x86_64-pld-linux-gnux32-gcc static flag -static works... yes checking if x86_64-pld-linux-gnux32-gcc supports -c -o file.o... yes checking if x86_64-pld-linux-gnux32-gcc supports -c -o file.o... (cached) yes checking whether the x86_64-pld-linux-gnux32-gcc linker (/usr/bin/ld -m elf_i386) supports shared libraries... yes checking whether -lc should be explicitly linked in... no checking dynamic linker characteristics... GNU/Linux ld.so checking how to hardcode library paths into programs... immediate checking whether stripping libraries is possible... yes checking if libtool supports shared libraries... yes checking whether to build shared libraries... yes checking whether to build static libraries... yes checking how to run the C++ preprocessor... x86_64-pld-linux-gnux32-g++ -E checking for ld used by x86_64-pld-linux-gnux32-g++... /usr/bin/ld -m elf_i386 checking if the linker (/usr/bin/ld -m elf_i386) is GNU ld... yes checking whether the x86_64-pld-linux-gnux32-g++ linker (/usr/bin/ld -m elf_i386) supports shared libraries... yes checking for x86_64-pld-linux-gnux32-g++ option to produce PIC... -fPIC -DPIC checking if x86_64-pld-linux-gnux32-g++ PIC flag -fPIC -DPIC works... yes checking if x86_64-pld-linux-gnux32-g++ static flag -static works... yes checking if x86_64-pld-linux-gnux32-g++ supports -c -o file.o... yes checking if x86_64-pld-linux-gnux32-g++ supports -c -o file.o... (cached) yes checking whether the x86_64-pld-linux-gnux32-g++ linker (/usr/bin/ld -m elf_i386) supports shared libraries... yes checking dynamic linker characteristics... (cached) GNU/Linux ld.so checking how to hardcode library paths into programs... immediate checking termios.h usability... yes checking termios.h presence... yes checking for termios.h... yes checking --enable-dc argument... yes checking zlib.h usability... yes checking zlib.h presence... yes checking for zlib.h... yes checking for uncompress in -lz... yes checking --enable-fw-mgr argument... yes checking curl/curl.h usability... yes checking curl/curl.h presence... yes checking for curl/curl.h... yes checking for zlib.h... (cached) yes checking lzma.h usability... yes checking lzma.h presence... yes checking for lzma.h... yes checking for uncompress in -lz... (cached) yes checking for regcompA in -lboost_regex... yes checking --enable-xml2 argument... yes configure: checking for libxml2... yes checking for xmlDocDumpFormatMemoryEnc in -lxml2... yes checking --enable-inband argument... yes checking infiniband/mad.h usability... yes checking infiniband/mad.h presence... yes checking for infiniband/mad.h... yes checking --enable-cs argument... yes checking openssl/md5.h usability... yes checking openssl/md5.h presence... yes checking for openssl/md5.h... yes checking --enable-openssl argument... yes checking openssl/sha.h usability... yes checking openssl/sha.h presence... yes checking for openssl/sha.h... yes checking openssl/rsa.h usability... yes checking openssl/rsa.h presence... yes checking for openssl/rsa.h... yes checking openssl/pem.h usability... yes checking openssl/pem.h presence... yes checking for openssl/pem.h... yes checking openssl/bio.h usability... yes checking openssl/bio.h presence... yes checking for openssl/bio.h... yes checking for openssl/md5.h... (cached) yes checking whether C compiler accepts -Wno-format-overflow... yes checking whether C compiler accepts -Wno-implicit-fallthrough... yes checking whether C compiler accepts -Wno-cast-function-type... yes checking whether C++ compiler accepts -Wno-implicit-fallthrough... yes checking whether C++ compiler accepts -Wno-format-overflow... yes checking whether C++ compiler accepts -Wno-cast-function-type... yes checking whether C++ compiler accepts -Wno-class-memaccess... yes configure: Linux MTCR checking that generated files are newer than configure... done configure: creating ./config.status config.status: creating mstflint.spec config.status: creating tools_crypto/Makefile config.status: creating mlxsign_lib/Makefile config.status: creating mlxfwupdate/Makefile config.status: creating libmfa/Makefile config.status: creating xz_utils/Makefile config.status: creating ext_libs/iniParser/Makefile config.status: creating ext_libs/json/Makefile config.status: creating ext_libs/minixz/Makefile config.status: creating mtcr_ul/Makefile config.status: creating Makefile config.status: creating common/Makefile config.status: creating mft_utils/Makefile config.status: creating mtcr_py/Makefile config.status: creating ext_libs/Makefile config.status: creating ext_libs/sqlite/Makefile config.status: creating ext_libs/muparser/Makefile config.status: creating dev_mgt/Makefile config.status: creating tools_layouts/Makefile config.status: creating reg_access/Makefile config.status: creating cmdif/Makefile config.status: creating tools_res_mgmt/Makefile config.status: creating mlxconfig/Makefile config.status: creating mlxconfig/mlxconfig_dbs/Makefile config.status: creating mflash/Makefile config.status: creating mlxfwops/Makefile config.status: creating mlxfwops/lib/Makefile config.status: creating cmdparser/Makefile config.status: creating flint/Makefile config.status: creating small_utils/Makefile config.status: creating small_utils/mlxfwresetlib/Makefile config.status: creating mstdump/Makefile config.status: creating mstdump/crd_lib/Makefile config.status: creating mstdump/crd_main/Makefile config.status: creating mstdump/mstdump_dbs/Makefile config.status: creating mvpd/Makefile config.status: creating fw_comps_mgr/Makefile config.status: creating mad_ifc/Makefile config.status: creating config.h config.status: executing depfiles commands config.status: executing libtool commands + /usr/bin/make -Otarget -j9 /usr/bin/make all-recursive Making all in common make[2]: Entering directory '/tmp/B.B1V4OG/BUILD/mstflint-4.10.0/common' sed -e 's,[@]MFT_VERSION_STR[@],mstflint 4.10.0,g' -e 's,[@]TOOLS_BUILD_TIME[@],Oct 31 2018\, 21:46:13,g' -e 's,[@]TOOLS_GIT_SHA[@],N/A,g' < ./tools_version.py.in > tools_version.py make[2]: Leaving directory '/tmp/B.B1V4OG/BUILD/mstflint-4.10.0/common' make[2]: Entering directory '/tmp/B.B1V4OG/BUILD/mstflint-4.10.0/common' sed -e 's,[@]MST_LIB_DIR[@],/usr/libx32,g' -e 's,[@]MST_BIN_DIR[@],/usr/bin,g' -e 's,[@]MFTCONF_PREFIX[@],/usr,g' < ./python_wrapper.sh > python_wrapper chmod +x python_wrapper make[2]: Leaving directory '/tmp/B.B1V4OG/BUILD/mstflint-4.10.0/common' Making all in mft_utils make[2]: Entering directory '/tmp/B.B1V4OG/BUILD/mstflint-4.10.0/mft_utils' x86_64-pld-linux-gnux32-gcc -DHAVE_CONFIG_H -I. -I.. -I. -I../common -fPIC -MD -pipe -Wall -W -Werror -fPIC -O2 -fwrapv -pipe -Wformat -Werror=format-security -gdwarf-4 -fno-debug-types-section -fvar-tracking-assignments -g2 -Wp,-D_FORTIFY_SOURCE=2 -fstack-protector-strong --param=ssp-buffer-size=4 -fPIC -mtune=generic -march=x86-64 -gdwarf-4 -fno-debug-types-section -fvar-tracking-assignments -g2 -Werror -DMST_UL -Wno-format-overflow -Wno-implicit-fallthrough -Wno-cast-function-type -MT calc_hw_crc.o -MD -MP -MF .deps/calc_hw_crc.Tpo -c -o calc_hw_crc.o calc_hw_crc.c mv -f .deps/calc_hw_crc.Tpo .deps/calc_hw_crc.Po make[2]: Leaving directory '/tmp/B.B1V4OG/BUILD/mstflint-4.10.0/mft_utils' make[2]: Entering directory '/tmp/B.B1V4OG/BUILD/mstflint-4.10.0/mft_utils' x86_64-pld-linux-gnux32-gcc -DHAVE_CONFIG_H -I. -I.. -I. -I../common -fPIC -MD -pipe -Wall -W -Werror -fPIC -O2 -fwrapv -pipe -Wformat -Werror=format-security -gdwarf-4 -fno-debug-types-section -fvar-tracking-assignments -g2 -Wp,-D_FORTIFY_SOURCE=2 -fstack-protector-strong --param=ssp-buffer-size=4 -fPIC -mtune=generic -march=x86-64 -gdwarf-4 -fno-debug-types-section -fvar-tracking-assignments -g2 -Werror -DMST_UL -Wno-format-overflow -Wno-implicit-fallthrough -Wno-cast-function-type -MT mft_sig_handler.o -MD -MP -MF .deps/mft_sig_handler.Tpo -c -o mft_sig_handler.o mft_sig_handler.c mv -f .deps/mft_sig_handler.Tpo .deps/mft_sig_handler.Po make[2]: Leaving directory '/tmp/B.B1V4OG/BUILD/mstflint-4.10.0/mft_utils' make[2]: Entering directory '/tmp/B.B1V4OG/BUILD/mstflint-4.10.0/mft_utils' x86_64-pld-linux-gnux32-g++ -DHAVE_CONFIG_H -I. -I.. -I. -I../common -fPIC -O2 -fwrapv -pipe -Wformat -Werror=format-security -gdwarf-4 -fno-debug-types-section -fvar-tracking-assignments -g2 -Wp,-D_FORTIFY_SOURCE=2 -fstack-protector-strong --param=ssp-buffer-size=4 -fPIC -mtune=generic -march=x86-64 -gdwarf-4 -fno-debug-types-section -fvar-tracking-assignments -g2 -DHAVE_TERMIOS_H -Werror -DMST_UL -Wno-implicit-fallthrough -Wno-format-overflow -Wno-cast-function-type -Wno-class-memaccess -MT mlarge_buffer.o -MD -MP -MF .deps/mlarge_buffer.Tpo -c -o mlarge_buffer.o mlarge_buffer.cpp mv -f .deps/mlarge_buffer.Tpo .deps/mlarge_buffer.Po make[2]: Leaving directory '/tmp/B.B1V4OG/BUILD/mstflint-4.10.0/mft_utils' make[2]: Entering directory '/tmp/B.B1V4OG/BUILD/mstflint-4.10.0/mft_utils' x86_64-pld-linux-gnux32-g++ -DHAVE_CONFIG_H -I. -I.. -I. -I../common -fPIC -O2 -fwrapv -pipe -Wformat -Werror=format-security -gdwarf-4 -fno-debug-types-section -fvar-tracking-assignments -g2 -Wp,-D_FORTIFY_SOURCE=2 -fstack-protector-strong --param=ssp-buffer-size=4 -fPIC -mtune=generic -march=x86-64 -gdwarf-4 -fno-debug-types-section -fvar-tracking-assignments -g2 -DHAVE_TERMIOS_H -Werror -DMST_UL -Wno-implicit-fallthrough -Wno-format-overflow -Wno-cast-function-type -Wno-class-memaccess -MT errmsg.o -MD -MP -MF .deps/errmsg.Tpo -c -o errmsg.o errmsg.cpp mv -f .deps/errmsg.Tpo .deps/errmsg.Po make[2]: Leaving directory '/tmp/B.B1V4OG/BUILD/mstflint-4.10.0/mft_utils' make[2]: Entering directory '/tmp/B.B1V4OG/BUILD/mstflint-4.10.0/mft_utils' rm -f libmftutils.a ar cru libmftutils.a mft_sig_handler.o errmsg.o calc_hw_crc.o mlarge_buffer.o ranlib libmftutils.a make[2]: Leaving directory '/tmp/B.B1V4OG/BUILD/mstflint-4.10.0/mft_utils' Making all in ext_libs Making all in muparser make[3]: Entering directory '/tmp/B.B1V4OG/BUILD/mstflint-4.10.0/ext_libs/muparser' x86_64-pld-linux-gnux32-g++ -DHAVE_CONFIG_H -I. -I../.. -W -Wno-error -g -MP -MD -fPIC -Wno-deprecated-declarations -O2 -fwrapv -pipe -Wformat -Werror=format-security -gdwarf-4 -fno-debug-types-section -fvar-tracking-assignments -g2 -Wp,-D_FORTIFY_SOURCE=2 -fstack-protector-strong --param=ssp-buffer-size=4 -fPIC -mtune=generic -march=x86-64 -gdwarf-4 -fno-debug-types-section -fvar-tracking-assignments -g2 -DHAVE_TERMIOS_H -Werror -DMST_UL -Wno-implicit-fallthrough -Wno-format-overflow -Wno-cast-function-type -Wno-class-memaccess -MT muParserCallback.o -MD -MP -MF .deps/muParserCallback.Tpo -c -o muParserCallback.o muParserCallback.cpp mv -f .deps/muParserCallback.Tpo .deps/muParserCallback.Po make[3]: Leaving directory '/tmp/B.B1V4OG/BUILD/mstflint-4.10.0/ext_libs/muparser' make[3]: Entering directory '/tmp/B.B1V4OG/BUILD/mstflint-4.10.0/ext_libs/muparser' x86_64-pld-linux-gnux32-g++ -DHAVE_CONFIG_H -I. -I../.. -W -Wno-error -g -MP -MD -fPIC -Wno-deprecated-declarations -O2 -fwrapv -pipe -Wformat -Werror=format-security -gdwarf-4 -fno-debug-types-section -fvar-tracking-assignments -g2 -Wp,-D_FORTIFY_SOURCE=2 -fstack-protector-strong --param=ssp-buffer-size=4 -fPIC -mtune=generic -march=x86-64 -gdwarf-4 -fno-debug-types-section -fvar-tracking-assignments -g2 -DHAVE_TERMIOS_H -Werror -DMST_UL -Wno-implicit-fallthrough -Wno-format-overflow -Wno-cast-function-type -Wno-class-memaccess -MT muParserBytecode.o -MD -MP -MF .deps/muParserBytecode.Tpo -c -o muParserBytecode.o muParserBytecode.cpp mv -f .deps/muParserBytecode.Tpo .deps/muParserBytecode.Po make[3]: Leaving directory '/tmp/B.B1V4OG/BUILD/mstflint-4.10.0/ext_libs/muparser' make[3]: Entering directory '/tmp/B.B1V4OG/BUILD/mstflint-4.10.0/ext_libs/muparser' x86_64-pld-linux-gnux32-g++ -DHAVE_CONFIG_H -I. -I../.. -W -Wno-error -g -MP -MD -fPIC -Wno-deprecated-declarations -O2 -fwrapv -pipe -Wformat -Werror=format-security -gdwarf-4 -fno-debug-types-section -fvar-tracking-assignments -g2 -Wp,-D_FORTIFY_SOURCE=2 -fstack-protector-strong --param=ssp-buffer-size=4 -fPIC -mtune=generic -march=x86-64 -gdwarf-4 -fno-debug-types-section -fvar-tracking-assignments -g2 -DHAVE_TERMIOS_H -Werror -DMST_UL -Wno-implicit-fallthrough -Wno-format-overflow -Wno-cast-function-type -Wno-class-memaccess -MT muParserError.o -MD -MP -MF .deps/muParserError.Tpo -c -o muParserError.o muParserError.cpp mv -f .deps/muParserError.Tpo .deps/muParserError.Po make[3]: Leaving directory '/tmp/B.B1V4OG/BUILD/mstflint-4.10.0/ext_libs/muparser' make[3]: Entering directory '/tmp/B.B1V4OG/BUILD/mstflint-4.10.0/ext_libs/muparser' x86_64-pld-linux-gnux32-g++ -DHAVE_CONFIG_H -I. -I../.. -W -Wno-error -g -MP -MD -fPIC -Wno-deprecated-declarations -O2 -fwrapv -pipe -Wformat -Werror=format-security -gdwarf-4 -fno-debug-types-section -fvar-tracking-assignments -g2 -Wp,-D_FORTIFY_SOURCE=2 -fstack-protector-strong --param=ssp-buffer-size=4 -fPIC -mtune=generic -march=x86-64 -gdwarf-4 -fno-debug-types-section -fvar-tracking-assignments -g2 -DHAVE_TERMIOS_H -Werror -DMST_UL -Wno-implicit-fallthrough -Wno-format-overflow -Wno-cast-function-type -Wno-class-memaccess -MT muParser.o -MD -MP -MF .deps/muParser.Tpo -c -o muParser.o muParser.cpp mv -f .deps/muParser.Tpo .deps/muParser.Po make[3]: Leaving directory '/tmp/B.B1V4OG/BUILD/mstflint-4.10.0/ext_libs/muparser' make[3]: Entering directory '/tmp/B.B1V4OG/BUILD/mstflint-4.10.0/ext_libs/muparser' x86_64-pld-linux-gnux32-g++ -DHAVE_CONFIG_H -I. -I../.. -W -Wno-error -g -MP -MD -fPIC -Wno-deprecated-declarations -O2 -fwrapv -pipe -Wformat -Werror=format-security -gdwarf-4 -fno-debug-types-section -fvar-tracking-assignments -g2 -Wp,-D_FORTIFY_SOURCE=2 -fstack-protector-strong --param=ssp-buffer-size=4 -fPIC -mtune=generic -march=x86-64 -gdwarf-4 -fno-debug-types-section -fvar-tracking-assignments -g2 -DHAVE_TERMIOS_H -Werror -DMST_UL -Wno-implicit-fallthrough -Wno-format-overflow -Wno-cast-function-type -Wno-class-memaccess -MT muParserTokenReader.o -MD -MP -MF .deps/muParserTokenReader.Tpo -c -o muParserTokenReader.o muParserTokenReader.cpp mv -f .deps/muParserTokenReader.Tpo .deps/muParserTokenReader.Po make[3]: Leaving directory '/tmp/B.B1V4OG/BUILD/mstflint-4.10.0/ext_libs/muparser' make[3]: Entering directory '/tmp/B.B1V4OG/BUILD/mstflint-4.10.0/ext_libs/muparser' x86_64-pld-linux-gnux32-g++ -DHAVE_CONFIG_H -I. -I../.. -W -Wno-error -g -MP -MD -fPIC -Wno-deprecated-declarations -O2 -fwrapv -pipe -Wformat -Werror=format-security -gdwarf-4 -fno-debug-types-section -fvar-tracking-assignments -g2 -Wp,-D_FORTIFY_SOURCE=2 -fstack-protector-strong --param=ssp-buffer-size=4 -fPIC -mtune=generic -march=x86-64 -gdwarf-4 -fno-debug-types-section -fvar-tracking-assignments -g2 -DHAVE_TERMIOS_H -Werror -DMST_UL -Wno-implicit-fallthrough -Wno-format-overflow -Wno-cast-function-type -Wno-class-memaccess -MT muParserBase.o -MD -MP -MF .deps/muParserBase.Tpo -c -o muParserBase.o muParserBase.cpp mv -f .deps/muParserBase.Tpo .deps/muParserBase.Po make[3]: Leaving directory '/tmp/B.B1V4OG/BUILD/mstflint-4.10.0/ext_libs/muparser' make[3]: Entering directory '/tmp/B.B1V4OG/BUILD/mstflint-4.10.0/ext_libs/muparser' rm -f libmuparser.a ar cru libmuparser.a muParserBase.o muParserBytecode.o muParserCallback.o muParser.o muParserError.o muParserTokenReader.o ranlib libmuparser.a make[3]: Leaving directory '/tmp/B.B1V4OG/BUILD/mstflint-4.10.0/ext_libs/muparser' Making all in sqlite make[3]: Entering directory '/tmp/B.B1V4OG/BUILD/mstflint-4.10.0/ext_libs/sqlite' x86_64-pld-linux-gnux32-gcc -DHAVE_CONFIG_H -I. -I../.. -W -Werror -g -MP -MD -DSQLITE_THREADSAFE=0 -fPIC -O2 -fwrapv -pipe -Wformat -Werror=format-security -gdwarf-4 -fno-debug-types-section -fvar-tracking-assignments -g2 -Wp,-D_FORTIFY_SOURCE=2 -fstack-protector-strong --param=ssp-buffer-size=4 -fPIC -mtune=generic -march=x86-64 -gdwarf-4 -fno-debug-types-section -fvar-tracking-assignments -g2 -Werror -DMST_UL -Wno-format-overflow -Wno-implicit-fallthrough -Wno-cast-function-type -MT sqlite3.o -MD -MP -MF .deps/sqlite3.Tpo -c -o sqlite3.o sqlite3.c mv -f .deps/sqlite3.Tpo .deps/sqlite3.Po make[3]: Leaving directory '/tmp/B.B1V4OG/BUILD/mstflint-4.10.0/ext_libs/sqlite' make[3]: Entering directory '/tmp/B.B1V4OG/BUILD/mstflint-4.10.0/ext_libs/sqlite' rm -f libsqlite3.a ar cru libsqlite3.a sqlite3.o ranlib libsqlite3.a make[3]: Leaving directory '/tmp/B.B1V4OG/BUILD/mstflint-4.10.0/ext_libs/sqlite' Making all in iniParser make[3]: Entering directory '/tmp/B.B1V4OG/BUILD/mstflint-4.10.0/ext_libs/iniParser' /bin/sh ../../libtool --tag=CC --mode=compile x86_64-pld-linux-gnux32-gcc -DHAVE_CONFIG_H -I. -I../.. -I. -I../.. -I../../ -I../../common -W -Werror -g -MP -MD -fPIC -O2 -fwrapv -pipe -Wformat -Werror=format-security -gdwarf-4 -fno-debug-types-section -fvar-tracking-assignments -g2 -Wp,-D_FORTIFY_SOURCE=2 -fstack-protector-strong --param=ssp-buffer-size=4 -fPIC -mtune=generic -march=x86-64 -gdwarf-4 -fno-debug-types-section -fvar-tracking-assignments -g2 -Werror -DMST_UL -Wno-format-overflow -Wno-implicit-fallthrough -Wno-cast-function-type -MT dictionary.lo -MD -MP -MF .deps/dictionary.Tpo -c -o dictionary.lo dictionary.c libtool: compile: x86_64-pld-linux-gnux32-gcc -DHAVE_CONFIG_H -I. -I../.. -I. -I../.. -I../../ -I../../common -W -Werror -g -MP -MD -fPIC -O2 -fwrapv -pipe -Wformat -Werror=format-security -gdwarf-4 -fno-debug-types-section -fvar-tracking-assignments -g2 -Wp,-D_FORTIFY_SOURCE=2 -fstack-protector-strong --param=ssp-buffer-size=4 -fPIC -mtune=generic -march=x86-64 -gdwarf-4 -fno-debug-types-section -fvar-tracking-assignments -g2 -Werror -DMST_UL -Wno-format-overflow -Wno-implicit-fallthrough -Wno-cast-function-type -MT dictionary.lo -MD -MP -MF .deps/dictionary.Tpo -c dictionary.c -fPIC -DPIC -o .libs/dictionary.o libtool: compile: x86_64-pld-linux-gnux32-gcc -DHAVE_CONFIG_H -I. -I../.. -I. -I../.. -I../../ -I../../common -W -Werror -g -MP -MD -fPIC -O2 -fwrapv -pipe -Wformat -Werror=format-security -gdwarf-4 -fno-debug-types-section -fvar-tracking-assignments -g2 -Wp,-D_FORTIFY_SOURCE=2 -fstack-protector-strong --param=ssp-buffer-size=4 -fPIC -mtune=generic -march=x86-64 -gdwarf-4 -fno-debug-types-section -fvar-tracking-assignments -g2 -Werror -DMST_UL -Wno-format-overflow -Wno-implicit-fallthrough -Wno-cast-function-type -MT dictionary.lo -MD -MP -MF .deps/dictionary.Tpo -c dictionary.c -o dictionary.o >/dev/null 2>&1 mv -f .deps/dictionary.Tpo .deps/dictionary.Plo make[3]: Leaving directory '/tmp/B.B1V4OG/BUILD/mstflint-4.10.0/ext_libs/iniParser' make[3]: Entering directory '/tmp/B.B1V4OG/BUILD/mstflint-4.10.0/ext_libs/iniParser' /bin/sh ../../libtool --tag=CC --mode=compile x86_64-pld-linux-gnux32-gcc -DHAVE_CONFIG_H -I. -I../.. -I. -I../.. -I../../ -I../../common -W -Werror -g -MP -MD -fPIC -O2 -fwrapv -pipe -Wformat -Werror=format-security -gdwarf-4 -fno-debug-types-section -fvar-tracking-assignments -g2 -Wp,-D_FORTIFY_SOURCE=2 -fstack-protector-strong --param=ssp-buffer-size=4 -fPIC -mtune=generic -march=x86-64 -gdwarf-4 -fno-debug-types-section -fvar-tracking-assignments -g2 -Werror -DMST_UL -Wno-format-overflow -Wno-implicit-fallthrough -Wno-cast-function-type -MT iniparser.lo -MD -MP -MF .deps/iniparser.Tpo -c -o iniparser.lo iniparser.c libtool: compile: x86_64-pld-linux-gnux32-gcc -DHAVE_CONFIG_H -I. -I../.. -I. -I../.. -I../../ -I../../common -W -Werror -g -MP -MD -fPIC -O2 -fwrapv -pipe -Wformat -Werror=format-security -gdwarf-4 -fno-debug-types-section -fvar-tracking-assignments -g2 -Wp,-D_FORTIFY_SOURCE=2 -fstack-protector-strong --param=ssp-buffer-size=4 -fPIC -mtune=generic -march=x86-64 -gdwarf-4 -fno-debug-types-section -fvar-tracking-assignments -g2 -Werror -DMST_UL -Wno-format-overflow -Wno-implicit-fallthrough -Wno-cast-function-type -MT iniparser.lo -MD -MP -MF .deps/iniparser.Tpo -c iniparser.c -fPIC -DPIC -o .libs/iniparser.o libtool: compile: x86_64-pld-linux-gnux32-gcc -DHAVE_CONFIG_H -I. -I../.. -I. -I../.. -I../../ -I../../common -W -Werror -g -MP -MD -fPIC -O2 -fwrapv -pipe -Wformat -Werror=format-security -gdwarf-4 -fno-debug-types-section -fvar-tracking-assignments -g2 -Wp,-D_FORTIFY_SOURCE=2 -fstack-protector-strong --param=ssp-buffer-size=4 -fPIC -mtune=generic -march=x86-64 -gdwarf-4 -fno-debug-types-section -fvar-tracking-assignments -g2 -Werror -DMST_UL -Wno-format-overflow -Wno-implicit-fallthrough -Wno-cast-function-type -MT iniparser.lo -MD -MP -MF .deps/iniparser.Tpo -c iniparser.c -o iniparser.o >/dev/null 2>&1 mv -f .deps/iniparser.Tpo .deps/iniparser.Plo make[3]: Leaving directory '/tmp/B.B1V4OG/BUILD/mstflint-4.10.0/ext_libs/iniParser' make[3]: Entering directory '/tmp/B.B1V4OG/BUILD/mstflint-4.10.0/ext_libs/iniParser' /bin/sh ../../libtool --tag=CC --mode=link x86_64-pld-linux-gnux32-gcc -W -Werror -g -MP -MD -fPIC -O2 -fwrapv -pipe -Wformat -Werror=format-security -gdwarf-4 -fno-debug-types-section -fvar-tracking-assignments -g2 -Wp,-D_FORTIFY_SOURCE=2 -fstack-protector-strong --param=ssp-buffer-size=4 -fPIC -mtune=generic -march=x86-64 -gdwarf-4 -fno-debug-types-section -fvar-tracking-assignments -g2 -Werror -DMST_UL -Wno-format-overflow -Wno-implicit-fallthrough -Wno-cast-function-type -Wl,--as-needed -Wl,--no-copy-dt-needed-entries -Wl,-z,relro -Wl,-z,combreloc -o libiniparser.a iniparser.lo dictionary.lo -lxml2 -lboost_regex -lz -lz libtool: link: warning: `-l' is ignored for archives/objects libtool: link: warning: `-l' is ignored for archives/objects libtool: link: warning: `-l' is ignored for archives/objects libtool: link: warning: `-l' is ignored for archives/objects libtool: link: ar cru libiniparser.a iniparser.o dictionary.o libtool: link: ranlib libiniparser.a make[3]: Leaving directory '/tmp/B.B1V4OG/BUILD/mstflint-4.10.0/ext_libs/iniParser' Making all in minixz make[3]: Entering directory '/tmp/B.B1V4OG/BUILD/mstflint-4.10.0/ext_libs/minixz' /bin/sh ../../libtool --tag=CC --mode=compile x86_64-pld-linux-gnux32-gcc -DHAVE_CONFIG_H -I. -I../.. -I. -DXZ_DEC_ANY_CHECK -W -g -MP -MD -fPIC -Werror -O2 -fwrapv -pipe -Wformat -Werror=format-security -gdwarf-4 -fno-debug-types-section -fvar-tracking-assignments -g2 -Wp,-D_FORTIFY_SOURCE=2 -fstack-protector-strong --param=ssp-buffer-size=4 -fPIC -mtune=generic -march=x86-64 -gdwarf-4 -fno-debug-types-section -fvar-tracking-assignments -g2 -Werror -DMST_UL -Wno-format-overflow -Wno-implicit-fallthrough -Wno-cast-function-type -MT xz_dec_bcj.lo -MD -MP -MF .deps/xz_dec_bcj.Tpo -c -o xz_dec_bcj.lo xz_dec_bcj.c libtool: compile: x86_64-pld-linux-gnux32-gcc -DHAVE_CONFIG_H -I. -I../.. -I. -DXZ_DEC_ANY_CHECK -W -g -MP -MD -fPIC -Werror -O2 -fwrapv -pipe -Wformat -Werror=format-security -gdwarf-4 -fno-debug-types-section -fvar-tracking-assignments -g2 -Wp,-D_FORTIFY_SOURCE=2 -fstack-protector-strong --param=ssp-buffer-size=4 -fPIC -mtune=generic -march=x86-64 -gdwarf-4 -fno-debug-types-section -fvar-tracking-assignments -g2 -Werror -DMST_UL -Wno-format-overflow -Wno-implicit-fallthrough -Wno-cast-function-type -MT xz_dec_bcj.lo -MD -MP -MF .deps/xz_dec_bcj.Tpo -c xz_dec_bcj.c -fPIC -DPIC -o .libs/xz_dec_bcj.o libtool: compile: x86_64-pld-linux-gnux32-gcc -DHAVE_CONFIG_H -I. -I../.. -I. -DXZ_DEC_ANY_CHECK -W -g -MP -MD -fPIC -Werror -O2 -fwrapv -pipe -Wformat -Werror=format-security -gdwarf-4 -fno-debug-types-section -fvar-tracking-assignments -g2 -Wp,-D_FORTIFY_SOURCE=2 -fstack-protector-strong --param=ssp-buffer-size=4 -fPIC -mtune=generic -march=x86-64 -gdwarf-4 -fno-debug-types-section -fvar-tracking-assignments -g2 -Werror -DMST_UL -Wno-format-overflow -Wno-implicit-fallthrough -Wno-cast-function-type -MT xz_dec_bcj.lo -MD -MP -MF .deps/xz_dec_bcj.Tpo -c xz_dec_bcj.c -o xz_dec_bcj.o >/dev/null 2>&1 mv -f .deps/xz_dec_bcj.Tpo .deps/xz_dec_bcj.Plo make[3]: Leaving directory '/tmp/B.B1V4OG/BUILD/mstflint-4.10.0/ext_libs/minixz' make[3]: Entering directory '/tmp/B.B1V4OG/BUILD/mstflint-4.10.0/ext_libs/minixz' /bin/sh ../../libtool --tag=CC --mode=compile x86_64-pld-linux-gnux32-gcc -DHAVE_CONFIG_H -I. -I../.. -I. -DXZ_DEC_ANY_CHECK -W -g -MP -MD -fPIC -Werror -O2 -fwrapv -pipe -Wformat -Werror=format-security -gdwarf-4 -fno-debug-types-section -fvar-tracking-assignments -g2 -Wp,-D_FORTIFY_SOURCE=2 -fstack-protector-strong --param=ssp-buffer-size=4 -fPIC -mtune=generic -march=x86-64 -gdwarf-4 -fno-debug-types-section -fvar-tracking-assignments -g2 -Werror -DMST_UL -Wno-format-overflow -Wno-implicit-fallthrough -Wno-cast-function-type -MT xz_crc32.lo -MD -MP -MF .deps/xz_crc32.Tpo -c -o xz_crc32.lo xz_crc32.c libtool: compile: x86_64-pld-linux-gnux32-gcc -DHAVE_CONFIG_H -I. -I../.. -I. -DXZ_DEC_ANY_CHECK -W -g -MP -MD -fPIC -Werror -O2 -fwrapv -pipe -Wformat -Werror=format-security -gdwarf-4 -fno-debug-types-section -fvar-tracking-assignments -g2 -Wp,-D_FORTIFY_SOURCE=2 -fstack-protector-strong --param=ssp-buffer-size=4 -fPIC -mtune=generic -march=x86-64 -gdwarf-4 -fno-debug-types-section -fvar-tracking-assignments -g2 -Werror -DMST_UL -Wno-format-overflow -Wno-implicit-fallthrough -Wno-cast-function-type -MT xz_crc32.lo -MD -MP -MF .deps/xz_crc32.Tpo -c xz_crc32.c -fPIC -DPIC -o .libs/xz_crc32.o libtool: compile: x86_64-pld-linux-gnux32-gcc -DHAVE_CONFIG_H -I. -I../.. -I. -DXZ_DEC_ANY_CHECK -W -g -MP -MD -fPIC -Werror -O2 -fwrapv -pipe -Wformat -Werror=format-security -gdwarf-4 -fno-debug-types-section -fvar-tracking-assignments -g2 -Wp,-D_FORTIFY_SOURCE=2 -fstack-protector-strong --param=ssp-buffer-size=4 -fPIC -mtune=generic -march=x86-64 -gdwarf-4 -fno-debug-types-section -fvar-tracking-assignments -g2 -Werror -DMST_UL -Wno-format-overflow -Wno-implicit-fallthrough -Wno-cast-function-type -MT xz_crc32.lo -MD -MP -MF .deps/xz_crc32.Tpo -c xz_crc32.c -o xz_crc32.o >/dev/null 2>&1 mv -f .deps/xz_crc32.Tpo .deps/xz_crc32.Plo make[3]: Leaving directory '/tmp/B.B1V4OG/BUILD/mstflint-4.10.0/ext_libs/minixz' make[3]: Entering directory '/tmp/B.B1V4OG/BUILD/mstflint-4.10.0/ext_libs/minixz' /bin/sh ../../libtool --tag=CC --mode=compile x86_64-pld-linux-gnux32-gcc -DHAVE_CONFIG_H -I. -I../.. -I. -DXZ_DEC_ANY_CHECK -W -g -MP -MD -fPIC -Werror -O2 -fwrapv -pipe -Wformat -Werror=format-security -gdwarf-4 -fno-debug-types-section -fvar-tracking-assignments -g2 -Wp,-D_FORTIFY_SOURCE=2 -fstack-protector-strong --param=ssp-buffer-size=4 -fPIC -mtune=generic -march=x86-64 -gdwarf-4 -fno-debug-types-section -fvar-tracking-assignments -g2 -Werror -DMST_UL -Wno-format-overflow -Wno-implicit-fallthrough -Wno-cast-function-type -MT xz_dec_stream.lo -MD -MP -MF .deps/xz_dec_stream.Tpo -c -o xz_dec_stream.lo xz_dec_stream.c libtool: compile: x86_64-pld-linux-gnux32-gcc -DHAVE_CONFIG_H -I. -I../.. -I. -DXZ_DEC_ANY_CHECK -W -g -MP -MD -fPIC -Werror -O2 -fwrapv -pipe -Wformat -Werror=format-security -gdwarf-4 -fno-debug-types-section -fvar-tracking-assignments -g2 -Wp,-D_FORTIFY_SOURCE=2 -fstack-protector-strong --param=ssp-buffer-size=4 -fPIC -mtune=generic -march=x86-64 -gdwarf-4 -fno-debug-types-section -fvar-tracking-assignments -g2 -Werror -DMST_UL -Wno-format-overflow -Wno-implicit-fallthrough -Wno-cast-function-type -MT xz_dec_stream.lo -MD -MP -MF .deps/xz_dec_stream.Tpo -c xz_dec_stream.c -fPIC -DPIC -o .libs/xz_dec_stream.o libtool: compile: x86_64-pld-linux-gnux32-gcc -DHAVE_CONFIG_H -I. -I../.. -I. -DXZ_DEC_ANY_CHECK -W -g -MP -MD -fPIC -Werror -O2 -fwrapv -pipe -Wformat -Werror=format-security -gdwarf-4 -fno-debug-types-section -fvar-tracking-assignments -g2 -Wp,-D_FORTIFY_SOURCE=2 -fstack-protector-strong --param=ssp-buffer-size=4 -fPIC -mtune=generic -march=x86-64 -gdwarf-4 -fno-debug-types-section -fvar-tracking-assignments -g2 -Werror -DMST_UL -Wno-format-overflow -Wno-implicit-fallthrough -Wno-cast-function-type -MT xz_dec_stream.lo -MD -MP -MF .deps/xz_dec_stream.Tpo -c xz_dec_stream.c -o xz_dec_stream.o >/dev/null 2>&1 mv -f .deps/xz_dec_stream.Tpo .deps/xz_dec_stream.Plo make[3]: Leaving directory '/tmp/B.B1V4OG/BUILD/mstflint-4.10.0/ext_libs/minixz' make[3]: Entering directory '/tmp/B.B1V4OG/BUILD/mstflint-4.10.0/ext_libs/minixz' /bin/sh ../../libtool --tag=CC --mode=compile x86_64-pld-linux-gnux32-gcc -DHAVE_CONFIG_H -I. -I../.. -I. -DXZ_DEC_ANY_CHECK -W -g -MP -MD -fPIC -Werror -O2 -fwrapv -pipe -Wformat -Werror=format-security -gdwarf-4 -fno-debug-types-section -fvar-tracking-assignments -g2 -Wp,-D_FORTIFY_SOURCE=2 -fstack-protector-strong --param=ssp-buffer-size=4 -fPIC -mtune=generic -march=x86-64 -gdwarf-4 -fno-debug-types-section -fvar-tracking-assignments -g2 -Werror -DMST_UL -Wno-format-overflow -Wno-implicit-fallthrough -Wno-cast-function-type -MT xz_dec_lzma2.lo -MD -MP -MF .deps/xz_dec_lzma2.Tpo -c -o xz_dec_lzma2.lo xz_dec_lzma2.c libtool: compile: x86_64-pld-linux-gnux32-gcc -DHAVE_CONFIG_H -I. -I../.. -I. -DXZ_DEC_ANY_CHECK -W -g -MP -MD -fPIC -Werror -O2 -fwrapv -pipe -Wformat -Werror=format-security -gdwarf-4 -fno-debug-types-section -fvar-tracking-assignments -g2 -Wp,-D_FORTIFY_SOURCE=2 -fstack-protector-strong --param=ssp-buffer-size=4 -fPIC -mtune=generic -march=x86-64 -gdwarf-4 -fno-debug-types-section -fvar-tracking-assignments -g2 -Werror -DMST_UL -Wno-format-overflow -Wno-implicit-fallthrough -Wno-cast-function-type -MT xz_dec_lzma2.lo -MD -MP -MF .deps/xz_dec_lzma2.Tpo -c xz_dec_lzma2.c -fPIC -DPIC -o .libs/xz_dec_lzma2.o libtool: compile: x86_64-pld-linux-gnux32-gcc -DHAVE_CONFIG_H -I. -I../.. -I. -DXZ_DEC_ANY_CHECK -W -g -MP -MD -fPIC -Werror -O2 -fwrapv -pipe -Wformat -Werror=format-security -gdwarf-4 -fno-debug-types-section -fvar-tracking-assignments -g2 -Wp,-D_FORTIFY_SOURCE=2 -fstack-protector-strong --param=ssp-buffer-size=4 -fPIC -mtune=generic -march=x86-64 -gdwarf-4 -fno-debug-types-section -fvar-tracking-assignments -g2 -Werror -DMST_UL -Wno-format-overflow -Wno-implicit-fallthrough -Wno-cast-function-type -MT xz_dec_lzma2.lo -MD -MP -MF .deps/xz_dec_lzma2.Tpo -c xz_dec_lzma2.c -o xz_dec_lzma2.o >/dev/null 2>&1 mv -f .deps/xz_dec_lzma2.Tpo .deps/xz_dec_lzma2.Plo make[3]: Leaving directory '/tmp/B.B1V4OG/BUILD/mstflint-4.10.0/ext_libs/minixz' make[3]: Entering directory '/tmp/B.B1V4OG/BUILD/mstflint-4.10.0/ext_libs/minixz' /bin/sh ../../libtool --tag=CC --mode=link x86_64-pld-linux-gnux32-gcc -O2 -fwrapv -pipe -Wformat -Werror=format-security -gdwarf-4 -fno-debug-types-section -fvar-tracking-assignments -g2 -Wp,-D_FORTIFY_SOURCE=2 -fstack-protector-strong --param=ssp-buffer-size=4 -fPIC -mtune=generic -march=x86-64 -gdwarf-4 -fno-debug-types-section -fvar-tracking-assignments -g2 -Werror -DMST_UL -Wno-format-overflow -Wno-implicit-fallthrough -Wno-cast-function-type -Wl,--as-needed -Wl,--no-copy-dt-needed-entries -Wl,-z,relro -Wl,-z,combreloc -o libminixz.a xz_crc32.lo xz_dec_bcj.lo xz_dec_lzma2.lo xz_dec_stream.lo -lxml2 -lboost_regex -lz -lz libtool: link: warning: `-l' is ignored for archives/objects libtool: link: warning: `-l' is ignored for archives/objects libtool: link: warning: `-l' is ignored for archives/objects libtool: link: warning: `-l' is ignored for archives/objects libtool: link: ar cru libminixz.a xz_crc32.o xz_dec_bcj.o xz_dec_lzma2.o xz_dec_stream.o libtool: link: ranlib libminixz.a make[3]: Leaving directory '/tmp/B.B1V4OG/BUILD/mstflint-4.10.0/ext_libs/minixz' Making all in json make[3]: Entering directory '/tmp/B.B1V4OG/BUILD/mstflint-4.10.0/ext_libs/json' /bin/sh ../../libtool --tag=CXX --mode=compile x86_64-pld-linux-gnux32-g++ -DHAVE_CONFIG_H -I. -I../.. -W -Werror -g -MP -MD -fPIC -O2 -fwrapv -pipe -Wformat -Werror=format-security -gdwarf-4 -fno-debug-types-section -fvar-tracking-assignments -g2 -Wp,-D_FORTIFY_SOURCE=2 -fstack-protector-strong --param=ssp-buffer-size=4 -fPIC -mtune=generic -march=x86-64 -gdwarf-4 -fno-debug-types-section -fvar-tracking-assignments -g2 -DHAVE_TERMIOS_H -Werror -DMST_UL -Wno-implicit-fallthrough -Wno-format-overflow -Wno-cast-function-type -Wno-class-memaccess -MT json_writer.lo -MD -MP -MF .deps/json_writer.Tpo -c -o json_writer.lo json_writer.cpp libtool: compile: x86_64-pld-linux-gnux32-g++ -DHAVE_CONFIG_H -I. -I../.. -W -Werror -g -MP -MD -fPIC -O2 -fwrapv -pipe -Wformat -Werror=format-security -gdwarf-4 -fno-debug-types-section -fvar-tracking-assignments -g2 -Wp,-D_FORTIFY_SOURCE=2 -fstack-protector-strong --param=ssp-buffer-size=4 -fPIC -mtune=generic -march=x86-64 -gdwarf-4 -fno-debug-types-section -fvar-tracking-assignments -g2 -DHAVE_TERMIOS_H -Werror -DMST_UL -Wno-implicit-fallthrough -Wno-format-overflow -Wno-cast-function-type -Wno-class-memaccess -MT json_writer.lo -MD -MP -MF .deps/json_writer.Tpo -c json_writer.cpp -fPIC -DPIC -o .libs/json_writer.o libtool: compile: x86_64-pld-linux-gnux32-g++ -DHAVE_CONFIG_H -I. -I../.. -W -Werror -g -MP -MD -fPIC -O2 -fwrapv -pipe -Wformat -Werror=format-security -gdwarf-4 -fno-debug-types-section -fvar-tracking-assignments -g2 -Wp,-D_FORTIFY_SOURCE=2 -fstack-protector-strong --param=ssp-buffer-size=4 -fPIC -mtune=generic -march=x86-64 -gdwarf-4 -fno-debug-types-section -fvar-tracking-assignments -g2 -DHAVE_TERMIOS_H -Werror -DMST_UL -Wno-implicit-fallthrough -Wno-format-overflow -Wno-cast-function-type -Wno-class-memaccess -MT json_writer.lo -MD -MP -MF .deps/json_writer.Tpo -c json_writer.cpp -o json_writer.o >/dev/null 2>&1 mv -f .deps/json_writer.Tpo .deps/json_writer.Plo make[3]: Leaving directory '/tmp/B.B1V4OG/BUILD/mstflint-4.10.0/ext_libs/json' make[3]: Entering directory '/tmp/B.B1V4OG/BUILD/mstflint-4.10.0/ext_libs/json' /bin/sh ../../libtool --tag=CXX --mode=compile x86_64-pld-linux-gnux32-g++ -DHAVE_CONFIG_H -I. -I../.. -W -Werror -g -MP -MD -fPIC -O2 -fwrapv -pipe -Wformat -Werror=format-security -gdwarf-4 -fno-debug-types-section -fvar-tracking-assignments -g2 -Wp,-D_FORTIFY_SOURCE=2 -fstack-protector-strong --param=ssp-buffer-size=4 -fPIC -mtune=generic -march=x86-64 -gdwarf-4 -fno-debug-types-section -fvar-tracking-assignments -g2 -DHAVE_TERMIOS_H -Werror -DMST_UL -Wno-implicit-fallthrough -Wno-format-overflow -Wno-cast-function-type -Wno-class-memaccess -MT json_reader.lo -MD -MP -MF .deps/json_reader.Tpo -c -o json_reader.lo json_reader.cpp libtool: compile: x86_64-pld-linux-gnux32-g++ -DHAVE_CONFIG_H -I. -I../.. -W -Werror -g -MP -MD -fPIC -O2 -fwrapv -pipe -Wformat -Werror=format-security -gdwarf-4 -fno-debug-types-section -fvar-tracking-assignments -g2 -Wp,-D_FORTIFY_SOURCE=2 -fstack-protector-strong --param=ssp-buffer-size=4 -fPIC -mtune=generic -march=x86-64 -gdwarf-4 -fno-debug-types-section -fvar-tracking-assignments -g2 -DHAVE_TERMIOS_H -Werror -DMST_UL -Wno-implicit-fallthrough -Wno-format-overflow -Wno-cast-function-type -Wno-class-memaccess -MT json_reader.lo -MD -MP -MF .deps/json_reader.Tpo -c json_reader.cpp -fPIC -DPIC -o .libs/json_reader.o libtool: compile: x86_64-pld-linux-gnux32-g++ -DHAVE_CONFIG_H -I. -I../.. -W -Werror -g -MP -MD -fPIC -O2 -fwrapv -pipe -Wformat -Werror=format-security -gdwarf-4 -fno-debug-types-section -fvar-tracking-assignments -g2 -Wp,-D_FORTIFY_SOURCE=2 -fstack-protector-strong --param=ssp-buffer-size=4 -fPIC -mtune=generic -march=x86-64 -gdwarf-4 -fno-debug-types-section -fvar-tracking-assignments -g2 -DHAVE_TERMIOS_H -Werror -DMST_UL -Wno-implicit-fallthrough -Wno-format-overflow -Wno-cast-function-type -Wno-class-memaccess -MT json_reader.lo -MD -MP -MF .deps/json_reader.Tpo -c json_reader.cpp -o json_reader.o >/dev/null 2>&1 mv -f .deps/json_reader.Tpo .deps/json_reader.Plo make[3]: Leaving directory '/tmp/B.B1V4OG/BUILD/mstflint-4.10.0/ext_libs/json' make[3]: Entering directory '/tmp/B.B1V4OG/BUILD/mstflint-4.10.0/ext_libs/json' /bin/sh ../../libtool --tag=CXX --mode=compile x86_64-pld-linux-gnux32-g++ -DHAVE_CONFIG_H -I. -I../.. -W -Werror -g -MP -MD -fPIC -O2 -fwrapv -pipe -Wformat -Werror=format-security -gdwarf-4 -fno-debug-types-section -fvar-tracking-assignments -g2 -Wp,-D_FORTIFY_SOURCE=2 -fstack-protector-strong --param=ssp-buffer-size=4 -fPIC -mtune=generic -march=x86-64 -gdwarf-4 -fno-debug-types-section -fvar-tracking-assignments -g2 -DHAVE_TERMIOS_H -Werror -DMST_UL -Wno-implicit-fallthrough -Wno-format-overflow -Wno-cast-function-type -Wno-class-memaccess -MT json_value.lo -MD -MP -MF .deps/json_value.Tpo -c -o json_value.lo json_value.cpp libtool: compile: x86_64-pld-linux-gnux32-g++ -DHAVE_CONFIG_H -I. -I../.. -W -Werror -g -MP -MD -fPIC -O2 -fwrapv -pipe -Wformat -Werror=format-security -gdwarf-4 -fno-debug-types-section -fvar-tracking-assignments -g2 -Wp,-D_FORTIFY_SOURCE=2 -fstack-protector-strong --param=ssp-buffer-size=4 -fPIC -mtune=generic -march=x86-64 -gdwarf-4 -fno-debug-types-section -fvar-tracking-assignments -g2 -DHAVE_TERMIOS_H -Werror -DMST_UL -Wno-implicit-fallthrough -Wno-format-overflow -Wno-cast-function-type -Wno-class-memaccess -MT json_value.lo -MD -MP -MF .deps/json_value.Tpo -c json_value.cpp -fPIC -DPIC -o .libs/json_value.o libtool: compile: x86_64-pld-linux-gnux32-g++ -DHAVE_CONFIG_H -I. -I../.. -W -Werror -g -MP -MD -fPIC -O2 -fwrapv -pipe -Wformat -Werror=format-security -gdwarf-4 -fno-debug-types-section -fvar-tracking-assignments -g2 -Wp,-D_FORTIFY_SOURCE=2 -fstack-protector-strong --param=ssp-buffer-size=4 -fPIC -mtune=generic -march=x86-64 -gdwarf-4 -fno-debug-types-section -fvar-tracking-assignments -g2 -DHAVE_TERMIOS_H -Werror -DMST_UL -Wno-implicit-fallthrough -Wno-format-overflow -Wno-cast-function-type -Wno-class-memaccess -MT json_value.lo -MD -MP -MF .deps/json_value.Tpo -c json_value.cpp -o json_value.o >/dev/null 2>&1 mv -f .deps/json_value.Tpo .deps/json_value.Plo make[3]: Leaving directory '/tmp/B.B1V4OG/BUILD/mstflint-4.10.0/ext_libs/json' make[3]: Entering directory '/tmp/B.B1V4OG/BUILD/mstflint-4.10.0/ext_libs/json' /bin/sh ../../libtool --tag=CXX --mode=link x86_64-pld-linux-gnux32-g++ -O2 -fwrapv -pipe -Wformat -Werror=format-security -gdwarf-4 -fno-debug-types-section -fvar-tracking-assignments -g2 -Wp,-D_FORTIFY_SOURCE=2 -fstack-protector-strong --param=ssp-buffer-size=4 -fPIC -mtune=generic -march=x86-64 -gdwarf-4 -fno-debug-types-section -fvar-tracking-assignments -g2 -DHAVE_TERMIOS_H -Werror -DMST_UL -Wno-implicit-fallthrough -Wno-format-overflow -Wno-cast-function-type -Wno-class-memaccess -Wl,--as-needed -Wl,--no-copy-dt-needed-entries -Wl,-z,relro -Wl,-z,combreloc -o libjson.a json_reader.lo json_value.lo json_writer.lo -lxml2 -lboost_regex -lz -lz libtool: link: warning: `-l' is ignored for archives/objects libtool: link: warning: `-l' is ignored for archives/objects libtool: link: warning: `-l' is ignored for archives/objects libtool: link: warning: `-l' is ignored for archives/objects libtool: link: ar cru libjson.a json_reader.o json_value.o json_writer.o libtool: link: ranlib libjson.a make[3]: Leaving directory '/tmp/B.B1V4OG/BUILD/mstflint-4.10.0/ext_libs/json' make[3]: Nothing to be done for 'all-am'. Making all in tools_crypto make[2]: Entering directory '/tmp/B.B1V4OG/BUILD/mstflint-4.10.0/tools_crypto' x86_64-pld-linux-gnux32-gcc -DHAVE_CONFIG_H -I. -I.. -I.. -I../common -MD -pipe -Wall -W -DMST_UL -g -O2 -fwrapv -pipe -Wformat -Werror=format-security -gdwarf-4 -fno-debug-types-section -fvar-tracking-assignments -g2 -Wp,-D_FORTIFY_SOURCE=2 -fstack-protector-strong --param=ssp-buffer-size=4 -fPIC -mtune=generic -march=x86-64 -gdwarf-4 -fno-debug-types-section -fvar-tracking-assignments -g2 -Werror -DMST_UL -Wno-format-overflow -Wno-implicit-fallthrough -Wno-cast-function-type -MT tools_md5.o -MD -MP -MF .deps/tools_md5.Tpo -c -o tools_md5.o tools_md5.c mv -f .deps/tools_md5.Tpo .deps/tools_md5.Po make[2]: Leaving directory '/tmp/B.B1V4OG/BUILD/mstflint-4.10.0/tools_crypto' make[2]: Entering directory '/tmp/B.B1V4OG/BUILD/mstflint-4.10.0/tools_crypto' rm -f libtools_crypto.a ar cru libtools_crypto.a tools_md5.o ranlib libtools_crypto.a make[2]: Leaving directory '/tmp/B.B1V4OG/BUILD/mstflint-4.10.0/tools_crypto' Making all in mlxsign_lib make[2]: Entering directory '/tmp/B.B1V4OG/BUILD/mstflint-4.10.0/mlxsign_lib' x86_64-pld-linux-gnux32-g++ -DHAVE_CONFIG_H -I. -I.. -I.. -I../common -O2 -fwrapv -pipe -Wformat -Werror=format-security -gdwarf-4 -fno-debug-types-section -fvar-tracking-assignments -g2 -Wp,-D_FORTIFY_SOURCE=2 -fstack-protector-strong --param=ssp-buffer-size=4 -fPIC -mtune=generic -march=x86-64 -gdwarf-4 -fno-debug-types-section -fvar-tracking-assignments -g2 -DHAVE_TERMIOS_H -Werror -DMST_UL -Wno-implicit-fallthrough -Wno-format-overflow -Wno-cast-function-type -Wno-class-memaccess -MT mlxsign_lib.o -MD -MP -MF .deps/mlxsign_lib.Tpo -c -o mlxsign_lib.o mlxsign_lib.cpp mv -f .deps/mlxsign_lib.Tpo .deps/mlxsign_lib.Po make[2]: Leaving directory '/tmp/B.B1V4OG/BUILD/mstflint-4.10.0/mlxsign_lib' make[2]: Entering directory '/tmp/B.B1V4OG/BUILD/mstflint-4.10.0/mlxsign_lib' rm -f libmlxsign.a ar cru libmlxsign.a mlxsign_lib.o ranlib libmlxsign.a make[2]: Leaving directory '/tmp/B.B1V4OG/BUILD/mstflint-4.10.0/mlxsign_lib' Making all in tools_layouts make[2]: Entering directory '/tmp/B.B1V4OG/BUILD/mstflint-4.10.0/tools_layouts' /bin/sh ../libtool --tag=CC --mode=compile x86_64-pld-linux-gnux32-gcc -DHAVE_CONFIG_H -I. -I.. -I../ -I../common -Wall -W -g -MP -MD -pipe -fPIC -O2 -fwrapv -pipe -Wformat -Werror=format-security -gdwarf-4 -fno-debug-types-section -fvar-tracking-assignments -g2 -Wp,-D_FORTIFY_SOURCE=2 -fstack-protector-strong --param=ssp-buffer-size=4 -fPIC -mtune=generic -march=x86-64 -gdwarf-4 -fno-debug-types-section -fvar-tracking-assignments -g2 -Werror -DMST_UL -Wno-format-overflow -Wno-implicit-fallthrough -Wno-cast-function-type -MT cx5fw_layouts.lo -MD -MP -MF .deps/cx5fw_layouts.Tpo -c -o cx5fw_layouts.lo cx5fw_layouts.c libtool: compile: x86_64-pld-linux-gnux32-gcc -DHAVE_CONFIG_H -I. -I.. -I../ -I../common -Wall -W -g -MP -MD -pipe -fPIC -O2 -fwrapv -pipe -Wformat -Werror=format-security -gdwarf-4 -fno-debug-types-section -fvar-tracking-assignments -g2 -Wp,-D_FORTIFY_SOURCE=2 -fstack-protector-strong --param=ssp-buffer-size=4 -fPIC -mtune=generic -march=x86-64 -gdwarf-4 -fno-debug-types-section -fvar-tracking-assignments -g2 -Werror -DMST_UL -Wno-format-overflow -Wno-implicit-fallthrough -Wno-cast-function-type -MT cx5fw_layouts.lo -MD -MP -MF .deps/cx5fw_layouts.Tpo -c cx5fw_layouts.c -fPIC -DPIC -o .libs/cx5fw_layouts.o cx5fw_layouts.c: In function 'cx5fw_operation_key_print': cx5fw_layouts.c:594:16: error: format '%lx' expects argument of type 'long unsigned int', but argument 3 has type 'u_int64_t' {aka 'const long long unsigned int'} [-Werror=format=] fprintf(file, "key : " U64H_FMT "\n", ptr_struct->key); ^~~~~~~~~~~~~~~~~~~~~~~~~ ~~~~~~~~~~~~~~~ In file included from cx5fw_layouts.h:47, from cx5fw_layouts.c:39: adb_to_c_utils.h:185:33: note: format string is defined here # define U64H_FMT "0x%016lx" ~~~~~^ %016llx cx5fw_layouts.c: In function 'cx5fw_uid_entry_print': cx5fw_layouts.c:665:16: error: format '%lx' expects argument of type 'long unsigned int', but argument 3 has type 'u_int64_t' {aka 'const long long unsigned int'} [-Werror=format=] fprintf(file, "uid : " U64H_FMT "\n", ptr_struct->uid); ^~~~~~~~~~~~~~~~~~~~~~~~~ ~~~~~~~~~~~~~~~ In file included from cx5fw_layouts.h:47, from cx5fw_layouts.c:39: adb_to_c_utils.h:185:33: note: format string is defined here # define U64H_FMT "0x%016lx" ~~~~~^ %016llx cc1: all warnings being treated as errors make[2]: *** [Makefile:427: cx5fw_layouts.lo] Error 1 make[2]: Leaving directory '/tmp/B.B1V4OG/BUILD/mstflint-4.10.0/tools_layouts' make[2]: *** Waiting for unfinished jobs.... make[2]: Entering directory '/tmp/B.B1V4OG/BUILD/mstflint-4.10.0/tools_layouts' /bin/sh ../libtool --tag=CC --mode=compile x86_64-pld-linux-gnux32-gcc -DHAVE_CONFIG_H -I. -I.. -I../ -I../common -Wall -W -g -MP -MD -pipe -fPIC -O2 -fwrapv -pipe -Wformat -Werror=format-security -gdwarf-4 -fno-debug-types-section -fvar-tracking-assignments -g2 -Wp,-D_FORTIFY_SOURCE=2 -fstack-protector-strong --param=ssp-buffer-size=4 -fPIC -mtune=generic -march=x86-64 -gdwarf-4 -fno-debug-types-section -fvar-tracking-assignments -g2 -Werror -DMST_UL -Wno-format-overflow -Wno-implicit-fallthrough -Wno-cast-function-type -MT register_access_open_layouts.lo -MD -MP -MF .deps/register_access_open_layouts.Tpo -c -o register_access_open_layouts.lo register_access_open_layouts.c libtool: compile: x86_64-pld-linux-gnux32-gcc -DHAVE_CONFIG_H -I. -I.. -I../ -I../common -Wall -W -g -MP -MD -pipe -fPIC -O2 -fwrapv -pipe -Wformat -Werror=format-security -gdwarf-4 -fno-debug-types-section -fvar-tracking-assignments -g2 -Wp,-D_FORTIFY_SOURCE=2 -fstack-protector-strong --param=ssp-buffer-size=4 -fPIC -mtune=generic -march=x86-64 -gdwarf-4 -fno-debug-types-section -fvar-tracking-assignments -g2 -Werror -DMST_UL -Wno-format-overflow -Wno-implicit-fallthrough -Wno-cast-function-type -MT register_access_open_layouts.lo -MD -MP -MF .deps/register_access_open_layouts.Tpo -c register_access_open_layouts.c -fPIC -DPIC -o .libs/register_access_open_layouts.o libtool: compile: x86_64-pld-linux-gnux32-gcc -DHAVE_CONFIG_H -I. -I.. -I../ -I../common -Wall -W -g -MP -MD -pipe -fPIC -O2 -fwrapv -pipe -Wformat -Werror=format-security -gdwarf-4 -fno-debug-types-section -fvar-tracking-assignments -g2 -Wp,-D_FORTIFY_SOURCE=2 -fstack-protector-strong --param=ssp-buffer-size=4 -fPIC -mtune=generic -march=x86-64 -gdwarf-4 -fno-debug-types-section -fvar-tracking-assignments -g2 -Werror -DMST_UL -Wno-format-overflow -Wno-implicit-fallthrough -Wno-cast-function-type -MT register_access_open_layouts.lo -MD -MP -MF .deps/register_access_open_layouts.Tpo -c register_access_open_layouts.c -o register_access_open_layouts.o >/dev/null 2>&1 mv -f .deps/register_access_open_layouts.Tpo .deps/register_access_open_layouts.Plo make[2]: Leaving directory '/tmp/B.B1V4OG/BUILD/mstflint-4.10.0/tools_layouts' make[2]: Entering directory '/tmp/B.B1V4OG/BUILD/mstflint-4.10.0/tools_layouts' /bin/sh ../libtool --tag=CC --mode=compile x86_64-pld-linux-gnux32-gcc -DHAVE_CONFIG_H -I. -I.. -I../ -I../common -Wall -W -g -MP -MD -pipe -fPIC -O2 -fwrapv -pipe -Wformat -Werror=format-security -gdwarf-4 -fno-debug-types-section -fvar-tracking-assignments -g2 -Wp,-D_FORTIFY_SOURCE=2 -fstack-protector-strong --param=ssp-buffer-size=4 -fPIC -mtune=generic -march=x86-64 -gdwarf-4 -fno-debug-types-section -fvar-tracking-assignments -g2 -Werror -DMST_UL -Wno-format-overflow -Wno-implicit-fallthrough -Wno-cast-function-type -MT cx4fw_layouts.lo -MD -MP -MF .deps/cx4fw_layouts.Tpo -c -o cx4fw_layouts.lo cx4fw_layouts.c libtool: compile: x86_64-pld-linux-gnux32-gcc -DHAVE_CONFIG_H -I. -I.. -I../ -I../common -Wall -W -g -MP -MD -pipe -fPIC -O2 -fwrapv -pipe -Wformat -Werror=format-security -gdwarf-4 -fno-debug-types-section -fvar-tracking-assignments -g2 -Wp,-D_FORTIFY_SOURCE=2 -fstack-protector-strong --param=ssp-buffer-size=4 -fPIC -mtune=generic -march=x86-64 -gdwarf-4 -fno-debug-types-section -fvar-tracking-assignments -g2 -Werror -DMST_UL -Wno-format-overflow -Wno-implicit-fallthrough -Wno-cast-function-type -MT cx4fw_layouts.lo -MD -MP -MF .deps/cx4fw_layouts.Tpo -c cx4fw_layouts.c -fPIC -DPIC -o .libs/cx4fw_layouts.o cx4fw_layouts.c: In function 'cx4fw_uint64_print': cx4fw_layouts.c:63:14: error: format '%lx' expects argument of type 'long unsigned int', but argument 3 has type 'long long unsigned int' [-Werror=format=] fprintf(fd, "uint64 : " U64H_FMT "\n", (u_int64_t) *ptr_struct); ^~~~~~~~~~~~~~~~~~~~~~~~~ ~~~~~~~~~~~~~~~~~~~~~~~ In file included from cx4fw_layouts.h:47, from cx4fw_layouts.c:39: adb_to_c_utils.h:185:33: note: format string is defined here # define U64H_FMT "0x%016lx" ~~~~~^ %016llx cx4fw_layouts.c: In function 'cx4fw_uid_entry_print': cx4fw_layouts.c:110:14: error: format '%lx' expects argument of type 'long unsigned int', but argument 3 has type 'u_int64_t' {aka 'const long long unsigned int'} [-Werror=format=] fprintf(fd, "uid : " U64H_FMT "\n", ptr_struct->uid); ^~~~~~~~~~~~~~~~~~~~~~~~~ ~~~~~~~~~~~~~~~ In file included from cx4fw_layouts.h:47, from cx4fw_layouts.c:39: adb_to_c_utils.h:185:33: note: format string is defined here # define U64H_FMT "0x%016lx" ~~~~~^ %016llx cx4fw_layouts.c: In function 'cx4fw_operation_key_print': cx4fw_layouts.c:194:14: error: format '%lx' expects argument of type 'long unsigned int', but argument 3 has type 'u_int64_t' {aka 'const long long unsigned int'} [-Werror=format=] fprintf(fd, "key : " U64H_FMT "\n", ptr_struct->key); ^~~~~~~~~~~~~~~~~~~~~~~~~ ~~~~~~~~~~~~~~~ In file included from cx4fw_layouts.h:47, from cx4fw_layouts.c:39: adb_to_c_utils.h:185:33: note: format string is defined here # define U64H_FMT "0x%016lx" ~~~~~^ %016llx cc1: all warnings being treated as errors make[2]: *** [Makefile:427: cx4fw_layouts.lo] Error 1 make[2]: Leaving directory '/tmp/B.B1V4OG/BUILD/mstflint-4.10.0/tools_layouts' make[2]: Entering directory '/tmp/B.B1V4OG/BUILD/mstflint-4.10.0/tools_layouts' /bin/sh ../libtool --tag=CC --mode=compile x86_64-pld-linux-gnux32-gcc -DHAVE_CONFIG_H -I. -I.. -I../ -I../common -Wall -W -g -MP -MD -pipe -fPIC -O2 -fwrapv -pipe -Wformat -Werror=format-security -gdwarf-4 -fno-debug-types-section -fvar-tracking-assignments -g2 -Wp,-D_FORTIFY_SOURCE=2 -fstack-protector-strong --param=ssp-buffer-size=4 -fPIC -mtune=generic -march=x86-64 -gdwarf-4 -fno-debug-types-section -fvar-tracking-assignments -g2 -Werror -DMST_UL -Wno-format-overflow -Wno-implicit-fallthrough -Wno-cast-function-type -MT adb_to_c_utils.lo -MD -MP -MF .deps/adb_to_c_utils.Tpo -c -o adb_to_c_utils.lo adb_to_c_utils.c libtool: compile: x86_64-pld-linux-gnux32-gcc -DHAVE_CONFIG_H -I. -I.. -I../ -I../common -Wall -W -g -MP -MD -pipe -fPIC -O2 -fwrapv -pipe -Wformat -Werror=format-security -gdwarf-4 -fno-debug-types-section -fvar-tracking-assignments -g2 -Wp,-D_FORTIFY_SOURCE=2 -fstack-protector-strong --param=ssp-buffer-size=4 -fPIC -mtune=generic -march=x86-64 -gdwarf-4 -fno-debug-types-section -fvar-tracking-assignments -g2 -Werror -DMST_UL -Wno-format-overflow -Wno-implicit-fallthrough -Wno-cast-function-type -MT adb_to_c_utils.lo -MD -MP -MF .deps/adb_to_c_utils.Tpo -c adb_to_c_utils.c -fPIC -DPIC -o .libs/adb_to_c_utils.o libtool: compile: x86_64-pld-linux-gnux32-gcc -DHAVE_CONFIG_H -I. -I.. -I../ -I../common -Wall -W -g -MP -MD -pipe -fPIC -O2 -fwrapv -pipe -Wformat -Werror=format-security -gdwarf-4 -fno-debug-types-section -fvar-tracking-assignments -g2 -Wp,-D_FORTIFY_SOURCE=2 -fstack-protector-strong --param=ssp-buffer-size=4 -fPIC -mtune=generic -march=x86-64 -gdwarf-4 -fno-debug-types-section -fvar-tracking-assignments -g2 -Werror -DMST_UL -Wno-format-overflow -Wno-implicit-fallthrough -Wno-cast-function-type -MT adb_to_c_utils.lo -MD -MP -MF .deps/adb_to_c_utils.Tpo -c adb_to_c_utils.c -o adb_to_c_utils.o >/dev/null 2>&1 mv -f .deps/adb_to_c_utils.Tpo .deps/adb_to_c_utils.Plo make[2]: Leaving directory '/tmp/B.B1V4OG/BUILD/mstflint-4.10.0/tools_layouts' make[2]: Entering directory '/tmp/B.B1V4OG/BUILD/mstflint-4.10.0/tools_layouts' /bin/sh ../libtool --tag=CC --mode=compile x86_64-pld-linux-gnux32-gcc -DHAVE_CONFIG_H -I. -I.. -I../ -I../common -Wall -W -g -MP -MD -pipe -fPIC -O2 -fwrapv -pipe -Wformat -Werror=format-security -gdwarf-4 -fno-debug-types-section -fvar-tracking-assignments -g2 -Wp,-D_FORTIFY_SOURCE=2 -fstack-protector-strong --param=ssp-buffer-size=4 -fPIC -mtune=generic -march=x86-64 -gdwarf-4 -fno-debug-types-section -fvar-tracking-assignments -g2 -Werror -DMST_UL -Wno-format-overflow -Wno-implicit-fallthrough -Wno-cast-function-type -MT cibfw_layouts.lo -MD -MP -MF .deps/cibfw_layouts.Tpo -c -o cibfw_layouts.lo cibfw_layouts.c libtool: compile: x86_64-pld-linux-gnux32-gcc -DHAVE_CONFIG_H -I. -I.. -I../ -I../common -Wall -W -g -MP -MD -pipe -fPIC -O2 -fwrapv -pipe -Wformat -Werror=format-security -gdwarf-4 -fno-debug-types-section -fvar-tracking-assignments -g2 -Wp,-D_FORTIFY_SOURCE=2 -fstack-protector-strong --param=ssp-buffer-size=4 -fPIC -mtune=generic -march=x86-64 -gdwarf-4 -fno-debug-types-section -fvar-tracking-assignments -g2 -Werror -DMST_UL -Wno-format-overflow -Wno-implicit-fallthrough -Wno-cast-function-type -MT cibfw_layouts.lo -MD -MP -MF .deps/cibfw_layouts.Tpo -c cibfw_layouts.c -fPIC -DPIC -o .libs/cibfw_layouts.o cibfw_layouts.c: In function 'cibfw_uint64_print': cibfw_layouts.c:79:14: error: format '%lx' expects argument of type 'long unsigned int', but argument 3 has type 'long long unsigned int' [-Werror=format=] fprintf(fd, "uint64 : " U64H_FMT "\n", (u_int64_t) *ptr_struct); ^~~~~~~~~~~~~~~~~~~~~~~~~ ~~~~~~~~~~~~~~~~~~~~~~~ In file included from cibfw_layouts.h:46, from cibfw_layouts.c:39: adb_to_c_utils.h:185:33: note: format string is defined here # define U64H_FMT "0x%016lx" ~~~~~^ %016llx cibfw_layouts.c: In function 'cibfw_uid_entry_print': cibfw_layouts.c:205:14: error: format '%lx' expects argument of type 'long unsigned int', but argument 3 has type 'u_int64_t' {aka 'const long long unsigned int'} [-Werror=format=] fprintf(fd, "uid : " U64H_FMT "\n", ptr_struct->uid); ^~~~~~~~~~~~~~~~~~~~~~~~~ ~~~~~~~~~~~~~~~ In file included from cibfw_layouts.h:46, from cibfw_layouts.c:39: adb_to_c_utils.h:185:33: note: format string is defined here # define U64H_FMT "0x%016lx" ~~~~~^ %016llx cibfw_layouts.c: In function 'cibfw_operation_key_print': cibfw_layouts.c:649:14: error: format '%lx' expects argument of type 'long unsigned int', but argument 3 has type 'u_int64_t' {aka 'const long long unsigned int'} [-Werror=format=] fprintf(fd, "key : " U64H_FMT "\n", ptr_struct->key); ^~~~~~~~~~~~~~~~~~~~~~~~~ ~~~~~~~~~~~~~~~ In file included from cibfw_layouts.h:46, from cibfw_layouts.c:39: adb_to_c_utils.h:185:33: note: format string is defined here # define U64H_FMT "0x%016lx" ~~~~~^ %016llx cc1: all warnings being treated as errors make[2]: *** [Makefile:427: cibfw_layouts.lo] Error 1 make[2]: Leaving directory '/tmp/B.B1V4OG/BUILD/mstflint-4.10.0/tools_layouts' make[2]: Entering directory '/tmp/B.B1V4OG/BUILD/mstflint-4.10.0/tools_layouts' /bin/sh ../libtool --tag=CC --mode=compile x86_64-pld-linux-gnux32-gcc -DHAVE_CONFIG_H -I. -I.. -I../ -I../common -Wall -W -g -MP -MD -pipe -fPIC -O2 -fwrapv -pipe -Wformat -Werror=format-security -gdwarf-4 -fno-debug-types-section -fvar-tracking-assignments -g2 -Wp,-D_FORTIFY_SOURCE=2 -fstack-protector-strong --param=ssp-buffer-size=4 -fPIC -mtune=generic -march=x86-64 -gdwarf-4 -fno-debug-types-section -fvar-tracking-assignments -g2 -Werror -DMST_UL -Wno-format-overflow -Wno-implicit-fallthrough -Wno-cast-function-type -MT icmd_layouts.lo -MD -MP -MF .deps/icmd_layouts.Tpo -c -o icmd_layouts.lo icmd_layouts.c libtool: compile: x86_64-pld-linux-gnux32-gcc -DHAVE_CONFIG_H -I. -I.. -I../ -I../common -Wall -W -g -MP -MD -pipe -fPIC -O2 -fwrapv -pipe -Wformat -Werror=format-security -gdwarf-4 -fno-debug-types-section -fvar-tracking-assignments -g2 -Wp,-D_FORTIFY_SOURCE=2 -fstack-protector-strong --param=ssp-buffer-size=4 -fPIC -mtune=generic -march=x86-64 -gdwarf-4 -fno-debug-types-section -fvar-tracking-assignments -g2 -Werror -DMST_UL -Wno-format-overflow -Wno-implicit-fallthrough -Wno-cast-function-type -MT icmd_layouts.lo -MD -MP -MF .deps/icmd_layouts.Tpo -c icmd_layouts.c -fPIC -DPIC -o .libs/icmd_layouts.o libtool: compile: x86_64-pld-linux-gnux32-gcc -DHAVE_CONFIG_H -I. -I.. -I../ -I../common -Wall -W -g -MP -MD -pipe -fPIC -O2 -fwrapv -pipe -Wformat -Werror=format-security -gdwarf-4 -fno-debug-types-section -fvar-tracking-assignments -g2 -Wp,-D_FORTIFY_SOURCE=2 -fstack-protector-strong --param=ssp-buffer-size=4 -fPIC -mtune=generic -march=x86-64 -gdwarf-4 -fno-debug-types-section -fvar-tracking-assignments -g2 -Werror -DMST_UL -Wno-format-overflow -Wno-implicit-fallthrough -Wno-cast-function-type -MT icmd_layouts.lo -MD -MP -MF .deps/icmd_layouts.Tpo -c icmd_layouts.c -o icmd_layouts.o >/dev/null 2>&1 mv -f .deps/icmd_layouts.Tpo .deps/icmd_layouts.Plo make[2]: Leaving directory '/tmp/B.B1V4OG/BUILD/mstflint-4.10.0/tools_layouts' make[2]: Entering directory '/tmp/B.B1V4OG/BUILD/mstflint-4.10.0/tools_layouts' /bin/sh ../libtool --tag=CC --mode=compile x86_64-pld-linux-gnux32-gcc -DHAVE_CONFIG_H -I. -I.. -I../ -I../common -Wall -W -g -MP -MD -pipe -fPIC -O2 -fwrapv -pipe -Wformat -Werror=format-security -gdwarf-4 -fno-debug-types-section -fvar-tracking-assignments -g2 -Wp,-D_FORTIFY_SOURCE=2 -fstack-protector-strong --param=ssp-buffer-size=4 -fPIC -mtune=generic -march=x86-64 -gdwarf-4 -fno-debug-types-section -fvar-tracking-assignments -g2 -Werror -DMST_UL -Wno-format-overflow -Wno-implicit-fallthrough -Wno-cast-function-type -MT register_access_sib_layouts.lo -MD -MP -MF .deps/register_access_sib_layouts.Tpo -c -o register_access_sib_layouts.lo register_access_sib_layouts.c libtool: compile: x86_64-pld-linux-gnux32-gcc -DHAVE_CONFIG_H -I. -I.. -I../ -I../common -Wall -W -g -MP -MD -pipe -fPIC -O2 -fwrapv -pipe -Wformat -Werror=format-security -gdwarf-4 -fno-debug-types-section -fvar-tracking-assignments -g2 -Wp,-D_FORTIFY_SOURCE=2 -fstack-protector-strong --param=ssp-buffer-size=4 -fPIC -mtune=generic -march=x86-64 -gdwarf-4 -fno-debug-types-section -fvar-tracking-assignments -g2 -Werror -DMST_UL -Wno-format-overflow -Wno-implicit-fallthrough -Wno-cast-function-type -MT register_access_sib_layouts.lo -MD -MP -MF .deps/register_access_sib_layouts.Tpo -c register_access_sib_layouts.c -fPIC -DPIC -o .libs/register_access_sib_layouts.o libtool: compile: x86_64-pld-linux-gnux32-gcc -DHAVE_CONFIG_H -I. -I.. -I../ -I../common -Wall -W -g -MP -MD -pipe -fPIC -O2 -fwrapv -pipe -Wformat -Werror=format-security -gdwarf-4 -fno-debug-types-section -fvar-tracking-assignments -g2 -Wp,-D_FORTIFY_SOURCE=2 -fstack-protector-strong --param=ssp-buffer-size=4 -fPIC -mtune=generic -march=x86-64 -gdwarf-4 -fno-debug-types-section -fvar-tracking-assignments -g2 -Werror -DMST_UL -Wno-format-overflow -Wno-implicit-fallthrough -Wno-cast-function-type -MT register_access_sib_layouts.lo -MD -MP -MF .deps/register_access_sib_layouts.Tpo -c register_access_sib_layouts.c -o register_access_sib_layouts.o >/dev/null 2>&1 mv -f .deps/register_access_sib_layouts.Tpo .deps/register_access_sib_layouts.Plo make[2]: Leaving directory '/tmp/B.B1V4OG/BUILD/mstflint-4.10.0/tools_layouts' make[2]: Entering directory '/tmp/B.B1V4OG/BUILD/mstflint-4.10.0/tools_layouts' /bin/sh ../libtool --tag=CC --mode=compile x86_64-pld-linux-gnux32-gcc -DHAVE_CONFIG_H -I. -I.. -I../ -I../common -Wall -W -g -MP -MD -pipe -fPIC -O2 -fwrapv -pipe -Wformat -Werror=format-security -gdwarf-4 -fno-debug-types-section -fvar-tracking-assignments -g2 -Wp,-D_FORTIFY_SOURCE=2 -fstack-protector-strong --param=ssp-buffer-size=4 -fPIC -mtune=generic -march=x86-64 -gdwarf-4 -fno-debug-types-section -fvar-tracking-assignments -g2 -Werror -DMST_UL -Wno-format-overflow -Wno-implicit-fallthrough -Wno-cast-function-type -MT reg_access_hca_layouts.lo -MD -MP -MF .deps/reg_access_hca_layouts.Tpo -c -o reg_access_hca_layouts.lo reg_access_hca_layouts.c libtool: compile: x86_64-pld-linux-gnux32-gcc -DHAVE_CONFIG_H -I. -I.. -I../ -I../common -Wall -W -g -MP -MD -pipe -fPIC -O2 -fwrapv -pipe -Wformat -Werror=format-security -gdwarf-4 -fno-debug-types-section -fvar-tracking-assignments -g2 -Wp,-D_FORTIFY_SOURCE=2 -fstack-protector-strong --param=ssp-buffer-size=4 -fPIC -mtune=generic -march=x86-64 -gdwarf-4 -fno-debug-types-section -fvar-tracking-assignments -g2 -Werror -DMST_UL -Wno-format-overflow -Wno-implicit-fallthrough -Wno-cast-function-type -MT reg_access_hca_layouts.lo -MD -MP -MF .deps/reg_access_hca_layouts.Tpo -c reg_access_hca_layouts.c -fPIC -DPIC -o .libs/reg_access_hca_layouts.o reg_access_hca_layouts.c: In function 'reg_access_hca_uint64_print': reg_access_hca_layouts.c:674:14: error: format '%lx' expects argument of type 'long unsigned int', but argument 3 has type 'long long unsigned int' [-Werror=format=] fprintf(fd, "uint64 : " U64H_FMT "\n", (u_int64_t) *ptr_struct); ^~~~~~~~~~~~~~~~~~~~~~~~~ ~~~~~~~~~~~~~~~~~~~~~~~ In file included from reg_access_hca_layouts.h:29, from reg_access_hca_layouts.c:21: adb_to_c_utils.h:185:33: note: format string is defined here # define U64H_FMT "0x%016lx" ~~~~~^ %016llx reg_access_hca_layouts.c: In function 'reg_access_hca_fpga_cap_print': reg_access_hca_layouts.c:834:14: error: format '%lx' expects argument of type 'long unsigned int', but argument 3 has type 'u_int64_t' {aka 'const long long unsigned int'} [-Werror=format=] fprintf(fd, "sandbox_extended_caps_addr : " U64H_FMT "\n", ptr_struct->sandbox_extended_caps_addr); ^~~~~~~~~~~~~~~~~~~~~~~~~~~~~~~ ~~~~~~~~~~~~~~~~~~~~~~~~~~~~~~~~~~~~~~ In file included from reg_access_hca_layouts.h:29, from reg_access_hca_layouts.c:21: adb_to_c_utils.h:185:33: note: format string is defined here # define U64H_FMT "0x%016lx" ~~~~~^ %016llx reg_access_hca_layouts.c:836:14: error: format '%lx' expects argument of type 'long unsigned int', but argument 3 has type 'u_int64_t' {aka 'const long long unsigned int'} [-Werror=format=] fprintf(fd, "fpga_ddr_start_addr : " U64H_FMT "\n", ptr_struct->fpga_ddr_start_addr); ^~~~~~~~~~~~~~~~~~~~~~~~~ ~~~~~~~~~~~~~~~~~~~~~~~~~~~~~~~ In file included from reg_access_hca_layouts.h:29, from reg_access_hca_layouts.c:21: adb_to_c_utils.h:185:33: note: format string is defined here # define U64H_FMT "0x%016lx" ~~~~~^ %016llx reg_access_hca_layouts.c:838:14: error: format '%lx' expects argument of type 'long unsigned int', but argument 3 has type 'u_int64_t' {aka 'const long long unsigned int'} [-Werror=format=] fprintf(fd, "fpga_cr_space_start_addr : " U64H_FMT "\n", ptr_struct->fpga_cr_space_start_addr); ^~~~~~~~~~~~~~~~~~~~~~~~~~~~~ ~~~~~~~~~~~~~~~~~~~~~~~~~~~~~~~~~~~~ In file included from reg_access_hca_layouts.h:29, from reg_access_hca_layouts.c:21: adb_to_c_utils.h:185:33: note: format string is defined here # define U64H_FMT "0x%016lx" ~~~~~^ %016llx reg_access_hca_layouts.c: In function 'reg_access_hca_mcqi_version_print': reg_access_hca_layouts.c:1327:14: error: format '%lx' expects argument of type 'long unsigned int', but argument 3 has type 'u_int64_t' {aka 'const long long unsigned int'} [-Werror=format=] fprintf(fd, "build_time : " U64H_FMT "\n", ptr_struct->build_time); ^~~~~~~~~~~~~~~~~~~~~~~~~ ~~~~~~~~~~~~~~~~~~~~~~ In file included from reg_access_hca_layouts.h:29, from reg_access_hca_layouts.c:21: adb_to_c_utils.h:185:33: note: format string is defined here # define U64H_FMT "0x%016lx" ~~~~~^ %016llx reg_access_hca_layouts.c:1329:14: error: format '%lx' expects argument of type 'long unsigned int', but argument 3 has type 'u_int64_t' {aka 'const long long unsigned int'} [-Werror=format=] fprintf(fd, "user_defined_time : " U64H_FMT "\n", ptr_struct->user_defined_time); ^~~~~~~~~~~~~~~~~~~~~~~~~ ~~~~~~~~~~~~~~~~~~~~~~~~~~~~~ In file included from reg_access_hca_layouts.h:29, from reg_access_hca_layouts.c:21: adb_to_c_utils.h:185:33: note: format string is defined here # define U64H_FMT "0x%016lx" ~~~~~^ %016llx cc1: all warnings being treated as errors make[2]: *** [Makefile:427: reg_access_hca_layouts.lo] Error 1 make[2]: Leaving directory '/tmp/B.B1V4OG/BUILD/mstflint-4.10.0/tools_layouts' make[2]: Entering directory '/tmp/B.B1V4OG/BUILD/mstflint-4.10.0/tools_layouts' /bin/sh ../libtool --tag=CC --mode=compile x86_64-pld-linux-gnux32-gcc -DHAVE_CONFIG_H -I. -I.. -I../ -I../common -Wall -W -g -MP -MD -pipe -fPIC -O2 -fwrapv -pipe -Wformat -Werror=format-security -gdwarf-4 -fno-debug-types-section -fvar-tracking-assignments -g2 -Wp,-D_FORTIFY_SOURCE=2 -fstack-protector-strong --param=ssp-buffer-size=4 -fPIC -mtune=generic -march=x86-64 -gdwarf-4 -fno-debug-types-section -fvar-tracking-assignments -g2 -Werror -DMST_UL -Wno-format-overflow -Wno-implicit-fallthrough -Wno-cast-function-type -MT tools_open_layouts.lo -MD -MP -MF .deps/tools_open_layouts.Tpo -c -o tools_open_layouts.lo tools_open_layouts.c libtool: compile: x86_64-pld-linux-gnux32-gcc -DHAVE_CONFIG_H -I. -I.. -I../ -I../common -Wall -W -g -MP -MD -pipe -fPIC -O2 -fwrapv -pipe -Wformat -Werror=format-security -gdwarf-4 -fno-debug-types-section -fvar-tracking-assignments -g2 -Wp,-D_FORTIFY_SOURCE=2 -fstack-protector-strong --param=ssp-buffer-size=4 -fPIC -mtune=generic -march=x86-64 -gdwarf-4 -fno-debug-types-section -fvar-tracking-assignments -g2 -Werror -DMST_UL -Wno-format-overflow -Wno-implicit-fallthrough -Wno-cast-function-type -MT tools_open_layouts.lo -MD -MP -MF .deps/tools_open_layouts.Tpo -c tools_open_layouts.c -fPIC -DPIC -o .libs/tools_open_layouts.o tools_open_layouts.c: In function 'tools_open_uint64_print': tools_open_layouts.c:1414:14: error: format '%lx' expects argument of type 'long unsigned int', but argument 3 has type 'long long unsigned int' [-Werror=format=] fprintf(fd, "uint64 : " U64H_FMT "\n", (u_int64_t) *ptr_struct); ^~~~~~~~~~~~~~~~~~~~~~~~~ ~~~~~~~~~~~~~~~~~~~~~~~ In file included from tools_open_layouts.h:47, from tools_open_layouts.c:39: adb_to_c_utils.h:185:33: note: format string is defined here # define U64H_FMT "0x%016lx" ~~~~~^ %016llx tools_open_layouts.c: In function 'tools_open_mlock_print': tools_open_layouts.c:2306:14: error: format '%lx' expects argument of type 'long unsigned int', but argument 3 has type 'u_int64_t' {aka 'const long long unsigned int'} [-Werror=format=] fprintf(fd, "key : " U64H_FMT "\n", ptr_struct->key); ^~~~~~~~~~~~~~~~~~~~~~~~~ ~~~~~~~~~~~~~~~ In file included from tools_open_layouts.h:47, from tools_open_layouts.c:39: adb_to_c_utils.h:185:33: note: format string is defined here # define U64H_FMT "0x%016lx" ~~~~~^ %016llx cc1: all warnings being treated as errors make[2]: *** [Makefile:427: tools_open_layouts.lo] Error 1 make[2]: Leaving directory '/tmp/B.B1V4OG/BUILD/mstflint-4.10.0/tools_layouts' make[1]: *** [Makefile:522: all-recursive] Error 1 make: *** [Makefile:408: all] Error 2 error: Bad exit status from /tmp/B.B1V4OG/BUILD/tmp/rpm-tmp.82078 (%build) RPM build errors: Bad exit status from /tmp/B.B1V4OG/BUILD/tmp/rpm-tmp.82078 (%build) ended at: Wed Oct 31 21:46:59 2018, done in 0:00:49.621171 error: No files produced. + chmod -R u+rwX /tmp/B.B1V4OG/BUILD + rm -rf /tmp/B.B1V4OG/tmp /tmp/B.B1V4OG/BUILD + rm -rf /tmp/B.B1V4OG Begin-PLD-Builder-Info Build-Time: user:65.68s sys:3.64s real:53.03s (faults io:0 non-io:1321682) End-PLD-Builder-Info
[Back to list of logs] [View rpm -qa of builder]