FailedOk

th/SRPMS[OK]
th/x32[OK]
th/i686[OK]
th/x86_64[OK]

ac/SRPMS[OK]
ac/i386[OK]
ac/i586[OK]
ac/i686[OK]
ac/alpha[OK]
ac/amd64[OK]
ac/athlon[OK]
ac/ppc[OK]
ac/sparc[OK]
ac/sparc64[OK]

Advanced Search
main()
Powered by PLD Linux
(c) 2002-2018 PLD Team
$Revision: 1.37 $
Powered by foobar.
Your IP: 54.221.75.115

mstflint df7c6696-5939-414f-b034-080daaec2347

Status:Failed
Source URL:ftp://buildlogs.pld-linux.org/th/x32/FAIL/mstflint,df7c6696-5939-414f-b034-080daaec2347.bz2
text/plain URL:View!
full text:View!
rpm -qa of builder:View!
Date:2018/10/31 21:46:59
Runtime:0:00:49.621171

Toc:

  • error 1
  • cx5fw_layouts.c:594:16: error: format '%lx' expects argument of type 'long unsigned int', but argument 3 has type 'u_int64_t' {aka 'const long long unsigned int'} [-Werror=format=]
  • error 2
  • cx5fw_layouts.c:665:16: error: format '%lx' expects argument of type 'long unsigned int', but argument 3 has type 'u_int64_t' {aka 'const long long unsigned int'} [-Werror=format=]
  • error 3
  • make[2]: *** [Makefile:427: cx5fw_layouts.lo] Error 1
  • error 4
  • cx4fw_layouts.c:63:14: error: format '%lx' expects argument of type 'long unsigned int', but argument 3 has type 'long long unsigned int' [-Werror=format=]
  • error 5
  • cx4fw_layouts.c:110:14: error: format '%lx' expects argument of type 'long unsigned int', but argument 3 has type 'u_int64_t' {aka 'const long long unsigned int'} [-Werror=format=]
  • error 6
  • cx4fw_layouts.c:194:14: error: format '%lx' expects argument of type 'long unsigned int', but argument 3 has type 'u_int64_t' {aka 'const long long unsigned int'} [-Werror=format=]
  • error 7
  • make[2]: *** [Makefile:427: cx4fw_layouts.lo] Error 1
  • error 8
  • cibfw_layouts.c:79:14: error: format '%lx' expects argument of type 'long unsigned int', but argument 3 has type 'long long unsigned int' [-Werror=format=]
  • error 9
  • cibfw_layouts.c:205:14: error: format '%lx' expects argument of type 'long unsigned int', but argument 3 has type 'u_int64_t' {aka 'const long long unsigned int'} [-Werror=format=]
  • error 10
  • cibfw_layouts.c:649:14: error: format '%lx' expects argument of type 'long unsigned int', but argument 3 has type 'u_int64_t' {aka 'const long long unsigned int'} [-Werror=format=]
  • error 11
  • make[2]: *** [Makefile:427: cibfw_layouts.lo] Error 1
  • error 12
  • reg_access_hca_layouts.c:674:14: error: format '%lx' expects argument of type 'long unsigned int', but argument 3 has type 'long long unsigned int' [-Werror=format=]
  • error 13
  • reg_access_hca_layouts.c:834:14: error: format '%lx' expects argument of type 'long unsigned int', but argument 3 has type 'u_int64_t' {aka 'const long long unsigned int'} [-Werror=format=]
  • error 14
  • reg_access_hca_layouts.c:836:14: error: format '%lx' expects argument of type 'long unsigned int', but argument 3 has type 'u_int64_t' {aka 'const long long unsigned int'} [-Werror=format=]
  • error 15
  • reg_access_hca_layouts.c:838:14: error: format '%lx' expects argument of type 'long unsigned int', but argument 3 has type 'u_int64_t' {aka 'const long long unsigned int'} [-Werror=format=]
  • error 16
  • reg_access_hca_layouts.c:1327:14: error: format '%lx' expects argument of type 'long unsigned int', but argument 3 has type 'u_int64_t' {aka 'const long long unsigned int'} [-Werror=format=]
  • error 17
  • reg_access_hca_layouts.c:1329:14: error: format '%lx' expects argument of type 'long unsigned int', but argument 3 has type 'u_int64_t' {aka 'const long long unsigned int'} [-Werror=format=]
  • error 18
  • make[2]: *** [Makefile:427: reg_access_hca_layouts.lo] Error 1
  • error 19
  • tools_open_layouts.c:1414:14: error: format '%lx' expects argument of type 'long unsigned int', but argument 3 has type 'long long unsigned int' [-Werror=format=]
  • error 20
  • tools_open_layouts.c:2306:14: error: format '%lx' expects argument of type 'long unsigned int', but argument 3 has type 'u_int64_t' {aka 'const long long unsigned int'} [-Werror=format=]
  • error 21
  • make[2]: *** [Makefile:427: tools_open_layouts.lo] Error 1
  • error 22
  • make[1]: *** [Makefile:522: all-recursive] Error 1
  • error 23
  • error: Bad exit status from /tmp/B.B1V4OG/BUILD/tmp/rpm-tmp.82078 (%build)
  • error 24
  • RPM build errors:
  • error 25
  • error: No files produced.

Content:

mv -f .deps/iniparser.Tpo .deps/iniparser.Plo
make[3]: Leaving directory '/tmp/B.B1V4OG/BUILD/mstflint-4.10.0/ext_libs/iniParser'
make[3]: Entering directory '/tmp/B.B1V4OG/BUILD/mstflint-4.10.0/ext_libs/iniParser'
/bin/sh ../../libtool  --tag=CC   --mode=link x86_64-pld-linux-gnux32-gcc -W -Werror -g -MP -MD -fPIC  -O2 -fwrapv -pipe -Wformat -Werror=format-security -gdwarf-4 -fno-debug-types-section -fvar-tracking-assignments -g2 -Wp,-D_FORTIFY_SOURCE=2 -fstack-protector-strong --param=ssp-buffer-size=4 -fPIC -mtune=generic -march=x86-64 -gdwarf-4 -fno-debug-types-section -fvar-tracking-assignments -g2  -Werror -DMST_UL -Wno-format-overflow -Wno-implicit-fallthrough -Wno-cast-function-type  -Wl,--as-needed -Wl,--no-copy-dt-needed-entries -Wl,-z,relro -Wl,-z,combreloc  -o libiniparser.a  iniparser.lo dictionary.lo  -lxml2 -lboost_regex -lz -lz 
libtool: link: warning: `-l' is ignored for archives/objects
libtool: link: warning: `-l' is ignored for archives/objects
libtool: link: warning: `-l' is ignored for archives/objects
libtool: link: warning: `-l' is ignored for archives/objects
libtool: link: ar cru libiniparser.a  iniparser.o dictionary.o
libtool: link: ranlib libiniparser.a
make[3]: Leaving directory '/tmp/B.B1V4OG/BUILD/mstflint-4.10.0/ext_libs/iniParser'
Making all in minixz
make[3]: Entering directory '/tmp/B.B1V4OG/BUILD/mstflint-4.10.0/ext_libs/minixz'
/bin/sh ../../libtool  --tag=CC   --mode=compile x86_64-pld-linux-gnux32-gcc -DHAVE_CONFIG_H -I. -I../.. -I. -DXZ_DEC_ANY_CHECK -W  -g -MP -MD -fPIC -Werror   -O2 -fwrapv -pipe -Wformat -Werror=format-security -gdwarf-4 -fno-debug-types-section -fvar-tracking-assignments -g2 -Wp,-D_FORTIFY_SOURCE=2 -fstack-protector-strong --param=ssp-buffer-size=4 -fPIC -mtune=generic -march=x86-64 -gdwarf-4 -fno-debug-types-section -fvar-tracking-assignments -g2  -Werror -DMST_UL -Wno-format-overflow -Wno-implicit-fallthrough -Wno-cast-function-type -MT xz_dec_bcj.lo -MD -MP -MF .deps/xz_dec_bcj.Tpo -c -o xz_dec_bcj.lo xz_dec_bcj.c
libtool: compile:  x86_64-pld-linux-gnux32-gcc -DHAVE_CONFIG_H -I. -I../.. -I. -DXZ_DEC_ANY_CHECK -W -g -MP -MD -fPIC -Werror -O2 -fwrapv -pipe -Wformat -Werror=format-security -gdwarf-4 -fno-debug-types-section -fvar-tracking-assignments -g2 -Wp,-D_FORTIFY_SOURCE=2 -fstack-protector-strong --param=ssp-buffer-size=4 -fPIC -mtune=generic -march=x86-64 -gdwarf-4 -fno-debug-types-section -fvar-tracking-assignments -g2 -Werror -DMST_UL -Wno-format-overflow -Wno-implicit-fallthrough -Wno-cast-function-type -MT xz_dec_bcj.lo -MD -MP -MF .deps/xz_dec_bcj.Tpo -c xz_dec_bcj.c  -fPIC -DPIC -o .libs/xz_dec_bcj.o
libtool: compile:  x86_64-pld-linux-gnux32-gcc -DHAVE_CONFIG_H -I. -I../.. -I. -DXZ_DEC_ANY_CHECK -W -g -MP -MD -fPIC -Werror -O2 -fwrapv -pipe -Wformat -Werror=format-security -gdwarf-4 -fno-debug-types-section -fvar-tracking-assignments -g2 -Wp,-D_FORTIFY_SOURCE=2 -fstack-protector-strong --param=ssp-buffer-size=4 -fPIC -mtune=generic -march=x86-64 -gdwarf-4 -fno-debug-types-section -fvar-tracking-assignments -g2 -Werror -DMST_UL -Wno-format-overflow -Wno-implicit-fallthrough -Wno-cast-function-type -MT xz_dec_bcj.lo -MD -MP -MF .deps/xz_dec_bcj.Tpo -c xz_dec_bcj.c -o xz_dec_bcj.o >/dev/null 2>&1
mv -f .deps/xz_dec_bcj.Tpo .deps/xz_dec_bcj.Plo
make[3]: Leaving directory '/tmp/B.B1V4OG/BUILD/mstflint-4.10.0/ext_libs/minixz'
make[3]: Entering directory '/tmp/B.B1V4OG/BUILD/mstflint-4.10.0/ext_libs/minixz'
/bin/sh ../../libtool  --tag=CC   --mode=compile x86_64-pld-linux-gnux32-gcc -DHAVE_CONFIG_H -I. -I../.. -I. -DXZ_DEC_ANY_CHECK -W  -g -MP -MD -fPIC -Werror   -O2 -fwrapv -pipe -Wformat -Werror=format-security -gdwarf-4 -fno-debug-types-section -fvar-tracking-assignments -g2 -Wp,-D_FORTIFY_SOURCE=2 -fstack-protector-strong --param=ssp-buffer-size=4 -fPIC -mtune=generic -march=x86-64 -gdwarf-4 -fno-debug-types-section -fvar-tracking-assignments -g2  -Werror -DMST_UL -Wno-format-overflow -Wno-implicit-fallthrough -Wno-cast-function-type -MT xz_crc32.lo -MD -MP -MF .deps/xz_crc32.Tpo -c -o xz_crc32.lo xz_crc32.c
libtool: compile:  x86_64-pld-linux-gnux32-gcc -DHAVE_CONFIG_H -I. -I../.. -I. -DXZ_DEC_ANY_CHECK -W -g -MP -MD -fPIC -Werror -O2 -fwrapv -pipe -Wformat -Werror=format-security -gdwarf-4 -fno-debug-types-section -fvar-tracking-assignments -g2 -Wp,-D_FORTIFY_SOURCE=2 -fstack-protector-strong --param=ssp-buffer-size=4 -fPIC -mtune=generic -march=x86-64 -gdwarf-4 -fno-debug-types-section -fvar-tracking-assignments -g2 -Werror -DMST_UL -Wno-format-overflow -Wno-implicit-fallthrough -Wno-cast-function-type -MT xz_crc32.lo -MD -MP -MF .deps/xz_crc32.Tpo -c xz_crc32.c  -fPIC -DPIC -o .libs/xz_crc32.o
libtool: compile:  x86_64-pld-linux-gnux32-gcc -DHAVE_CONFIG_H -I. -I../.. -I. -DXZ_DEC_ANY_CHECK -W -g -MP -MD -fPIC -Werror -O2 -fwrapv -pipe -Wformat -Werror=format-security -gdwarf-4 -fno-debug-types-section -fvar-tracking-assignments -g2 -Wp,-D_FORTIFY_SOURCE=2 -fstack-protector-strong --param=ssp-buffer-size=4 -fPIC -mtune=generic -march=x86-64 -gdwarf-4 -fno-debug-types-section -fvar-tracking-assignments -g2 -Werror -DMST_UL -Wno-format-overflow -Wno-implicit-fallthrough -Wno-cast-function-type -MT xz_crc32.lo -MD -MP -MF .deps/xz_crc32.Tpo -c xz_crc32.c -o xz_crc32.o >/dev/null 2>&1
mv -f .deps/xz_crc32.Tpo .deps/xz_crc32.Plo
make[3]: Leaving directory '/tmp/B.B1V4OG/BUILD/mstflint-4.10.0/ext_libs/minixz'
make[3]: Entering directory '/tmp/B.B1V4OG/BUILD/mstflint-4.10.0/ext_libs/minixz'
/bin/sh ../../libtool  --tag=CC   --mode=compile x86_64-pld-linux-gnux32-gcc -DHAVE_CONFIG_H -I. -I../.. -I. -DXZ_DEC_ANY_CHECK -W  -g -MP -MD -fPIC -Werror   -O2 -fwrapv -pipe -Wformat -Werror=format-security -gdwarf-4 -fno-debug-types-section -fvar-tracking-assignments -g2 -Wp,-D_FORTIFY_SOURCE=2 -fstack-protector-strong --param=ssp-buffer-size=4 -fPIC -mtune=generic -march=x86-64 -gdwarf-4 -fno-debug-types-section -fvar-tracking-assignments -g2  -Werror -DMST_UL -Wno-format-overflow -Wno-implicit-fallthrough -Wno-cast-function-type -MT xz_dec_stream.lo -MD -MP -MF .deps/xz_dec_stream.Tpo -c -o xz_dec_stream.lo xz_dec_stream.c
libtool: compile:  x86_64-pld-linux-gnux32-gcc -DHAVE_CONFIG_H -I. -I../.. -I. -DXZ_DEC_ANY_CHECK -W -g -MP -MD -fPIC -Werror -O2 -fwrapv -pipe -Wformat -Werror=format-security -gdwarf-4 -fno-debug-types-section -fvar-tracking-assignments -g2 -Wp,-D_FORTIFY_SOURCE=2 -fstack-protector-strong --param=ssp-buffer-size=4 -fPIC -mtune=generic -march=x86-64 -gdwarf-4 -fno-debug-types-section -fvar-tracking-assignments -g2 -Werror -DMST_UL -Wno-format-overflow -Wno-implicit-fallthrough -Wno-cast-function-type -MT xz_dec_stream.lo -MD -MP -MF .deps/xz_dec_stream.Tpo -c xz_dec_stream.c  -fPIC -DPIC -o .libs/xz_dec_stream.o
libtool: compile:  x86_64-pld-linux-gnux32-gcc -DHAVE_CONFIG_H -I. -I../.. -I. -DXZ_DEC_ANY_CHECK -W -g -MP -MD -fPIC -Werror -O2 -fwrapv -pipe -Wformat -Werror=format-security -gdwarf-4 -fno-debug-types-section -fvar-tracking-assignments -g2 -Wp,-D_FORTIFY_SOURCE=2 -fstack-protector-strong --param=ssp-buffer-size=4 -fPIC -mtune=generic -march=x86-64 -gdwarf-4 -fno-debug-types-section -fvar-tracking-assignments -g2 -Werror -DMST_UL -Wno-format-overflow -Wno-implicit-fallthrough -Wno-cast-function-type -MT xz_dec_stream.lo -MD -MP -MF .deps/xz_dec_stream.Tpo -c xz_dec_stream.c -o xz_dec_stream.o >/dev/null 2>&1
mv -f .deps/xz_dec_stream.Tpo .deps/xz_dec_stream.Plo
make[3]: Leaving directory '/tmp/B.B1V4OG/BUILD/mstflint-4.10.0/ext_libs/minixz'
make[3]: Entering directory '/tmp/B.B1V4OG/BUILD/mstflint-4.10.0/ext_libs/minixz'
/bin/sh ../../libtool  --tag=CC   --mode=compile x86_64-pld-linux-gnux32-gcc -DHAVE_CONFIG_H -I. -I../.. -I. -DXZ_DEC_ANY_CHECK -W  -g -MP -MD -fPIC -Werror   -O2 -fwrapv -pipe -Wformat -Werror=format-security -gdwarf-4 -fno-debug-types-section -fvar-tracking-assignments -g2 -Wp,-D_FORTIFY_SOURCE=2 -fstack-protector-strong --param=ssp-buffer-size=4 -fPIC -mtune=generic -march=x86-64 -gdwarf-4 -fno-debug-types-section -fvar-tracking-assignments -g2  -Werror -DMST_UL -Wno-format-overflow -Wno-implicit-fallthrough -Wno-cast-function-type -MT xz_dec_lzma2.lo -MD -MP -MF .deps/xz_dec_lzma2.Tpo -c -o xz_dec_lzma2.lo xz_dec_lzma2.c
libtool: compile:  x86_64-pld-linux-gnux32-gcc -DHAVE_CONFIG_H -I. -I../.. -I. -DXZ_DEC_ANY_CHECK -W -g -MP -MD -fPIC -Werror -O2 -fwrapv -pipe -Wformat -Werror=format-security -gdwarf-4 -fno-debug-types-section -fvar-tracking-assignments -g2 -Wp,-D_FORTIFY_SOURCE=2 -fstack-protector-strong --param=ssp-buffer-size=4 -fPIC -mtune=generic -march=x86-64 -gdwarf-4 -fno-debug-types-section -fvar-tracking-assignments -g2 -Werror -DMST_UL -Wno-format-overflow -Wno-implicit-fallthrough -Wno-cast-function-type -MT xz_dec_lzma2.lo -MD -MP -MF .deps/xz_dec_lzma2.Tpo -c xz_dec_lzma2.c  -fPIC -DPIC -o .libs/xz_dec_lzma2.o
libtool: compile:  x86_64-pld-linux-gnux32-gcc -DHAVE_CONFIG_H -I. -I../.. -I. -DXZ_DEC_ANY_CHECK -W -g -MP -MD -fPIC -Werror -O2 -fwrapv -pipe -Wformat -Werror=format-security -gdwarf-4 -fno-debug-types-section -fvar-tracking-assignments -g2 -Wp,-D_FORTIFY_SOURCE=2 -fstack-protector-strong --param=ssp-buffer-size=4 -fPIC -mtune=generic -march=x86-64 -gdwarf-4 -fno-debug-types-section -fvar-tracking-assignments -g2 -Werror -DMST_UL -Wno-format-overflow -Wno-implicit-fallthrough -Wno-cast-function-type -MT xz_dec_lzma2.lo -MD -MP -MF .deps/xz_dec_lzma2.Tpo -c xz_dec_lzma2.c -o xz_dec_lzma2.o >/dev/null 2>&1
mv -f .deps/xz_dec_lzma2.Tpo .deps/xz_dec_lzma2.Plo
make[3]: Leaving directory '/tmp/B.B1V4OG/BUILD/mstflint-4.10.0/ext_libs/minixz'
make[3]: Entering directory '/tmp/B.B1V4OG/BUILD/mstflint-4.10.0/ext_libs/minixz'
/bin/sh ../../libtool  --tag=CC   --mode=link x86_64-pld-linux-gnux32-gcc  -O2 -fwrapv -pipe -Wformat -Werror=format-security -gdwarf-4 -fno-debug-types-section -fvar-tracking-assignments -g2 -Wp,-D_FORTIFY_SOURCE=2 -fstack-protector-strong --param=ssp-buffer-size=4 -fPIC -mtune=generic -march=x86-64 -gdwarf-4 -fno-debug-types-section -fvar-tracking-assignments -g2  -Werror -DMST_UL -Wno-format-overflow -Wno-implicit-fallthrough -Wno-cast-function-type  -Wl,--as-needed -Wl,--no-copy-dt-needed-entries -Wl,-z,relro -Wl,-z,combreloc  -o libminixz.a  xz_crc32.lo xz_dec_bcj.lo xz_dec_lzma2.lo xz_dec_stream.lo  -lxml2 -lboost_regex -lz -lz 
libtool: link: warning: `-l' is ignored for archives/objects
libtool: link: warning: `-l' is ignored for archives/objects
libtool: link: warning: `-l' is ignored for archives/objects
libtool: link: warning: `-l' is ignored for archives/objects
libtool: link: ar cru libminixz.a  xz_crc32.o xz_dec_bcj.o xz_dec_lzma2.o xz_dec_stream.o
libtool: link: ranlib libminixz.a
make[3]: Leaving directory '/tmp/B.B1V4OG/BUILD/mstflint-4.10.0/ext_libs/minixz'
Making all in json
make[3]: Entering directory '/tmp/B.B1V4OG/BUILD/mstflint-4.10.0/ext_libs/json'
/bin/sh ../../libtool  --tag=CXX   --mode=compile x86_64-pld-linux-gnux32-g++ -DHAVE_CONFIG_H -I. -I../..  -W -Werror -g -MP -MD -fPIC   -O2 -fwrapv -pipe -Wformat -Werror=format-security -gdwarf-4 -fno-debug-types-section -fvar-tracking-assignments -g2 -Wp,-D_FORTIFY_SOURCE=2 -fstack-protector-strong --param=ssp-buffer-size=4 -fPIC -mtune=generic -march=x86-64 -gdwarf-4 -fno-debug-types-section -fvar-tracking-assignments -g2  -DHAVE_TERMIOS_H -Werror -DMST_UL -Wno-implicit-fallthrough -Wno-format-overflow -Wno-cast-function-type -Wno-class-memaccess -MT json_writer.lo -MD -MP -MF .deps/json_writer.Tpo -c -o json_writer.lo json_writer.cpp
libtool: compile:  x86_64-pld-linux-gnux32-g++ -DHAVE_CONFIG_H -I. -I../.. -W -Werror -g -MP -MD -fPIC -O2 -fwrapv -pipe -Wformat -Werror=format-security -gdwarf-4 -fno-debug-types-section -fvar-tracking-assignments -g2 -Wp,-D_FORTIFY_SOURCE=2 -fstack-protector-strong --param=ssp-buffer-size=4 -fPIC -mtune=generic -march=x86-64 -gdwarf-4 -fno-debug-types-section -fvar-tracking-assignments -g2 -DHAVE_TERMIOS_H -Werror -DMST_UL -Wno-implicit-fallthrough -Wno-format-overflow -Wno-cast-function-type -Wno-class-memaccess -MT json_writer.lo -MD -MP -MF .deps/json_writer.Tpo -c json_writer.cpp  -fPIC -DPIC -o .libs/json_writer.o
libtool: compile:  x86_64-pld-linux-gnux32-g++ -DHAVE_CONFIG_H -I. -I../.. -W -Werror -g -MP -MD -fPIC -O2 -fwrapv -pipe -Wformat -Werror=format-security -gdwarf-4 -fno-debug-types-section -fvar-tracking-assignments -g2 -Wp,-D_FORTIFY_SOURCE=2 -fstack-protector-strong --param=ssp-buffer-size=4 -fPIC -mtune=generic -march=x86-64 -gdwarf-4 -fno-debug-types-section -fvar-tracking-assignments -g2 -DHAVE_TERMIOS_H -Werror -DMST_UL -Wno-implicit-fallthrough -Wno-format-overflow -Wno-cast-function-type -Wno-class-memaccess -MT json_writer.lo -MD -MP -MF .deps/json_writer.Tpo -c json_writer.cpp -o json_writer.o >/dev/null 2>&1
mv -f .deps/json_writer.Tpo .deps/json_writer.Plo
make[3]: Leaving directory '/tmp/B.B1V4OG/BUILD/mstflint-4.10.0/ext_libs/json'
make[3]: Entering directory '/tmp/B.B1V4OG/BUILD/mstflint-4.10.0/ext_libs/json'
/bin/sh ../../libtool  --tag=CXX   --mode=compile x86_64-pld-linux-gnux32-g++ -DHAVE_CONFIG_H -I. -I../..  -W -Werror -g -MP -MD -fPIC   -O2 -fwrapv -pipe -Wformat -Werror=format-security -gdwarf-4 -fno-debug-types-section -fvar-tracking-assignments -g2 -Wp,-D_FORTIFY_SOURCE=2 -fstack-protector-strong --param=ssp-buffer-size=4 -fPIC -mtune=generic -march=x86-64 -gdwarf-4 -fno-debug-types-section -fvar-tracking-assignments -g2  -DHAVE_TERMIOS_H -Werror -DMST_UL -Wno-implicit-fallthrough -Wno-format-overflow -Wno-cast-function-type -Wno-class-memaccess -MT json_reader.lo -MD -MP -MF .deps/json_reader.Tpo -c -o json_reader.lo json_reader.cpp
libtool: compile:  x86_64-pld-linux-gnux32-g++ -DHAVE_CONFIG_H -I. -I../.. -W -Werror -g -MP -MD -fPIC -O2 -fwrapv -pipe -Wformat -Werror=format-security -gdwarf-4 -fno-debug-types-section -fvar-tracking-assignments -g2 -Wp,-D_FORTIFY_SOURCE=2 -fstack-protector-strong --param=ssp-buffer-size=4 -fPIC -mtune=generic -march=x86-64 -gdwarf-4 -fno-debug-types-section -fvar-tracking-assignments -g2 -DHAVE_TERMIOS_H -Werror -DMST_UL -Wno-implicit-fallthrough -Wno-format-overflow -Wno-cast-function-type -Wno-class-memaccess -MT json_reader.lo -MD -MP -MF .deps/json_reader.Tpo -c json_reader.cpp  -fPIC -DPIC -o .libs/json_reader.o
libtool: compile:  x86_64-pld-linux-gnux32-g++ -DHAVE_CONFIG_H -I. -I../.. -W -Werror -g -MP -MD -fPIC -O2 -fwrapv -pipe -Wformat -Werror=format-security -gdwarf-4 -fno-debug-types-section -fvar-tracking-assignments -g2 -Wp,-D_FORTIFY_SOURCE=2 -fstack-protector-strong --param=ssp-buffer-size=4 -fPIC -mtune=generic -march=x86-64 -gdwarf-4 -fno-debug-types-section -fvar-tracking-assignments -g2 -DHAVE_TERMIOS_H -Werror -DMST_UL -Wno-implicit-fallthrough -Wno-format-overflow -Wno-cast-function-type -Wno-class-memaccess -MT json_reader.lo -MD -MP -MF .deps/json_reader.Tpo -c json_reader.cpp -o json_reader.o >/dev/null 2>&1
mv -f .deps/json_reader.Tpo .deps/json_reader.Plo
make[3]: Leaving directory '/tmp/B.B1V4OG/BUILD/mstflint-4.10.0/ext_libs/json'
make[3]: Entering directory '/tmp/B.B1V4OG/BUILD/mstflint-4.10.0/ext_libs/json'
/bin/sh ../../libtool  --tag=CXX   --mode=compile x86_64-pld-linux-gnux32-g++ -DHAVE_CONFIG_H -I. -I../..  -W -Werror -g -MP -MD -fPIC   -O2 -fwrapv -pipe -Wformat -Werror=format-security -gdwarf-4 -fno-debug-types-section -fvar-tracking-assignments -g2 -Wp,-D_FORTIFY_SOURCE=2 -fstack-protector-strong --param=ssp-buffer-size=4 -fPIC -mtune=generic -march=x86-64 -gdwarf-4 -fno-debug-types-section -fvar-tracking-assignments -g2  -DHAVE_TERMIOS_H -Werror -DMST_UL -Wno-implicit-fallthrough -Wno-format-overflow -Wno-cast-function-type -Wno-class-memaccess -MT json_value.lo -MD -MP -MF .deps/json_value.Tpo -c -o json_value.lo json_value.cpp
libtool: compile:  x86_64-pld-linux-gnux32-g++ -DHAVE_CONFIG_H -I. -I../.. -W -Werror -g -MP -MD -fPIC -O2 -fwrapv -pipe -Wformat -Werror=format-security -gdwarf-4 -fno-debug-types-section -fvar-tracking-assignments -g2 -Wp,-D_FORTIFY_SOURCE=2 -fstack-protector-strong --param=ssp-buffer-size=4 -fPIC -mtune=generic -march=x86-64 -gdwarf-4 -fno-debug-types-section -fvar-tracking-assignments -g2 -DHAVE_TERMIOS_H -Werror -DMST_UL -Wno-implicit-fallthrough -Wno-format-overflow -Wno-cast-function-type -Wno-class-memaccess -MT json_value.lo -MD -MP -MF .deps/json_value.Tpo -c json_value.cpp  -fPIC -DPIC -o .libs/json_value.o
libtool: compile:  x86_64-pld-linux-gnux32-g++ -DHAVE_CONFIG_H -I. -I../.. -W -Werror -g -MP -MD -fPIC -O2 -fwrapv -pipe -Wformat -Werror=format-security -gdwarf-4 -fno-debug-types-section -fvar-tracking-assignments -g2 -Wp,-D_FORTIFY_SOURCE=2 -fstack-protector-strong --param=ssp-buffer-size=4 -fPIC -mtune=generic -march=x86-64 -gdwarf-4 -fno-debug-types-section -fvar-tracking-assignments -g2 -DHAVE_TERMIOS_H -Werror -DMST_UL -Wno-implicit-fallthrough -Wno-format-overflow -Wno-cast-function-type -Wno-class-memaccess -MT json_value.lo -MD -MP -MF .deps/json_value.Tpo -c json_value.cpp -o json_value.o >/dev/null 2>&1
mv -f .deps/json_value.Tpo .deps/json_value.Plo
make[3]: Leaving directory '/tmp/B.B1V4OG/BUILD/mstflint-4.10.0/ext_libs/json'
make[3]: Entering directory '/tmp/B.B1V4OG/BUILD/mstflint-4.10.0/ext_libs/json'
/bin/sh ../../libtool  --tag=CXX   --mode=link x86_64-pld-linux-gnux32-g++  -O2 -fwrapv -pipe -Wformat -Werror=format-security -gdwarf-4 -fno-debug-types-section -fvar-tracking-assignments -g2 -Wp,-D_FORTIFY_SOURCE=2 -fstack-protector-strong --param=ssp-buffer-size=4 -fPIC -mtune=generic -march=x86-64 -gdwarf-4 -fno-debug-types-section -fvar-tracking-assignments -g2  -DHAVE_TERMIOS_H -Werror -DMST_UL -Wno-implicit-fallthrough -Wno-format-overflow -Wno-cast-function-type -Wno-class-memaccess  -Wl,--as-needed -Wl,--no-copy-dt-needed-entries -Wl,-z,relro -Wl,-z,combreloc  -o libjson.a  json_reader.lo json_value.lo json_writer.lo  -lxml2 -lboost_regex -lz -lz 
libtool: link: warning: `-l' is ignored for archives/objects
libtool: link: warning: `-l' is ignored for archives/objects
libtool: link: warning: `-l' is ignored for archives/objects
libtool: link: warning: `-l' is ignored for archives/objects
libtool: link: ar cru libjson.a  json_reader.o json_value.o json_writer.o
libtool: link: ranlib libjson.a
make[3]: Leaving directory '/tmp/B.B1V4OG/BUILD/mstflint-4.10.0/ext_libs/json'
make[3]: Nothing to be done for 'all-am'.
Making all in tools_crypto
make[2]: Entering directory '/tmp/B.B1V4OG/BUILD/mstflint-4.10.0/tools_crypto'
x86_64-pld-linux-gnux32-gcc -DHAVE_CONFIG_H -I. -I..  -I.. -I../common  -MD -pipe -Wall -W -DMST_UL -g -O2 -fwrapv -pipe -Wformat -Werror=format-security -gdwarf-4 -fno-debug-types-section -fvar-tracking-assignments -g2 -Wp,-D_FORTIFY_SOURCE=2 -fstack-protector-strong --param=ssp-buffer-size=4 -fPIC -mtune=generic -march=x86-64 -gdwarf-4 -fno-debug-types-section -fvar-tracking-assignments -g2  -Werror -DMST_UL -Wno-format-overflow -Wno-implicit-fallthrough -Wno-cast-function-type -MT tools_md5.o -MD -MP -MF .deps/tools_md5.Tpo -c -o tools_md5.o tools_md5.c
mv -f .deps/tools_md5.Tpo .deps/tools_md5.Po
make[2]: Leaving directory '/tmp/B.B1V4OG/BUILD/mstflint-4.10.0/tools_crypto'
make[2]: Entering directory '/tmp/B.B1V4OG/BUILD/mstflint-4.10.0/tools_crypto'
rm -f libtools_crypto.a
ar cru libtools_crypto.a tools_md5.o 
ranlib libtools_crypto.a
make[2]: Leaving directory '/tmp/B.B1V4OG/BUILD/mstflint-4.10.0/tools_crypto'
Making all in mlxsign_lib
make[2]: Entering directory '/tmp/B.B1V4OG/BUILD/mstflint-4.10.0/mlxsign_lib'
x86_64-pld-linux-gnux32-g++ -DHAVE_CONFIG_H -I. -I.. -I.. -I../common    -O2 -fwrapv -pipe -Wformat -Werror=format-security -gdwarf-4 -fno-debug-types-section -fvar-tracking-assignments -g2 -Wp,-D_FORTIFY_SOURCE=2 -fstack-protector-strong --param=ssp-buffer-size=4 -fPIC -mtune=generic -march=x86-64 -gdwarf-4 -fno-debug-types-section -fvar-tracking-assignments -g2  -DHAVE_TERMIOS_H -Werror -DMST_UL -Wno-implicit-fallthrough -Wno-format-overflow -Wno-cast-function-type -Wno-class-memaccess -MT mlxsign_lib.o -MD -MP -MF .deps/mlxsign_lib.Tpo -c -o mlxsign_lib.o mlxsign_lib.cpp
mv -f .deps/mlxsign_lib.Tpo .deps/mlxsign_lib.Po
make[2]: Leaving directory '/tmp/B.B1V4OG/BUILD/mstflint-4.10.0/mlxsign_lib'
make[2]: Entering directory '/tmp/B.B1V4OG/BUILD/mstflint-4.10.0/mlxsign_lib'
rm -f libmlxsign.a
ar cru libmlxsign.a mlxsign_lib.o 
ranlib libmlxsign.a
make[2]: Leaving directory '/tmp/B.B1V4OG/BUILD/mstflint-4.10.0/mlxsign_lib'
Making all in tools_layouts
make[2]: Entering directory '/tmp/B.B1V4OG/BUILD/mstflint-4.10.0/tools_layouts'
/bin/sh ../libtool  --tag=CC   --mode=compile x86_64-pld-linux-gnux32-gcc -DHAVE_CONFIG_H -I. -I..  -I../ -I../common  -Wall -W -g -MP -MD -pipe -fPIC -O2 -fwrapv -pipe -Wformat -Werror=format-security -gdwarf-4 -fno-debug-types-section -fvar-tracking-assignments -g2 -Wp,-D_FORTIFY_SOURCE=2 -fstack-protector-strong --param=ssp-buffer-size=4 -fPIC -mtune=generic -march=x86-64 -gdwarf-4 -fno-debug-types-section -fvar-tracking-assignments -g2  -Werror -DMST_UL -Wno-format-overflow -Wno-implicit-fallthrough -Wno-cast-function-type -MT cx5fw_layouts.lo -MD -MP -MF .deps/cx5fw_layouts.Tpo -c -o cx5fw_layouts.lo cx5fw_layouts.c
libtool: compile:  x86_64-pld-linux-gnux32-gcc -DHAVE_CONFIG_H -I. -I.. -I../ -I../common -Wall -W -g -MP -MD -pipe -fPIC -O2 -fwrapv -pipe -Wformat -Werror=format-security -gdwarf-4 -fno-debug-types-section -fvar-tracking-assignments -g2 -Wp,-D_FORTIFY_SOURCE=2 -fstack-protector-strong --param=ssp-buffer-size=4 -fPIC -mtune=generic -march=x86-64 -gdwarf-4 -fno-debug-types-section -fvar-tracking-assignments -g2 -Werror -DMST_UL -Wno-format-overflow -Wno-implicit-fallthrough -Wno-cast-function-type -MT cx5fw_layouts.lo -MD -MP -MF .deps/cx5fw_layouts.Tpo -c cx5fw_layouts.c  -fPIC -DPIC -o .libs/cx5fw_layouts.o
cx5fw_layouts.c: In function 'cx5fw_operation_key_print':
cx5fw_layouts.c:594:16: error: format '%lx' expects argument of type 'long unsigned int', but argument 3 has type 'u_int64_t' {aka 'const long long unsigned int'} [-Werror=format=]
  fprintf(file, "key                  : " U64H_FMT "\n", ptr_struct->key);
                ^~~~~~~~~~~~~~~~~~~~~~~~~                ~~~~~~~~~~~~~~~
In file included from cx5fw_layouts.h:47,
                 from cx5fw_layouts.c:39:
adb_to_c_utils.h:185:33: note: format string is defined here
 #    define U64H_FMT    "0x%016lx"
                            ~~~~~^
                            %016llx
cx5fw_layouts.c: In function 'cx5fw_uid_entry_print':
cx5fw_layouts.c:665:16: error: format '%lx' expects argument of type 'long unsigned int', but argument 3 has type 'u_int64_t' {aka 'const long long unsigned int'} [-Werror=format=]
  fprintf(file, "uid                  : " U64H_FMT "\n", ptr_struct->uid);
                ^~~~~~~~~~~~~~~~~~~~~~~~~                ~~~~~~~~~~~~~~~
In file included from cx5fw_layouts.h:47,
                 from cx5fw_layouts.c:39:
adb_to_c_utils.h:185:33: note: format string is defined here
 #    define U64H_FMT    "0x%016lx"
                            ~~~~~^
                            %016llx
cc1: all warnings being treated as errors
make[2]: *** [Makefile:427: cx5fw_layouts.lo] Error 1
make[2]: Leaving directory '/tmp/B.B1V4OG/BUILD/mstflint-4.10.0/tools_layouts'
make[2]: *** Waiting for unfinished jobs....
make[2]: Entering directory '/tmp/B.B1V4OG/BUILD/mstflint-4.10.0/tools_layouts'
/bin/sh ../libtool  --tag=CC   --mode=compile x86_64-pld-linux-gnux32-gcc -DHAVE_CONFIG_H -I. -I..  -I../ -I../common  -Wall -W -g -MP -MD -pipe -fPIC -O2 -fwrapv -pipe -Wformat -Werror=format-security -gdwarf-4 -fno-debug-types-section -fvar-tracking-assignments -g2 -Wp,-D_FORTIFY_SOURCE=2 -fstack-protector-strong --param=ssp-buffer-size=4 -fPIC -mtune=generic -march=x86-64 -gdwarf-4 -fno-debug-types-section -fvar-tracking-assignments -g2  -Werror -DMST_UL -Wno-format-overflow -Wno-implicit-fallthrough -Wno-cast-function-type -MT register_access_open_layouts.lo -MD -MP -MF .deps/register_access_open_layouts.Tpo -c -o register_access_open_layouts.lo register_access_open_layouts.c
libtool: compile:  x86_64-pld-linux-gnux32-gcc -DHAVE_CONFIG_H -I. -I.. -I../ -I../common -Wall -W -g -MP -MD -pipe -fPIC -O2 -fwrapv -pipe -Wformat -Werror=format-security -gdwarf-4 -fno-debug-types-section -fvar-tracking-assignments -g2 -Wp,-D_FORTIFY_SOURCE=2 -fstack-protector-strong --param=ssp-buffer-size=4 -fPIC -mtune=generic -march=x86-64 -gdwarf-4 -fno-debug-types-section -fvar-tracking-assignments -g2 -Werror -DMST_UL -Wno-format-overflow -Wno-implicit-fallthrough -Wno-cast-function-type -MT register_access_open_layouts.lo -MD -MP -MF .deps/register_access_open_layouts.Tpo -c register_access_open_layouts.c  -fPIC -DPIC -o .libs/register_access_open_layouts.o
libtool: compile:  x86_64-pld-linux-gnux32-gcc -DHAVE_CONFIG_H -I. -I.. -I../ -I../common -Wall -W -g -MP -MD -pipe -fPIC -O2 -fwrapv -pipe -Wformat -Werror=format-security -gdwarf-4 -fno-debug-types-section -fvar-tracking-assignments -g2 -Wp,-D_FORTIFY_SOURCE=2 -fstack-protector-strong --param=ssp-buffer-size=4 -fPIC -mtune=generic -march=x86-64 -gdwarf-4 -fno-debug-types-section -fvar-tracking-assignments -g2 -Werror -DMST_UL -Wno-format-overflow -Wno-implicit-fallthrough -Wno-cast-function-type -MT register_access_open_layouts.lo -MD -MP -MF .deps/register_access_open_layouts.Tpo -c register_access_open_layouts.c -o register_access_open_layouts.o >/dev/null 2>&1
mv -f .deps/register_access_open_layouts.Tpo .deps/register_access_open_layouts.Plo
make[2]: Leaving directory '/tmp/B.B1V4OG/BUILD/mstflint-4.10.0/tools_layouts'
make[2]: Entering directory '/tmp/B.B1V4OG/BUILD/mstflint-4.10.0/tools_layouts'
/bin/sh ../libtool  --tag=CC   --mode=compile x86_64-pld-linux-gnux32-gcc -DHAVE_CONFIG_H -I. -I..  -I../ -I../common  -Wall -W -g -MP -MD -pipe -fPIC -O2 -fwrapv -pipe -Wformat -Werror=format-security -gdwarf-4 -fno-debug-types-section -fvar-tracking-assignments -g2 -Wp,-D_FORTIFY_SOURCE=2 -fstack-protector-strong --param=ssp-buffer-size=4 -fPIC -mtune=generic -march=x86-64 -gdwarf-4 -fno-debug-types-section -fvar-tracking-assignments -g2  -Werror -DMST_UL -Wno-format-overflow -Wno-implicit-fallthrough -Wno-cast-function-type -MT cx4fw_layouts.lo -MD -MP -MF .deps/cx4fw_layouts.Tpo -c -o cx4fw_layouts.lo cx4fw_layouts.c
libtool: compile:  x86_64-pld-linux-gnux32-gcc -DHAVE_CONFIG_H -I. -I.. -I../ -I../common -Wall -W -g -MP -MD -pipe -fPIC -O2 -fwrapv -pipe -Wformat -Werror=format-security -gdwarf-4 -fno-debug-types-section -fvar-tracking-assignments -g2 -Wp,-D_FORTIFY_SOURCE=2 -fstack-protector-strong --param=ssp-buffer-size=4 -fPIC -mtune=generic -march=x86-64 -gdwarf-4 -fno-debug-types-section -fvar-tracking-assignments -g2 -Werror -DMST_UL -Wno-format-overflow -Wno-implicit-fallthrough -Wno-cast-function-type -MT cx4fw_layouts.lo -MD -MP -MF .deps/cx4fw_layouts.Tpo -c cx4fw_layouts.c  -fPIC -DPIC -o .libs/cx4fw_layouts.o
cx4fw_layouts.c: In function 'cx4fw_uint64_print':
cx4fw_layouts.c:63:14: error: format '%lx' expects argument of type 'long unsigned int', but argument 3 has type 'long long unsigned int' [-Werror=format=]
  fprintf(fd, "uint64               : " U64H_FMT "\n", (u_int64_t) *ptr_struct);
              ^~~~~~~~~~~~~~~~~~~~~~~~~                ~~~~~~~~~~~~~~~~~~~~~~~
In file included from cx4fw_layouts.h:47,
                 from cx4fw_layouts.c:39:
adb_to_c_utils.h:185:33: note: format string is defined here
 #    define U64H_FMT    "0x%016lx"
                            ~~~~~^
                            %016llx
cx4fw_layouts.c: In function 'cx4fw_uid_entry_print':
cx4fw_layouts.c:110:14: error: format '%lx' expects argument of type 'long unsigned int', but argument 3 has type 'u_int64_t' {aka 'const long long unsigned int'} [-Werror=format=]
  fprintf(fd, "uid                  : " U64H_FMT "\n", ptr_struct->uid);
              ^~~~~~~~~~~~~~~~~~~~~~~~~                ~~~~~~~~~~~~~~~
In file included from cx4fw_layouts.h:47,
                 from cx4fw_layouts.c:39:
adb_to_c_utils.h:185:33: note: format string is defined here
 #    define U64H_FMT    "0x%016lx"
                            ~~~~~^
                            %016llx
cx4fw_layouts.c: In function 'cx4fw_operation_key_print':
cx4fw_layouts.c:194:14: error: format '%lx' expects argument of type 'long unsigned int', but argument 3 has type 'u_int64_t' {aka 'const long long unsigned int'} [-Werror=format=]
  fprintf(fd, "key                  : " U64H_FMT "\n", ptr_struct->key);
              ^~~~~~~~~~~~~~~~~~~~~~~~~                ~~~~~~~~~~~~~~~
In file included from cx4fw_layouts.h:47,
                 from cx4fw_layouts.c:39:
adb_to_c_utils.h:185:33: note: format string is defined here
 #    define U64H_FMT    "0x%016lx"
                            ~~~~~^
                            %016llx
cc1: all warnings being treated as errors
make[2]: *** [Makefile:427: cx4fw_layouts.lo] Error 1
make[2]: Leaving directory '/tmp/B.B1V4OG/BUILD/mstflint-4.10.0/tools_layouts'
make[2]: Entering directory '/tmp/B.B1V4OG/BUILD/mstflint-4.10.0/tools_layouts'
/bin/sh ../libtool  --tag=CC   --mode=compile x86_64-pld-linux-gnux32-gcc -DHAVE_CONFIG_H -I. -I..  -I../ -I../common  -Wall -W -g -MP -MD -pipe -fPIC -O2 -fwrapv -pipe -Wformat -Werror=format-security -gdwarf-4 -fno-debug-types-section -fvar-tracking-assignments -g2 -Wp,-D_FORTIFY_SOURCE=2 -fstack-protector-strong --param=ssp-buffer-size=4 -fPIC -mtune=generic -march=x86-64 -gdwarf-4 -fno-debug-types-section -fvar-tracking-assignments -g2  -Werror -DMST_UL -Wno-format-overflow -Wno-implicit-fallthrough -Wno-cast-function-type -MT adb_to_c_utils.lo -MD -MP -MF .deps/adb_to_c_utils.Tpo -c -o adb_to_c_utils.lo adb_to_c_utils.c
libtool: compile:  x86_64-pld-linux-gnux32-gcc -DHAVE_CONFIG_H -I. -I.. -I../ -I../common -Wall -W -g -MP -MD -pipe -fPIC -O2 -fwrapv -pipe -Wformat -Werror=format-security -gdwarf-4 -fno-debug-types-section -fvar-tracking-assignments -g2 -Wp,-D_FORTIFY_SOURCE=2 -fstack-protector-strong --param=ssp-buffer-size=4 -fPIC -mtune=generic -march=x86-64 -gdwarf-4 -fno-debug-types-section -fvar-tracking-assignments -g2 -Werror -DMST_UL -Wno-format-overflow -Wno-implicit-fallthrough -Wno-cast-function-type -MT adb_to_c_utils.lo -MD -MP -MF .deps/adb_to_c_utils.Tpo -c adb_to_c_utils.c  -fPIC -DPIC -o .libs/adb_to_c_utils.o
libtool: compile:  x86_64-pld-linux-gnux32-gcc -DHAVE_CONFIG_H -I. -I.. -I../ -I../common -Wall -W -g -MP -MD -pipe -fPIC -O2 -fwrapv -pipe -Wformat -Werror=format-security -gdwarf-4 -fno-debug-types-section -fvar-tracking-assignments -g2 -Wp,-D_FORTIFY_SOURCE=2 -fstack-protector-strong --param=ssp-buffer-size=4 -fPIC -mtune=generic -march=x86-64 -gdwarf-4 -fno-debug-types-section -fvar-tracking-assignments -g2 -Werror -DMST_UL -Wno-format-overflow -Wno-implicit-fallthrough -Wno-cast-function-type -MT adb_to_c_utils.lo -MD -MP -MF .deps/adb_to_c_utils.Tpo -c adb_to_c_utils.c -o adb_to_c_utils.o >/dev/null 2>&1
mv -f .deps/adb_to_c_utils.Tpo .deps/adb_to_c_utils.Plo
make[2]: Leaving directory '/tmp/B.B1V4OG/BUILD/mstflint-4.10.0/tools_layouts'
make[2]: Entering directory '/tmp/B.B1V4OG/BUILD/mstflint-4.10.0/tools_layouts'
/bin/sh ../libtool  --tag=CC   --mode=compile x86_64-pld-linux-gnux32-gcc -DHAVE_CONFIG_H -I. -I..  -I../ -I../common  -Wall -W -g -MP -MD -pipe -fPIC -O2 -fwrapv -pipe -Wformat -Werror=format-security -gdwarf-4 -fno-debug-types-section -fvar-tracking-assignments -g2 -Wp,-D_FORTIFY_SOURCE=2 -fstack-protector-strong --param=ssp-buffer-size=4 -fPIC -mtune=generic -march=x86-64 -gdwarf-4 -fno-debug-types-section -fvar-tracking-assignments -g2  -Werror -DMST_UL -Wno-format-overflow -Wno-implicit-fallthrough -Wno-cast-function-type -MT cibfw_layouts.lo -MD -MP -MF .deps/cibfw_layouts.Tpo -c -o cibfw_layouts.lo cibfw_layouts.c
libtool: compile:  x86_64-pld-linux-gnux32-gcc -DHAVE_CONFIG_H -I. -I.. -I../ -I../common -Wall -W -g -MP -MD -pipe -fPIC -O2 -fwrapv -pipe -Wformat -Werror=format-security -gdwarf-4 -fno-debug-types-section -fvar-tracking-assignments -g2 -Wp,-D_FORTIFY_SOURCE=2 -fstack-protector-strong --param=ssp-buffer-size=4 -fPIC -mtune=generic -march=x86-64 -gdwarf-4 -fno-debug-types-section -fvar-tracking-assignments -g2 -Werror -DMST_UL -Wno-format-overflow -Wno-implicit-fallthrough -Wno-cast-function-type -MT cibfw_layouts.lo -MD -MP -MF .deps/cibfw_layouts.Tpo -c cibfw_layouts.c  -fPIC -DPIC -o .libs/cibfw_layouts.o
cibfw_layouts.c: In function 'cibfw_uint64_print':
cibfw_layouts.c:79:14: error: format '%lx' expects argument of type 'long unsigned int', but argument 3 has type 'long long unsigned int' [-Werror=format=]
  fprintf(fd, "uint64               : " U64H_FMT "\n", (u_int64_t) *ptr_struct);
              ^~~~~~~~~~~~~~~~~~~~~~~~~                ~~~~~~~~~~~~~~~~~~~~~~~
In file included from cibfw_layouts.h:46,
                 from cibfw_layouts.c:39:
adb_to_c_utils.h:185:33: note: format string is defined here
 #    define U64H_FMT    "0x%016lx"
                            ~~~~~^
                            %016llx
cibfw_layouts.c: In function 'cibfw_uid_entry_print':
cibfw_layouts.c:205:14: error: format '%lx' expects argument of type 'long unsigned int', but argument 3 has type 'u_int64_t' {aka 'const long long unsigned int'} [-Werror=format=]
  fprintf(fd, "uid                  : " U64H_FMT "\n", ptr_struct->uid);
              ^~~~~~~~~~~~~~~~~~~~~~~~~                ~~~~~~~~~~~~~~~
In file included from cibfw_layouts.h:46,
                 from cibfw_layouts.c:39:
adb_to_c_utils.h:185:33: note: format string is defined here
 #    define U64H_FMT    "0x%016lx"
                            ~~~~~^
                            %016llx
cibfw_layouts.c: In function 'cibfw_operation_key_print':
cibfw_layouts.c:649:14: error: format '%lx' expects argument of type 'long unsigned int', but argument 3 has type 'u_int64_t' {aka 'const long long unsigned int'} [-Werror=format=]
  fprintf(fd, "key                  : " U64H_FMT "\n", ptr_struct->key);
              ^~~~~~~~~~~~~~~~~~~~~~~~~                ~~~~~~~~~~~~~~~
In file included from cibfw_layouts.h:46,
                 from cibfw_layouts.c:39:
adb_to_c_utils.h:185:33: note: format string is defined here
 #    define U64H_FMT    "0x%016lx"
                            ~~~~~^
                            %016llx
cc1: all warnings being treated as errors
make[2]: *** [Makefile:427: cibfw_layouts.lo] Error 1
make[2]: Leaving directory '/tmp/B.B1V4OG/BUILD/mstflint-4.10.0/tools_layouts'
make[2]: Entering directory '/tmp/B.B1V4OG/BUILD/mstflint-4.10.0/tools_layouts'
/bin/sh ../libtool  --tag=CC   --mode=compile x86_64-pld-linux-gnux32-gcc -DHAVE_CONFIG_H -I. -I..  -I../ -I../common  -Wall -W -g -MP -MD -pipe -fPIC -O2 -fwrapv -pipe -Wformat -Werror=format-security -gdwarf-4 -fno-debug-types-section -fvar-tracking-assignments -g2 -Wp,-D_FORTIFY_SOURCE=2 -fstack-protector-strong --param=ssp-buffer-size=4 -fPIC -mtune=generic -march=x86-64 -gdwarf-4 -fno-debug-types-section -fvar-tracking-assignments -g2  -Werror -DMST_UL -Wno-format-overflow -Wno-implicit-fallthrough -Wno-cast-function-type -MT icmd_layouts.lo -MD -MP -MF .deps/icmd_layouts.Tpo -c -o icmd_layouts.lo icmd_layouts.c
libtool: compile:  x86_64-pld-linux-gnux32-gcc -DHAVE_CONFIG_H -I. -I.. -I../ -I../common -Wall -W -g -MP -MD -pipe -fPIC -O2 -fwrapv -pipe -Wformat -Werror=format-security -gdwarf-4 -fno-debug-types-section -fvar-tracking-assignments -g2 -Wp,-D_FORTIFY_SOURCE=2 -fstack-protector-strong --param=ssp-buffer-size=4 -fPIC -mtune=generic -march=x86-64 -gdwarf-4 -fno-debug-types-section -fvar-tracking-assignments -g2 -Werror -DMST_UL -Wno-format-overflow -Wno-implicit-fallthrough -Wno-cast-function-type -MT icmd_layouts.lo -MD -MP -MF .deps/icmd_layouts.Tpo -c icmd_layouts.c  -fPIC -DPIC -o .libs/icmd_layouts.o
libtool: compile:  x86_64-pld-linux-gnux32-gcc -DHAVE_CONFIG_H -I. -I.. -I../ -I../common -Wall -W -g -MP -MD -pipe -fPIC -O2 -fwrapv -pipe -Wformat -Werror=format-security -gdwarf-4 -fno-debug-types-section -fvar-tracking-assignments -g2 -Wp,-D_FORTIFY_SOURCE=2 -fstack-protector-strong --param=ssp-buffer-size=4 -fPIC -mtune=generic -march=x86-64 -gdwarf-4 -fno-debug-types-section -fvar-tracking-assignments -g2 -Werror -DMST_UL -Wno-format-overflow -Wno-implicit-fallthrough -Wno-cast-function-type -MT icmd_layouts.lo -MD -MP -MF .deps/icmd_layouts.Tpo -c icmd_layouts.c -o icmd_layouts.o >/dev/null 2>&1
mv -f .deps/icmd_layouts.Tpo .deps/icmd_layouts.Plo
make[2]: Leaving directory '/tmp/B.B1V4OG/BUILD/mstflint-4.10.0/tools_layouts'
make[2]: Entering directory '/tmp/B.B1V4OG/BUILD/mstflint-4.10.0/tools_layouts'
/bin/sh ../libtool  --tag=CC   --mode=compile x86_64-pld-linux-gnux32-gcc -DHAVE_CONFIG_H -I. -I..  -I../ -I../common  -Wall -W -g -MP -MD -pipe -fPIC -O2 -fwrapv -pipe -Wformat -Werror=format-security -gdwarf-4 -fno-debug-types-section -fvar-tracking-assignments -g2 -Wp,-D_FORTIFY_SOURCE=2 -fstack-protector-strong --param=ssp-buffer-size=4 -fPIC -mtune=generic -march=x86-64 -gdwarf-4 -fno-debug-types-section -fvar-tracking-assignments -g2  -Werror -DMST_UL -Wno-format-overflow -Wno-implicit-fallthrough -Wno-cast-function-type -MT register_access_sib_layouts.lo -MD -MP -MF .deps/register_access_sib_layouts.Tpo -c -o register_access_sib_layouts.lo register_access_sib_layouts.c
libtool: compile:  x86_64-pld-linux-gnux32-gcc -DHAVE_CONFIG_H -I. -I.. -I../ -I../common -Wall -W -g -MP -MD -pipe -fPIC -O2 -fwrapv -pipe -Wformat -Werror=format-security -gdwarf-4 -fno-debug-types-section -fvar-tracking-assignments -g2 -Wp,-D_FORTIFY_SOURCE=2 -fstack-protector-strong --param=ssp-buffer-size=4 -fPIC -mtune=generic -march=x86-64 -gdwarf-4 -fno-debug-types-section -fvar-tracking-assignments -g2 -Werror -DMST_UL -Wno-format-overflow -Wno-implicit-fallthrough -Wno-cast-function-type -MT register_access_sib_layouts.lo -MD -MP -MF .deps/register_access_sib_layouts.Tpo -c register_access_sib_layouts.c  -fPIC -DPIC -o .libs/register_access_sib_layouts.o
libtool: compile:  x86_64-pld-linux-gnux32-gcc -DHAVE_CONFIG_H -I. -I.. -I../ -I../common -Wall -W -g -MP -MD -pipe -fPIC -O2 -fwrapv -pipe -Wformat -Werror=format-security -gdwarf-4 -fno-debug-types-section -fvar-tracking-assignments -g2 -Wp,-D_FORTIFY_SOURCE=2 -fstack-protector-strong --param=ssp-buffer-size=4 -fPIC -mtune=generic -march=x86-64 -gdwarf-4 -fno-debug-types-section -fvar-tracking-assignments -g2 -Werror -DMST_UL -Wno-format-overflow -Wno-implicit-fallthrough -Wno-cast-function-type -MT register_access_sib_layouts.lo -MD -MP -MF .deps/register_access_sib_layouts.Tpo -c register_access_sib_layouts.c -o register_access_sib_layouts.o >/dev/null 2>&1
mv -f .deps/register_access_sib_layouts.Tpo .deps/register_access_sib_layouts.Plo
make[2]: Leaving directory '/tmp/B.B1V4OG/BUILD/mstflint-4.10.0/tools_layouts'
make[2]: Entering directory '/tmp/B.B1V4OG/BUILD/mstflint-4.10.0/tools_layouts'
/bin/sh ../libtool  --tag=CC   --mode=compile x86_64-pld-linux-gnux32-gcc -DHAVE_CONFIG_H -I. -I..  -I../ -I../common  -Wall -W -g -MP -MD -pipe -fPIC -O2 -fwrapv -pipe -Wformat -Werror=format-security -gdwarf-4 -fno-debug-types-section -fvar-tracking-assignments -g2 -Wp,-D_FORTIFY_SOURCE=2 -fstack-protector-strong --param=ssp-buffer-size=4 -fPIC -mtune=generic -march=x86-64 -gdwarf-4 -fno-debug-types-section -fvar-tracking-assignments -g2  -Werror -DMST_UL -Wno-format-overflow -Wno-implicit-fallthrough -Wno-cast-function-type -MT reg_access_hca_layouts.lo -MD -MP -MF .deps/reg_access_hca_layouts.Tpo -c -o reg_access_hca_layouts.lo reg_access_hca_layouts.c
libtool: compile:  x86_64-pld-linux-gnux32-gcc -DHAVE_CONFIG_H -I. -I.. -I../ -I../common -Wall -W -g -MP -MD -pipe -fPIC -O2 -fwrapv -pipe -Wformat -Werror=format-security -gdwarf-4 -fno-debug-types-section -fvar-tracking-assignments -g2 -Wp,-D_FORTIFY_SOURCE=2 -fstack-protector-strong --param=ssp-buffer-size=4 -fPIC -mtune=generic -march=x86-64 -gdwarf-4 -fno-debug-types-section -fvar-tracking-assignments -g2 -Werror -DMST_UL -Wno-format-overflow -Wno-implicit-fallthrough -Wno-cast-function-type -MT reg_access_hca_layouts.lo -MD -MP -MF .deps/reg_access_hca_layouts.Tpo -c reg_access_hca_layouts.c  -fPIC -DPIC -o .libs/reg_access_hca_layouts.o
reg_access_hca_layouts.c: In function 'reg_access_hca_uint64_print':
reg_access_hca_layouts.c:674:14: error: format '%lx' expects argument of type 'long unsigned int', but argument 3 has type 'long long unsigned int' [-Werror=format=]
  fprintf(fd, "uint64               : " U64H_FMT "\n", (u_int64_t) *ptr_struct);
              ^~~~~~~~~~~~~~~~~~~~~~~~~                ~~~~~~~~~~~~~~~~~~~~~~~
In file included from reg_access_hca_layouts.h:29,
                 from reg_access_hca_layouts.c:21:
adb_to_c_utils.h:185:33: note: format string is defined here
 #    define U64H_FMT    "0x%016lx"
                            ~~~~~^
                            %016llx
reg_access_hca_layouts.c: In function 'reg_access_hca_fpga_cap_print':
reg_access_hca_layouts.c:834:14: error: format '%lx' expects argument of type 'long unsigned int', but argument 3 has type 'u_int64_t' {aka 'const long long unsigned int'} [-Werror=format=]
  fprintf(fd, "sandbox_extended_caps_addr : " U64H_FMT "\n", ptr_struct->sandbox_extended_caps_addr);
              ^~~~~~~~~~~~~~~~~~~~~~~~~~~~~~~                ~~~~~~~~~~~~~~~~~~~~~~~~~~~~~~~~~~~~~~
In file included from reg_access_hca_layouts.h:29,
                 from reg_access_hca_layouts.c:21:
adb_to_c_utils.h:185:33: note: format string is defined here
 #    define U64H_FMT    "0x%016lx"
                            ~~~~~^
                            %016llx
reg_access_hca_layouts.c:836:14: error: format '%lx' expects argument of type 'long unsigned int', but argument 3 has type 'u_int64_t' {aka 'const long long unsigned int'} [-Werror=format=]
  fprintf(fd, "fpga_ddr_start_addr  : " U64H_FMT "\n", ptr_struct->fpga_ddr_start_addr);
              ^~~~~~~~~~~~~~~~~~~~~~~~~                ~~~~~~~~~~~~~~~~~~~~~~~~~~~~~~~
In file included from reg_access_hca_layouts.h:29,
                 from reg_access_hca_layouts.c:21:
adb_to_c_utils.h:185:33: note: format string is defined here
 #    define U64H_FMT    "0x%016lx"
                            ~~~~~^
                            %016llx
reg_access_hca_layouts.c:838:14: error: format '%lx' expects argument of type 'long unsigned int', but argument 3 has type 'u_int64_t' {aka 'const long long unsigned int'} [-Werror=format=]
  fprintf(fd, "fpga_cr_space_start_addr : " U64H_FMT "\n", ptr_struct->fpga_cr_space_start_addr);
              ^~~~~~~~~~~~~~~~~~~~~~~~~~~~~                ~~~~~~~~~~~~~~~~~~~~~~~~~~~~~~~~~~~~
In file included from reg_access_hca_layouts.h:29,
                 from reg_access_hca_layouts.c:21:
adb_to_c_utils.h:185:33: note: format string is defined here
 #    define U64H_FMT    "0x%016lx"
                            ~~~~~^
                            %016llx
reg_access_hca_layouts.c: In function 'reg_access_hca_mcqi_version_print':
reg_access_hca_layouts.c:1327:14: error: format '%lx' expects argument of type 'long unsigned int', but argument 3 has type 'u_int64_t' {aka 'const long long unsigned int'} [-Werror=format=]
  fprintf(fd, "build_time           : " U64H_FMT "\n", ptr_struct->build_time);
              ^~~~~~~~~~~~~~~~~~~~~~~~~                ~~~~~~~~~~~~~~~~~~~~~~
In file included from reg_access_hca_layouts.h:29,
                 from reg_access_hca_layouts.c:21:
adb_to_c_utils.h:185:33: note: format string is defined here
 #    define U64H_FMT    "0x%016lx"
                            ~~~~~^
                            %016llx
reg_access_hca_layouts.c:1329:14: error: format '%lx' expects argument of type 'long unsigned int', but argument 3 has type 'u_int64_t' {aka 'const long long unsigned int'} [-Werror=format=]
  fprintf(fd, "user_defined_time    : " U64H_FMT "\n", ptr_struct->user_defined_time);
              ^~~~~~~~~~~~~~~~~~~~~~~~~                ~~~~~~~~~~~~~~~~~~~~~~~~~~~~~
In file included from reg_access_hca_layouts.h:29,
                 from reg_access_hca_layouts.c:21:
adb_to_c_utils.h:185:33: note: format string is defined here
 #    define U64H_FMT    "0x%016lx"
                            ~~~~~^
                            %016llx
cc1: all warnings being treated as errors
make[2]: *** [Makefile:427: reg_access_hca_layouts.lo] Error 1
make[2]: Leaving directory '/tmp/B.B1V4OG/BUILD/mstflint-4.10.0/tools_layouts'
make[2]: Entering directory '/tmp/B.B1V4OG/BUILD/mstflint-4.10.0/tools_layouts'
/bin/sh ../libtool  --tag=CC   --mode=compile x86_64-pld-linux-gnux32-gcc -DHAVE_CONFIG_H -I. -I..  -I../ -I../common  -Wall -W -g -MP -MD -pipe -fPIC -O2 -fwrapv -pipe -Wformat -Werror=format-security -gdwarf-4 -fno-debug-types-section -fvar-tracking-assignments -g2 -Wp,-D_FORTIFY_SOURCE=2 -fstack-protector-strong --param=ssp-buffer-size=4 -fPIC -mtune=generic -march=x86-64 -gdwarf-4 -fno-debug-types-section -fvar-tracking-assignments -g2  -Werror -DMST_UL -Wno-format-overflow -Wno-implicit-fallthrough -Wno-cast-function-type -MT tools_open_layouts.lo -MD -MP -MF .deps/tools_open_layouts.Tpo -c -o tools_open_layouts.lo tools_open_layouts.c
libtool: compile:  x86_64-pld-linux-gnux32-gcc -DHAVE_CONFIG_H -I. -I.. -I../ -I../common -Wall -W -g -MP -MD -pipe -fPIC -O2 -fwrapv -pipe -Wformat -Werror=format-security -gdwarf-4 -fno-debug-types-section -fvar-tracking-assignments -g2 -Wp,-D_FORTIFY_SOURCE=2 -fstack-protector-strong --param=ssp-buffer-size=4 -fPIC -mtune=generic -march=x86-64 -gdwarf-4 -fno-debug-types-section -fvar-tracking-assignments -g2 -Werror -DMST_UL -Wno-format-overflow -Wno-implicit-fallthrough -Wno-cast-function-type -MT tools_open_layouts.lo -MD -MP -MF .deps/tools_open_layouts.Tpo -c tools_open_layouts.c  -fPIC -DPIC -o .libs/tools_open_layouts.o
tools_open_layouts.c: In function 'tools_open_uint64_print':
tools_open_layouts.c:1414:14: error: format '%lx' expects argument of type 'long unsigned int', but argument 3 has type 'long long unsigned int' [-Werror=format=]
  fprintf(fd, "uint64               : " U64H_FMT "\n", (u_int64_t) *ptr_struct);
              ^~~~~~~~~~~~~~~~~~~~~~~~~                ~~~~~~~~~~~~~~~~~~~~~~~
In file included from tools_open_layouts.h:47,
                 from tools_open_layouts.c:39:
adb_to_c_utils.h:185:33: note: format string is defined here
 #    define U64H_FMT    "0x%016lx"
                            ~~~~~^
                            %016llx
tools_open_layouts.c: In function 'tools_open_mlock_print':
tools_open_layouts.c:2306:14: error: format '%lx' expects argument of type 'long unsigned int', but argument 3 has type 'u_int64_t' {aka 'const long long unsigned int'} [-Werror=format=]
  fprintf(fd, "key                  : " U64H_FMT "\n", ptr_struct->key);
              ^~~~~~~~~~~~~~~~~~~~~~~~~                ~~~~~~~~~~~~~~~
In file included from tools_open_layouts.h:47,
                 from tools_open_layouts.c:39:
adb_to_c_utils.h:185:33: note: format string is defined here
 #    define U64H_FMT    "0x%016lx"
                            ~~~~~^
                            %016llx
cc1: all warnings being treated as errors
make[2]: *** [Makefile:427: tools_open_layouts.lo] Error 1
make[2]: Leaving directory '/tmp/B.B1V4OG/BUILD/mstflint-4.10.0/tools_layouts'
make[1]: *** [Makefile:522: all-recursive] Error 1
make: *** [Makefile:408: all] Error 2
error: Bad exit status from /tmp/B.B1V4OG/BUILD/tmp/rpm-tmp.82078 (%build)


RPM build errors:
    Bad exit status from /tmp/B.B1V4OG/BUILD/tmp/rpm-tmp.82078 (%build)
ended at: Wed Oct 31 21:46:59 2018, done in 0:00:49.621171
error: No files produced.
+ chmod -R u+rwX /tmp/B.B1V4OG/BUILD
+ rm -rf /tmp/B.B1V4OG/tmp /tmp/B.B1V4OG/BUILD
+ rm -rf /tmp/B.B1V4OG
Begin-PLD-Builder-Info
Build-Time: user:65.68s sys:3.64s real:53.03s (faults io:0 non-io:1321682)

End-PLD-Builder-Info
[Back to list of logs] [View rpm -qa of builder]