FailedOk

th/SRPMS[OK]
th/x32[OK]
th/i686[OK]
th/x86_64[OK]

ac/SRPMS[OK]
ac/i386[OK]
ac/i586[OK]
ac/i686[OK]
ac/alpha[OK]
ac/amd64[OK]
ac/athlon[OK]
ac/ppc[OK]
ac/sparc[OK]
ac/sparc64[OK]

Advanced Search
main()
Powered by PLD Linux
(c) 2002-2018 PLD Team
$Revision: 1.37 $
Powered by The Bad Thing.
Your IP: 54.92.190.11

mysql 2cb0a77b-4375-48a6-ba6b-d6357826b8f9

Status:Failed
Source URL:ftp://buildlogs.pld-linux.org/th/x32/FAIL/mysql,2cb0a77b-4375-48a6-ba6b-d6357826b8f9.bz2
text/plain URL:View!
full text:View!
rpm -qa of builder:View!
Date:2018/09/13 21:01:56
Runtime:0:02:09.311220

Toc:

  • error 1
  • /tmp/B.8exqh5/BUILD/mysql-5.7.22/vio/viosslfactories.c:124:7: error: dereferencing pointer to incomplete type 'DH' {aka 'struct dh_st'}
  • error 2
  • make[2]: *** [vio/CMakeFiles/vio.dir/build.make:105: vio/CMakeFiles/vio.dir/viosslfactories.c.o] Error 1
  • error 3
  • make[1]: *** [CMakeFiles/Makefile2:489: vio/CMakeFiles/vio.dir/all] Error 2
  • error 4
  • error: Bad exit status from /tmp/B.8exqh5/BUILD/tmp/rpm-tmp.89223 (%build)
  • error 5
  • RPM build errors:
  • error 6
  • error: No files produced.

Content:

make[2]: Leaving directory '/tmp/B.8exqh5/BUILD/mysql-5.7.22/build'
make[2]: Entering directory '/tmp/B.8exqh5/BUILD/mysql-5.7.22/build'
[  2%] Building C object strings/CMakeFiles/strings.dir/ctype-extra.c.o
cd /tmp/B.8exqh5/BUILD/mysql-5.7.22/build/strings && /usr/bin/x86_64-pld-linux-gnux32-gcc -DBOOST_GEOMETRY_SQRT_CHECK_FINITENESS -DDISABLE_MYSQL_THREAD_H -DHAVE_CONFIG_H -DHAVE_LIBEVENT2 -D_FILE_OFFSET_BITS=64 -D_GNU_SOURCE -I/tmp/B.8exqh5/BUILD/mysql-5.7.22/build/include -I/tmp/B.8exqh5/BUILD/mysql-5.7.22/extra/rapidjson/include -I/tmp/B.8exqh5/BUILD/mysql-5.7.22/build/libbinlogevents/include -I/tmp/B.8exqh5/BUILD/mysql-5.7.22/libbinlogevents/export -I/tmp/B.8exqh5/BUILD/mysql-5.7.22/include  -fPIC -Wall -Wextra -Wformat-security -Wvla -Wimplicit-fallthrough=2 -Wwrite-strings -Wdeclaration-after-statement -O3 -O2 -fwrapv -pipe -Wformat -Werror=format-security -gdwarf-4 -fno-debug-types-section -fvar-tracking-assignments -g2 -Wp,-D_FORTIFY_SOURCE=2 -fstack-protector-strong --param=ssp-buffer-size=4 -fPIC -mtune=generic -march=x86-64 -gdwarf-4 -fno-debug-types-section -fvar-tracking-assignments -g2  -DNDEBUG -fno-omit-frame-pointer -fno-strict-aliasing -g -fabi-version=2 -fno-omit-frame-pointer -fno-strict-aliasing -DDBUG_OFF   -o CMakeFiles/strings.dir/ctype-extra.c.o   -c /tmp/B.8exqh5/BUILD/mysql-5.7.22/strings/ctype-extra.c
make[2]: Leaving directory '/tmp/B.8exqh5/BUILD/mysql-5.7.22/build'
make[2]: Entering directory '/tmp/B.8exqh5/BUILD/mysql-5.7.22/build'
[  2%] Building CXX object rapid/plugin/group_replication/CMakeFiles/gr_unit_test_resource.dir/src/member_version.cc.o
cd /tmp/B.8exqh5/BUILD/mysql-5.7.22/build/rapid/plugin/group_replication && /usr/bin/x86_64-pld-linux-gnux32-g++  -DBOOST_GEOMETRY_SQRT_CHECK_FINITENESS -DDISABLE_ALL_PSI -DHAVE_CONFIG_H -DHAVE_LIBEVENT2 -DHAVE_OPENSSL -DHAVE_TIRPC -DXCOM_HAVE_OPENSSL -D_FILE_OFFSET_BITS=64 -D_GNU_SOURCE -I/tmp/B.8exqh5/BUILD/mysql-5.7.22/build/include -I/tmp/B.8exqh5/BUILD/mysql-5.7.22/extra/rapidjson/include -I/tmp/B.8exqh5/BUILD/mysql-5.7.22/build/libbinlogevents/include -I/tmp/B.8exqh5/BUILD/mysql-5.7.22/libbinlogevents/export -I/tmp/B.8exqh5/BUILD/mysql-5.7.22/build/rapid/plugin/group_replication/xdr_gen -isystem /usr/include/tirpc -I/tmp/B.8exqh5/BUILD/mysql-5.7.22/libbinlogevents/include -I/tmp/B.8exqh5/BUILD/mysql-5.7.22/rapid/plugin/group_replication/include -I/tmp/B.8exqh5/BUILD/mysql-5.7.22/rapid/plugin/group_replication/include/sql_service -I/tmp/B.8exqh5/BUILD/mysql-5.7.22/rapid/plugin/group_replication/libmysqlgcs/include -I/tmp/B.8exqh5/BUILD/mysql-5.7.22/rapid/plugin/group_replication/libmysqlgcs/include/mysql -I/tmp/B.8exqh5/BUILD/mysql-5.7.22/rapid/plugin/group_replication/libmysqlgcs/include/mysql/gcs -I/tmp/B.8exqh5/BUILD/mysql-5.7.22/rapid/plugin/group_replication/libmysqlgcs/src/bindings/xcom/xcom -I/tmp/B.8exqh5/BUILD/mysql-5.7.22/build/rapid/plugin/group_replication/include -I/tmp/B.8exqh5/BUILD/mysql-5.7.22/include -I/tmp/B.8exqh5/BUILD/mysql-5.7.22/sql -I/tmp/B.8exqh5/BUILD/mysql-5.7.22/sql/auth -I/tmp/B.8exqh5/BUILD/mysql-5.7.22/regex  -fPIC -Wall -Wextra -Wformat-security -Wvla -Wimplicit-fallthrough=2 -Woverloaded-virtual -Wno-unused-parameter -O3 -O2 -fwrapv -pipe -Wformat -Werror=format-security -gdwarf-4 -fno-debug-types-section -fvar-tracking-assignments -g2 -Wp,-D_FORTIFY_SOURCE=2 -fstack-protector-strong --param=ssp-buffer-size=4 -fPIC -mtune=generic -march=x86-64 -gdwarf-4 -fno-debug-types-section -fvar-tracking-assignments -g2  -DNDEBUG -fno-omit-frame-pointer -fno-strict-aliasing -g -fabi-version=2 -fno-omit-frame-pointer -fno-strict-aliasing -std=gnu++03 -DDBUG_OFF   -o CMakeFiles/gr_unit_test_resource.dir/src/member_version.cc.o -c /tmp/B.8exqh5/BUILD/mysql-5.7.22/rapid/plugin/group_replication/src/member_version.cc
make[2]: Leaving directory '/tmp/B.8exqh5/BUILD/mysql-5.7.22/build'
make[2]: Entering directory '/tmp/B.8exqh5/BUILD/mysql-5.7.22/build'
[  2%] Building C object strings/CMakeFiles/strings.dir/ctype-gb2312.c.o
cd /tmp/B.8exqh5/BUILD/mysql-5.7.22/build/strings && /usr/bin/x86_64-pld-linux-gnux32-gcc -DBOOST_GEOMETRY_SQRT_CHECK_FINITENESS -DDISABLE_MYSQL_THREAD_H -DHAVE_CONFIG_H -DHAVE_LIBEVENT2 -D_FILE_OFFSET_BITS=64 -D_GNU_SOURCE -I/tmp/B.8exqh5/BUILD/mysql-5.7.22/build/include -I/tmp/B.8exqh5/BUILD/mysql-5.7.22/extra/rapidjson/include -I/tmp/B.8exqh5/BUILD/mysql-5.7.22/build/libbinlogevents/include -I/tmp/B.8exqh5/BUILD/mysql-5.7.22/libbinlogevents/export -I/tmp/B.8exqh5/BUILD/mysql-5.7.22/include  -fPIC -Wall -Wextra -Wformat-security -Wvla -Wimplicit-fallthrough=2 -Wwrite-strings -Wdeclaration-after-statement -O3 -O2 -fwrapv -pipe -Wformat -Werror=format-security -gdwarf-4 -fno-debug-types-section -fvar-tracking-assignments -g2 -Wp,-D_FORTIFY_SOURCE=2 -fstack-protector-strong --param=ssp-buffer-size=4 -fPIC -mtune=generic -march=x86-64 -gdwarf-4 -fno-debug-types-section -fvar-tracking-assignments -g2  -DNDEBUG -fno-omit-frame-pointer -fno-strict-aliasing -g -fabi-version=2 -fno-omit-frame-pointer -fno-strict-aliasing -DDBUG_OFF   -o CMakeFiles/strings.dir/ctype-gb2312.c.o   -c /tmp/B.8exqh5/BUILD/mysql-5.7.22/strings/ctype-gb2312.c
make[2]: Leaving directory '/tmp/B.8exqh5/BUILD/mysql-5.7.22/build'
make[2]: Entering directory '/tmp/B.8exqh5/BUILD/mysql-5.7.22/build'
[  2%] Building CXX object rapid/plugin/group_replication/CMakeFiles/gr_unit_test_resource.dir/src/member_info.cc.o
cd /tmp/B.8exqh5/BUILD/mysql-5.7.22/build/rapid/plugin/group_replication && /usr/bin/x86_64-pld-linux-gnux32-g++  -DBOOST_GEOMETRY_SQRT_CHECK_FINITENESS -DDISABLE_ALL_PSI -DHAVE_CONFIG_H -DHAVE_LIBEVENT2 -DHAVE_OPENSSL -DHAVE_TIRPC -DXCOM_HAVE_OPENSSL -D_FILE_OFFSET_BITS=64 -D_GNU_SOURCE -I/tmp/B.8exqh5/BUILD/mysql-5.7.22/build/include -I/tmp/B.8exqh5/BUILD/mysql-5.7.22/extra/rapidjson/include -I/tmp/B.8exqh5/BUILD/mysql-5.7.22/build/libbinlogevents/include -I/tmp/B.8exqh5/BUILD/mysql-5.7.22/libbinlogevents/export -I/tmp/B.8exqh5/BUILD/mysql-5.7.22/build/rapid/plugin/group_replication/xdr_gen -isystem /usr/include/tirpc -I/tmp/B.8exqh5/BUILD/mysql-5.7.22/libbinlogevents/include -I/tmp/B.8exqh5/BUILD/mysql-5.7.22/rapid/plugin/group_replication/include -I/tmp/B.8exqh5/BUILD/mysql-5.7.22/rapid/plugin/group_replication/include/sql_service -I/tmp/B.8exqh5/BUILD/mysql-5.7.22/rapid/plugin/group_replication/libmysqlgcs/include -I/tmp/B.8exqh5/BUILD/mysql-5.7.22/rapid/plugin/group_replication/libmysqlgcs/include/mysql -I/tmp/B.8exqh5/BUILD/mysql-5.7.22/rapid/plugin/group_replication/libmysqlgcs/include/mysql/gcs -I/tmp/B.8exqh5/BUILD/mysql-5.7.22/rapid/plugin/group_replication/libmysqlgcs/src/bindings/xcom/xcom -I/tmp/B.8exqh5/BUILD/mysql-5.7.22/build/rapid/plugin/group_replication/include -I/tmp/B.8exqh5/BUILD/mysql-5.7.22/include -I/tmp/B.8exqh5/BUILD/mysql-5.7.22/sql -I/tmp/B.8exqh5/BUILD/mysql-5.7.22/sql/auth -I/tmp/B.8exqh5/BUILD/mysql-5.7.22/regex  -fPIC -Wall -Wextra -Wformat-security -Wvla -Wimplicit-fallthrough=2 -Woverloaded-virtual -Wno-unused-parameter -O3 -O2 -fwrapv -pipe -Wformat -Werror=format-security -gdwarf-4 -fno-debug-types-section -fvar-tracking-assignments -g2 -Wp,-D_FORTIFY_SOURCE=2 -fstack-protector-strong --param=ssp-buffer-size=4 -fPIC -mtune=generic -march=x86-64 -gdwarf-4 -fno-debug-types-section -fvar-tracking-assignments -g2  -DNDEBUG -fno-omit-frame-pointer -fno-strict-aliasing -g -fabi-version=2 -fno-omit-frame-pointer -fno-strict-aliasing -std=gnu++03 -DDBUG_OFF   -o CMakeFiles/gr_unit_test_resource.dir/src/member_info.cc.o -c /tmp/B.8exqh5/BUILD/mysql-5.7.22/rapid/plugin/group_replication/src/member_info.cc
make[2]: Leaving directory '/tmp/B.8exqh5/BUILD/mysql-5.7.22/build'
make[2]: Entering directory '/tmp/B.8exqh5/BUILD/mysql-5.7.22/build'
[  2%] Building C object regex/CMakeFiles/regex.dir/regfree.c.o
cd /tmp/B.8exqh5/BUILD/mysql-5.7.22/build/regex && /usr/bin/x86_64-pld-linux-gnux32-gcc -DBOOST_GEOMETRY_SQRT_CHECK_FINITENESS -DHAVE_CONFIG_H -DHAVE_LIBEVENT2 -D_FILE_OFFSET_BITS=64 -D_GNU_SOURCE -I/tmp/B.8exqh5/BUILD/mysql-5.7.22/build/include -I/tmp/B.8exqh5/BUILD/mysql-5.7.22/extra/rapidjson/include -I/tmp/B.8exqh5/BUILD/mysql-5.7.22/build/libbinlogevents/include -I/tmp/B.8exqh5/BUILD/mysql-5.7.22/libbinlogevents/export -I/tmp/B.8exqh5/BUILD/mysql-5.7.22/include  -fPIC -Wall -Wextra -Wformat-security -Wvla -Wimplicit-fallthrough=2 -Wwrite-strings -Wdeclaration-after-statement -O3 -O2 -fwrapv -pipe -Wformat -Werror=format-security -gdwarf-4 -fno-debug-types-section -fvar-tracking-assignments -g2 -Wp,-D_FORTIFY_SOURCE=2 -fstack-protector-strong --param=ssp-buffer-size=4 -fPIC -mtune=generic -march=x86-64 -gdwarf-4 -fno-debug-types-section -fvar-tracking-assignments -g2  -DNDEBUG -fno-omit-frame-pointer -fno-strict-aliasing -g -fabi-version=2 -fno-omit-frame-pointer -fno-strict-aliasing -DDBUG_OFF   -o CMakeFiles/regex.dir/regfree.c.o   -c /tmp/B.8exqh5/BUILD/mysql-5.7.22/regex/regfree.c
make[2]: Leaving directory '/tmp/B.8exqh5/BUILD/mysql-5.7.22/build'
make[2]: Entering directory '/tmp/B.8exqh5/BUILD/mysql-5.7.22/build'
[  2%] Building CXX object libbinlogstandalone/src/CMakeFiles/binlogstandalone_static.dir/__/__/libbinlogevents/src/statement_events.cpp.o
cd /tmp/B.8exqh5/BUILD/mysql-5.7.22/build/libbinlogstandalone/src && /usr/bin/x86_64-pld-linux-gnux32-g++  -DBOOST_GEOMETRY_SQRT_CHECK_FINITENESS -DHAVE_CONFIG_H -DHAVE_LIBEVENT2 -DSTANDALONE_BINLOG -D_FILE_OFFSET_BITS=64 -D_GNU_SOURCE -I/tmp/B.8exqh5/BUILD/mysql-5.7.22/build/include -I/tmp/B.8exqh5/BUILD/mysql-5.7.22/extra/rapidjson/include -I/tmp/B.8exqh5/BUILD/mysql-5.7.22/build/libbinlogevents/include -I/tmp/B.8exqh5/BUILD/mysql-5.7.22/libbinlogevents/export -I/tmp/B.8exqh5/BUILD/mysql-5.7.22/include -I/tmp/B.8exqh5/BUILD/mysql-5.7.22/libbinlogevents/include -I/tmp/B.8exqh5/BUILD/mysql-5.7.22/build/libbinlogstandalone/../libbinlogevents/include -I/tmp/B.8exqh5/BUILD/mysql-5.7.22/build/libbinlogstandalone/libbinlogevents/export  -fPIC -Wall -Wextra -Wformat-security -Wvla -Wimplicit-fallthrough=2 -Woverloaded-virtual -Wno-unused-parameter -O3 -O2 -fwrapv -pipe -Wformat -Werror=format-security -gdwarf-4 -fno-debug-types-section -fvar-tracking-assignments -g2 -Wp,-D_FORTIFY_SOURCE=2 -fstack-protector-strong --param=ssp-buffer-size=4 -fPIC -mtune=generic -march=x86-64 -gdwarf-4 -fno-debug-types-section -fvar-tracking-assignments -g2  -DNDEBUG -fno-omit-frame-pointer -fno-strict-aliasing -g -fabi-version=2 -fno-omit-frame-pointer -fno-strict-aliasing -std=gnu++03 -DDBUG_OFF   -o CMakeFiles/binlogstandalone_static.dir/__/__/libbinlogevents/src/statement_events.cpp.o -c /tmp/B.8exqh5/BUILD/mysql-5.7.22/libbinlogevents/src/statement_events.cpp
make[2]: Leaving directory '/tmp/B.8exqh5/BUILD/mysql-5.7.22/build'
make[2]: Entering directory '/tmp/B.8exqh5/BUILD/mysql-5.7.22/build'
[  1%] Building C object vio/CMakeFiles/vio.dir/viosocket.c.o
cd /tmp/B.8exqh5/BUILD/mysql-5.7.22/build/vio && /usr/bin/x86_64-pld-linux-gnux32-gcc -DBOOST_GEOMETRY_SQRT_CHECK_FINITENESS -DHAVE_CONFIG_H -DHAVE_LIBEVENT2 -DHAVE_OPENSSL -D_FILE_OFFSET_BITS=64 -D_GNU_SOURCE -I/tmp/B.8exqh5/BUILD/mysql-5.7.22/build/include -I/tmp/B.8exqh5/BUILD/mysql-5.7.22/extra/rapidjson/include -I/tmp/B.8exqh5/BUILD/mysql-5.7.22/build/libbinlogevents/include -I/tmp/B.8exqh5/BUILD/mysql-5.7.22/libbinlogevents/export -I/tmp/B.8exqh5/BUILD/mysql-5.7.22/include  -fPIC -Wall -Wextra -Wformat-security -Wvla -Wimplicit-fallthrough=2 -Wwrite-strings -Wdeclaration-after-statement -O3 -O2 -fwrapv -pipe -Wformat -Werror=format-security -gdwarf-4 -fno-debug-types-section -fvar-tracking-assignments -g2 -Wp,-D_FORTIFY_SOURCE=2 -fstack-protector-strong --param=ssp-buffer-size=4 -fPIC -mtune=generic -march=x86-64 -gdwarf-4 -fno-debug-types-section -fvar-tracking-assignments -g2  -DNDEBUG -fno-omit-frame-pointer -fno-strict-aliasing -g -fabi-version=2 -fno-omit-frame-pointer -fno-strict-aliasing -DDBUG_OFF   -o CMakeFiles/vio.dir/viosocket.c.o   -c /tmp/B.8exqh5/BUILD/mysql-5.7.22/vio/viosocket.c
make[2]: Leaving directory '/tmp/B.8exqh5/BUILD/mysql-5.7.22/build'
make[2]: Entering directory '/tmp/B.8exqh5/BUILD/mysql-5.7.22/build'
[  1%] Building C object vio/CMakeFiles/vio.dir/viossl.c.o
cd /tmp/B.8exqh5/BUILD/mysql-5.7.22/build/vio && /usr/bin/x86_64-pld-linux-gnux32-gcc -DBOOST_GEOMETRY_SQRT_CHECK_FINITENESS -DHAVE_CONFIG_H -DHAVE_LIBEVENT2 -DHAVE_OPENSSL -D_FILE_OFFSET_BITS=64 -D_GNU_SOURCE -I/tmp/B.8exqh5/BUILD/mysql-5.7.22/build/include -I/tmp/B.8exqh5/BUILD/mysql-5.7.22/extra/rapidjson/include -I/tmp/B.8exqh5/BUILD/mysql-5.7.22/build/libbinlogevents/include -I/tmp/B.8exqh5/BUILD/mysql-5.7.22/libbinlogevents/export -I/tmp/B.8exqh5/BUILD/mysql-5.7.22/include  -fPIC -Wall -Wextra -Wformat-security -Wvla -Wimplicit-fallthrough=2 -Wwrite-strings -Wdeclaration-after-statement -O3 -O2 -fwrapv -pipe -Wformat -Werror=format-security -gdwarf-4 -fno-debug-types-section -fvar-tracking-assignments -g2 -Wp,-D_FORTIFY_SOURCE=2 -fstack-protector-strong --param=ssp-buffer-size=4 -fPIC -mtune=generic -march=x86-64 -gdwarf-4 -fno-debug-types-section -fvar-tracking-assignments -g2  -DNDEBUG -fno-omit-frame-pointer -fno-strict-aliasing -g -fabi-version=2 -fno-omit-frame-pointer -fno-strict-aliasing -DDBUG_OFF   -o CMakeFiles/vio.dir/viossl.c.o   -c /tmp/B.8exqh5/BUILD/mysql-5.7.22/vio/viossl.c
/tmp/B.8exqh5/BUILD/mysql-5.7.22/vio/viossl.c: In function 'vio_ssl_delete':
/tmp/B.8exqh5/BUILD/mysql-5.7.22/vio/viossl.c:313:3: warning: 'ERR_remove_thread_state' is deprecated [-Wdeprecated-declarations]
   ERR_remove_thread_state(0);
   ^~~~~~~~~~~~~~~~~~~~~~~
In file included from /usr/include/openssl/e_os2.h:13,
                 from /usr/include/openssl/ssl.h:15,
                 from /tmp/B.8exqh5/BUILD/mysql-5.7.22/include/violite.h:192,
                 from /tmp/B.8exqh5/BUILD/mysql-5.7.22/vio/vio_priv.h:26,
                 from /tmp/B.8exqh5/BUILD/mysql-5.7.22/vio/viossl.c:23:
/usr/include/openssl/err.h:259:1: note: declared here
 DEPRECATEDIN_1_1_0(void ERR_remove_thread_state(void *))
 ^~~~~~~~~~~~~~~~~~
make[2]: Leaving directory '/tmp/B.8exqh5/BUILD/mysql-5.7.22/build'
make[2]: Entering directory '/tmp/B.8exqh5/BUILD/mysql-5.7.22/build'
[  2%] Building CXX object rapid/plugin/group_replication/CMakeFiles/gr_unit_test_resource.dir/src/compatibility_module.cc.o
cd /tmp/B.8exqh5/BUILD/mysql-5.7.22/build/rapid/plugin/group_replication && /usr/bin/x86_64-pld-linux-gnux32-g++  -DBOOST_GEOMETRY_SQRT_CHECK_FINITENESS -DDISABLE_ALL_PSI -DHAVE_CONFIG_H -DHAVE_LIBEVENT2 -DHAVE_OPENSSL -DHAVE_TIRPC -DXCOM_HAVE_OPENSSL -D_FILE_OFFSET_BITS=64 -D_GNU_SOURCE -I/tmp/B.8exqh5/BUILD/mysql-5.7.22/build/include -I/tmp/B.8exqh5/BUILD/mysql-5.7.22/extra/rapidjson/include -I/tmp/B.8exqh5/BUILD/mysql-5.7.22/build/libbinlogevents/include -I/tmp/B.8exqh5/BUILD/mysql-5.7.22/libbinlogevents/export -I/tmp/B.8exqh5/BUILD/mysql-5.7.22/build/rapid/plugin/group_replication/xdr_gen -isystem /usr/include/tirpc -I/tmp/B.8exqh5/BUILD/mysql-5.7.22/libbinlogevents/include -I/tmp/B.8exqh5/BUILD/mysql-5.7.22/rapid/plugin/group_replication/include -I/tmp/B.8exqh5/BUILD/mysql-5.7.22/rapid/plugin/group_replication/include/sql_service -I/tmp/B.8exqh5/BUILD/mysql-5.7.22/rapid/plugin/group_replication/libmysqlgcs/include -I/tmp/B.8exqh5/BUILD/mysql-5.7.22/rapid/plugin/group_replication/libmysqlgcs/include/mysql -I/tmp/B.8exqh5/BUILD/mysql-5.7.22/rapid/plugin/group_replication/libmysqlgcs/include/mysql/gcs -I/tmp/B.8exqh5/BUILD/mysql-5.7.22/rapid/plugin/group_replication/libmysqlgcs/src/bindings/xcom/xcom -I/tmp/B.8exqh5/BUILD/mysql-5.7.22/build/rapid/plugin/group_replication/include -I/tmp/B.8exqh5/BUILD/mysql-5.7.22/include -I/tmp/B.8exqh5/BUILD/mysql-5.7.22/sql -I/tmp/B.8exqh5/BUILD/mysql-5.7.22/sql/auth -I/tmp/B.8exqh5/BUILD/mysql-5.7.22/regex  -fPIC -Wall -Wextra -Wformat-security -Wvla -Wimplicit-fallthrough=2 -Woverloaded-virtual -Wno-unused-parameter -O3 -O2 -fwrapv -pipe -Wformat -Werror=format-security -gdwarf-4 -fno-debug-types-section -fvar-tracking-assignments -g2 -Wp,-D_FORTIFY_SOURCE=2 -fstack-protector-strong --param=ssp-buffer-size=4 -fPIC -mtune=generic -march=x86-64 -gdwarf-4 -fno-debug-types-section -fvar-tracking-assignments -g2  -DNDEBUG -fno-omit-frame-pointer -fno-strict-aliasing -g -fabi-version=2 -fno-omit-frame-pointer -fno-strict-aliasing -std=gnu++03 -DDBUG_OFF   -o CMakeFiles/gr_unit_test_resource.dir/src/compatibility_module.cc.o -c /tmp/B.8exqh5/BUILD/mysql-5.7.22/rapid/plugin/group_replication/src/compatibility_module.cc
make[2]: Leaving directory '/tmp/B.8exqh5/BUILD/mysql-5.7.22/build'
make[2]: Entering directory '/tmp/B.8exqh5/BUILD/mysql-5.7.22/build'
[  2%] Building C object regex/CMakeFiles/regex.dir/reginit.c.o
cd /tmp/B.8exqh5/BUILD/mysql-5.7.22/build/regex && /usr/bin/x86_64-pld-linux-gnux32-gcc -DBOOST_GEOMETRY_SQRT_CHECK_FINITENESS -DHAVE_CONFIG_H -DHAVE_LIBEVENT2 -D_FILE_OFFSET_BITS=64 -D_GNU_SOURCE -I/tmp/B.8exqh5/BUILD/mysql-5.7.22/build/include -I/tmp/B.8exqh5/BUILD/mysql-5.7.22/extra/rapidjson/include -I/tmp/B.8exqh5/BUILD/mysql-5.7.22/build/libbinlogevents/include -I/tmp/B.8exqh5/BUILD/mysql-5.7.22/libbinlogevents/export -I/tmp/B.8exqh5/BUILD/mysql-5.7.22/include  -fPIC -Wall -Wextra -Wformat-security -Wvla -Wimplicit-fallthrough=2 -Wwrite-strings -Wdeclaration-after-statement -O3 -O2 -fwrapv -pipe -Wformat -Werror=format-security -gdwarf-4 -fno-debug-types-section -fvar-tracking-assignments -g2 -Wp,-D_FORTIFY_SOURCE=2 -fstack-protector-strong --param=ssp-buffer-size=4 -fPIC -mtune=generic -march=x86-64 -gdwarf-4 -fno-debug-types-section -fvar-tracking-assignments -g2  -DNDEBUG -fno-omit-frame-pointer -fno-strict-aliasing -g -fabi-version=2 -fno-omit-frame-pointer -fno-strict-aliasing -DDBUG_OFF   -o CMakeFiles/regex.dir/reginit.c.o   -c /tmp/B.8exqh5/BUILD/mysql-5.7.22/regex/reginit.c
make[2]: Leaving directory '/tmp/B.8exqh5/BUILD/mysql-5.7.22/build'
make[2]: Entering directory '/tmp/B.8exqh5/BUILD/mysql-5.7.22/build'
[  2%] Building C object regex/CMakeFiles/regex.dir/regexec.c.o
cd /tmp/B.8exqh5/BUILD/mysql-5.7.22/build/regex && /usr/bin/x86_64-pld-linux-gnux32-gcc -DBOOST_GEOMETRY_SQRT_CHECK_FINITENESS -DHAVE_CONFIG_H -DHAVE_LIBEVENT2 -D_FILE_OFFSET_BITS=64 -D_GNU_SOURCE -I/tmp/B.8exqh5/BUILD/mysql-5.7.22/build/include -I/tmp/B.8exqh5/BUILD/mysql-5.7.22/extra/rapidjson/include -I/tmp/B.8exqh5/BUILD/mysql-5.7.22/build/libbinlogevents/include -I/tmp/B.8exqh5/BUILD/mysql-5.7.22/libbinlogevents/export -I/tmp/B.8exqh5/BUILD/mysql-5.7.22/include  -fPIC -Wall -Wextra -Wformat-security -Wvla -Wimplicit-fallthrough=2 -Wwrite-strings -Wdeclaration-after-statement -O3 -O2 -fwrapv -pipe -Wformat -Werror=format-security -gdwarf-4 -fno-debug-types-section -fvar-tracking-assignments -g2 -Wp,-D_FORTIFY_SOURCE=2 -fstack-protector-strong --param=ssp-buffer-size=4 -fPIC -mtune=generic -march=x86-64 -gdwarf-4 -fno-debug-types-section -fvar-tracking-assignments -g2  -DNDEBUG -fno-omit-frame-pointer -fno-strict-aliasing -g -fabi-version=2 -fno-omit-frame-pointer -fno-strict-aliasing -DDBUG_OFF   -o CMakeFiles/regex.dir/regexec.c.o   -c /tmp/B.8exqh5/BUILD/mysql-5.7.22/regex/regexec.c
make[2]: Leaving directory '/tmp/B.8exqh5/BUILD/mysql-5.7.22/build'
make[2]: Entering directory '/tmp/B.8exqh5/BUILD/mysql-5.7.22/build'
[  2%] Building CXX object libbinlogstandalone/src/CMakeFiles/binlogstandalone_shared.dir/__/__/libbinlogevents/src/rows_event.cpp.o
cd /tmp/B.8exqh5/BUILD/mysql-5.7.22/build/libbinlogstandalone/src && /usr/bin/x86_64-pld-linux-gnux32-g++  -DBOOST_GEOMETRY_SQRT_CHECK_FINITENESS -DHAVE_CONFIG_H -DHAVE_LIBEVENT2 -DSTANDALONE_BINLOG -D_FILE_OFFSET_BITS=64 -D_GNU_SOURCE -Dbinlogstandalone_shared_EXPORTS -I/tmp/B.8exqh5/BUILD/mysql-5.7.22/build/include -I/tmp/B.8exqh5/BUILD/mysql-5.7.22/extra/rapidjson/include -I/tmp/B.8exqh5/BUILD/mysql-5.7.22/build/libbinlogevents/include -I/tmp/B.8exqh5/BUILD/mysql-5.7.22/libbinlogevents/export -I/tmp/B.8exqh5/BUILD/mysql-5.7.22/include -I/tmp/B.8exqh5/BUILD/mysql-5.7.22/libbinlogevents/include -I/tmp/B.8exqh5/BUILD/mysql-5.7.22/build/libbinlogstandalone/../libbinlogevents/include -I/tmp/B.8exqh5/BUILD/mysql-5.7.22/build/libbinlogstandalone/libbinlogevents/export  -fPIC -Wall -Wextra -Wformat-security -Wvla -Wimplicit-fallthrough=2 -Woverloaded-virtual -Wno-unused-parameter -O3 -O2 -fwrapv -pipe -Wformat -Werror=format-security -gdwarf-4 -fno-debug-types-section -fvar-tracking-assignments -g2 -Wp,-D_FORTIFY_SOURCE=2 -fstack-protector-strong --param=ssp-buffer-size=4 -fPIC -mtune=generic -march=x86-64 -gdwarf-4 -fno-debug-types-section -fvar-tracking-assignments -g2  -DNDEBUG -fno-omit-frame-pointer -fno-strict-aliasing -g -fabi-version=2 -fno-omit-frame-pointer -fno-strict-aliasing -std=gnu++03 -DDBUG_OFF -fPIC   -o CMakeFiles/binlogstandalone_shared.dir/__/__/libbinlogevents/src/rows_event.cpp.o -c /tmp/B.8exqh5/BUILD/mysql-5.7.22/libbinlogevents/src/rows_event.cpp
/tmp/B.8exqh5/BUILD/mysql-5.7.22/libbinlogevents/src/rows_event.cpp: In constructor 'binary_log::Table_map_event::Table_map_event(const char*, unsigned int, const binary_log::Format_description_event*)':
/tmp/B.8exqh5/BUILD/mysql-5.7.22/libbinlogevents/src/rows_event.cpp:94:38: warning: 'void* memcpy(void*, const void*, size_t)' writing to an object of type 'class Table_id' with no trivial copy-assignment; use copy-assignment or copy-initialization instead [-Wclass-memaccess]
     memcpy(&m_table_id, post_start, 4);
                                      ^
In file included from /tmp/B.8exqh5/BUILD/mysql-5.7.22/libbinlogevents/include/rows_event.h:31,
                 from /tmp/B.8exqh5/BUILD/mysql-5.7.22/libbinlogevents/src/rows_event.cpp:16:
/tmp/B.8exqh5/BUILD/mysql-5.7.22/libbinlogevents/include/table_id.h:32:7: note: 'class Table_id' declared here
 class Table_id
       ^~~~~~~~
/tmp/B.8exqh5/BUILD/mysql-5.7.22/libbinlogevents/src/rows_event.cpp:101:38: warning: 'void* memcpy(void*, const void*, size_t)' writing to an object of type 'class Table_id' with no trivial copy-assignment; use copy-assignment or copy-initialization instead [-Wclass-memaccess]
     memcpy(&m_table_id, post_start, 6);
                                      ^
In file included from /tmp/B.8exqh5/BUILD/mysql-5.7.22/libbinlogevents/include/rows_event.h:31,
                 from /tmp/B.8exqh5/BUILD/mysql-5.7.22/libbinlogevents/src/rows_event.cpp:16:
/tmp/B.8exqh5/BUILD/mysql-5.7.22/libbinlogevents/include/table_id.h:32:7: note: 'class Table_id' declared here
 class Table_id
       ^~~~~~~~
/tmp/B.8exqh5/BUILD/mysql-5.7.22/libbinlogevents/src/rows_event.cpp: In constructor 'binary_log::Rows_event::Rows_event(const char*, unsigned int, const binary_log::Format_description_event*)':
/tmp/B.8exqh5/BUILD/mysql-5.7.22/libbinlogevents/src/rows_event.cpp:196:38: warning: 'void* memcpy(void*, const void*, size_t)' writing to an object of type 'class Table_id' with no trivial copy-assignment; use copy-assignment or copy-initialization instead [-Wclass-memaccess]
     memcpy(&m_table_id, post_start, 4);
                                      ^
In file included from /tmp/B.8exqh5/BUILD/mysql-5.7.22/libbinlogevents/include/rows_event.h:31,
                 from /tmp/B.8exqh5/BUILD/mysql-5.7.22/libbinlogevents/src/rows_event.cpp:16:
/tmp/B.8exqh5/BUILD/mysql-5.7.22/libbinlogevents/include/table_id.h:32:7: note: 'class Table_id' declared here
 class Table_id
       ^~~~~~~~
/tmp/B.8exqh5/BUILD/mysql-5.7.22/libbinlogevents/src/rows_event.cpp:202:38: warning: 'void* memcpy(void*, const void*, size_t)' writing to an object of type 'class Table_id' with no trivial copy-assignment; use copy-assignment or copy-initialization instead [-Wclass-memaccess]
     memcpy(&m_table_id, post_start, 6);
                                      ^
In file included from /tmp/B.8exqh5/BUILD/mysql-5.7.22/libbinlogevents/include/rows_event.h:31,
                 from /tmp/B.8exqh5/BUILD/mysql-5.7.22/libbinlogevents/src/rows_event.cpp:16:
/tmp/B.8exqh5/BUILD/mysql-5.7.22/libbinlogevents/include/table_id.h:32:7: note: 'class Table_id' declared here
 class Table_id
       ^~~~~~~~
make[2]: Leaving directory '/tmp/B.8exqh5/BUILD/mysql-5.7.22/build'
make[2]: Entering directory '/tmp/B.8exqh5/BUILD/mysql-5.7.22/build'
[  2%] Building C object vio/CMakeFiles/vio.dir/viosslfactories.c.o
cd /tmp/B.8exqh5/BUILD/mysql-5.7.22/build/vio && /usr/bin/x86_64-pld-linux-gnux32-gcc -DBOOST_GEOMETRY_SQRT_CHECK_FINITENESS -DHAVE_CONFIG_H -DHAVE_LIBEVENT2 -DHAVE_OPENSSL -D_FILE_OFFSET_BITS=64 -D_GNU_SOURCE -I/tmp/B.8exqh5/BUILD/mysql-5.7.22/build/include -I/tmp/B.8exqh5/BUILD/mysql-5.7.22/extra/rapidjson/include -I/tmp/B.8exqh5/BUILD/mysql-5.7.22/build/libbinlogevents/include -I/tmp/B.8exqh5/BUILD/mysql-5.7.22/libbinlogevents/export -I/tmp/B.8exqh5/BUILD/mysql-5.7.22/include  -fPIC -Wall -Wextra -Wformat-security -Wvla -Wimplicit-fallthrough=2 -Wwrite-strings -Wdeclaration-after-statement -O3 -O2 -fwrapv -pipe -Wformat -Werror=format-security -gdwarf-4 -fno-debug-types-section -fvar-tracking-assignments -g2 -Wp,-D_FORTIFY_SOURCE=2 -fstack-protector-strong --param=ssp-buffer-size=4 -fPIC -mtune=generic -march=x86-64 -gdwarf-4 -fno-debug-types-section -fvar-tracking-assignments -g2  -DNDEBUG -fno-omit-frame-pointer -fno-strict-aliasing -g -fabi-version=2 -fno-omit-frame-pointer -fno-strict-aliasing -DDBUG_OFF   -o CMakeFiles/vio.dir/viosslfactories.c.o   -c /tmp/B.8exqh5/BUILD/mysql-5.7.22/vio/viosslfactories.c
/tmp/B.8exqh5/BUILD/mysql-5.7.22/vio/viosslfactories.c: In function 'get_dh2048':
/tmp/B.8exqh5/BUILD/mysql-5.7.22/vio/viosslfactories.c:124:7: error: dereferencing pointer to incomplete type 'DH' {aka 'struct dh_st'}
     dh->p=BN_bin2bn(dh2048_p,sizeof(dh2048_p),NULL);
       ^~
/tmp/B.8exqh5/BUILD/mysql-5.7.22/vio/viosslfactories.c: In function 'set_lock_callback_functions':
/tmp/B.8exqh5/BUILD/mysql-5.7.22/vio/viosslfactories.c:374:49: warning: unused parameter 'init' [-Wunused-parameter]
 static void set_lock_callback_functions(my_bool init)
                                         ~~~~~~~~^~~~
/tmp/B.8exqh5/BUILD/mysql-5.7.22/vio/viosslfactories.c: In function 'vio_ssl_end':
/tmp/B.8exqh5/BUILD/mysql-5.7.22/vio/viosslfactories.c:398:5: warning: 'ERR_remove_state' is deprecated [-Wdeprecated-declarations]
     ERR_remove_state(0);
     ^~~~~~~~~~~~~~~~
In file included from /usr/include/openssl/e_os2.h:13,
                 from /usr/include/openssl/ssl.h:15,
                 from /tmp/B.8exqh5/BUILD/mysql-5.7.22/include/violite.h:192,
                 from /tmp/B.8exqh5/BUILD/mysql-5.7.22/vio/vio_priv.h:26,
                 from /tmp/B.8exqh5/BUILD/mysql-5.7.22/vio/viosslfactories.c:16:
/usr/include/openssl/err.h:260:1: note: declared here
 DEPRECATEDIN_1_0_0(void ERR_remove_state(unsigned long pid))
 ^~~~~~~~~~~~~~~~~~
At top level:
/tmp/B.8exqh5/BUILD/mysql-5.7.22/vio/viosslfactories.c:348:22: warning: 'openssl_id_function' defined but not used [-Wunused-function]
 static unsigned long openssl_id_function()
                      ^~~~~~~~~~~~~~~~~~~
/tmp/B.8exqh5/BUILD/mysql-5.7.22/vio/viosslfactories.c:338:13: warning: 'openssl_dynlock_destroy' defined but not used [-Wunused-function]
 static void openssl_dynlock_destroy(openssl_lock_t *lock,
             ^~~~~~~~~~~~~~~~~~~~~~~
/tmp/B.8exqh5/BUILD/mysql-5.7.22/vio/viosslfactories.c:318:24: warning: 'openssl_dynlock_create' defined but not used [-Wunused-function]
 static openssl_lock_t *openssl_dynlock_create(const char *file
                        ^~~~~~~~~~~~~~~~~~~~~~
/tmp/B.8exqh5/BUILD/mysql-5.7.22/vio/viosslfactories.c:301:13: warning: 'openssl_lock_function' defined but not used [-Wunused-function]
 static void openssl_lock_function(int mode, int n,
             ^~~~~~~~~~~~~~~~~~~~~
make[2]: *** [vio/CMakeFiles/vio.dir/build.make:105: vio/CMakeFiles/vio.dir/viosslfactories.c.o] Error 1
make[2]: Leaving directory '/tmp/B.8exqh5/BUILD/mysql-5.7.22/build'
make[1]: *** [CMakeFiles/Makefile2:489: vio/CMakeFiles/vio.dir/all] Error 2
make[1]: *** Waiting for unfinished jobs....
make[2]: Entering directory '/tmp/B.8exqh5/BUILD/mysql-5.7.22/build'
[  2%] Building C object strings/CMakeFiles/strings.dir/ctype-gbk.c.o
cd /tmp/B.8exqh5/BUILD/mysql-5.7.22/build/strings && /usr/bin/x86_64-pld-linux-gnux32-gcc -DBOOST_GEOMETRY_SQRT_CHECK_FINITENESS -DDISABLE_MYSQL_THREAD_H -DHAVE_CONFIG_H -DHAVE_LIBEVENT2 -D_FILE_OFFSET_BITS=64 -D_GNU_SOURCE -I/tmp/B.8exqh5/BUILD/mysql-5.7.22/build/include -I/tmp/B.8exqh5/BUILD/mysql-5.7.22/extra/rapidjson/include -I/tmp/B.8exqh5/BUILD/mysql-5.7.22/build/libbinlogevents/include -I/tmp/B.8exqh5/BUILD/mysql-5.7.22/libbinlogevents/export -I/tmp/B.8exqh5/BUILD/mysql-5.7.22/include  -fPIC -Wall -Wextra -Wformat-security -Wvla -Wimplicit-fallthrough=2 -Wwrite-strings -Wdeclaration-after-statement -O3 -O2 -fwrapv -pipe -Wformat -Werror=format-security -gdwarf-4 -fno-debug-types-section -fvar-tracking-assignments -g2 -Wp,-D_FORTIFY_SOURCE=2 -fstack-protector-strong --param=ssp-buffer-size=4 -fPIC -mtune=generic -march=x86-64 -gdwarf-4 -fno-debug-types-section -fvar-tracking-assignments -g2  -DNDEBUG -fno-omit-frame-pointer -fno-strict-aliasing -g -fabi-version=2 -fno-omit-frame-pointer -fno-strict-aliasing -DDBUG_OFF   -o CMakeFiles/strings.dir/ctype-gbk.c.o   -c /tmp/B.8exqh5/BUILD/mysql-5.7.22/strings/ctype-gbk.c
make[2]: Leaving directory '/tmp/B.8exqh5/BUILD/mysql-5.7.22/build'
make[2]: Entering directory '/tmp/B.8exqh5/BUILD/mysql-5.7.22/build'
[  2%] Linking C static library ../archive_output_directory/libregex.a
cd /tmp/B.8exqh5/BUILD/mysql-5.7.22/build/regex && /usr/bin/cmake -P CMakeFiles/regex.dir/cmake_clean_target.cmake
cd /tmp/B.8exqh5/BUILD/mysql-5.7.22/build/regex && /usr/bin/cmake -E cmake_link_script CMakeFiles/regex.dir/link.txt --verbose=1
/usr/bin/ar qc ../archive_output_directory/libregex.a  CMakeFiles/regex.dir/regcomp.c.o CMakeFiles/regex.dir/regerror.c.o CMakeFiles/regex.dir/regexec.c.o CMakeFiles/regex.dir/regfree.c.o CMakeFiles/regex.dir/reginit.c.o
/usr/bin/ranlib ../archive_output_directory/libregex.a
cd /tmp/B.8exqh5/BUILD/mysql-5.7.22/build/regex && /usr/bin/cmake -DTARGET_NAME=regex -DTARGET_LOC=/tmp/B.8exqh5/BUILD/mysql-5.7.22/build/archive_output_directory/libregex.a -DCFG_INTDIR=. -P /tmp/B.8exqh5/BUILD/mysql-5.7.22/build/archive_output_directory/lib_location_regex.cmake
make[2]: Leaving directory '/tmp/B.8exqh5/BUILD/mysql-5.7.22/build'
make[1]: Entering directory '/tmp/B.8exqh5/BUILD/mysql-5.7.22/build'
[  2%] Built target regex
make[1]: Leaving directory '/tmp/B.8exqh5/BUILD/mysql-5.7.22/build'
make[2]: Entering directory '/tmp/B.8exqh5/BUILD/mysql-5.7.22/build'
[  2%] Building CXX object libbinlogstandalone/src/CMakeFiles/binlogstandalone_static.dir/__/__/libbinlogevents/src/control_events.cpp.o
cd /tmp/B.8exqh5/BUILD/mysql-5.7.22/build/libbinlogstandalone/src && /usr/bin/x86_64-pld-linux-gnux32-g++  -DBOOST_GEOMETRY_SQRT_CHECK_FINITENESS -DHAVE_CONFIG_H -DHAVE_LIBEVENT2 -DSTANDALONE_BINLOG -D_FILE_OFFSET_BITS=64 -D_GNU_SOURCE -I/tmp/B.8exqh5/BUILD/mysql-5.7.22/build/include -I/tmp/B.8exqh5/BUILD/mysql-5.7.22/extra/rapidjson/include -I/tmp/B.8exqh5/BUILD/mysql-5.7.22/build/libbinlogevents/include -I/tmp/B.8exqh5/BUILD/mysql-5.7.22/libbinlogevents/export -I/tmp/B.8exqh5/BUILD/mysql-5.7.22/include -I/tmp/B.8exqh5/BUILD/mysql-5.7.22/libbinlogevents/include -I/tmp/B.8exqh5/BUILD/mysql-5.7.22/build/libbinlogstandalone/../libbinlogevents/include -I/tmp/B.8exqh5/BUILD/mysql-5.7.22/build/libbinlogstandalone/libbinlogevents/export  -fPIC -Wall -Wextra -Wformat-security -Wvla -Wimplicit-fallthrough=2 -Woverloaded-virtual -Wno-unused-parameter -O3 -O2 -fwrapv -pipe -Wformat -Werror=format-security -gdwarf-4 -fno-debug-types-section -fvar-tracking-assignments -g2 -Wp,-D_FORTIFY_SOURCE=2 -fstack-protector-strong --param=ssp-buffer-size=4 -fPIC -mtune=generic -march=x86-64 -gdwarf-4 -fno-debug-types-section -fvar-tracking-assignments -g2  -DNDEBUG -fno-omit-frame-pointer -fno-strict-aliasing -g -fabi-version=2 -fno-omit-frame-pointer -fno-strict-aliasing -std=gnu++03 -DDBUG_OFF   -o CMakeFiles/binlogstandalone_static.dir/__/__/libbinlogevents/src/control_events.cpp.o -c /tmp/B.8exqh5/BUILD/mysql-5.7.22/libbinlogevents/src/control_events.cpp
make[2]: Leaving directory '/tmp/B.8exqh5/BUILD/mysql-5.7.22/build'
make[2]: Entering directory '/tmp/B.8exqh5/BUILD/mysql-5.7.22/build'
[  2%] Building C object strings/CMakeFiles/strings.dir/ctype-latin1.c.o
cd /tmp/B.8exqh5/BUILD/mysql-5.7.22/build/strings && /usr/bin/x86_64-pld-linux-gnux32-gcc -DBOOST_GEOMETRY_SQRT_CHECK_FINITENESS -DDISABLE_MYSQL_THREAD_H -DHAVE_CONFIG_H -DHAVE_LIBEVENT2 -D_FILE_OFFSET_BITS=64 -D_GNU_SOURCE -I/tmp/B.8exqh5/BUILD/mysql-5.7.22/build/include -I/tmp/B.8exqh5/BUILD/mysql-5.7.22/extra/rapidjson/include -I/tmp/B.8exqh5/BUILD/mysql-5.7.22/build/libbinlogevents/include -I/tmp/B.8exqh5/BUILD/mysql-5.7.22/libbinlogevents/export -I/tmp/B.8exqh5/BUILD/mysql-5.7.22/include  -fPIC -Wall -Wextra -Wformat-security -Wvla -Wimplicit-fallthrough=2 -Wwrite-strings -Wdeclaration-after-statement -O3 -O2 -fwrapv -pipe -Wformat -Werror=format-security -gdwarf-4 -fno-debug-types-section -fvar-tracking-assignments -g2 -Wp,-D_FORTIFY_SOURCE=2 -fstack-protector-strong --param=ssp-buffer-size=4 -fPIC -mtune=generic -march=x86-64 -gdwarf-4 -fno-debug-types-section -fvar-tracking-assignments -g2  -DNDEBUG -fno-omit-frame-pointer -fno-strict-aliasing -g -fabi-version=2 -fno-omit-frame-pointer -fno-strict-aliasing -DDBUG_OFF   -o CMakeFiles/strings.dir/ctype-latin1.c.o   -c /tmp/B.8exqh5/BUILD/mysql-5.7.22/strings/ctype-latin1.c
make[2]: Leaving directory '/tmp/B.8exqh5/BUILD/mysql-5.7.22/build'
make[2]: Entering directory '/tmp/B.8exqh5/BUILD/mysql-5.7.22/build'
[  2%] Building CXX object libbinlogstandalone/src/CMakeFiles/binlogstandalone_static.dir/__/__/libbinlogevents/src/uuid.cpp.o
cd /tmp/B.8exqh5/BUILD/mysql-5.7.22/build/libbinlogstandalone/src && /usr/bin/x86_64-pld-linux-gnux32-g++  -DBOOST_GEOMETRY_SQRT_CHECK_FINITENESS -DHAVE_CONFIG_H -DHAVE_LIBEVENT2 -DSTANDALONE_BINLOG -D_FILE_OFFSET_BITS=64 -D_GNU_SOURCE -I/tmp/B.8exqh5/BUILD/mysql-5.7.22/build/include -I/tmp/B.8exqh5/BUILD/mysql-5.7.22/extra/rapidjson/include -I/tmp/B.8exqh5/BUILD/mysql-5.7.22/build/libbinlogevents/include -I/tmp/B.8exqh5/BUILD/mysql-5.7.22/libbinlogevents/export -I/tmp/B.8exqh5/BUILD/mysql-5.7.22/include -I/tmp/B.8exqh5/BUILD/mysql-5.7.22/libbinlogevents/include -I/tmp/B.8exqh5/BUILD/mysql-5.7.22/build/libbinlogstandalone/../libbinlogevents/include -I/tmp/B.8exqh5/BUILD/mysql-5.7.22/build/libbinlogstandalone/libbinlogevents/export  -fPIC -Wall -Wextra -Wformat-security -Wvla -Wimplicit-fallthrough=2 -Woverloaded-virtual -Wno-unused-parameter -O3 -O2 -fwrapv -pipe -Wformat -Werror=format-security -gdwarf-4 -fno-debug-types-section -fvar-tracking-assignments -g2 -Wp,-D_FORTIFY_SOURCE=2 -fstack-protector-strong --param=ssp-buffer-size=4 -fPIC -mtune=generic -march=x86-64 -gdwarf-4 -fno-debug-types-section -fvar-tracking-assignments -g2  -DNDEBUG -fno-omit-frame-pointer -fno-strict-aliasing -g -fabi-version=2 -fno-omit-frame-pointer -fno-strict-aliasing -std=gnu++03 -DDBUG_OFF   -o CMakeFiles/binlogstandalone_static.dir/__/__/libbinlogevents/src/uuid.cpp.o -c /tmp/B.8exqh5/BUILD/mysql-5.7.22/libbinlogevents/src/uuid.cpp
make[2]: Leaving directory '/tmp/B.8exqh5/BUILD/mysql-5.7.22/build'
make[2]: Entering directory '/tmp/B.8exqh5/BUILD/mysql-5.7.22/build'
[  2%] Linking CXX static library ../lib/libbinlogstandalone.a
cd /tmp/B.8exqh5/BUILD/mysql-5.7.22/build/libbinlogstandalone/src && /usr/bin/cmake -P CMakeFiles/binlogstandalone_static.dir/cmake_clean_target.cmake
cd /tmp/B.8exqh5/BUILD/mysql-5.7.22/build/libbinlogstandalone/src && /usr/bin/cmake -E cmake_link_script CMakeFiles/binlogstandalone_static.dir/link.txt --verbose=1
/usr/bin/ar qc ../lib/libbinlogstandalone.a  CMakeFiles/binlogstandalone_static.dir/__/__/libbinlogevents/src/load_data_events.cpp.o CMakeFiles/binlogstandalone_static.dir/__/__/libbinlogevents/src/rows_event.cpp.o CMakeFiles/binlogstandalone_static.dir/__/__/libbinlogevents/src/binlog_event.cpp.o CMakeFiles/binlogstandalone_static.dir/__/__/libbinlogevents/src/control_events.cpp.o CMakeFiles/binlogstandalone_static.dir/__/__/libbinlogevents/src/statement_events.cpp.o CMakeFiles/binlogstandalone_static.dir/__/__/libbinlogevents/src/uuid.cpp.o
/usr/bin/ranlib ../lib/libbinlogstandalone.a
make[2]: Leaving directory '/tmp/B.8exqh5/BUILD/mysql-5.7.22/build'
make[1]: Entering directory '/tmp/B.8exqh5/BUILD/mysql-5.7.22/build'
[  2%] Built target binlogstandalone_static
make[1]: Leaving directory '/tmp/B.8exqh5/BUILD/mysql-5.7.22/build'
make[2]: Entering directory '/tmp/B.8exqh5/BUILD/mysql-5.7.22/build'
[  2%] Building CXX object rapid/plugin/group_replication/CMakeFiles/gr_unit_test_resource.dir/libmysqlgcs/src/interface/xplatform/my_xp_cond.cc.o
cd /tmp/B.8exqh5/BUILD/mysql-5.7.22/build/rapid/plugin/group_replication && /usr/bin/x86_64-pld-linux-gnux32-g++  -DBOOST_GEOMETRY_SQRT_CHECK_FINITENESS -DDISABLE_ALL_PSI -DHAVE_CONFIG_H -DHAVE_LIBEVENT2 -DHAVE_OPENSSL -DHAVE_TIRPC -DXCOM_HAVE_OPENSSL -D_FILE_OFFSET_BITS=64 -D_GNU_SOURCE -I/tmp/B.8exqh5/BUILD/mysql-5.7.22/build/include -I/tmp/B.8exqh5/BUILD/mysql-5.7.22/extra/rapidjson/include -I/tmp/B.8exqh5/BUILD/mysql-5.7.22/build/libbinlogevents/include -I/tmp/B.8exqh5/BUILD/mysql-5.7.22/libbinlogevents/export -I/tmp/B.8exqh5/BUILD/mysql-5.7.22/build/rapid/plugin/group_replication/xdr_gen -isystem /usr/include/tirpc -I/tmp/B.8exqh5/BUILD/mysql-5.7.22/libbinlogevents/include -I/tmp/B.8exqh5/BUILD/mysql-5.7.22/rapid/plugin/group_replication/include -I/tmp/B.8exqh5/BUILD/mysql-5.7.22/rapid/plugin/group_replication/include/sql_service -I/tmp/B.8exqh5/BUILD/mysql-5.7.22/rapid/plugin/group_replication/libmysqlgcs/include -I/tmp/B.8exqh5/BUILD/mysql-5.7.22/rapid/plugin/group_replication/libmysqlgcs/include/mysql -I/tmp/B.8exqh5/BUILD/mysql-5.7.22/rapid/plugin/group_replication/libmysqlgcs/include/mysql/gcs -I/tmp/B.8exqh5/BUILD/mysql-5.7.22/rapid/plugin/group_replication/libmysqlgcs/src/bindings/xcom/xcom -I/tmp/B.8exqh5/BUILD/mysql-5.7.22/build/rapid/plugin/group_replication/include -I/tmp/B.8exqh5/BUILD/mysql-5.7.22/include -I/tmp/B.8exqh5/BUILD/mysql-5.7.22/sql -I/tmp/B.8exqh5/BUILD/mysql-5.7.22/sql/auth -I/tmp/B.8exqh5/BUILD/mysql-5.7.22/regex  -fPIC -Wall -Wextra -Wformat-security -Wvla -Wimplicit-fallthrough=2 -Woverloaded-virtual -Wno-unused-parameter -O3 -O2 -fwrapv -pipe -Wformat -Werror=format-security -gdwarf-4 -fno-debug-types-section -fvar-tracking-assignments -g2 -Wp,-D_FORTIFY_SOURCE=2 -fstack-protector-strong --param=ssp-buffer-size=4 -fPIC -mtune=generic -march=x86-64 -gdwarf-4 -fno-debug-types-section -fvar-tracking-assignments -g2  -DNDEBUG -fno-omit-frame-pointer -fno-strict-aliasing -g -fabi-version=2 -fno-omit-frame-pointer -fno-strict-aliasing -std=gnu++03 -DDBUG_OFF   -o CMakeFiles/gr_unit_test_resource.dir/libmysqlgcs/src/interface/xplatform/my_xp_cond.cc.o -c /tmp/B.8exqh5/BUILD/mysql-5.7.22/rapid/plugin/group_replication/libmysqlgcs/src/interface/xplatform/my_xp_cond.cc
make[2]: Leaving directory '/tmp/B.8exqh5/BUILD/mysql-5.7.22/build'
make[2]: Entering directory '/tmp/B.8exqh5/BUILD/mysql-5.7.22/build'
[  2%] Building CXX object rapid/plugin/group_replication/CMakeFiles/gr_unit_test_resource.dir/libmysqlgcs/src/interface/xplatform/my_xp_mutex.cc.o
cd /tmp/B.8exqh5/BUILD/mysql-5.7.22/build/rapid/plugin/group_replication && /usr/bin/x86_64-pld-linux-gnux32-g++  -DBOOST_GEOMETRY_SQRT_CHECK_FINITENESS -DDISABLE_ALL_PSI -DHAVE_CONFIG_H -DHAVE_LIBEVENT2 -DHAVE_OPENSSL -DHAVE_TIRPC -DXCOM_HAVE_OPENSSL -D_FILE_OFFSET_BITS=64 -D_GNU_SOURCE -I/tmp/B.8exqh5/BUILD/mysql-5.7.22/build/include -I/tmp/B.8exqh5/BUILD/mysql-5.7.22/extra/rapidjson/include -I/tmp/B.8exqh5/BUILD/mysql-5.7.22/build/libbinlogevents/include -I/tmp/B.8exqh5/BUILD/mysql-5.7.22/libbinlogevents/export -I/tmp/B.8exqh5/BUILD/mysql-5.7.22/build/rapid/plugin/group_replication/xdr_gen -isystem /usr/include/tirpc -I/tmp/B.8exqh5/BUILD/mysql-5.7.22/libbinlogevents/include -I/tmp/B.8exqh5/BUILD/mysql-5.7.22/rapid/plugin/group_replication/include -I/tmp/B.8exqh5/BUILD/mysql-5.7.22/rapid/plugin/group_replication/include/sql_service -I/tmp/B.8exqh5/BUILD/mysql-5.7.22/rapid/plugin/group_replication/libmysqlgcs/include -I/tmp/B.8exqh5/BUILD/mysql-5.7.22/rapid/plugin/group_replication/libmysqlgcs/include/mysql -I/tmp/B.8exqh5/BUILD/mysql-5.7.22/rapid/plugin/group_replication/libmysqlgcs/include/mysql/gcs -I/tmp/B.8exqh5/BUILD/mysql-5.7.22/rapid/plugin/group_replication/libmysqlgcs/src/bindings/xcom/xcom -I/tmp/B.8exqh5/BUILD/mysql-5.7.22/build/rapid/plugin/group_replication/include -I/tmp/B.8exqh5/BUILD/mysql-5.7.22/include -I/tmp/B.8exqh5/BUILD/mysql-5.7.22/sql -I/tmp/B.8exqh5/BUILD/mysql-5.7.22/sql/auth -I/tmp/B.8exqh5/BUILD/mysql-5.7.22/regex  -fPIC -Wall -Wextra -Wformat-security -Wvla -Wimplicit-fallthrough=2 -Woverloaded-virtual -Wno-unused-parameter -O3 -O2 -fwrapv -pipe -Wformat -Werror=format-security -gdwarf-4 -fno-debug-types-section -fvar-tracking-assignments -g2 -Wp,-D_FORTIFY_SOURCE=2 -fstack-protector-strong --param=ssp-buffer-size=4 -fPIC -mtune=generic -march=x86-64 -gdwarf-4 -fno-debug-types-section -fvar-tracking-assignments -g2  -DNDEBUG -fno-omit-frame-pointer -fno-strict-aliasing -g -fabi-version=2 -fno-omit-frame-pointer -fno-strict-aliasing -std=gnu++03 -DDBUG_OFF   -o CMakeFiles/gr_unit_test_resource.dir/libmysqlgcs/src/interface/xplatform/my_xp_mutex.cc.o -c /tmp/B.8exqh5/BUILD/mysql-5.7.22/rapid/plugin/group_replication/libmysqlgcs/src/interface/xplatform/my_xp_mutex.cc
make[2]: Leaving directory '/tmp/B.8exqh5/BUILD/mysql-5.7.22/build'
make[2]: Entering directory '/tmp/B.8exqh5/BUILD/mysql-5.7.22/build'
[  2%] Building CXX object rapid/plugin/group_replication/CMakeFiles/gr_unit_test_resource.dir/libmysqlgcs/src/interface/gcs_logging.cc.o
cd /tmp/B.8exqh5/BUILD/mysql-5.7.22/build/rapid/plugin/group_replication && /usr/bin/x86_64-pld-linux-gnux32-g++  -DBOOST_GEOMETRY_SQRT_CHECK_FINITENESS -DDISABLE_ALL_PSI -DHAVE_CONFIG_H -DHAVE_LIBEVENT2 -DHAVE_OPENSSL -DHAVE_TIRPC -DXCOM_HAVE_OPENSSL -D_FILE_OFFSET_BITS=64 -D_GNU_SOURCE -I/tmp/B.8exqh5/BUILD/mysql-5.7.22/build/include -I/tmp/B.8exqh5/BUILD/mysql-5.7.22/extra/rapidjson/include -I/tmp/B.8exqh5/BUILD/mysql-5.7.22/build/libbinlogevents/include -I/tmp/B.8exqh5/BUILD/mysql-5.7.22/libbinlogevents/export -I/tmp/B.8exqh5/BUILD/mysql-5.7.22/build/rapid/plugin/group_replication/xdr_gen -isystem /usr/include/tirpc -I/tmp/B.8exqh5/BUILD/mysql-5.7.22/libbinlogevents/include -I/tmp/B.8exqh5/BUILD/mysql-5.7.22/rapid/plugin/group_replication/include -I/tmp/B.8exqh5/BUILD/mysql-5.7.22/rapid/plugin/group_replication/include/sql_service -I/tmp/B.8exqh5/BUILD/mysql-5.7.22/rapid/plugin/group_replication/libmysqlgcs/include -I/tmp/B.8exqh5/BUILD/mysql-5.7.22/rapid/plugin/group_replication/libmysqlgcs/include/mysql -I/tmp/B.8exqh5/BUILD/mysql-5.7.22/rapid/plugin/group_replication/libmysqlgcs/include/mysql/gcs -I/tmp/B.8exqh5/BUILD/mysql-5.7.22/rapid/plugin/group_replication/libmysqlgcs/src/bindings/xcom/xcom -I/tmp/B.8exqh5/BUILD/mysql-5.7.22/build/rapid/plugin/group_replication/include -I/tmp/B.8exqh5/BUILD/mysql-5.7.22/include -I/tmp/B.8exqh5/BUILD/mysql-5.7.22/sql -I/tmp/B.8exqh5/BUILD/mysql-5.7.22/sql/auth -I/tmp/B.8exqh5/BUILD/mysql-5.7.22/regex  -fPIC -Wall -Wextra -Wformat-security -Wvla -Wimplicit-fallthrough=2 -Woverloaded-virtual -Wno-unused-parameter -O3 -O2 -fwrapv -pipe -Wformat -Werror=format-security -gdwarf-4 -fno-debug-types-section -fvar-tracking-assignments -g2 -Wp,-D_FORTIFY_SOURCE=2 -fstack-protector-strong --param=ssp-buffer-size=4 -fPIC -mtune=generic -march=x86-64 -gdwarf-4 -fno-debug-types-section -fvar-tracking-assignments -g2  -DNDEBUG -fno-omit-frame-pointer -fno-strict-aliasing -g -fabi-version=2 -fno-omit-frame-pointer -fno-strict-aliasing -std=gnu++03 -DDBUG_OFF   -o CMakeFiles/gr_unit_test_resource.dir/libmysqlgcs/src/interface/gcs_logging.cc.o -c /tmp/B.8exqh5/BUILD/mysql-5.7.22/rapid/plugin/group_replication/libmysqlgcs/src/interface/gcs_logging.cc
make[2]: Leaving directory '/tmp/B.8exqh5/BUILD/mysql-5.7.22/build'
make[2]: Entering directory '/tmp/B.8exqh5/BUILD/mysql-5.7.22/build'
[  2%] Building C object strings/CMakeFiles/strings.dir/ctype-mb.c.o
cd /tmp/B.8exqh5/BUILD/mysql-5.7.22/build/strings && /usr/bin/x86_64-pld-linux-gnux32-gcc -DBOOST_GEOMETRY_SQRT_CHECK_FINITENESS -DDISABLE_MYSQL_THREAD_H -DHAVE_CONFIG_H -DHAVE_LIBEVENT2 -D_FILE_OFFSET_BITS=64 -D_GNU_SOURCE -I/tmp/B.8exqh5/BUILD/mysql-5.7.22/build/include -I/tmp/B.8exqh5/BUILD/mysql-5.7.22/extra/rapidjson/include -I/tmp/B.8exqh5/BUILD/mysql-5.7.22/build/libbinlogevents/include -I/tmp/B.8exqh5/BUILD/mysql-5.7.22/libbinlogevents/export -I/tmp/B.8exqh5/BUILD/mysql-5.7.22/include  -fPIC -Wall -Wextra -Wformat-security -Wvla -Wimplicit-fallthrough=2 -Wwrite-strings -Wdeclaration-after-statement -O3 -O2 -fwrapv -pipe -Wformat -Werror=format-security -gdwarf-4 -fno-debug-types-section -fvar-tracking-assignments -g2 -Wp,-D_FORTIFY_SOURCE=2 -fstack-protector-strong --param=ssp-buffer-size=4 -fPIC -mtune=generic -march=x86-64 -gdwarf-4 -fno-debug-types-section -fvar-tracking-assignments -g2  -DNDEBUG -fno-omit-frame-pointer -fno-strict-aliasing -g -fabi-version=2 -fno-omit-frame-pointer -fno-strict-aliasing -DDBUG_OFF   -o CMakeFiles/strings.dir/ctype-mb.c.o   -c /tmp/B.8exqh5/BUILD/mysql-5.7.22/strings/ctype-mb.c
make[2]: Leaving directory '/tmp/B.8exqh5/BUILD/mysql-5.7.22/build'
make[2]: Entering directory '/tmp/B.8exqh5/BUILD/mysql-5.7.22/build'
[  2%] Building C object strings/CMakeFiles/strings.dir/ctype-sjis.c.o
cd /tmp/B.8exqh5/BUILD/mysql-5.7.22/build/strings && /usr/bin/x86_64-pld-linux-gnux32-gcc -DBOOST_GEOMETRY_SQRT_CHECK_FINITENESS -DDISABLE_MYSQL_THREAD_H -DHAVE_CONFIG_H -DHAVE_LIBEVENT2 -D_FILE_OFFSET_BITS=64 -D_GNU_SOURCE -I/tmp/B.8exqh5/BUILD/mysql-5.7.22/build/include -I/tmp/B.8exqh5/BUILD/mysql-5.7.22/extra/rapidjson/include -I/tmp/B.8exqh5/BUILD/mysql-5.7.22/build/libbinlogevents/include -I/tmp/B.8exqh5/BUILD/mysql-5.7.22/libbinlogevents/export -I/tmp/B.8exqh5/BUILD/mysql-5.7.22/include  -fPIC -Wall -Wextra -Wformat-security -Wvla -Wimplicit-fallthrough=2 -Wwrite-strings -Wdeclaration-after-statement -O3 -O2 -fwrapv -pipe -Wformat -Werror=format-security -gdwarf-4 -fno-debug-types-section -fvar-tracking-assignments -g2 -Wp,-D_FORTIFY_SOURCE=2 -fstack-protector-strong --param=ssp-buffer-size=4 -fPIC -mtune=generic -march=x86-64 -gdwarf-4 -fno-debug-types-section -fvar-tracking-assignments -g2  -DNDEBUG -fno-omit-frame-pointer -fno-strict-aliasing -g -fabi-version=2 -fno-omit-frame-pointer -fno-strict-aliasing -DDBUG_OFF   -o CMakeFiles/strings.dir/ctype-sjis.c.o   -c /tmp/B.8exqh5/BUILD/mysql-5.7.22/strings/ctype-sjis.c
make[2]: Leaving directory '/tmp/B.8exqh5/BUILD/mysql-5.7.22/build'
make[2]: Entering directory '/tmp/B.8exqh5/BUILD/mysql-5.7.22/build'
[  2%] Building CXX object libbinlogstandalone/src/CMakeFiles/binlogstandalone_shared.dir/__/__/libbinlogevents/src/binlog_event.cpp.o
cd /tmp/B.8exqh5/BUILD/mysql-5.7.22/build/libbinlogstandalone/src && /usr/bin/x86_64-pld-linux-gnux32-g++  -DBOOST_GEOMETRY_SQRT_CHECK_FINITENESS -DHAVE_CONFIG_H -DHAVE_LIBEVENT2 -DSTANDALONE_BINLOG -D_FILE_OFFSET_BITS=64 -D_GNU_SOURCE -Dbinlogstandalone_shared_EXPORTS -I/tmp/B.8exqh5/BUILD/mysql-5.7.22/build/include -I/tmp/B.8exqh5/BUILD/mysql-5.7.22/extra/rapidjson/include -I/tmp/B.8exqh5/BUILD/mysql-5.7.22/build/libbinlogevents/include -I/tmp/B.8exqh5/BUILD/mysql-5.7.22/libbinlogevents/export -I/tmp/B.8exqh5/BUILD/mysql-5.7.22/include -I/tmp/B.8exqh5/BUILD/mysql-5.7.22/libbinlogevents/include -I/tmp/B.8exqh5/BUILD/mysql-5.7.22/build/libbinlogstandalone/../libbinlogevents/include -I/tmp/B.8exqh5/BUILD/mysql-5.7.22/build/libbinlogstandalone/libbinlogevents/export  -fPIC -Wall -Wextra -Wformat-security -Wvla -Wimplicit-fallthrough=2 -Woverloaded-virtual -Wno-unused-parameter -O3 -O2 -fwrapv -pipe -Wformat -Werror=format-security -gdwarf-4 -fno-debug-types-section -fvar-tracking-assignments -g2 -Wp,-D_FORTIFY_SOURCE=2 -fstack-protector-strong --param=ssp-buffer-size=4 -fPIC -mtune=generic -march=x86-64 -gdwarf-4 -fno-debug-types-section -fvar-tracking-assignments -g2  -DNDEBUG -fno-omit-frame-pointer -fno-strict-aliasing -g -fabi-version=2 -fno-omit-frame-pointer -fno-strict-aliasing -std=gnu++03 -DDBUG_OFF -fPIC   -o CMakeFiles/binlogstandalone_shared.dir/__/__/libbinlogevents/src/binlog_event.cpp.o -c /tmp/B.8exqh5/BUILD/mysql-5.7.22/libbinlogevents/src/binlog_event.cpp
make[2]: Leaving directory '/tmp/B.8exqh5/BUILD/mysql-5.7.22/build'
make[2]: Entering directory '/tmp/B.8exqh5/BUILD/mysql-5.7.22/build'
[  3%] Building C object strings/CMakeFiles/strings.dir/ctype-tis620.c.o
cd /tmp/B.8exqh5/BUILD/mysql-5.7.22/build/strings && /usr/bin/x86_64-pld-linux-gnux32-gcc -DBOOST_GEOMETRY_SQRT_CHECK_FINITENESS -DDISABLE_MYSQL_THREAD_H -DHAVE_CONFIG_H -DHAVE_LIBEVENT2 -D_FILE_OFFSET_BITS=64 -D_GNU_SOURCE -I/tmp/B.8exqh5/BUILD/mysql-5.7.22/build/include -I/tmp/B.8exqh5/BUILD/mysql-5.7.22/extra/rapidjson/include -I/tmp/B.8exqh5/BUILD/mysql-5.7.22/build/libbinlogevents/include -I/tmp/B.8exqh5/BUILD/mysql-5.7.22/libbinlogevents/export -I/tmp/B.8exqh5/BUILD/mysql-5.7.22/include  -fPIC -Wall -Wextra -Wformat-security -Wvla -Wimplicit-fallthrough=2 -Wwrite-strings -Wdeclaration-after-statement -O3 -O2 -fwrapv -pipe -Wformat -Werror=format-security -gdwarf-4 -fno-debug-types-section -fvar-tracking-assignments -g2 -Wp,-D_FORTIFY_SOURCE=2 -fstack-protector-strong --param=ssp-buffer-size=4 -fPIC -mtune=generic -march=x86-64 -gdwarf-4 -fno-debug-types-section -fvar-tracking-assignments -g2  -DNDEBUG -fno-omit-frame-pointer -fno-strict-aliasing -g -fabi-version=2 -fno-omit-frame-pointer -fno-strict-aliasing -DDBUG_OFF   -o CMakeFiles/strings.dir/ctype-tis620.c.o   -c /tmp/B.8exqh5/BUILD/mysql-5.7.22/strings/ctype-tis620.c
make[2]: Leaving directory '/tmp/B.8exqh5/BUILD/mysql-5.7.22/build'
make[2]: Entering directory '/tmp/B.8exqh5/BUILD/mysql-5.7.22/build'
[  2%] Building CXX object rapid/plugin/group_replication/CMakeFiles/gr_unit_test_resource.dir/libmysqlgcs/src/interface/xplatform/my_xp_thread.cc.o
cd /tmp/B.8exqh5/BUILD/mysql-5.7.22/build/rapid/plugin/group_replication && /usr/bin/x86_64-pld-linux-gnux32-g++  -DBOOST_GEOMETRY_SQRT_CHECK_FINITENESS -DDISABLE_ALL_PSI -DHAVE_CONFIG_H -DHAVE_LIBEVENT2 -DHAVE_OPENSSL -DHAVE_TIRPC -DXCOM_HAVE_OPENSSL -D_FILE_OFFSET_BITS=64 -D_GNU_SOURCE -I/tmp/B.8exqh5/BUILD/mysql-5.7.22/build/include -I/tmp/B.8exqh5/BUILD/mysql-5.7.22/extra/rapidjson/include -I/tmp/B.8exqh5/BUILD/mysql-5.7.22/build/libbinlogevents/include -I/tmp/B.8exqh5/BUILD/mysql-5.7.22/libbinlogevents/export -I/tmp/B.8exqh5/BUILD/mysql-5.7.22/build/rapid/plugin/group_replication/xdr_gen -isystem /usr/include/tirpc -I/tmp/B.8exqh5/BUILD/mysql-5.7.22/libbinlogevents/include -I/tmp/B.8exqh5/BUILD/mysql-5.7.22/rapid/plugin/group_replication/include -I/tmp/B.8exqh5/BUILD/mysql-5.7.22/rapid/plugin/group_replication/include/sql_service -I/tmp/B.8exqh5/BUILD/mysql-5.7.22/rapid/plugin/group_replication/libmysqlgcs/include -I/tmp/B.8exqh5/BUILD/mysql-5.7.22/rapid/plugin/group_replication/libmysqlgcs/include/mysql -I/tmp/B.8exqh5/BUILD/mysql-5.7.22/rapid/plugin/group_replication/libmysqlgcs/include/mysql/gcs -I/tmp/B.8exqh5/BUILD/mysql-5.7.22/rapid/plugin/group_replication/libmysqlgcs/src/bindings/xcom/xcom -I/tmp/B.8exqh5/BUILD/mysql-5.7.22/build/rapid/plugin/group_replication/include -I/tmp/B.8exqh5/BUILD/mysql-5.7.22/include -I/tmp/B.8exqh5/BUILD/mysql-5.7.22/sql -I/tmp/B.8exqh5/BUILD/mysql-5.7.22/sql/auth -I/tmp/B.8exqh5/BUILD/mysql-5.7.22/regex  -fPIC -Wall -Wextra -Wformat-security -Wvla -Wimplicit-fallthrough=2 -Woverloaded-virtual -Wno-unused-parameter -O3 -O2 -fwrapv -pipe -Wformat -Werror=format-security -gdwarf-4 -fno-debug-types-section -fvar-tracking-assignments -g2 -Wp,-D_FORTIFY_SOURCE=2 -fstack-protector-strong --param=ssp-buffer-size=4 -fPIC -mtune=generic -march=x86-64 -gdwarf-4 -fno-debug-types-section -fvar-tracking-assignments -g2  -DNDEBUG -fno-omit-frame-pointer -fno-strict-aliasing -g -fabi-version=2 -fno-omit-frame-pointer -fno-strict-aliasing -std=gnu++03 -DDBUG_OFF   -o CMakeFiles/gr_unit_test_resource.dir/libmysqlgcs/src/interface/xplatform/my_xp_thread.cc.o -c /tmp/B.8exqh5/BUILD/mysql-5.7.22/rapid/plugin/group_replication/libmysqlgcs/src/interface/xplatform/my_xp_thread.cc
make[2]: Leaving directory '/tmp/B.8exqh5/BUILD/mysql-5.7.22/build'
make[2]: Entering directory '/tmp/B.8exqh5/BUILD/mysql-5.7.22/build'
[  2%] Building CXX object rapid/plugin/group_replication/CMakeFiles/gr_unit_test_resource.dir/libmysqlgcs/src/interface/xplatform/my_xp_util.cc.o
cd /tmp/B.8exqh5/BUILD/mysql-5.7.22/build/rapid/plugin/group_replication && /usr/bin/x86_64-pld-linux-gnux32-g++  -DBOOST_GEOMETRY_SQRT_CHECK_FINITENESS -DDISABLE_ALL_PSI -DHAVE_CONFIG_H -DHAVE_LIBEVENT2 -DHAVE_OPENSSL -DHAVE_TIRPC -DXCOM_HAVE_OPENSSL -D_FILE_OFFSET_BITS=64 -D_GNU_SOURCE -I/tmp/B.8exqh5/BUILD/mysql-5.7.22/build/include -I/tmp/B.8exqh5/BUILD/mysql-5.7.22/extra/rapidjson/include -I/tmp/B.8exqh5/BUILD/mysql-5.7.22/build/libbinlogevents/include -I/tmp/B.8exqh5/BUILD/mysql-5.7.22/libbinlogevents/export -I/tmp/B.8exqh5/BUILD/mysql-5.7.22/build/rapid/plugin/group_replication/xdr_gen -isystem /usr/include/tirpc -I/tmp/B.8exqh5/BUILD/mysql-5.7.22/libbinlogevents/include -I/tmp/B.8exqh5/BUILD/mysql-5.7.22/rapid/plugin/group_replication/include -I/tmp/B.8exqh5/BUILD/mysql-5.7.22/rapid/plugin/group_replication/include/sql_service -I/tmp/B.8exqh5/BUILD/mysql-5.7.22/rapid/plugin/group_replication/libmysqlgcs/include -I/tmp/B.8exqh5/BUILD/mysql-5.7.22/rapid/plugin/group_replication/libmysqlgcs/include/mysql -I/tmp/B.8exqh5/BUILD/mysql-5.7.22/rapid/plugin/group_replication/libmysqlgcs/include/mysql/gcs -I/tmp/B.8exqh5/BUILD/mysql-5.7.22/rapid/plugin/group_replication/libmysqlgcs/src/bindings/xcom/xcom -I/tmp/B.8exqh5/BUILD/mysql-5.7.22/build/rapid/plugin/group_replication/include -I/tmp/B.8exqh5/BUILD/mysql-5.7.22/include -I/tmp/B.8exqh5/BUILD/mysql-5.7.22/sql -I/tmp/B.8exqh5/BUILD/mysql-5.7.22/sql/auth -I/tmp/B.8exqh5/BUILD/mysql-5.7.22/regex  -fPIC -Wall -Wextra -Wformat-security -Wvla -Wimplicit-fallthrough=2 -Woverloaded-virtual -Wno-unused-parameter -O3 -O2 -fwrapv -pipe -Wformat -Werror=format-security -gdwarf-4 -fno-debug-types-section -fvar-tracking-assignments -g2 -Wp,-D_FORTIFY_SOURCE=2 -fstack-protector-strong --param=ssp-buffer-size=4 -fPIC -mtune=generic -march=x86-64 -gdwarf-4 -fno-debug-types-section -fvar-tracking-assignments -g2  -DNDEBUG -fno-omit-frame-pointer -fno-strict-aliasing -g -fabi-version=2 -fno-omit-frame-pointer -fno-strict-aliasing -std=gnu++03 -DDBUG_OFF   -o CMakeFiles/gr_unit_test_resource.dir/libmysqlgcs/src/interface/xplatform/my_xp_util.cc.o -c /tmp/B.8exqh5/BUILD/mysql-5.7.22/rapid/plugin/group_replication/libmysqlgcs/src/interface/xplatform/my_xp_util.cc
make[2]: Leaving directory '/tmp/B.8exqh5/BUILD/mysql-5.7.22/build'
make[2]: Entering directory '/tmp/B.8exqh5/BUILD/mysql-5.7.22/build'
[  2%] Building C object strings/CMakeFiles/strings.dir/ctype-simple.c.o
cd /tmp/B.8exqh5/BUILD/mysql-5.7.22/build/strings && /usr/bin/x86_64-pld-linux-gnux32-gcc -DBOOST_GEOMETRY_SQRT_CHECK_FINITENESS -DDISABLE_MYSQL_THREAD_H -DHAVE_CONFIG_H -DHAVE_LIBEVENT2 -D_FILE_OFFSET_BITS=64 -D_GNU_SOURCE -I/tmp/B.8exqh5/BUILD/mysql-5.7.22/build/include -I/tmp/B.8exqh5/BUILD/mysql-5.7.22/extra/rapidjson/include -I/tmp/B.8exqh5/BUILD/mysql-5.7.22/build/libbinlogevents/include -I/tmp/B.8exqh5/BUILD/mysql-5.7.22/libbinlogevents/export -I/tmp/B.8exqh5/BUILD/mysql-5.7.22/include  -fPIC -Wall -Wextra -Wformat-security -Wvla -Wimplicit-fallthrough=2 -Wwrite-strings -Wdeclaration-after-statement -O3 -O2 -fwrapv -pipe -Wformat -Werror=format-security -gdwarf-4 -fno-debug-types-section -fvar-tracking-assignments -g2 -Wp,-D_FORTIFY_SOURCE=2 -fstack-protector-strong --param=ssp-buffer-size=4 -fPIC -mtune=generic -march=x86-64 -gdwarf-4 -fno-debug-types-section -fvar-tracking-assignments -g2  -DNDEBUG -fno-omit-frame-pointer -fno-strict-aliasing -g -fabi-version=2 -fno-omit-frame-pointer -fno-strict-aliasing -DDBUG_OFF   -o CMakeFiles/strings.dir/ctype-simple.c.o   -c /tmp/B.8exqh5/BUILD/mysql-5.7.22/strings/ctype-simple.c
make[2]: Leaving directory '/tmp/B.8exqh5/BUILD/mysql-5.7.22/build'
make[2]: Entering directory '/tmp/B.8exqh5/BUILD/mysql-5.7.22/build'
[  2%] Building C object strings/CMakeFiles/strings.dir/ctype-gb18030.c.o
cd /tmp/B.8exqh5/BUILD/mysql-5.7.22/build/strings && /usr/bin/x86_64-pld-linux-gnux32-gcc -DBOOST_GEOMETRY_SQRT_CHECK_FINITENESS -DDISABLE_MYSQL_THREAD_H -DHAVE_CONFIG_H -DHAVE_LIBEVENT2 -D_FILE_OFFSET_BITS=64 -D_GNU_SOURCE -I/tmp/B.8exqh5/BUILD/mysql-5.7.22/build/include -I/tmp/B.8exqh5/BUILD/mysql-5.7.22/extra/rapidjson/include -I/tmp/B.8exqh5/BUILD/mysql-5.7.22/build/libbinlogevents/include -I/tmp/B.8exqh5/BUILD/mysql-5.7.22/libbinlogevents/export -I/tmp/B.8exqh5/BUILD/mysql-5.7.22/include  -fPIC -Wall -Wextra -Wformat-security -Wvla -Wimplicit-fallthrough=2 -Wwrite-strings -Wdeclaration-after-statement -O3 -O2 -fwrapv -pipe -Wformat -Werror=format-security -gdwarf-4 -fno-debug-types-section -fvar-tracking-assignments -g2 -Wp,-D_FORTIFY_SOURCE=2 -fstack-protector-strong --param=ssp-buffer-size=4 -fPIC -mtune=generic -march=x86-64 -gdwarf-4 -fno-debug-types-section -fvar-tracking-assignments -g2  -DNDEBUG -fno-omit-frame-pointer -fno-strict-aliasing -g -fabi-version=2 -fno-omit-frame-pointer -fno-strict-aliasing -DDBUG_OFF   -o CMakeFiles/strings.dir/ctype-gb18030.c.o   -c /tmp/B.8exqh5/BUILD/mysql-5.7.22/strings/ctype-gb18030.c
make[2]: Leaving directory '/tmp/B.8exqh5/BUILD/mysql-5.7.22/build'
make[2]: Entering directory '/tmp/B.8exqh5/BUILD/mysql-5.7.22/build'
[  3%] Building CXX object libbinlogstandalone/src/CMakeFiles/binlogstandalone_shared.dir/__/__/libbinlogevents/src/uuid.cpp.o
cd /tmp/B.8exqh5/BUILD/mysql-5.7.22/build/libbinlogstandalone/src && /usr/bin/x86_64-pld-linux-gnux32-g++  -DBOOST_GEOMETRY_SQRT_CHECK_FINITENESS -DHAVE_CONFIG_H -DHAVE_LIBEVENT2 -DSTANDALONE_BINLOG -D_FILE_OFFSET_BITS=64 -D_GNU_SOURCE -Dbinlogstandalone_shared_EXPORTS -I/tmp/B.8exqh5/BUILD/mysql-5.7.22/build/include -I/tmp/B.8exqh5/BUILD/mysql-5.7.22/extra/rapidjson/include -I/tmp/B.8exqh5/BUILD/mysql-5.7.22/build/libbinlogevents/include -I/tmp/B.8exqh5/BUILD/mysql-5.7.22/libbinlogevents/export -I/tmp/B.8exqh5/BUILD/mysql-5.7.22/include -I/tmp/B.8exqh5/BUILD/mysql-5.7.22/libbinlogevents/include -I/tmp/B.8exqh5/BUILD/mysql-5.7.22/build/libbinlogstandalone/../libbinlogevents/include -I/tmp/B.8exqh5/BUILD/mysql-5.7.22/build/libbinlogstandalone/libbinlogevents/export  -fPIC -Wall -Wextra -Wformat-security -Wvla -Wimplicit-fallthrough=2 -Woverloaded-virtual -Wno-unused-parameter -O3 -O2 -fwrapv -pipe -Wformat -Werror=format-security -gdwarf-4 -fno-debug-types-section -fvar-tracking-assignments -g2 -Wp,-D_FORTIFY_SOURCE=2 -fstack-protector-strong --param=ssp-buffer-size=4 -fPIC -mtune=generic -march=x86-64 -gdwarf-4 -fno-debug-types-section -fvar-tracking-assignments -g2  -DNDEBUG -fno-omit-frame-pointer -fno-strict-aliasing -g -fabi-version=2 -fno-omit-frame-pointer -fno-strict-aliasing -std=gnu++03 -DDBUG_OFF -fPIC   -o CMakeFiles/binlogstandalone_shared.dir/__/__/libbinlogevents/src/uuid.cpp.o -c /tmp/B.8exqh5/BUILD/mysql-5.7.22/libbinlogevents/src/uuid.cpp
make[2]: Leaving directory '/tmp/B.8exqh5/BUILD/mysql-5.7.22/build'
make[2]: Entering directory '/tmp/B.8exqh5/BUILD/mysql-5.7.22/build'
[  3%] Building CXX object libbinlogstandalone/src/CMakeFiles/binlogstandalone_shared.dir/__/__/libbinlogevents/src/statement_events.cpp.o
cd /tmp/B.8exqh5/BUILD/mysql-5.7.22/build/libbinlogstandalone/src && /usr/bin/x86_64-pld-linux-gnux32-g++  -DBOOST_GEOMETRY_SQRT_CHECK_FINITENESS -DHAVE_CONFIG_H -DHAVE_LIBEVENT2 -DSTANDALONE_BINLOG -D_FILE_OFFSET_BITS=64 -D_GNU_SOURCE -Dbinlogstandalone_shared_EXPORTS -I/tmp/B.8exqh5/BUILD/mysql-5.7.22/build/include -I/tmp/B.8exqh5/BUILD/mysql-5.7.22/extra/rapidjson/include -I/tmp/B.8exqh5/BUILD/mysql-5.7.22/build/libbinlogevents/include -I/tmp/B.8exqh5/BUILD/mysql-5.7.22/libbinlogevents/export -I/tmp/B.8exqh5/BUILD/mysql-5.7.22/include -I/tmp/B.8exqh5/BUILD/mysql-5.7.22/libbinlogevents/include -I/tmp/B.8exqh5/BUILD/mysql-5.7.22/build/libbinlogstandalone/../libbinlogevents/include -I/tmp/B.8exqh5/BUILD/mysql-5.7.22/build/libbinlogstandalone/libbinlogevents/export  -fPIC -Wall -Wextra -Wformat-security -Wvla -Wimplicit-fallthrough=2 -Woverloaded-virtual -Wno-unused-parameter -O3 -O2 -fwrapv -pipe -Wformat -Werror=format-security -gdwarf-4 -fno-debug-types-section -fvar-tracking-assignments -g2 -Wp,-D_FORTIFY_SOURCE=2 -fstack-protector-strong --param=ssp-buffer-size=4 -fPIC -mtune=generic -march=x86-64 -gdwarf-4 -fno-debug-types-section -fvar-tracking-assignments -g2  -DNDEBUG -fno-omit-frame-pointer -fno-strict-aliasing -g -fabi-version=2 -fno-omit-frame-pointer -fno-strict-aliasing -std=gnu++03 -DDBUG_OFF -fPIC   -o CMakeFiles/binlogstandalone_shared.dir/__/__/libbinlogevents/src/statement_events.cpp.o -c /tmp/B.8exqh5/BUILD/mysql-5.7.22/libbinlogevents/src/statement_events.cpp
make[2]: Leaving directory '/tmp/B.8exqh5/BUILD/mysql-5.7.22/build'
make[2]: Entering directory '/tmp/B.8exqh5/BUILD/mysql-5.7.22/build'
[  2%] Building CXX object libbinlogstandalone/src/CMakeFiles/binlogstandalone_shared.dir/__/__/libbinlogevents/src/control_events.cpp.o
cd /tmp/B.8exqh5/BUILD/mysql-5.7.22/build/libbinlogstandalone/src && /usr/bin/x86_64-pld-linux-gnux32-g++  -DBOOST_GEOMETRY_SQRT_CHECK_FINITENESS -DHAVE_CONFIG_H -DHAVE_LIBEVENT2 -DSTANDALONE_BINLOG -D_FILE_OFFSET_BITS=64 -D_GNU_SOURCE -Dbinlogstandalone_shared_EXPORTS -I/tmp/B.8exqh5/BUILD/mysql-5.7.22/build/include -I/tmp/B.8exqh5/BUILD/mysql-5.7.22/extra/rapidjson/include -I/tmp/B.8exqh5/BUILD/mysql-5.7.22/build/libbinlogevents/include -I/tmp/B.8exqh5/BUILD/mysql-5.7.22/libbinlogevents/export -I/tmp/B.8exqh5/BUILD/mysql-5.7.22/include -I/tmp/B.8exqh5/BUILD/mysql-5.7.22/libbinlogevents/include -I/tmp/B.8exqh5/BUILD/mysql-5.7.22/build/libbinlogstandalone/../libbinlogevents/include -I/tmp/B.8exqh5/BUILD/mysql-5.7.22/build/libbinlogstandalone/libbinlogevents/export  -fPIC -Wall -Wextra -Wformat-security -Wvla -Wimplicit-fallthrough=2 -Woverloaded-virtual -Wno-unused-parameter -O3 -O2 -fwrapv -pipe -Wformat -Werror=format-security -gdwarf-4 -fno-debug-types-section -fvar-tracking-assignments -g2 -Wp,-D_FORTIFY_SOURCE=2 -fstack-protector-strong --param=ssp-buffer-size=4 -fPIC -mtune=generic -march=x86-64 -gdwarf-4 -fno-debug-types-section -fvar-tracking-assignments -g2  -DNDEBUG -fno-omit-frame-pointer -fno-strict-aliasing -g -fabi-version=2 -fno-omit-frame-pointer -fno-strict-aliasing -std=gnu++03 -DDBUG_OFF -fPIC   -o CMakeFiles/binlogstandalone_shared.dir/__/__/libbinlogevents/src/control_events.cpp.o -c /tmp/B.8exqh5/BUILD/mysql-5.7.22/libbinlogevents/src/control_events.cpp
make[2]: Leaving directory '/tmp/B.8exqh5/BUILD/mysql-5.7.22/build'
make[2]: Entering directory '/tmp/B.8exqh5/BUILD/mysql-5.7.22/build'
[  3%] Building CXX object rapid/plugin/group_replication/CMakeFiles/gr_unit_test_resource.dir/libmysqlgcs/src/interface/gcs_view.cc.o
cd /tmp/B.8exqh5/BUILD/mysql-5.7.22/build/rapid/plugin/group_replication && /usr/bin/x86_64-pld-linux-gnux32-g++  -DBOOST_GEOMETRY_SQRT_CHECK_FINITENESS -DDISABLE_ALL_PSI -DHAVE_CONFIG_H -DHAVE_LIBEVENT2 -DHAVE_OPENSSL -DHAVE_TIRPC -DXCOM_HAVE_OPENSSL -D_FILE_OFFSET_BITS=64 -D_GNU_SOURCE -I/tmp/B.8exqh5/BUILD/mysql-5.7.22/build/include -I/tmp/B.8exqh5/BUILD/mysql-5.7.22/extra/rapidjson/include -I/tmp/B.8exqh5/BUILD/mysql-5.7.22/build/libbinlogevents/include -I/tmp/B.8exqh5/BUILD/mysql-5.7.22/libbinlogevents/export -I/tmp/B.8exqh5/BUILD/mysql-5.7.22/build/rapid/plugin/group_replication/xdr_gen -isystem /usr/include/tirpc -I/tmp/B.8exqh5/BUILD/mysql-5.7.22/libbinlogevents/include -I/tmp/B.8exqh5/BUILD/mysql-5.7.22/rapid/plugin/group_replication/include -I/tmp/B.8exqh5/BUILD/mysql-5.7.22/rapid/plugin/group_replication/include/sql_service -I/tmp/B.8exqh5/BUILD/mysql-5.7.22/rapid/plugin/group_replication/libmysqlgcs/include -I/tmp/B.8exqh5/BUILD/mysql-5.7.22/rapid/plugin/group_replication/libmysqlgcs/include/mysql -I/tmp/B.8exqh5/BUILD/mysql-5.7.22/rapid/plugin/group_replication/libmysqlgcs/include/mysql/gcs -I/tmp/B.8exqh5/BUILD/mysql-5.7.22/rapid/plugin/group_replication/libmysqlgcs/src/bindings/xcom/xcom -I/tmp/B.8exqh5/BUILD/mysql-5.7.22/build/rapid/plugin/group_replication/include -I/tmp/B.8exqh5/BUILD/mysql-5.7.22/include -I/tmp/B.8exqh5/BUILD/mysql-5.7.22/sql -I/tmp/B.8exqh5/BUILD/mysql-5.7.22/sql/auth -I/tmp/B.8exqh5/BUILD/mysql-5.7.22/regex  -fPIC -Wall -Wextra -Wformat-security -Wvla -Wimplicit-fallthrough=2 -Woverloaded-virtual -Wno-unused-parameter -O3 -O2 -fwrapv -pipe -Wformat -Werror=format-security -gdwarf-4 -fno-debug-types-section -fvar-tracking-assignments -g2 -Wp,-D_FORTIFY_SOURCE=2 -fstack-protector-strong --param=ssp-buffer-size=4 -fPIC -mtune=generic -march=x86-64 -gdwarf-4 -fno-debug-types-section -fvar-tracking-assignments -g2  -DNDEBUG -fno-omit-frame-pointer -fno-strict-aliasing -g -fabi-version=2 -fno-omit-frame-pointer -fno-strict-aliasing -std=gnu++03 -DDBUG_OFF   -o CMakeFiles/gr_unit_test_resource.dir/libmysqlgcs/src/interface/gcs_view.cc.o -c /tmp/B.8exqh5/BUILD/mysql-5.7.22/rapid/plugin/group_replication/libmysqlgcs/src/interface/gcs_view.cc
make[2]: Leaving directory '/tmp/B.8exqh5/BUILD/mysql-5.7.22/build'
make[2]: Entering directory '/tmp/B.8exqh5/BUILD/mysql-5.7.22/build'
[  3%] Building CXX object rapid/plugin/group_replication/CMakeFiles/gr_unit_test_resource.dir/libmysqlgcs/src/interface/gcs_types.cc.o
cd /tmp/B.8exqh5/BUILD/mysql-5.7.22/build/rapid/plugin/group_replication && /usr/bin/x86_64-pld-linux-gnux32-g++  -DBOOST_GEOMETRY_SQRT_CHECK_FINITENESS -DDISABLE_ALL_PSI -DHAVE_CONFIG_H -DHAVE_LIBEVENT2 -DHAVE_OPENSSL -DHAVE_TIRPC -DXCOM_HAVE_OPENSSL -D_FILE_OFFSET_BITS=64 -D_GNU_SOURCE -I/tmp/B.8exqh5/BUILD/mysql-5.7.22/build/include -I/tmp/B.8exqh5/BUILD/mysql-5.7.22/extra/rapidjson/include -I/tmp/B.8exqh5/BUILD/mysql-5.7.22/build/libbinlogevents/include -I/tmp/B.8exqh5/BUILD/mysql-5.7.22/libbinlogevents/export -I/tmp/B.8exqh5/BUILD/mysql-5.7.22/build/rapid/plugin/group_replication/xdr_gen -isystem /usr/include/tirpc -I/tmp/B.8exqh5/BUILD/mysql-5.7.22/libbinlogevents/include -I/tmp/B.8exqh5/BUILD/mysql-5.7.22/rapid/plugin/group_replication/include -I/tmp/B.8exqh5/BUILD/mysql-5.7.22/rapid/plugin/group_replication/include/sql_service -I/tmp/B.8exqh5/BUILD/mysql-5.7.22/rapid/plugin/group_replication/libmysqlgcs/include -I/tmp/B.8exqh5/BUILD/mysql-5.7.22/rapid/plugin/group_replication/libmysqlgcs/include/mysql -I/tmp/B.8exqh5/BUILD/mysql-5.7.22/rapid/plugin/group_replication/libmysqlgcs/include/mysql/gcs -I/tmp/B.8exqh5/BUILD/mysql-5.7.22/rapid/plugin/group_replication/libmysqlgcs/src/bindings/xcom/xcom -I/tmp/B.8exqh5/BUILD/mysql-5.7.22/build/rapid/plugin/group_replication/include -I/tmp/B.8exqh5/BUILD/mysql-5.7.22/include -I/tmp/B.8exqh5/BUILD/mysql-5.7.22/sql -I/tmp/B.8exqh5/BUILD/mysql-5.7.22/sql/auth -I/tmp/B.8exqh5/BUILD/mysql-5.7.22/regex  -fPIC -Wall -Wextra -Wformat-security -Wvla -Wimplicit-fallthrough=2 -Woverloaded-virtual -Wno-unused-parameter -O3 -O2 -fwrapv -pipe -Wformat -Werror=format-security -gdwarf-4 -fno-debug-types-section -fvar-tracking-assignments -g2 -Wp,-D_FORTIFY_SOURCE=2 -fstack-protector-strong --param=ssp-buffer-size=4 -fPIC -mtune=generic -march=x86-64 -gdwarf-4 -fno-debug-types-section -fvar-tracking-assignments -g2  -DNDEBUG -fno-omit-frame-pointer -fno-strict-aliasing -g -fabi-version=2 -fno-omit-frame-pointer -fno-strict-aliasing -std=gnu++03 -DDBUG_OFF   -o CMakeFiles/gr_unit_test_resource.dir/libmysqlgcs/src/interface/gcs_types.cc.o -c /tmp/B.8exqh5/BUILD/mysql-5.7.22/rapid/plugin/group_replication/libmysqlgcs/src/interface/gcs_types.cc
make[2]: Leaving directory '/tmp/B.8exqh5/BUILD/mysql-5.7.22/build'
make[2]: Entering directory '/tmp/B.8exqh5/BUILD/mysql-5.7.22/build'
[  3%] Building CXX object rapid/plugin/group_replication/CMakeFiles/gr_unit_test_resource.dir/libmysqlgcs/src/interface/gcs_group_identifier.cc.o
cd /tmp/B.8exqh5/BUILD/mysql-5.7.22/build/rapid/plugin/group_replication && /usr/bin/x86_64-pld-linux-gnux32-g++  -DBOOST_GEOMETRY_SQRT_CHECK_FINITENESS -DDISABLE_ALL_PSI -DHAVE_CONFIG_H -DHAVE_LIBEVENT2 -DHAVE_OPENSSL -DHAVE_TIRPC -DXCOM_HAVE_OPENSSL -D_FILE_OFFSET_BITS=64 -D_GNU_SOURCE -I/tmp/B.8exqh5/BUILD/mysql-5.7.22/build/include -I/tmp/B.8exqh5/BUILD/mysql-5.7.22/extra/rapidjson/include -I/tmp/B.8exqh5/BUILD/mysql-5.7.22/build/libbinlogevents/include -I/tmp/B.8exqh5/BUILD/mysql-5.7.22/libbinlogevents/export -I/tmp/B.8exqh5/BUILD/mysql-5.7.22/build/rapid/plugin/group_replication/xdr_gen -isystem /usr/include/tirpc -I/tmp/B.8exqh5/BUILD/mysql-5.7.22/libbinlogevents/include -I/tmp/B.8exqh5/BUILD/mysql-5.7.22/rapid/plugin/group_replication/include -I/tmp/B.8exqh5/BUILD/mysql-5.7.22/rapid/plugin/group_replication/include/sql_service -I/tmp/B.8exqh5/BUILD/mysql-5.7.22/rapid/plugin/group_replication/libmysqlgcs/include -I/tmp/B.8exqh5/BUILD/mysql-5.7.22/rapid/plugin/group_replication/libmysqlgcs/include/mysql -I/tmp/B.8exqh5/BUILD/mysql-5.7.22/rapid/plugin/group_replication/libmysqlgcs/include/mysql/gcs -I/tmp/B.8exqh5/BUILD/mysql-5.7.22/rapid/plugin/group_replication/libmysqlgcs/src/bindings/xcom/xcom -I/tmp/B.8exqh5/BUILD/mysql-5.7.22/build/rapid/plugin/group_replication/include -I/tmp/B.8exqh5/BUILD/mysql-5.7.22/include -I/tmp/B.8exqh5/BUILD/mysql-5.7.22/sql -I/tmp/B.8exqh5/BUILD/mysql-5.7.22/sql/auth -I/tmp/B.8exqh5/BUILD/mysql-5.7.22/regex  -fPIC -Wall -Wextra -Wformat-security -Wvla -Wimplicit-fallthrough=2 -Woverloaded-virtual -Wno-unused-parameter -O3 -O2 -fwrapv -pipe -Wformat -Werror=format-security -gdwarf-4 -fno-debug-types-section -fvar-tracking-assignments -g2 -Wp,-D_FORTIFY_SOURCE=2 -fstack-protector-strong --param=ssp-buffer-size=4 -fPIC -mtune=generic -march=x86-64 -gdwarf-4 -fno-debug-types-section -fvar-tracking-assignments -g2  -DNDEBUG -fno-omit-frame-pointer -fno-strict-aliasing -g -fabi-version=2 -fno-omit-frame-pointer -fno-strict-aliasing -std=gnu++03 -DDBUG_OFF   -o CMakeFiles/gr_unit_test_resource.dir/libmysqlgcs/src/interface/gcs_group_identifier.cc.o -c /tmp/B.8exqh5/BUILD/mysql-5.7.22/rapid/plugin/group_replication/libmysqlgcs/src/interface/gcs_group_identifier.cc
make[2]: Leaving directory '/tmp/B.8exqh5/BUILD/mysql-5.7.22/build'
make[2]: Entering directory '/tmp/B.8exqh5/BUILD/mysql-5.7.22/build'
[  3%] Building C object strings/CMakeFiles/strings.dir/ctype-uca.c.o
cd /tmp/B.8exqh5/BUILD/mysql-5.7.22/build/strings && /usr/bin/x86_64-pld-linux-gnux32-gcc -DBOOST_GEOMETRY_SQRT_CHECK_FINITENESS -DDISABLE_MYSQL_THREAD_H -DHAVE_CONFIG_H -DHAVE_LIBEVENT2 -D_FILE_OFFSET_BITS=64 -D_GNU_SOURCE -I/tmp/B.8exqh5/BUILD/mysql-5.7.22/build/include -I/tmp/B.8exqh5/BUILD/mysql-5.7.22/extra/rapidjson/include -I/tmp/B.8exqh5/BUILD/mysql-5.7.22/build/libbinlogevents/include -I/tmp/B.8exqh5/BUILD/mysql-5.7.22/libbinlogevents/export -I/tmp/B.8exqh5/BUILD/mysql-5.7.22/include  -fPIC -Wall -Wextra -Wformat-security -Wvla -Wimplicit-fallthrough=2 -Wwrite-strings -Wdeclaration-after-statement -O3 -O2 -fwrapv -pipe -Wformat -Werror=format-security -gdwarf-4 -fno-debug-types-section -fvar-tracking-assignments -g2 -Wp,-D_FORTIFY_SOURCE=2 -fstack-protector-strong --param=ssp-buffer-size=4 -fPIC -mtune=generic -march=x86-64 -gdwarf-4 -fno-debug-types-section -fvar-tracking-assignments -g2  -DNDEBUG -fno-omit-frame-pointer -fno-strict-aliasing -g -fabi-version=2 -fno-omit-frame-pointer -fno-strict-aliasing -DDBUG_OFF   -o CMakeFiles/strings.dir/ctype-uca.c.o   -c /tmp/B.8exqh5/BUILD/mysql-5.7.22/strings/ctype-uca.c
make[2]: Leaving directory '/tmp/B.8exqh5/BUILD/mysql-5.7.22/build'
make[2]: Entering directory '/tmp/B.8exqh5/BUILD/mysql-5.7.22/build'
[  3%] Building C object strings/CMakeFiles/strings.dir/ctype-win1250ch.c.o
cd /tmp/B.8exqh5/BUILD/mysql-5.7.22/build/strings && /usr/bin/x86_64-pld-linux-gnux32-gcc -DBOOST_GEOMETRY_SQRT_CHECK_FINITENESS -DDISABLE_MYSQL_THREAD_H -DHAVE_CONFIG_H -DHAVE_LIBEVENT2 -D_FILE_OFFSET_BITS=64 -D_GNU_SOURCE -I/tmp/B.8exqh5/BUILD/mysql-5.7.22/build/include -I/tmp/B.8exqh5/BUILD/mysql-5.7.22/extra/rapidjson/include -I/tmp/B.8exqh5/BUILD/mysql-5.7.22/build/libbinlogevents/include -I/tmp/B.8exqh5/BUILD/mysql-5.7.22/libbinlogevents/export -I/tmp/B.8exqh5/BUILD/mysql-5.7.22/include  -fPIC -Wall -Wextra -Wformat-security -Wvla -Wimplicit-fallthrough=2 -Wwrite-strings -Wdeclaration-after-statement -O3 -O2 -fwrapv -pipe -Wformat -Werror=format-security -gdwarf-4 -fno-debug-types-section -fvar-tracking-assignments -g2 -Wp,-D_FORTIFY_SOURCE=2 -fstack-protector-strong --param=ssp-buffer-size=4 -fPIC -mtune=generic -march=x86-64 -gdwarf-4 -fno-debug-types-section -fvar-tracking-assignments -g2  -DNDEBUG -fno-omit-frame-pointer -fno-strict-aliasing -g -fabi-version=2 -fno-omit-frame-pointer -fno-strict-aliasing -DDBUG_OFF   -o CMakeFiles/strings.dir/ctype-win1250ch.c.o   -c /tmp/B.8exqh5/BUILD/mysql-5.7.22/strings/ctype-win1250ch.c
make[2]: Leaving directory '/tmp/B.8exqh5/BUILD/mysql-5.7.22/build'
make[2]: Entering directory '/tmp/B.8exqh5/BUILD/mysql-5.7.22/build'
[  3%] Building CXX object rapid/plugin/group_replication/CMakeFiles/gr_unit_test_resource.dir/libmysqlgcs/src/interface/gcs_message.cc.o
cd /tmp/B.8exqh5/BUILD/mysql-5.7.22/build/rapid/plugin/group_replication && /usr/bin/x86_64-pld-linux-gnux32-g++  -DBOOST_GEOMETRY_SQRT_CHECK_FINITENESS -DDISABLE_ALL_PSI -DHAVE_CONFIG_H -DHAVE_LIBEVENT2 -DHAVE_OPENSSL -DHAVE_TIRPC -DXCOM_HAVE_OPENSSL -D_FILE_OFFSET_BITS=64 -D_GNU_SOURCE -I/tmp/B.8exqh5/BUILD/mysql-5.7.22/build/include -I/tmp/B.8exqh5/BUILD/mysql-5.7.22/extra/rapidjson/include -I/tmp/B.8exqh5/BUILD/mysql-5.7.22/build/libbinlogevents/include -I/tmp/B.8exqh5/BUILD/mysql-5.7.22/libbinlogevents/export -I/tmp/B.8exqh5/BUILD/mysql-5.7.22/build/rapid/plugin/group_replication/xdr_gen -isystem /usr/include/tirpc -I/tmp/B.8exqh5/BUILD/mysql-5.7.22/libbinlogevents/include -I/tmp/B.8exqh5/BUILD/mysql-5.7.22/rapid/plugin/group_replication/include -I/tmp/B.8exqh5/BUILD/mysql-5.7.22/rapid/plugin/group_replication/include/sql_service -I/tmp/B.8exqh5/BUILD/mysql-5.7.22/rapid/plugin/group_replication/libmysqlgcs/include -I/tmp/B.8exqh5/BUILD/mysql-5.7.22/rapid/plugin/group_replication/libmysqlgcs/include/mysql -I/tmp/B.8exqh5/BUILD/mysql-5.7.22/rapid/plugin/group_replication/libmysqlgcs/include/mysql/gcs -I/tmp/B.8exqh5/BUILD/mysql-5.7.22/rapid/plugin/group_replication/libmysqlgcs/src/bindings/xcom/xcom -I/tmp/B.8exqh5/BUILD/mysql-5.7.22/build/rapid/plugin/group_replication/include -I/tmp/B.8exqh5/BUILD/mysql-5.7.22/include -I/tmp/B.8exqh5/BUILD/mysql-5.7.22/sql -I/tmp/B.8exqh5/BUILD/mysql-5.7.22/sql/auth -I/tmp/B.8exqh5/BUILD/mysql-5.7.22/regex  -fPIC -Wall -Wextra -Wformat-security -Wvla -Wimplicit-fallthrough=2 -Woverloaded-virtual -Wno-unused-parameter -O3 -O2 -fwrapv -pipe -Wformat -Werror=format-security -gdwarf-4 -fno-debug-types-section -fvar-tracking-assignments -g2 -Wp,-D_FORTIFY_SOURCE=2 -fstack-protector-strong --param=ssp-buffer-size=4 -fPIC -mtune=generic -march=x86-64 -gdwarf-4 -fno-debug-types-section -fvar-tracking-assignments -g2  -DNDEBUG -fno-omit-frame-pointer -fno-strict-aliasing -g -fabi-version=2 -fno-omit-frame-pointer -fno-strict-aliasing -std=gnu++03 -DDBUG_OFF   -o CMakeFiles/gr_unit_test_resource.dir/libmysqlgcs/src/interface/gcs_message.cc.o -c /tmp/B.8exqh5/BUILD/mysql-5.7.22/rapid/plugin/group_replication/libmysqlgcs/src/interface/gcs_message.cc
make[2]: Leaving directory '/tmp/B.8exqh5/BUILD/mysql-5.7.22/build'
make[2]: Entering directory '/tmp/B.8exqh5/BUILD/mysql-5.7.22/build'
[  3%] Building C object strings/CMakeFiles/strings.dir/ctype-ujis.c.o
cd /tmp/B.8exqh5/BUILD/mysql-5.7.22/build/strings && /usr/bin/x86_64-pld-linux-gnux32-gcc -DBOOST_GEOMETRY_SQRT_CHECK_FINITENESS -DDISABLE_MYSQL_THREAD_H -DHAVE_CONFIG_H -DHAVE_LIBEVENT2 -D_FILE_OFFSET_BITS=64 -D_GNU_SOURCE -I/tmp/B.8exqh5/BUILD/mysql-5.7.22/build/include -I/tmp/B.8exqh5/BUILD/mysql-5.7.22/extra/rapidjson/include -I/tmp/B.8exqh5/BUILD/mysql-5.7.22/build/libbinlogevents/include -I/tmp/B.8exqh5/BUILD/mysql-5.7.22/libbinlogevents/export -I/tmp/B.8exqh5/BUILD/mysql-5.7.22/include  -fPIC -Wall -Wextra -Wformat-security -Wvla -Wimplicit-fallthrough=2 -Wwrite-strings -Wdeclaration-after-statement -O3 -O2 -fwrapv -pipe -Wformat -Werror=format-security -gdwarf-4 -fno-debug-types-section -fvar-tracking-assignments -g2 -Wp,-D_FORTIFY_SOURCE=2 -fstack-protector-strong --param=ssp-buffer-size=4 -fPIC -mtune=generic -march=x86-64 -gdwarf-4 -fno-debug-types-section -fvar-tracking-assignments -g2  -DNDEBUG -fno-omit-frame-pointer -fno-strict-aliasing -g -fabi-version=2 -fno-omit-frame-pointer -fno-strict-aliasing -DDBUG_OFF   -o CMakeFiles/strings.dir/ctype-ujis.c.o   -c /tmp/B.8exqh5/BUILD/mysql-5.7.22/strings/ctype-ujis.c
make[2]: Leaving directory '/tmp/B.8exqh5/BUILD/mysql-5.7.22/build'
make[2]: Entering directory '/tmp/B.8exqh5/BUILD/mysql-5.7.22/build'
[  3%] Building C object strings/CMakeFiles/strings.dir/ctype-utf8.c.o
cd /tmp/B.8exqh5/BUILD/mysql-5.7.22/build/strings && /usr/bin/x86_64-pld-linux-gnux32-gcc -DBOOST_GEOMETRY_SQRT_CHECK_FINITENESS -DDISABLE_MYSQL_THREAD_H -DHAVE_CONFIG_H -DHAVE_LIBEVENT2 -D_FILE_OFFSET_BITS=64 -D_GNU_SOURCE -I/tmp/B.8exqh5/BUILD/mysql-5.7.22/build/include -I/tmp/B.8exqh5/BUILD/mysql-5.7.22/extra/rapidjson/include -I/tmp/B.8exqh5/BUILD/mysql-5.7.22/build/libbinlogevents/include -I/tmp/B.8exqh5/BUILD/mysql-5.7.22/libbinlogevents/export -I/tmp/B.8exqh5/BUILD/mysql-5.7.22/include  -fPIC -Wall -Wextra -Wformat-security -Wvla -Wimplicit-fallthrough=2 -Wwrite-strings -Wdeclaration-after-statement -O3 -O2 -fwrapv -pipe -Wformat -Werror=format-security -gdwarf-4 -fno-debug-types-section -fvar-tracking-assignments -g2 -Wp,-D_FORTIFY_SOURCE=2 -fstack-protector-strong --param=ssp-buffer-size=4 -fPIC -mtune=generic -march=x86-64 -gdwarf-4 -fno-debug-types-section -fvar-tracking-assignments -g2  -DNDEBUG -fno-omit-frame-pointer -fno-strict-aliasing -g -fabi-version=2 -fno-omit-frame-pointer -fno-strict-aliasing -DDBUG_OFF   -o CMakeFiles/strings.dir/ctype-utf8.c.o   -c /tmp/B.8exqh5/BUILD/mysql-5.7.22/strings/ctype-utf8.c
make[2]: Leaving directory '/tmp/B.8exqh5/BUILD/mysql-5.7.22/build'
make[2]: Entering directory '/tmp/B.8exqh5/BUILD/mysql-5.7.22/build'
[  3%] Building C object strings/CMakeFiles/strings.dir/int2str.c.o
cd /tmp/B.8exqh5/BUILD/mysql-5.7.22/build/strings && /usr/bin/x86_64-pld-linux-gnux32-gcc -DBOOST_GEOMETRY_SQRT_CHECK_FINITENESS -DDISABLE_MYSQL_THREAD_H -DHAVE_CONFIG_H -DHAVE_LIBEVENT2 -D_FILE_OFFSET_BITS=64 -D_GNU_SOURCE -I/tmp/B.8exqh5/BUILD/mysql-5.7.22/build/include -I/tmp/B.8exqh5/BUILD/mysql-5.7.22/extra/rapidjson/include -I/tmp/B.8exqh5/BUILD/mysql-5.7.22/build/libbinlogevents/include -I/tmp/B.8exqh5/BUILD/mysql-5.7.22/libbinlogevents/export -I/tmp/B.8exqh5/BUILD/mysql-5.7.22/include  -fPIC -Wall -Wextra -Wformat-security -Wvla -Wimplicit-fallthrough=2 -Wwrite-strings -Wdeclaration-after-statement -O3 -O2 -fwrapv -pipe -Wformat -Werror=format-security -gdwarf-4 -fno-debug-types-section -fvar-tracking-assignments -g2 -Wp,-D_FORTIFY_SOURCE=2 -fstack-protector-strong --param=ssp-buffer-size=4 -fPIC -mtune=generic -march=x86-64 -gdwarf-4 -fno-debug-types-section -fvar-tracking-assignments -g2  -DNDEBUG -fno-omit-frame-pointer -fno-strict-aliasing -g -fabi-version=2 -fno-omit-frame-pointer -fno-strict-aliasing -DDBUG_OFF   -o CMakeFiles/strings.dir/int2str.c.o   -c /tmp/B.8exqh5/BUILD/mysql-5.7.22/strings/int2str.c
make[2]: Leaving directory '/tmp/B.8exqh5/BUILD/mysql-5.7.22/build'
make[2]: Entering directory '/tmp/B.8exqh5/BUILD/mysql-5.7.22/build'
[  3%] Building CXX object rapid/plugin/group_replication/CMakeFiles/gr_unit_test_resource.dir/libmysqlgcs/src/interface/gcs_member_identifier.cc.o
cd /tmp/B.8exqh5/BUILD/mysql-5.7.22/build/rapid/plugin/group_replication && /usr/bin/x86_64-pld-linux-gnux32-g++  -DBOOST_GEOMETRY_SQRT_CHECK_FINITENESS -DDISABLE_ALL_PSI -DHAVE_CONFIG_H -DHAVE_LIBEVENT2 -DHAVE_OPENSSL -DHAVE_TIRPC -DXCOM_HAVE_OPENSSL -D_FILE_OFFSET_BITS=64 -D_GNU_SOURCE -I/tmp/B.8exqh5/BUILD/mysql-5.7.22/build/include -I/tmp/B.8exqh5/BUILD/mysql-5.7.22/extra/rapidjson/include -I/tmp/B.8exqh5/BUILD/mysql-5.7.22/build/libbinlogevents/include -I/tmp/B.8exqh5/BUILD/mysql-5.7.22/libbinlogevents/export -I/tmp/B.8exqh5/BUILD/mysql-5.7.22/build/rapid/plugin/group_replication/xdr_gen -isystem /usr/include/tirpc -I/tmp/B.8exqh5/BUILD/mysql-5.7.22/libbinlogevents/include -I/tmp/B.8exqh5/BUILD/mysql-5.7.22/rapid/plugin/group_replication/include -I/tmp/B.8exqh5/BUILD/mysql-5.7.22/rapid/plugin/group_replication/include/sql_service -I/tmp/B.8exqh5/BUILD/mysql-5.7.22/rapid/plugin/group_replication/libmysqlgcs/include -I/tmp/B.8exqh5/BUILD/mysql-5.7.22/rapid/plugin/group_replication/libmysqlgcs/include/mysql -I/tmp/B.8exqh5/BUILD/mysql-5.7.22/rapid/plugin/group_replication/libmysqlgcs/include/mysql/gcs -I/tmp/B.8exqh5/BUILD/mysql-5.7.22/rapid/plugin/group_replication/libmysqlgcs/src/bindings/xcom/xcom -I/tmp/B.8exqh5/BUILD/mysql-5.7.22/build/rapid/plugin/group_replication/include -I/tmp/B.8exqh5/BUILD/mysql-5.7.22/include -I/tmp/B.8exqh5/BUILD/mysql-5.7.22/sql -I/tmp/B.8exqh5/BUILD/mysql-5.7.22/sql/auth -I/tmp/B.8exqh5/BUILD/mysql-5.7.22/regex  -fPIC -Wall -Wextra -Wformat-security -Wvla -Wimplicit-fallthrough=2 -Woverloaded-virtual -Wno-unused-parameter -O3 -O2 -fwrapv -pipe -Wformat -Werror=format-security -gdwarf-4 -fno-debug-types-section -fvar-tracking-assignments -g2 -Wp,-D_FORTIFY_SOURCE=2 -fstack-protector-strong --param=ssp-buffer-size=4 -fPIC -mtune=generic -march=x86-64 -gdwarf-4 -fno-debug-types-section -fvar-tracking-assignments -g2  -DNDEBUG -fno-omit-frame-pointer -fno-strict-aliasing -g -fabi-version=2 -fno-omit-frame-pointer -fno-strict-aliasing -std=gnu++03 -DDBUG_OFF   -o CMakeFiles/gr_unit_test_resource.dir/libmysqlgcs/src/interface/gcs_member_identifier.cc.o -c /tmp/B.8exqh5/BUILD/mysql-5.7.22/rapid/plugin/group_replication/libmysqlgcs/src/interface/gcs_member_identifier.cc
make[2]: Leaving directory '/tmp/B.8exqh5/BUILD/mysql-5.7.22/build'
make[2]: Entering directory '/tmp/B.8exqh5/BUILD/mysql-5.7.22/build'
[  3%] Building C object strings/CMakeFiles/strings.dir/is_prefix.c.o
cd /tmp/B.8exqh5/BUILD/mysql-5.7.22/build/strings && /usr/bin/x86_64-pld-linux-gnux32-gcc -DBOOST_GEOMETRY_SQRT_CHECK_FINITENESS -DDISABLE_MYSQL_THREAD_H -DHAVE_CONFIG_H -DHAVE_LIBEVENT2 -D_FILE_OFFSET_BITS=64 -D_GNU_SOURCE -I/tmp/B.8exqh5/BUILD/mysql-5.7.22/build/include -I/tmp/B.8exqh5/BUILD/mysql-5.7.22/extra/rapidjson/include -I/tmp/B.8exqh5/BUILD/mysql-5.7.22/build/libbinlogevents/include -I/tmp/B.8exqh5/BUILD/mysql-5.7.22/libbinlogevents/export -I/tmp/B.8exqh5/BUILD/mysql-5.7.22/include  -fPIC -Wall -Wextra -Wformat-security -Wvla -Wimplicit-fallthrough=2 -Wwrite-strings -Wdeclaration-after-statement -O3 -O2 -fwrapv -pipe -Wformat -Werror=format-security -gdwarf-4 -fno-debug-types-section -fvar-tracking-assignments -g2 -Wp,-D_FORTIFY_SOURCE=2 -fstack-protector-strong --param=ssp-buffer-size=4 -fPIC -mtune=generic -march=x86-64 -gdwarf-4 -fno-debug-types-section -fvar-tracking-assignments -g2  -DNDEBUG -fno-omit-frame-pointer -fno-strict-aliasing -g -fabi-version=2 -fno-omit-frame-pointer -fno-strict-aliasing -DDBUG_OFF   -o CMakeFiles/strings.dir/is_prefix.c.o   -c /tmp/B.8exqh5/BUILD/mysql-5.7.22/strings/is_prefix.c
make[2]: Leaving directory '/tmp/B.8exqh5/BUILD/mysql-5.7.22/build'
make[2]: Entering directory '/tmp/B.8exqh5/BUILD/mysql-5.7.22/build'
[  3%] Building C object strings/CMakeFiles/strings.dir/ctype.c.o
cd /tmp/B.8exqh5/BUILD/mysql-5.7.22/build/strings && /usr/bin/x86_64-pld-linux-gnux32-gcc -DBOOST_GEOMETRY_SQRT_CHECK_FINITENESS -DDISABLE_MYSQL_THREAD_H -DHAVE_CONFIG_H -DHAVE_LIBEVENT2 -D_FILE_OFFSET_BITS=64 -D_GNU_SOURCE -I/tmp/B.8exqh5/BUILD/mysql-5.7.22/build/include -I/tmp/B.8exqh5/BUILD/mysql-5.7.22/extra/rapidjson/include -I/tmp/B.8exqh5/BUILD/mysql-5.7.22/build/libbinlogevents/include -I/tmp/B.8exqh5/BUILD/mysql-5.7.22/libbinlogevents/export -I/tmp/B.8exqh5/BUILD/mysql-5.7.22/include  -fPIC -Wall -Wextra -Wformat-security -Wvla -Wimplicit-fallthrough=2 -Wwrite-strings -Wdeclaration-after-statement -O3 -O2 -fwrapv -pipe -Wformat -Werror=format-security -gdwarf-4 -fno-debug-types-section -fvar-tracking-assignments -g2 -Wp,-D_FORTIFY_SOURCE=2 -fstack-protector-strong --param=ssp-buffer-size=4 -fPIC -mtune=generic -march=x86-64 -gdwarf-4 -fno-debug-types-section -fvar-tracking-assignments -g2  -DNDEBUG -fno-omit-frame-pointer -fno-strict-aliasing -g -fabi-version=2 -fno-omit-frame-pointer -fno-strict-aliasing -DDBUG_OFF   -o CMakeFiles/strings.dir/ctype.c.o   -c /tmp/B.8exqh5/BUILD/mysql-5.7.22/strings/ctype.c
make[2]: Leaving directory '/tmp/B.8exqh5/BUILD/mysql-5.7.22/build'
make[2]: Entering directory '/tmp/B.8exqh5/BUILD/mysql-5.7.22/build'
[  3%] Building C object strings/CMakeFiles/strings.dir/llstr.c.o
cd /tmp/B.8exqh5/BUILD/mysql-5.7.22/build/strings && /usr/bin/x86_64-pld-linux-gnux32-gcc -DBOOST_GEOMETRY_SQRT_CHECK_FINITENESS -DDISABLE_MYSQL_THREAD_H -DHAVE_CONFIG_H -DHAVE_LIBEVENT2 -D_FILE_OFFSET_BITS=64 -D_GNU_SOURCE -I/tmp/B.8exqh5/BUILD/mysql-5.7.22/build/include -I/tmp/B.8exqh5/BUILD/mysql-5.7.22/extra/rapidjson/include -I/tmp/B.8exqh5/BUILD/mysql-5.7.22/build/libbinlogevents/include -I/tmp/B.8exqh5/BUILD/mysql-5.7.22/libbinlogevents/export -I/tmp/B.8exqh5/BUILD/mysql-5.7.22/include  -fPIC -Wall -Wextra -Wformat-security -Wvla -Wimplicit-fallthrough=2 -Wwrite-strings -Wdeclaration-after-statement -O3 -O2 -fwrapv -pipe -Wformat -Werror=format-security -gdwarf-4 -fno-debug-types-section -fvar-tracking-assignments -g2 -Wp,-D_FORTIFY_SOURCE=2 -fstack-protector-strong --param=ssp-buffer-size=4 -fPIC -mtune=generic -march=x86-64 -gdwarf-4 -fno-debug-types-section -fvar-tracking-assignments -g2  -DNDEBUG -fno-omit-frame-pointer -fno-strict-aliasing -g -fabi-version=2 -fno-omit-frame-pointer -fno-strict-aliasing -DDBUG_OFF   -o CMakeFiles/strings.dir/llstr.c.o   -c /tmp/B.8exqh5/BUILD/mysql-5.7.22/strings/llstr.c
make[2]: Leaving directory '/tmp/B.8exqh5/BUILD/mysql-5.7.22/build'
make[2]: Entering directory '/tmp/B.8exqh5/BUILD/mysql-5.7.22/build'
[  3%] Linking CXX shared library ../lib/libbinlogstandalone.so
cd /tmp/B.8exqh5/BUILD/mysql-5.7.22/build/libbinlogstandalone/src && /usr/bin/cmake -E cmake_link_script CMakeFiles/binlogstandalone_shared.dir/link.txt --verbose=1
/usr/bin/x86_64-pld-linux-gnux32-g++ -fPIC  -fPIC -Wall -Wextra -Wformat-security -Wvla -Wimplicit-fallthrough=2 -Woverloaded-virtual -Wno-unused-parameter -O3 -O2 -fwrapv -pipe -Wformat -Werror=format-security -gdwarf-4 -fno-debug-types-section -fvar-tracking-assignments -g2 -Wp,-D_FORTIFY_SOURCE=2 -fstack-protector-strong --param=ssp-buffer-size=4 -fPIC -mtune=generic -march=x86-64 -gdwarf-4 -fno-debug-types-section -fvar-tracking-assignments -g2  -DNDEBUG -fno-omit-frame-pointer -fno-strict-aliasing -g -fabi-version=2 -fno-omit-frame-pointer -fno-strict-aliasing -std=gnu++03 -DDBUG_OFF -fPIC  -shared -Wl,-soname,libbinlogstandalone.so -o ../lib/libbinlogstandalone.so CMakeFiles/binlogstandalone_shared.dir/__/__/libbinlogevents/src/load_data_events.cpp.o CMakeFiles/binlogstandalone_shared.dir/__/__/libbinlogevents/src/rows_event.cpp.o CMakeFiles/binlogstandalone_shared.dir/__/__/libbinlogevents/src/binlog_event.cpp.o CMakeFiles/binlogstandalone_shared.dir/__/__/libbinlogevents/src/control_events.cpp.o CMakeFiles/binlogstandalone_shared.dir/__/__/libbinlogevents/src/statement_events.cpp.o CMakeFiles/binlogstandalone_shared.dir/__/__/libbinlogevents/src/uuid.cpp.o -lpthread -lz 
make[2]: Leaving directory '/tmp/B.8exqh5/BUILD/mysql-5.7.22/build'
make[2]: Entering directory '/tmp/B.8exqh5/BUILD/mysql-5.7.22/build'
[  3%] Building C object strings/CMakeFiles/strings.dir/longlong2str.c.o
cd /tmp/B.8exqh5/BUILD/mysql-5.7.22/build/strings && /usr/bin/x86_64-pld-linux-gnux32-gcc -DBOOST_GEOMETRY_SQRT_CHECK_FINITENESS -DDISABLE_MYSQL_THREAD_H -DHAVE_CONFIG_H -DHAVE_LIBEVENT2 -D_FILE_OFFSET_BITS=64 -D_GNU_SOURCE -I/tmp/B.8exqh5/BUILD/mysql-5.7.22/build/include -I/tmp/B.8exqh5/BUILD/mysql-5.7.22/extra/rapidjson/include -I/tmp/B.8exqh5/BUILD/mysql-5.7.22/build/libbinlogevents/include -I/tmp/B.8exqh5/BUILD/mysql-5.7.22/libbinlogevents/export -I/tmp/B.8exqh5/BUILD/mysql-5.7.22/include  -fPIC -Wall -Wextra -Wformat-security -Wvla -Wimplicit-fallthrough=2 -Wwrite-strings -Wdeclaration-after-statement -O3 -O2 -fwrapv -pipe -Wformat -Werror=format-security -gdwarf-4 -fno-debug-types-section -fvar-tracking-assignments -g2 -Wp,-D_FORTIFY_SOURCE=2 -fstack-protector-strong --param=ssp-buffer-size=4 -fPIC -mtune=generic -march=x86-64 -gdwarf-4 -fno-debug-types-section -fvar-tracking-assignments -g2  -DNDEBUG -fno-omit-frame-pointer -fno-strict-aliasing -g -fabi-version=2 -fno-omit-frame-pointer -fno-strict-aliasing -DDBUG_OFF   -o CMakeFiles/strings.dir/longlong2str.c.o   -c /tmp/B.8exqh5/BUILD/mysql-5.7.22/strings/longlong2str.c
make[2]: Leaving directory '/tmp/B.8exqh5/BUILD/mysql-5.7.22/build'
make[1]: Entering directory '/tmp/B.8exqh5/BUILD/mysql-5.7.22/build'
[  3%] Built target binlogstandalone_shared
make[1]: Leaving directory '/tmp/B.8exqh5/BUILD/mysql-5.7.22/build'
make[2]: Entering directory '/tmp/B.8exqh5/BUILD/mysql-5.7.22/build'
[  3%] Building C object strings/CMakeFiles/strings.dir/my_strtoll10.c.o
cd /tmp/B.8exqh5/BUILD/mysql-5.7.22/build/strings && /usr/bin/x86_64-pld-linux-gnux32-gcc -DBOOST_GEOMETRY_SQRT_CHECK_FINITENESS -DDISABLE_MYSQL_THREAD_H -DHAVE_CONFIG_H -DHAVE_LIBEVENT2 -D_FILE_OFFSET_BITS=64 -D_GNU_SOURCE -I/tmp/B.8exqh5/BUILD/mysql-5.7.22/build/include -I/tmp/B.8exqh5/BUILD/mysql-5.7.22/extra/rapidjson/include -I/tmp/B.8exqh5/BUILD/mysql-5.7.22/build/libbinlogevents/include -I/tmp/B.8exqh5/BUILD/mysql-5.7.22/libbinlogevents/export -I/tmp/B.8exqh5/BUILD/mysql-5.7.22/include  -fPIC -Wall -Wextra -Wformat-security -Wvla -Wimplicit-fallthrough=2 -Wwrite-strings -Wdeclaration-after-statement -O3 -O2 -fwrapv -pipe -Wformat -Werror=format-security -gdwarf-4 -fno-debug-types-section -fvar-tracking-assignments -g2 -Wp,-D_FORTIFY_SOURCE=2 -fstack-protector-strong --param=ssp-buffer-size=4 -fPIC -mtune=generic -march=x86-64 -gdwarf-4 -fno-debug-types-section -fvar-tracking-assignments -g2  -DNDEBUG -fno-omit-frame-pointer -fno-strict-aliasing -g -fabi-version=2 -fno-omit-frame-pointer -fno-strict-aliasing -DDBUG_OFF   -o CMakeFiles/strings.dir/my_strtoll10.c.o   -c /tmp/B.8exqh5/BUILD/mysql-5.7.22/strings/my_strtoll10.c
make[2]: Leaving directory '/tmp/B.8exqh5/BUILD/mysql-5.7.22/build'
make[2]: Entering directory '/tmp/B.8exqh5/BUILD/mysql-5.7.22/build'
[  3%] Linking CXX static library ../../../archive_output_directory/libgr_unit_test_resource.a
cd /tmp/B.8exqh5/BUILD/mysql-5.7.22/build/rapid/plugin/group_replication && /usr/bin/cmake -P CMakeFiles/gr_unit_test_resource.dir/cmake_clean_target.cmake
cd /tmp/B.8exqh5/BUILD/mysql-5.7.22/build/rapid/plugin/group_replication && /usr/bin/cmake -E cmake_link_script CMakeFiles/gr_unit_test_resource.dir/link.txt --verbose=1
/usr/bin/ar qc ../../../archive_output_directory/libgr_unit_test_resource.a  CMakeFiles/gr_unit_test_resource.dir/src/gcs_plugin_messages.cc.o CMakeFiles/gr_unit_test_resource.dir/src/member_info.cc.o CMakeFiles/gr_unit_test_resource.dir/src/member_version.cc.o CMakeFiles/gr_unit_test_resource.dir/src/compatibility_module.cc.o CMakeFiles/gr_unit_test_resource.dir/libmysqlgcs/src/interface/gcs_logging.cc.o CMakeFiles/gr_unit_test_resource.dir/libmysqlgcs/src/interface/xplatform/my_xp_cond.cc.o CMakeFiles/gr_unit_test_resource.dir/libmysqlgcs/src/interface/xplatform/my_xp_thread.cc.o CMakeFiles/gr_unit_test_resource.dir/libmysqlgcs/src/interface/xplatform/my_xp_mutex.cc.o CMakeFiles/gr_unit_test_resource.dir/libmysqlgcs/src/interface/xplatform/my_xp_util.cc.o CMakeFiles/gr_unit_test_resource.dir/libmysqlgcs/src/interface/gcs_view.cc.o CMakeFiles/gr_unit_test_resource.dir/libmysqlgcs/src/interface/gcs_types.cc.o CMakeFiles/gr_unit_test_resource.dir/libmysqlgcs/src/interface/gcs_message.cc.o CMakeFiles/gr_unit_test_resource.dir/libmysqlgcs/src/interface/gcs_member_identifier.cc.o CMakeFiles/gr_unit_test_resource.dir/libmysqlgcs/src/interface/gcs_group_identifier.cc.o
/usr/bin/ranlib ../../../archive_output_directory/libgr_unit_test_resource.a
cd /tmp/B.8exqh5/BUILD/mysql-5.7.22/build/rapid/plugin/group_replication && /usr/bin/cmake -DTARGET_NAME=gr_unit_test_resource -DTARGET_LOC=/tmp/B.8exqh5/BUILD/mysql-5.7.22/build/archive_output_directory/libgr_unit_test_resource.a -DCFG_INTDIR=. -P /tmp/B.8exqh5/BUILD/mysql-5.7.22/build/archive_output_directory/lib_location_gr_unit_test_resource.cmake
make[2]: Leaving directory '/tmp/B.8exqh5/BUILD/mysql-5.7.22/build'
make[2]: Entering directory '/tmp/B.8exqh5/BUILD/mysql-5.7.22/build'
[  3%] Building C object strings/CMakeFiles/strings.dir/str_alloc.c.o
cd /tmp/B.8exqh5/BUILD/mysql-5.7.22/build/strings && /usr/bin/x86_64-pld-linux-gnux32-gcc -DBOOST_GEOMETRY_SQRT_CHECK_FINITENESS -DDISABLE_MYSQL_THREAD_H -DHAVE_CONFIG_H -DHAVE_LIBEVENT2 -D_FILE_OFFSET_BITS=64 -D_GNU_SOURCE -I/tmp/B.8exqh5/BUILD/mysql-5.7.22/build/include -I/tmp/B.8exqh5/BUILD/mysql-5.7.22/extra/rapidjson/include -I/tmp/B.8exqh5/BUILD/mysql-5.7.22/build/libbinlogevents/include -I/tmp/B.8exqh5/BUILD/mysql-5.7.22/libbinlogevents/export -I/tmp/B.8exqh5/BUILD/mysql-5.7.22/include  -fPIC -Wall -Wextra -Wformat-security -Wvla -Wimplicit-fallthrough=2 -Wwrite-strings -Wdeclaration-after-statement -O3 -O2 -fwrapv -pipe -Wformat -Werror=format-security -gdwarf-4 -fno-debug-types-section -fvar-tracking-assignments -g2 -Wp,-D_FORTIFY_SOURCE=2 -fstack-protector-strong --param=ssp-buffer-size=4 -fPIC -mtune=generic -march=x86-64 -gdwarf-4 -fno-debug-types-section -fvar-tracking-assignments -g2  -DNDEBUG -fno-omit-frame-pointer -fno-strict-aliasing -g -fabi-version=2 -fno-omit-frame-pointer -fno-strict-aliasing -DDBUG_OFF   -o CMakeFiles/strings.dir/str_alloc.c.o   -c /tmp/B.8exqh5/BUILD/mysql-5.7.22/strings/str_alloc.c
make[2]: Leaving directory '/tmp/B.8exqh5/BUILD/mysql-5.7.22/build'
make[2]: Entering directory '/tmp/B.8exqh5/BUILD/mysql-5.7.22/build'
[  3%] Building C object strings/CMakeFiles/strings.dir/str2int.c.o
cd /tmp/B.8exqh5/BUILD/mysql-5.7.22/build/strings && /usr/bin/x86_64-pld-linux-gnux32-gcc -DBOOST_GEOMETRY_SQRT_CHECK_FINITENESS -DDISABLE_MYSQL_THREAD_H -DHAVE_CONFIG_H -DHAVE_LIBEVENT2 -D_FILE_OFFSET_BITS=64 -D_GNU_SOURCE -I/tmp/B.8exqh5/BUILD/mysql-5.7.22/build/include -I/tmp/B.8exqh5/BUILD/mysql-5.7.22/extra/rapidjson/include -I/tmp/B.8exqh5/BUILD/mysql-5.7.22/build/libbinlogevents/include -I/tmp/B.8exqh5/BUILD/mysql-5.7.22/libbinlogevents/export -I/tmp/B.8exqh5/BUILD/mysql-5.7.22/include  -fPIC -Wall -Wextra -Wformat-security -Wvla -Wimplicit-fallthrough=2 -Wwrite-strings -Wdeclaration-after-statement -O3 -O2 -fwrapv -pipe -Wformat -Werror=format-security -gdwarf-4 -fno-debug-types-section -fvar-tracking-assignments -g2 -Wp,-D_FORTIFY_SOURCE=2 -fstack-protector-strong --param=ssp-buffer-size=4 -fPIC -mtune=generic -march=x86-64 -gdwarf-4 -fno-debug-types-section -fvar-tracking-assignments -g2  -DNDEBUG -fno-omit-frame-pointer -fno-strict-aliasing -g -fabi-version=2 -fno-omit-frame-pointer -fno-strict-aliasing -DDBUG_OFF   -o CMakeFiles/strings.dir/str2int.c.o   -c /tmp/B.8exqh5/BUILD/mysql-5.7.22/strings/str2int.c
make[2]: Leaving directory '/tmp/B.8exqh5/BUILD/mysql-5.7.22/build'
make[1]: Entering directory '/tmp/B.8exqh5/BUILD/mysql-5.7.22/build'
[  4%] Built target gr_unit_test_resource
make[1]: Leaving directory '/tmp/B.8exqh5/BUILD/mysql-5.7.22/build'
make[2]: Entering directory '/tmp/B.8exqh5/BUILD/mysql-5.7.22/build'
[  3%] Building C object strings/CMakeFiles/strings.dir/ctype-ucs2.c.o
cd /tmp/B.8exqh5/BUILD/mysql-5.7.22/build/strings && /usr/bin/x86_64-pld-linux-gnux32-gcc -DBOOST_GEOMETRY_SQRT_CHECK_FINITENESS -DDISABLE_MYSQL_THREAD_H -DHAVE_CONFIG_H -DHAVE_LIBEVENT2 -D_FILE_OFFSET_BITS=64 -D_GNU_SOURCE -I/tmp/B.8exqh5/BUILD/mysql-5.7.22/build/include -I/tmp/B.8exqh5/BUILD/mysql-5.7.22/extra/rapidjson/include -I/tmp/B.8exqh5/BUILD/mysql-5.7.22/build/libbinlogevents/include -I/tmp/B.8exqh5/BUILD/mysql-5.7.22/libbinlogevents/export -I/tmp/B.8exqh5/BUILD/mysql-5.7.22/include  -fPIC -Wall -Wextra -Wformat-security -Wvla -Wimplicit-fallthrough=2 -Wwrite-strings -Wdeclaration-after-statement -O3 -O2 -fwrapv -pipe -Wformat -Werror=format-security -gdwarf-4 -fno-debug-types-section -fvar-tracking-assignments -g2 -Wp,-D_FORTIFY_SOURCE=2 -fstack-protector-strong --param=ssp-buffer-size=4 -fPIC -mtune=generic -march=x86-64 -gdwarf-4 -fno-debug-types-section -fvar-tracking-assignments -g2  -DNDEBUG -fno-omit-frame-pointer -fno-strict-aliasing -g -fabi-version=2 -fno-omit-frame-pointer -fno-strict-aliasing -DDBUG_OFF   -o CMakeFiles/strings.dir/ctype-ucs2.c.o   -c /tmp/B.8exqh5/BUILD/mysql-5.7.22/strings/ctype-ucs2.c
make[2]: Leaving directory '/tmp/B.8exqh5/BUILD/mysql-5.7.22/build'
make[2]: Entering directory '/tmp/B.8exqh5/BUILD/mysql-5.7.22/build'
[  3%] Building C object strings/CMakeFiles/strings.dir/strcend.c.o
cd /tmp/B.8exqh5/BUILD/mysql-5.7.22/build/strings && /usr/bin/x86_64-pld-linux-gnux32-gcc -DBOOST_GEOMETRY_SQRT_CHECK_FINITENESS -DDISABLE_MYSQL_THREAD_H -DHAVE_CONFIG_H -DHAVE_LIBEVENT2 -D_FILE_OFFSET_BITS=64 -D_GNU_SOURCE -I/tmp/B.8exqh5/BUILD/mysql-5.7.22/build/include -I/tmp/B.8exqh5/BUILD/mysql-5.7.22/extra/rapidjson/include -I/tmp/B.8exqh5/BUILD/mysql-5.7.22/build/libbinlogevents/include -I/tmp/B.8exqh5/BUILD/mysql-5.7.22/libbinlogevents/export -I/tmp/B.8exqh5/BUILD/mysql-5.7.22/include  -fPIC -Wall -Wextra -Wformat-security -Wvla -Wimplicit-fallthrough=2 -Wwrite-strings -Wdeclaration-after-statement -O3 -O2 -fwrapv -pipe -Wformat -Werror=format-security -gdwarf-4 -fno-debug-types-section -fvar-tracking-assignments -g2 -Wp,-D_FORTIFY_SOURCE=2 -fstack-protector-strong --param=ssp-buffer-size=4 -fPIC -mtune=generic -march=x86-64 -gdwarf-4 -fno-debug-types-section -fvar-tracking-assignments -g2  -DNDEBUG -fno-omit-frame-pointer -fno-strict-aliasing -g -fabi-version=2 -fno-omit-frame-pointer -fno-strict-aliasing -DDBUG_OFF   -o CMakeFiles/strings.dir/strcend.c.o   -c /tmp/B.8exqh5/BUILD/mysql-5.7.22/strings/strcend.c
make[2]: Leaving directory '/tmp/B.8exqh5/BUILD/mysql-5.7.22/build'
make[2]: Entering directory '/tmp/B.8exqh5/BUILD/mysql-5.7.22/build'
[  4%] Building C object strings/CMakeFiles/strings.dir/strend.c.o
cd /tmp/B.8exqh5/BUILD/mysql-5.7.22/build/strings && /usr/bin/x86_64-pld-linux-gnux32-gcc -DBOOST_GEOMETRY_SQRT_CHECK_FINITENESS -DDISABLE_MYSQL_THREAD_H -DHAVE_CONFIG_H -DHAVE_LIBEVENT2 -D_FILE_OFFSET_BITS=64 -D_GNU_SOURCE -I/tmp/B.8exqh5/BUILD/mysql-5.7.22/build/include -I/tmp/B.8exqh5/BUILD/mysql-5.7.22/extra/rapidjson/include -I/tmp/B.8exqh5/BUILD/mysql-5.7.22/build/libbinlogevents/include -I/tmp/B.8exqh5/BUILD/mysql-5.7.22/libbinlogevents/export -I/tmp/B.8exqh5/BUILD/mysql-5.7.22/include  -fPIC -Wall -Wextra -Wformat-security -Wvla -Wimplicit-fallthrough=2 -Wwrite-strings -Wdeclaration-after-statement -O3 -O2 -fwrapv -pipe -Wformat -Werror=format-security -gdwarf-4 -fno-debug-types-section -fvar-tracking-assignments -g2 -Wp,-D_FORTIFY_SOURCE=2 -fstack-protector-strong --param=ssp-buffer-size=4 -fPIC -mtune=generic -march=x86-64 -gdwarf-4 -fno-debug-types-section -fvar-tracking-assignments -g2  -DNDEBUG -fno-omit-frame-pointer -fno-strict-aliasing -g -fabi-version=2 -fno-omit-frame-pointer -fno-strict-aliasing -DDBUG_OFF   -o CMakeFiles/strings.dir/strend.c.o   -c /tmp/B.8exqh5/BUILD/mysql-5.7.22/strings/strend.c
make[2]: Leaving directory '/tmp/B.8exqh5/BUILD/mysql-5.7.22/build'
make[2]: Entering directory '/tmp/B.8exqh5/BUILD/mysql-5.7.22/build'
[  4%] Building C object strings/CMakeFiles/strings.dir/strfill.c.o
cd /tmp/B.8exqh5/BUILD/mysql-5.7.22/build/strings && /usr/bin/x86_64-pld-linux-gnux32-gcc -DBOOST_GEOMETRY_SQRT_CHECK_FINITENESS -DDISABLE_MYSQL_THREAD_H -DHAVE_CONFIG_H -DHAVE_LIBEVENT2 -D_FILE_OFFSET_BITS=64 -D_GNU_SOURCE -I/tmp/B.8exqh5/BUILD/mysql-5.7.22/build/include -I/tmp/B.8exqh5/BUILD/mysql-5.7.22/extra/rapidjson/include -I/tmp/B.8exqh5/BUILD/mysql-5.7.22/build/libbinlogevents/include -I/tmp/B.8exqh5/BUILD/mysql-5.7.22/libbinlogevents/export -I/tmp/B.8exqh5/BUILD/mysql-5.7.22/include  -fPIC -Wall -Wextra -Wformat-security -Wvla -Wimplicit-fallthrough=2 -Wwrite-strings -Wdeclaration-after-statement -O3 -O2 -fwrapv -pipe -Wformat -Werror=format-security -gdwarf-4 -fno-debug-types-section -fvar-tracking-assignments -g2 -Wp,-D_FORTIFY_SOURCE=2 -fstack-protector-strong --param=ssp-buffer-size=4 -fPIC -mtune=generic -march=x86-64 -gdwarf-4 -fno-debug-types-section -fvar-tracking-assignments -g2  -DNDEBUG -fno-omit-frame-pointer -fno-strict-aliasing -g -fabi-version=2 -fno-omit-frame-pointer -fno-strict-aliasing -DDBUG_OFF   -o CMakeFiles/strings.dir/strfill.c.o   -c /tmp/B.8exqh5/BUILD/mysql-5.7.22/strings/strfill.c
make[2]: Leaving directory '/tmp/B.8exqh5/BUILD/mysql-5.7.22/build'
make[2]: Entering directory '/tmp/B.8exqh5/BUILD/mysql-5.7.22/build'
[  4%] Building C object strings/CMakeFiles/strings.dir/strmake.c.o
cd /tmp/B.8exqh5/BUILD/mysql-5.7.22/build/strings && /usr/bin/x86_64-pld-linux-gnux32-gcc -DBOOST_GEOMETRY_SQRT_CHECK_FINITENESS -DDISABLE_MYSQL_THREAD_H -DHAVE_CONFIG_H -DHAVE_LIBEVENT2 -D_FILE_OFFSET_BITS=64 -D_GNU_SOURCE -I/tmp/B.8exqh5/BUILD/mysql-5.7.22/build/include -I/tmp/B.8exqh5/BUILD/mysql-5.7.22/extra/rapidjson/include -I/tmp/B.8exqh5/BUILD/mysql-5.7.22/build/libbinlogevents/include -I/tmp/B.8exqh5/BUILD/mysql-5.7.22/libbinlogevents/export -I/tmp/B.8exqh5/BUILD/mysql-5.7.22/include  -fPIC -Wall -Wextra -Wformat-security -Wvla -Wimplicit-fallthrough=2 -Wwrite-strings -Wdeclaration-after-statement -O3 -O2 -fwrapv -pipe -Wformat -Werror=format-security -gdwarf-4 -fno-debug-types-section -fvar-tracking-assignments -g2 -Wp,-D_FORTIFY_SOURCE=2 -fstack-protector-strong --param=ssp-buffer-size=4 -fPIC -mtune=generic -march=x86-64 -gdwarf-4 -fno-debug-types-section -fvar-tracking-assignments -g2  -DNDEBUG -fno-omit-frame-pointer -fno-strict-aliasing -g -fabi-version=2 -fno-omit-frame-pointer -fno-strict-aliasing -DDBUG_OFF   -o CMakeFiles/strings.dir/strmake.c.o   -c /tmp/B.8exqh5/BUILD/mysql-5.7.22/strings/strmake.c
make[2]: Leaving directory '/tmp/B.8exqh5/BUILD/mysql-5.7.22/build'
make[2]: Entering directory '/tmp/B.8exqh5/BUILD/mysql-5.7.22/build'
[  4%] Building C object strings/CMakeFiles/strings.dir/my_stpmov.c.o
cd /tmp/B.8exqh5/BUILD/mysql-5.7.22/build/strings && /usr/bin/x86_64-pld-linux-gnux32-gcc -DBOOST_GEOMETRY_SQRT_CHECK_FINITENESS -DDISABLE_MYSQL_THREAD_H -DHAVE_CONFIG_H -DHAVE_LIBEVENT2 -D_FILE_OFFSET_BITS=64 -D_GNU_SOURCE -I/tmp/B.8exqh5/BUILD/mysql-5.7.22/build/include -I/tmp/B.8exqh5/BUILD/mysql-5.7.22/extra/rapidjson/include -I/tmp/B.8exqh5/BUILD/mysql-5.7.22/build/libbinlogevents/include -I/tmp/B.8exqh5/BUILD/mysql-5.7.22/libbinlogevents/export -I/tmp/B.8exqh5/BUILD/mysql-5.7.22/include  -fPIC -Wall -Wextra -Wformat-security -Wvla -Wimplicit-fallthrough=2 -Wwrite-strings -Wdeclaration-after-statement -O3 -O2 -fwrapv -pipe -Wformat -Werror=format-security -gdwarf-4 -fno-debug-types-section -fvar-tracking-assignments -g2 -Wp,-D_FORTIFY_SOURCE=2 -fstack-protector-strong --param=ssp-buffer-size=4 -fPIC -mtune=generic -march=x86-64 -gdwarf-4 -fno-debug-types-section -fvar-tracking-assignments -g2  -DNDEBUG -fno-omit-frame-pointer -fno-strict-aliasing -g -fabi-version=2 -fno-omit-frame-pointer -fno-strict-aliasing -DDBUG_OFF   -o CMakeFiles/strings.dir/my_stpmov.c.o   -c /tmp/B.8exqh5/BUILD/mysql-5.7.22/strings/my_stpmov.c
make[2]: Leaving directory '/tmp/B.8exqh5/BUILD/mysql-5.7.22/build'
make[2]: Entering directory '/tmp/B.8exqh5/BUILD/mysql-5.7.22/build'
[  3%] Building C object strings/CMakeFiles/strings.dir/my_vsnprintf.c.o
cd /tmp/B.8exqh5/BUILD/mysql-5.7.22/build/strings && /usr/bin/x86_64-pld-linux-gnux32-gcc -DBOOST_GEOMETRY_SQRT_CHECK_FINITENESS -DDISABLE_MYSQL_THREAD_H -DHAVE_CONFIG_H -DHAVE_LIBEVENT2 -D_FILE_OFFSET_BITS=64 -D_GNU_SOURCE -I/tmp/B.8exqh5/BUILD/mysql-5.7.22/build/include -I/tmp/B.8exqh5/BUILD/mysql-5.7.22/extra/rapidjson/include -I/tmp/B.8exqh5/BUILD/mysql-5.7.22/build/libbinlogevents/include -I/tmp/B.8exqh5/BUILD/mysql-5.7.22/libbinlogevents/export -I/tmp/B.8exqh5/BUILD/mysql-5.7.22/include  -fPIC -Wall -Wextra -Wformat-security -Wvla -Wimplicit-fallthrough=2 -Wwrite-strings -Wdeclaration-after-statement -O3 -O2 -fwrapv -pipe -Wformat -Werror=format-security -gdwarf-4 -fno-debug-types-section -fvar-tracking-assignments -g2 -Wp,-D_FORTIFY_SOURCE=2 -fstack-protector-strong --param=ssp-buffer-size=4 -fPIC -mtune=generic -march=x86-64 -gdwarf-4 -fno-debug-types-section -fvar-tracking-assignments -g2  -DNDEBUG -fno-omit-frame-pointer -fno-strict-aliasing -g -fabi-version=2 -fno-omit-frame-pointer -fno-strict-aliasing -DDBUG_OFF   -o CMakeFiles/strings.dir/my_vsnprintf.c.o   -c /tmp/B.8exqh5/BUILD/mysql-5.7.22/strings/my_vsnprintf.c
make[2]: Leaving directory '/tmp/B.8exqh5/BUILD/mysql-5.7.22/build'
make[2]: Entering directory '/tmp/B.8exqh5/BUILD/mysql-5.7.22/build'
[  4%] Building C object strings/CMakeFiles/strings.dir/my_stpnmov.c.o
cd /tmp/B.8exqh5/BUILD/mysql-5.7.22/build/strings && /usr/bin/x86_64-pld-linux-gnux32-gcc -DBOOST_GEOMETRY_SQRT_CHECK_FINITENESS -DDISABLE_MYSQL_THREAD_H -DHAVE_CONFIG_H -DHAVE_LIBEVENT2 -D_FILE_OFFSET_BITS=64 -D_GNU_SOURCE -I/tmp/B.8exqh5/BUILD/mysql-5.7.22/build/include -I/tmp/B.8exqh5/BUILD/mysql-5.7.22/extra/rapidjson/include -I/tmp/B.8exqh5/BUILD/mysql-5.7.22/build/libbinlogevents/include -I/tmp/B.8exqh5/BUILD/mysql-5.7.22/libbinlogevents/export -I/tmp/B.8exqh5/BUILD/mysql-5.7.22/include  -fPIC -Wall -Wextra -Wformat-security -Wvla -Wimplicit-fallthrough=2 -Wwrite-strings -Wdeclaration-after-statement -O3 -O2 -fwrapv -pipe -Wformat -Werror=format-security -gdwarf-4 -fno-debug-types-section -fvar-tracking-assignments -g2 -Wp,-D_FORTIFY_SOURCE=2 -fstack-protector-strong --param=ssp-buffer-size=4 -fPIC -mtune=generic -march=x86-64 -gdwarf-4 -fno-debug-types-section -fvar-tracking-assignments -g2  -DNDEBUG -fno-omit-frame-pointer -fno-strict-aliasing -g -fabi-version=2 -fno-omit-frame-pointer -fno-strict-aliasing -DDBUG_OFF   -o CMakeFiles/strings.dir/my_stpnmov.c.o   -c /tmp/B.8exqh5/BUILD/mysql-5.7.22/strings/my_stpnmov.c
make[2]: Leaving directory '/tmp/B.8exqh5/BUILD/mysql-5.7.22/build'
make[2]: Entering directory '/tmp/B.8exqh5/BUILD/mysql-5.7.22/build'
[  4%] Building C object strings/CMakeFiles/strings.dir/strxmov.c.o
cd /tmp/B.8exqh5/BUILD/mysql-5.7.22/build/strings && /usr/bin/x86_64-pld-linux-gnux32-gcc -DBOOST_GEOMETRY_SQRT_CHECK_FINITENESS -DDISABLE_MYSQL_THREAD_H -DHAVE_CONFIG_H -DHAVE_LIBEVENT2 -D_FILE_OFFSET_BITS=64 -D_GNU_SOURCE -I/tmp/B.8exqh5/BUILD/mysql-5.7.22/build/include -I/tmp/B.8exqh5/BUILD/mysql-5.7.22/extra/rapidjson/include -I/tmp/B.8exqh5/BUILD/mysql-5.7.22/build/libbinlogevents/include -I/tmp/B.8exqh5/BUILD/mysql-5.7.22/libbinlogevents/export -I/tmp/B.8exqh5/BUILD/mysql-5.7.22/include  -fPIC -Wall -Wextra -Wformat-security -Wvla -Wimplicit-fallthrough=2 -Wwrite-strings -Wdeclaration-after-statement -O3 -O2 -fwrapv -pipe -Wformat -Werror=format-security -gdwarf-4 -fno-debug-types-section -fvar-tracking-assignments -g2 -Wp,-D_FORTIFY_SOURCE=2 -fstack-protector-strong --param=ssp-buffer-size=4 -fPIC -mtune=generic -march=x86-64 -gdwarf-4 -fno-debug-types-section -fvar-tracking-assignments -g2  -DNDEBUG -fno-omit-frame-pointer -fno-strict-aliasing -g -fabi-version=2 -fno-omit-frame-pointer -fno-strict-aliasing -DDBUG_OFF   -o CMakeFiles/strings.dir/strxmov.c.o   -c /tmp/B.8exqh5/BUILD/mysql-5.7.22/strings/strxmov.c
make[2]: Leaving directory '/tmp/B.8exqh5/BUILD/mysql-5.7.22/build'
make[2]: Entering directory '/tmp/B.8exqh5/BUILD/mysql-5.7.22/build'
[  4%] Building C object strings/CMakeFiles/strings.dir/strxnmov.c.o
cd /tmp/B.8exqh5/BUILD/mysql-5.7.22/build/strings && /usr/bin/x86_64-pld-linux-gnux32-gcc -DBOOST_GEOMETRY_SQRT_CHECK_FINITENESS -DDISABLE_MYSQL_THREAD_H -DHAVE_CONFIG_H -DHAVE_LIBEVENT2 -D_FILE_OFFSET_BITS=64 -D_GNU_SOURCE -I/tmp/B.8exqh5/BUILD/mysql-5.7.22/build/include -I/tmp/B.8exqh5/BUILD/mysql-5.7.22/extra/rapidjson/include -I/tmp/B.8exqh5/BUILD/mysql-5.7.22/build/libbinlogevents/include -I/tmp/B.8exqh5/BUILD/mysql-5.7.22/libbinlogevents/export -I/tmp/B.8exqh5/BUILD/mysql-5.7.22/include  -fPIC -Wall -Wextra -Wformat-security -Wvla -Wimplicit-fallthrough=2 -Wwrite-strings -Wdeclaration-after-statement -O3 -O2 -fwrapv -pipe -Wformat -Werror=format-security -gdwarf-4 -fno-debug-types-section -fvar-tracking-assignments -g2 -Wp,-D_FORTIFY_SOURCE=2 -fstack-protector-strong --param=ssp-buffer-size=4 -fPIC -mtune=generic -march=x86-64 -gdwarf-4 -fno-debug-types-section -fvar-tracking-assignments -g2  -DNDEBUG -fno-omit-frame-pointer -fno-strict-aliasing -g -fabi-version=2 -fno-omit-frame-pointer -fno-strict-aliasing -DDBUG_OFF   -o CMakeFiles/strings.dir/strxnmov.c.o   -c /tmp/B.8exqh5/BUILD/mysql-5.7.22/strings/strxnmov.c
make[2]: Leaving directory '/tmp/B.8exqh5/BUILD/mysql-5.7.22/build'
make[2]: Entering directory '/tmp/B.8exqh5/BUILD/mysql-5.7.22/build'
[  4%] Building C object strings/CMakeFiles/strings.dir/strcont.c.o
cd /tmp/B.8exqh5/BUILD/mysql-5.7.22/build/strings && /usr/bin/x86_64-pld-linux-gnux32-gcc -DBOOST_GEOMETRY_SQRT_CHECK_FINITENESS -DDISABLE_MYSQL_THREAD_H -DHAVE_CONFIG_H -DHAVE_LIBEVENT2 -D_FILE_OFFSET_BITS=64 -D_GNU_SOURCE -I/tmp/B.8exqh5/BUILD/mysql-5.7.22/build/include -I/tmp/B.8exqh5/BUILD/mysql-5.7.22/extra/rapidjson/include -I/tmp/B.8exqh5/BUILD/mysql-5.7.22/build/libbinlogevents/include -I/tmp/B.8exqh5/BUILD/mysql-5.7.22/libbinlogevents/export -I/tmp/B.8exqh5/BUILD/mysql-5.7.22/include  -fPIC -Wall -Wextra -Wformat-security -Wvla -Wimplicit-fallthrough=2 -Wwrite-strings -Wdeclaration-after-statement -O3 -O2 -fwrapv -pipe -Wformat -Werror=format-security -gdwarf-4 -fno-debug-types-section -fvar-tracking-assignments -g2 -Wp,-D_FORTIFY_SOURCE=2 -fstack-protector-strong --param=ssp-buffer-size=4 -fPIC -mtune=generic -march=x86-64 -gdwarf-4 -fno-debug-types-section -fvar-tracking-assignments -g2  -DNDEBUG -fno-omit-frame-pointer -fno-strict-aliasing -g -fabi-version=2 -fno-omit-frame-pointer -fno-strict-aliasing -DDBUG_OFF   -o CMakeFiles/strings.dir/strcont.c.o   -c /tmp/B.8exqh5/BUILD/mysql-5.7.22/strings/strcont.c
make[2]: Leaving directory '/tmp/B.8exqh5/BUILD/mysql-5.7.22/build'
make[2]: Entering directory '/tmp/B.8exqh5/BUILD/mysql-5.7.22/build'
[  3%] Building C object strings/CMakeFiles/strings.dir/dtoa.c.o
cd /tmp/B.8exqh5/BUILD/mysql-5.7.22/build/strings && /usr/bin/x86_64-pld-linux-gnux32-gcc -DBOOST_GEOMETRY_SQRT_CHECK_FINITENESS -DDISABLE_MYSQL_THREAD_H -DHAVE_CONFIG_H -DHAVE_LIBEVENT2 -D_FILE_OFFSET_BITS=64 -D_GNU_SOURCE -I/tmp/B.8exqh5/BUILD/mysql-5.7.22/build/include -I/tmp/B.8exqh5/BUILD/mysql-5.7.22/extra/rapidjson/include -I/tmp/B.8exqh5/BUILD/mysql-5.7.22/build/libbinlogevents/include -I/tmp/B.8exqh5/BUILD/mysql-5.7.22/libbinlogevents/export -I/tmp/B.8exqh5/BUILD/mysql-5.7.22/include  -fPIC -Wall -Wextra -Wformat-security -Wvla -Wimplicit-fallthrough=2 -Wwrite-strings -Wdeclaration-after-statement -O3 -O2 -fwrapv -pipe -Wformat -Werror=format-security -gdwarf-4 -fno-debug-types-section -fvar-tracking-assignments -g2 -Wp,-D_FORTIFY_SOURCE=2 -fstack-protector-strong --param=ssp-buffer-size=4 -fPIC -mtune=generic -march=x86-64 -gdwarf-4 -fno-debug-types-section -fvar-tracking-assignments -g2  -DNDEBUG -fno-omit-frame-pointer -fno-strict-aliasing -g -fabi-version=2 -fno-omit-frame-pointer -fno-strict-aliasing -DDBUG_OFF   -o CMakeFiles/strings.dir/dtoa.c.o   -c /tmp/B.8exqh5/BUILD/mysql-5.7.22/strings/dtoa.c
make[2]: Leaving directory '/tmp/B.8exqh5/BUILD/mysql-5.7.22/build'
make[2]: Entering directory '/tmp/B.8exqh5/BUILD/mysql-5.7.22/build'
[  4%] Building C object strings/CMakeFiles/strings.dir/strappend.c.o
cd /tmp/B.8exqh5/BUILD/mysql-5.7.22/build/strings && /usr/bin/x86_64-pld-linux-gnux32-gcc -DBOOST_GEOMETRY_SQRT_CHECK_FINITENESS -DDISABLE_MYSQL_THREAD_H -DHAVE_CONFIG_H -DHAVE_LIBEVENT2 -D_FILE_OFFSET_BITS=64 -D_GNU_SOURCE -I/tmp/B.8exqh5/BUILD/mysql-5.7.22/build/include -I/tmp/B.8exqh5/BUILD/mysql-5.7.22/extra/rapidjson/include -I/tmp/B.8exqh5/BUILD/mysql-5.7.22/build/libbinlogevents/include -I/tmp/B.8exqh5/BUILD/mysql-5.7.22/libbinlogevents/export -I/tmp/B.8exqh5/BUILD/mysql-5.7.22/include  -fPIC -Wall -Wextra -Wformat-security -Wvla -Wimplicit-fallthrough=2 -Wwrite-strings -Wdeclaration-after-statement -O3 -O2 -fwrapv -pipe -Wformat -Werror=format-security -gdwarf-4 -fno-debug-types-section -fvar-tracking-assignments -g2 -Wp,-D_FORTIFY_SOURCE=2 -fstack-protector-strong --param=ssp-buffer-size=4 -fPIC -mtune=generic -march=x86-64 -gdwarf-4 -fno-debug-types-section -fvar-tracking-assignments -g2  -DNDEBUG -fno-omit-frame-pointer -fno-strict-aliasing -g -fabi-version=2 -fno-omit-frame-pointer -fno-strict-aliasing -DDBUG_OFF   -o CMakeFiles/strings.dir/strappend.c.o   -c /tmp/B.8exqh5/BUILD/mysql-5.7.22/strings/strappend.c
make[2]: Leaving directory '/tmp/B.8exqh5/BUILD/mysql-5.7.22/build'
make[2]: Entering directory '/tmp/B.8exqh5/BUILD/mysql-5.7.22/build'
[  4%] Building C object strings/CMakeFiles/strings.dir/my_strchr.c.o
cd /tmp/B.8exqh5/BUILD/mysql-5.7.22/build/strings && /usr/bin/x86_64-pld-linux-gnux32-gcc -DBOOST_GEOMETRY_SQRT_CHECK_FINITENESS -DDISABLE_MYSQL_THREAD_H -DHAVE_CONFIG_H -DHAVE_LIBEVENT2 -D_FILE_OFFSET_BITS=64 -D_GNU_SOURCE -I/tmp/B.8exqh5/BUILD/mysql-5.7.22/build/include -I/tmp/B.8exqh5/BUILD/mysql-5.7.22/extra/rapidjson/include -I/tmp/B.8exqh5/BUILD/mysql-5.7.22/build/libbinlogevents/include -I/tmp/B.8exqh5/BUILD/mysql-5.7.22/libbinlogevents/export -I/tmp/B.8exqh5/BUILD/mysql-5.7.22/include  -fPIC -Wall -Wextra -Wformat-security -Wvla -Wimplicit-fallthrough=2 -Wwrite-strings -Wdeclaration-after-statement -O3 -O2 -fwrapv -pipe -Wformat -Werror=format-security -gdwarf-4 -fno-debug-types-section -fvar-tracking-assignments -g2 -Wp,-D_FORTIFY_SOURCE=2 -fstack-protector-strong --param=ssp-buffer-size=4 -fPIC -mtune=generic -march=x86-64 -gdwarf-4 -fno-debug-types-section -fvar-tracking-assignments -g2  -DNDEBUG -fno-omit-frame-pointer -fno-strict-aliasing -g -fabi-version=2 -fno-omit-frame-pointer -fno-strict-aliasing -DDBUG_OFF   -o CMakeFiles/strings.dir/my_strchr.c.o   -c /tmp/B.8exqh5/BUILD/mysql-5.7.22/strings/my_strchr.c
make[2]: Leaving directory '/tmp/B.8exqh5/BUILD/mysql-5.7.22/build'
make[2]: Entering directory '/tmp/B.8exqh5/BUILD/mysql-5.7.22/build'
[  4%] Building C object strings/CMakeFiles/strings.dir/xml.c.o
cd /tmp/B.8exqh5/BUILD/mysql-5.7.22/build/strings && /usr/bin/x86_64-pld-linux-gnux32-gcc -DBOOST_GEOMETRY_SQRT_CHECK_FINITENESS -DDISABLE_MYSQL_THREAD_H -DHAVE_CONFIG_H -DHAVE_LIBEVENT2 -D_FILE_OFFSET_BITS=64 -D_GNU_SOURCE -I/tmp/B.8exqh5/BUILD/mysql-5.7.22/build/include -I/tmp/B.8exqh5/BUILD/mysql-5.7.22/extra/rapidjson/include -I/tmp/B.8exqh5/BUILD/mysql-5.7.22/build/libbinlogevents/include -I/tmp/B.8exqh5/BUILD/mysql-5.7.22/libbinlogevents/export -I/tmp/B.8exqh5/BUILD/mysql-5.7.22/include  -fPIC -Wall -Wextra -Wformat-security -Wvla -Wimplicit-fallthrough=2 -Wwrite-strings -Wdeclaration-after-statement -O3 -O2 -fwrapv -pipe -Wformat -Werror=format-security -gdwarf-4 -fno-debug-types-section -fvar-tracking-assignments -g2 -Wp,-D_FORTIFY_SOURCE=2 -fstack-protector-strong --param=ssp-buffer-size=4 -fPIC -mtune=generic -march=x86-64 -gdwarf-4 -fno-debug-types-section -fvar-tracking-assignments -g2  -DNDEBUG -fno-omit-frame-pointer -fno-strict-aliasing -g -fabi-version=2 -fno-omit-frame-pointer -fno-strict-aliasing -DDBUG_OFF   -o CMakeFiles/strings.dir/xml.c.o   -c /tmp/B.8exqh5/BUILD/mysql-5.7.22/strings/xml.c
make[2]: Leaving directory '/tmp/B.8exqh5/BUILD/mysql-5.7.22/build'
make[2]: Entering directory '/tmp/B.8exqh5/BUILD/mysql-5.7.22/build'
[  3%] Building C object strings/CMakeFiles/strings.dir/decimal.c.o
cd /tmp/B.8exqh5/BUILD/mysql-5.7.22/build/strings && /usr/bin/x86_64-pld-linux-gnux32-gcc -DBOOST_GEOMETRY_SQRT_CHECK_FINITENESS -DDISABLE_MYSQL_THREAD_H -DHAVE_CONFIG_H -DHAVE_LIBEVENT2 -D_FILE_OFFSET_BITS=64 -D_GNU_SOURCE -I/tmp/B.8exqh5/BUILD/mysql-5.7.22/build/include -I/tmp/B.8exqh5/BUILD/mysql-5.7.22/extra/rapidjson/include -I/tmp/B.8exqh5/BUILD/mysql-5.7.22/build/libbinlogevents/include -I/tmp/B.8exqh5/BUILD/mysql-5.7.22/libbinlogevents/export -I/tmp/B.8exqh5/BUILD/mysql-5.7.22/include  -fPIC -Wall -Wextra -Wformat-security -Wvla -Wimplicit-fallthrough=2 -Wwrite-strings -Wdeclaration-after-statement -O3 -O2 -fwrapv -pipe -Wformat -Werror=format-security -gdwarf-4 -fno-debug-types-section -fvar-tracking-assignments -g2 -Wp,-D_FORTIFY_SOURCE=2 -fstack-protector-strong --param=ssp-buffer-size=4 -fPIC -mtune=generic -march=x86-64 -gdwarf-4 -fno-debug-types-section -fvar-tracking-assignments -g2  -DNDEBUG -fno-omit-frame-pointer -fno-strict-aliasing -g -fabi-version=2 -fno-omit-frame-pointer -fno-strict-aliasing -DDBUG_OFF   -o CMakeFiles/strings.dir/decimal.c.o   -c /tmp/B.8exqh5/BUILD/mysql-5.7.22/strings/decimal.c
make[2]: Leaving directory '/tmp/B.8exqh5/BUILD/mysql-5.7.22/build'
make[2]: Entering directory '/tmp/B.8exqh5/BUILD/mysql-5.7.22/build'
[  4%] Linking C static library ../archive_output_directory/libstrings.a
cd /tmp/B.8exqh5/BUILD/mysql-5.7.22/build/strings && /usr/bin/cmake -P CMakeFiles/strings.dir/cmake_clean_target.cmake
cd /tmp/B.8exqh5/BUILD/mysql-5.7.22/build/strings && /usr/bin/cmake -E cmake_link_script CMakeFiles/strings.dir/link.txt --verbose=1
/usr/bin/ar qc ../archive_output_directory/libstrings.a  CMakeFiles/strings.dir/bchange.c.o CMakeFiles/strings.dir/ctype-big5.c.o CMakeFiles/strings.dir/ctype-bin.c.o CMakeFiles/strings.dir/ctype-cp932.c.o CMakeFiles/strings.dir/ctype-czech.c.o CMakeFiles/strings.dir/ctype-euc_kr.c.o CMakeFiles/strings.dir/ctype-eucjpms.c.o CMakeFiles/strings.dir/ctype-extra.c.o CMakeFiles/strings.dir/ctype-gb2312.c.o CMakeFiles/strings.dir/ctype-gbk.c.o CMakeFiles/strings.dir/ctype-gb18030.c.o CMakeFiles/strings.dir/ctype-latin1.c.o CMakeFiles/strings.dir/ctype-mb.c.o CMakeFiles/strings.dir/ctype-simple.c.o CMakeFiles/strings.dir/ctype-sjis.c.o CMakeFiles/strings.dir/ctype-tis620.c.o CMakeFiles/strings.dir/ctype-uca.c.o CMakeFiles/strings.dir/ctype-ucs2.c.o CMakeFiles/strings.dir/ctype-ujis.c.o CMakeFiles/strings.dir/ctype-utf8.c.o CMakeFiles/strings.dir/ctype-win1250ch.c.o CMakeFiles/strings.dir/ctype.c.o CMakeFiles/strings.dir/decimal.c.o CMakeFiles/strings.dir/dtoa.c.o CMakeFiles/strings.dir/int2str.c.o CMakeFiles/strings.dir/is_prefix.c.o CMakeFiles/strings.dir/llstr.c.o CMakeFiles/strings.dir/longlong2str.c.o CMakeFiles/strings.dir/my_strtoll10.c.o CMakeFiles/strings.dir/my_vsnprintf.c.o CMakeFiles/strings.dir/str2int.c.o CMakeFiles/strings.dir/str_alloc.c.o CMakeFiles/strings.dir/strcend.c.o CMakeFiles/strings.dir/strend.c.o CMakeFiles/strings.dir/strfill.c.o CMakeFiles/strings.dir/strmake.c.o CMakeFiles/strings.dir/my_stpmov.c.o CMakeFiles/strings.dir/my_stpnmov.c.o CMakeFiles/strings.dir/strxmov.c.o CMakeFiles/strings.dir/strxnmov.c.o CMakeFiles/strings.dir/xml.c.o CMakeFiles/strings.dir/my_strchr.c.o CMakeFiles/strings.dir/strcont.c.o CMakeFiles/strings.dir/strappend.c.o
/usr/bin/ranlib ../archive_output_directory/libstrings.a
cd /tmp/B.8exqh5/BUILD/mysql-5.7.22/build/strings && /usr/bin/cmake -DTARGET_NAME=strings -DTARGET_LOC=/tmp/B.8exqh5/BUILD/mysql-5.7.22/build/archive_output_directory/libstrings.a -DCFG_INTDIR=. -P /tmp/B.8exqh5/BUILD/mysql-5.7.22/build/archive_output_directory/lib_location_strings.cmake
make[2]: Leaving directory '/tmp/B.8exqh5/BUILD/mysql-5.7.22/build'
make[1]: Entering directory '/tmp/B.8exqh5/BUILD/mysql-5.7.22/build'
[  4%] Built target strings
make[1]: Leaving directory '/tmp/B.8exqh5/BUILD/mysql-5.7.22/build'
make: *** [Makefile:166: all] Error 2
error: Bad exit status from /tmp/B.8exqh5/BUILD/tmp/rpm-tmp.89223 (%build)


RPM build errors:
    Bad exit status from /tmp/B.8exqh5/BUILD/tmp/rpm-tmp.89223 (%build)
ended at: Thu Sep 13 21:01:49 2018, done in 0:02:09.311220
error: No files produced.
+ chmod -R u+rwX /tmp/B.8exqh5/BUILD
+ rm -rf /tmp/B.8exqh5/tmp /tmp/B.8exqh5/BUILD
+ rm -rf /tmp/B.8exqh5
Begin-PLD-Builder-Info
Build-Time: user:209.53s sys:85.73s real:169.31s (faults io:346 non-io:2911402)

End-PLD-Builder-Info
[Back to list of logs] [View rpm -qa of builder]