FailedOk

th/SRPMS[OK]
th/x32[OK]
th/i686[OK]
th/x86_64[OK]

ac/SRPMS[OK]
ac/i386[OK]
ac/i586[OK]
ac/i686[OK]
ac/alpha[OK]
ac/amd64[OK]
ac/athlon[OK]
ac/ppc[OK]
ac/sparc[OK]
ac/sparc64[OK]

Advanced Search
main()
Powered by PLD Linux
(c) 2002-2018 PLD Team
$Revision: 1.37 $
Powered by VAX.
Your IP: 54.221.147.93

nfs-utils 0656943a-cdc5-4d2e-aa1d-b8cd1a948ab2

Status:Failed
Source URL:ftp://buildlogs.pld-linux.org/th/x32/FAIL/nfs-utils,0656943a-cdc5-4d2e-aa1d-b8cd1a948ab2.bz2
text/plain URL:View!
rpm -qa of builder:View!
Date:2018/11/26 00:33:17
Runtime:0:00:27.474114

Toc:

  • prep
  • Executing(%prep): /bin/sh -e /tmp/B.P3wIU5/BUILD/tmp/rpm-tmp.76985
  • build
  • Executing(%build): /bin/sh -e /tmp/B.P3wIU5/BUILD/tmp/rpm-tmp.76985
  • error 1
  • cacheio.c:237:20: error: format '%ld' expects argument of type 'long int', but argument 3 has type '__time_t' {aka 'long long int'} [-Werror=format=]
  • error 2
  • make[2]: *** [Makefile:505: cacheio.lo] Error 1
  • error 3
  • make[1]: *** [Makefile:436: all-recursive] Error 1
  • error 4
  • error: Bad exit status from /tmp/B.P3wIU5/BUILD/tmp/rpm-tmp.76985 (%build)
  • error 5
  • RPM build errors:
  • error 6
  • error: No files produced.

Content:

request from: qboosh
checking if we should skip the build
started at: Mon Nov 26 00:32:47 2018
killing old processes on a builder
sending signal 9 to pid -1
Killed
cleaning up /tmp
fetching https://srcbuilder.pld-linux.org/th//srpms/0656943a-cdc5-4d2e-aa1d-b8cd1a948ab2/nfs-utils-2.3.3-1.src.rpm
fetched 776417 bytes, 1150.6 K/s
installing srpm: nfs-utils-2.3.3-1.src.rpm
+ install -d /tmp/B.P3wIU5/BUILD /tmp/B.P3wIU5/RPMS
+ LC_ALL=en_US.UTF-8
+ rpm -qp --changelog nfs-utils-2.3.3-1.src.rpm
* Sun Nov 25 2018 PLD Linux Team <feedback@pld-linux.org>
- For complete changelog see: http://git.pld-linux.org/?p=packages/nfs-utils.git;a=log;h=master
* Sun Nov 25 2018 Jakub Bogusz <qboosh@pld-linux.org> 4923578
- updated to 2.3.3 * Thu Sep 06 2018 Jakub Bogusz <qboosh@pld-linux.org> c17b600
- up to 2.3.2 - updated heimdal patch - removed obsolete rpc-include patch - now libnfsidmap is built here + rpm -Uhv --nodeps --define '_topdir /tmp/B.P3wIU5' --define '_specdir %{_topdir}' --define '_sourcedir %{_specdir}' --define '_rpmdir %{_topdir}/RPMS' --define '_builddir %{_topdir}/BUILD' nfs-utils-2.3.3-1.src.rpm Preparing... ################################################## nfs-utils ################################################## + rm -f nfs-utils-2.3.3-1.src.rpm + install -m 700 -d /tmp/B.P3wIU5/BUILD/tmp + TMPDIR=/tmp/B.P3wIU5/BUILD/tmp + exec nice -n 0 rpmbuild -bp --short-circuit --nodeps --define '_topdir /tmp/B.P3wIU5' --define '_specdir %{_topdir}' --define '_sourcedir %{_specdir}' --define '_rpmdir %{_topdir}/RPMS' --define '_builddir %{_topdir}/BUILD' --target x32-pld-linux --define 'prep exit 0' /tmp/B.P3wIU5/nfs-utils.spec Building target platforms: x32-pld-linux checking BuildConflict-ing packages no BuildConflicts found checking BR rpm: Building target platforms: x32-pld-linux no BR needed building RPM using: set -ex; : build-id: 0656943a-cdc5-4d2e-aa1d-b8cd1a948ab2; TMPDIR=/tmp/B.P3wIU5/BUILD/tmp exec nice -n 0 rpmbuild -bb --define '_smp_mflags -j9' --define '_make_opts -Otarget' --define '_pld_builder 1' --define '_topdir /tmp/B.P3wIU5' --define '_specdir %{_topdir}' --define '_sourcedir %{_specdir}' --define '_rpmdir %{_topdir}/RPMS' --define '_builddir %{_topdir}/BUILD' --target x32-pld-linux /tmp/B.P3wIU5/nfs-utils.spec + : build-id: 0656943a-cdc5-4d2e-aa1d-b8cd1a948ab2 + TMPDIR=/tmp/B.P3wIU5/BUILD/tmp + exec nice -n 0 rpmbuild -bb --define '_smp_mflags -j9' --define '_make_opts -Otarget' --define '_pld_builder 1' --define '_topdir /tmp/B.P3wIU5' --define '_specdir %{_topdir}' --define '_sourcedir %{_specdir}' --define '_rpmdir %{_topdir}/RPMS' --define '_builddir %{_topdir}/BUILD' --target x32-pld-linux /tmp/B.P3wIU5/nfs-utils.spec Building target platforms: x32-pld-linux Executing(%prep): /bin/sh -e /tmp/B.P3wIU5/BUILD/tmp/rpm-tmp.76985 + umask 022 + cd /tmp/B.P3wIU5/BUILD + cd /tmp/B.P3wIU5/BUILD + rm -rf nfs-utils-2.3.3 + /usr/bin/xz -dc /tmp/B.P3wIU5/nfs-utils-2.3.3.tar.xz + /bin/tar -xf - + STATUS=0 + '[' 0 -ne 0 ']' + cd nfs-utils-2.3.3 + /usr/bin/gzip -dc /tmp/B.P3wIU5/nfs.doc.tar.gz + /bin/tar -xf - + STATUS=0 + '[' 0 -ne 0 ']' + /bin/id -u + '[' 1000 '=' 0 ']' + /bin/id -u + '[' 1000 '=' 0 ']' + /bin/chmod -Rf a+rX,u+w,g-w,o-w . + echo 'Patch #0 (nfs-utils-install.patch):' Patch #0 (nfs-utils-install.patch): + '[' -f /tmp/B.P3wIU5/nfs-utils-install.patch ']' + /bin/cat /tmp/B.P3wIU5/nfs-utils-install.patch + /usr/bin/patch -s -p1 + echo 'Patch #1 (nfs-utils-statdpath.patch):' Patch #1 (nfs-utils-statdpath.patch): + '[' -f /tmp/B.P3wIU5/nfs-utils-statdpath.patch ']' + /bin/cat /tmp/B.P3wIU5/nfs-utils-statdpath.patch + /usr/bin/patch -s -p1 + echo 'Patch #2 (nfs-utils-subsys.patch):' Patch #2 (nfs-utils-subsys.patch): + '[' -f /tmp/B.P3wIU5/nfs-utils-subsys.patch ']' + /bin/cat /tmp/B.P3wIU5/nfs-utils-subsys.patch + /usr/bin/patch -s -p1 + echo 'Patch #3 (nfs-utils-union-mount.patch):' Patch #3 (nfs-utils-union-mount.patch): + '[' -f /tmp/B.P3wIU5/nfs-utils-union-mount.patch ']' + /bin/cat /tmp/B.P3wIU5/nfs-utils-union-mount.patch + /usr/bin/patch -s -p1 + echo 'Patch #4 (nfs-utils-heimdal.patch):' Patch #4 (nfs-utils-heimdal.patch): + '[' -f /tmp/B.P3wIU5/nfs-utils-heimdal.patch ']' + /bin/cat /tmp/B.P3wIU5/nfs-utils-heimdal.patch + /usr/bin/patch -s -p1 + echo 'Patch #5 (nfs-utils-x32.patch):' Patch #5 (nfs-utils-x32.patch): + '[' -f /tmp/B.P3wIU5/nfs-utils-x32.patch ']' + /bin/cat /tmp/B.P3wIU5/nfs-utils-x32.patch + /usr/bin/patch -s -p1 + exit 0 Executing(%build): /bin/sh -e /tmp/B.P3wIU5/BUILD/tmp/rpm-tmp.76985 HOME=/home/users/builder PATH=/home/users/builder/GNUstep/Tools:/usr/local/bin:/usr/bin:/bin TMPDIR=/tmp/B.P3wIU5/BUILD/tmp + umask 022 + cd /tmp/B.P3wIU5/BUILD + cd nfs-utils-2.3.3 + libtoolize --copy --force --install libtoolize: putting auxiliary files in '.'. libtoolize: copying file './config.guess' libtoolize: copying file './config.sub' libtoolize: copying file './install-sh' libtoolize: copying file './ltmain.sh' libtoolize: putting macros in AC_CONFIG_MACRO_DIRS, 'aclocal'. libtoolize: copying file 'aclocal/libtool.m4' libtoolize: You should add the contents of 'aclocal/libtool.m4' to 'aclocal.m4'. libtoolize: copying file 'aclocal/ltoptions.m4' libtoolize: You should add the contents of 'aclocal/ltoptions.m4' to 'aclocal.m4'. libtoolize: copying file 'aclocal/ltsugar.m4' libtoolize: You should add the contents of 'aclocal/ltsugar.m4' to 'aclocal.m4'. libtoolize: copying file 'aclocal/ltversion.m4' libtoolize: copying file 'aclocal/lt~obsolete.m4' libtoolize: You should add the contents of 'aclocal/lt~obsolete.m4' to 'aclocal.m4'. + aclocal -I aclocal + autoconf + autoheader + automake -a -c -f --foreign configure.ac:11: installing './compile' configure.ac:7: installing './missing' support/export/Makefile.am: installing './depcomp' + ./configure 'LDFLAGS=-Wl,--as-needed -Wl,--no-copy-dt-needed-entries -Wl,-z,relro -Wl,-z,combreloc ' 'CFLAGS=-O2 -fwrapv -pipe -Wformat -Werror=format-security -gdwarf-4 -fno-debug-types-section -fvar-tracking-assignments -g2 -Wp,-D_FORTIFY_SOURCE=2 -fstack-protector-strong --param=ssp-buffer-size=4 -fPIC -mtune=generic -march=x86-64 -gdwarf-4 -fno-debug-types-section -fvar-tracking-assignments -g2 ' 'CXXFLAGS=-O2 -fwrapv -pipe -Wformat -Werror=format-security -gdwarf-4 -fno-debug-types-section -fvar-tracking-assignments -g2 -Wp,-D_FORTIFY_SOURCE=2 -fstack-protector-strong --param=ssp-buffer-size=4 -fPIC -mtune=generic -march=x86-64 -gdwarf-4 -fno-debug-types-section -fvar-tracking-assignments -g2 ' 'FFLAGS=-O2 -fwrapv -pipe -Wformat -Werror=format-security -gdwarf-4 -fno-debug-types-section -fvar-tracking-assignments -g2 -Wp,-D_FORTIFY_SOURCE=2 -fstack-protector-strong --param=ssp-buffer-size=4 -fPIC -mtune=generic -march=x86-64 -gdwarf-4 -fno-debug-types-section -fvar-tracking-assignments -g2 ' 'FCFLAGS=-O2 -fwrapv -pipe -Wformat -Werror=format-security -gdwarf-4 -fno-debug-types-section -fvar-tracking-assignments -g2 -Wp,-D_FORTIFY_SOURCE=2 -fstack-protector-strong --param=ssp-buffer-size=4 -fPIC -mtune=generic -march=x86-64 -gdwarf-4 -fno-debug-types-section -fvar-tracking-assignments -g2 ' 'CPPFLAGS=' 'CC=x86_64-pld-linux-gnux32-gcc' 'CXX=x86_64-pld-linux-gnux32-g++' '--host=x86_64-pld-linux-gnux32' '--build=x86_64-pld-linux-gnux32' '--prefix=/usr' '--exec-prefix=/usr' '--bindir=/usr/bin' '--sbindir=/usr/sbin' '--sysconfdir=/etc' '--datadir=/usr/share' '--includedir=/usr/include' '--libdir=/usr/libx32' '--libexecdir=/usr/libexec' '--localstatedir=/var' '--sharedstatedir=/var/lib' '--mandir=/usr/share/man' '--infodir=/usr/share/info' '--x-libraries=/usr/libx32' --enable-nfsv4 --enable-nfsv41 --enable-gss --enable-libmount-mount --enable-mount --enable-mountconfig --enable-svcgss --enable-ipv6 --enable-tirpc '--with-statdpath=/var/lib/nfs/statd' '--with-statedir=/var/lib/nfs' '--with-statduser=rpcstatd' '--with-start-statd=/sbin/start-statd' --without-gssglue --with-krb5 '--with-systemd=/lib/systemd/system' --with-tcp-wrappers checking build system type... x86_64-pld-linux-gnux32 checking host system type... x86_64-pld-linux-gnux32 checking for a BSD-compatible install... /usr/bin/install -c checking whether build environment is sane... yes checking for a thread-safe mkdir -p... /bin/mkdir -p checking for mawk... mawk checking whether make sets $(MAKE)... yes checking whether make supports nested variables... yes checking whether to enable maintainer-specific portions of Makefiles... no checking whether make supports the include directive... yes (GNU style) checking for x86_64-pld-linux-gnux32-gcc... x86_64-pld-linux-gnux32-gcc checking whether the C compiler works... yes checking for C compiler default output file name... a.out checking for suffix of executables... checking whether we are cross compiling... no checking for suffix of object files... o checking whether we are using the GNU C compiler... yes checking whether x86_64-pld-linux-gnux32-gcc accepts -g... yes checking for x86_64-pld-linux-gnux32-gcc option to accept ISO C89... none needed checking whether x86_64-pld-linux-gnux32-gcc understands -c and -o together... yes checking dependency style of x86_64-pld-linux-gnux32-gcc... gcc3 checking how to run the C preprocessor... x86_64-pld-linux-gnux32-gcc -E checking for grep that handles long lines and -e... /bin/grep checking for egrep... /bin/grep -E checking for ANSI C header files... yes checking for sys/types.h... yes checking for sys/stat.h... yes checking for stdlib.h... yes checking for string.h... yes checking for memory.h... yes checking for strings.h... yes checking for inttypes.h... yes checking for stdint.h... yes checking for unistd.h... yes checking minix/config.h usability... no checking minix/config.h presence... no checking for minix/config.h... no checking whether it is safe to define __EXTENSIONS__... yes checking for x86_64-pld-linux-gnux32-pkg-config... /usr/bin/x86_64-pld-linux-gnux32-pkg-config checking pkg-config is at least version 0.9.0... yes checking for libtirpc... yes checking for authgss_free_private_data in -ltirpc... yes checking for libtirpc_set_debug in -ltirpc... yes checking for prctl... yes checking for cap_get_proc in -lcap... yes checking sys/capability.h usability... yes checking sys/capability.h presence... yes checking for sys/capability.h... yes checking for libwrap... yes checking for special C compiler options needed for large files... no checking for _FILE_OFFSET_BITS value needed for large files... no checking whether we are using the GNU C++ compiler... yes checking whether x86_64-pld-linux-gnux32-g++ accepts -g... yes checking dependency style of x86_64-pld-linux-gnux32-g++... gcc3 checking for x86_64-pld-linux-gnux32-gcc... (cached) x86_64-pld-linux-gnux32-gcc checking whether we are using the GNU C compiler... (cached) yes checking whether x86_64-pld-linux-gnux32-gcc accepts -g... (cached) yes checking for x86_64-pld-linux-gnux32-gcc option to accept ISO C89... (cached) none needed checking whether x86_64-pld-linux-gnux32-gcc understands -c and -o together... (cached) yes checking dependency style of x86_64-pld-linux-gnux32-gcc... (cached) gcc3 checking how to run the C preprocessor... x86_64-pld-linux-gnux32-gcc -E checking whether ln -s works... yes checking whether make sets $(MAKE)... (cached) yes checking how to print strings... print -r checking for a sed that does not truncate output... /bin/sed checking for fgrep... /bin/grep -F checking for ld used by x86_64-pld-linux-gnux32-gcc... /usr/bin/ld checking if the linker (/usr/bin/ld) is GNU ld... yes checking for BSD- or MS-compatible name lister (nm)... /usr/bin/nm -B checking the name lister (/usr/bin/nm -B) interface... BSD nm checking the maximum length of command line arguments... 1572864 checking how to convert x86_64-pld-linux-gnux32 file names to x86_64-pld-linux-gnux32 format... func_convert_file_noop checking how to convert x86_64-pld-linux-gnux32 file names to toolchain format... func_convert_file_noop checking for /usr/bin/ld option to reload object files... -r checking for x86_64-pld-linux-gnux32-objdump... no checking for objdump... objdump checking how to recognize dependent libraries... pass_all checking for x86_64-pld-linux-gnux32-dlltool... no checking for dlltool... no checking how to associate runtime and link libraries... print -r -- checking for x86_64-pld-linux-gnux32-ar... no checking for ar... ar checking for archiver @FILE support... @ checking for x86_64-pld-linux-gnux32-strip... no checking for strip... strip checking for x86_64-pld-linux-gnux32-ranlib... no checking for ranlib... ranlib checking command to parse /usr/bin/nm -B output from x86_64-pld-linux-gnux32-gcc object... ok checking for sysroot... no checking for a working dd... /bin/dd checking how to truncate binary pipes... /bin/dd bs=4096 count=1 checking for x86_64-pld-linux-gnux32-mt... no checking for mt... no checking if : is a manifest tool... no checking for dlfcn.h... yes checking for objdir... .libs checking if x86_64-pld-linux-gnux32-gcc supports -fno-rtti -fno-exceptions... no checking for x86_64-pld-linux-gnux32-gcc option to produce PIC... -fPIC -DPIC checking if x86_64-pld-linux-gnux32-gcc PIC flag -fPIC -DPIC works... yes checking if x86_64-pld-linux-gnux32-gcc static flag -static works... yes checking if x86_64-pld-linux-gnux32-gcc supports -c -o file.o... yes checking if x86_64-pld-linux-gnux32-gcc supports -c -o file.o... (cached) yes checking whether the x86_64-pld-linux-gnux32-gcc linker (/usr/bin/ld -m elf32_x86_64) supports shared libraries... yes checking whether -lc should be explicitly linked in... no checking dynamic linker characteristics... GNU/Linux ld.so checking how to hardcode library paths into programs... immediate checking whether stripping libraries is possible... yes checking if libtool supports shared libraries... yes checking whether to build shared libraries... yes checking whether to build static libraries... yes checking how to run the C++ preprocessor... x86_64-pld-linux-gnux32-g++ -E checking for ld used by x86_64-pld-linux-gnux32-g++... /usr/bin/ld -m elf32_x86_64 checking if the linker (/usr/bin/ld -m elf32_x86_64) is GNU ld... yes checking whether the x86_64-pld-linux-gnux32-g++ linker (/usr/bin/ld -m elf32_x86_64) supports shared libraries... yes checking for x86_64-pld-linux-gnux32-g++ option to produce PIC... -fPIC -DPIC checking if x86_64-pld-linux-gnux32-g++ PIC flag -fPIC -DPIC works... yes checking if x86_64-pld-linux-gnux32-g++ static flag -static works... yes checking if x86_64-pld-linux-gnux32-g++ supports -c -o file.o... yes checking if x86_64-pld-linux-gnux32-g++ supports -c -o file.o... (cached) yes checking whether the x86_64-pld-linux-gnux32-g++ linker (/usr/bin/ld -m elf32_x86_64) supports shared libraries... yes checking dynamic linker characteristics... (cached) GNU/Linux ld.so checking how to hardcode library paths into programs... immediate checking for x86_64-pld-linux-gnux32-ar... ar checking for x86_64-pld-linux-gnux32-ld... /usr/bin/ld -m elf32_x86_64 checking for ANSI C header files... (cached) yes checking for GNU libc2... yes checking for BSD signal semantics... no checking for gethostbyname... yes checking for connect... yes checking for getaddrinfo... yes checking for getservbyname... yes checking for crypt in -lcrypt... yes checking for event_dispatch in -levent... yes checking event.h usability... yes checking event.h presence... yes checking for event.h... yes checking for keyctl_instantiate in -lkeyutils... yes checking keyutils.h usability... yes checking keyutils.h presence... yes checking for keyutils.h... yes checking for find_key_by_type_and_desc in -lkeyutils... yes checking sqlite3.h usability... yes checking sqlite3.h presence... yes checking for sqlite3.h... yes checking for sqlite3_libversion_number in -lsqlite3... yes checking for suitable sqlite3 version... yes checking libgen.h usability... yes checking libgen.h presence... yes checking for libgen.h... yes checking sys/inotify.h usability... yes checking sys/inotify.h presence... yes checking for sys/inotify.h... yes checking for dm_task_create in -ldevmapper... yes checking libdevmapper.h usability... yes checking libdevmapper.h presence... yes checking for libdevmapper.h... yes checking for sys/inotify.h... (cached) yes checking for blkid_get_library_version in -lblkid... yes checking blkid/blkid.h usability... yes checking blkid/blkid.h presence... yes checking for blkid/blkid.h... yes checking for suitable libblkid version... yes checking for mnt_context_do_mount in -lmount... yes checking libmount/libmount.h usability... yes checking libmount/libmount.h presence... yes checking for libmount/libmount.h... yes checking for getnameinfo... yes checking for event_dispatch in -levent... (cached) yes checking for event.h... (cached) yes checking for Kerberos v5... /usr The current KRBDIR is /usr checking for gss_krb5_export_lucid_sec_context in -lgssapi... yes checking for gss_krb5_set_allowable_enctypes in -lgssapi... yes checking for gss_krb5_free_lucid_sec_context in -lgssapi... yes checking for krb5_get_error_message in -lgssapi... yes checking for krb5_get_init_creds_opt_set_addressless in -lgssapi... yes checking for pthread_create in -lpthread... yes checking pthread.h usability... yes checking pthread.h presence... yes checking for pthread.h... yes checking for __res_querydomain in -lresolv... yes checking ldap.h usability... yes checking ldap.h presence... yes checking for ldap.h... yes checking for ldap_initialize in -lldap... yes checking for getifaddrs... yes checking for getnameinfo... (cached) yes checking for bindresvport_sa in -ltirpc... yes checking arpa/inet.h usability... yes checking arpa/inet.h presence... yes checking for arpa/inet.h... yes checking fcntl.h usability... yes checking fcntl.h presence... yes checking for fcntl.h... yes checking libintl.h usability... yes checking libintl.h presence... yes checking for libintl.h... yes checking limits.h usability... yes checking limits.h presence... yes checking for limits.h... yes checking malloc.h usability... yes checking malloc.h presence... yes checking for malloc.h... yes checking for memory.h... (cached) yes checking netdb.h usability... yes checking netdb.h presence... yes checking for netdb.h... yes checking netinet/in.h usability... yes checking netinet/in.h presence... yes checking for netinet/in.h... yes checking paths.h usability... yes checking paths.h presence... yes checking for paths.h... yes checking for stdlib.h... (cached) yes checking for string.h... (cached) yes checking sys/file.h usability... yes checking sys/file.h presence... yes checking for sys/file.h... yes checking sys/ioctl.h usability... yes checking sys/ioctl.h presence... yes checking for sys/ioctl.h... yes checking sys/mount.h usability... yes checking sys/mount.h presence... yes checking for sys/mount.h... yes checking sys/param.h usability... yes checking sys/param.h presence... yes checking for sys/param.h... yes checking sys/socket.h usability... yes checking sys/socket.h presence... yes checking for sys/socket.h... yes checking sys/time.h usability... yes checking sys/time.h presence... yes checking for sys/time.h... yes checking sys/vfs.h usability... yes checking sys/vfs.h presence... yes checking for sys/vfs.h... yes checking syslog.h usability... yes checking syslog.h presence... yes checking for syslog.h... yes checking for unistd.h... (cached) yes checking com_err.h usability... yes checking com_err.h presence... yes checking for com_err.h... yes checking et/com_err.h usability... yes checking et/com_err.h presence... yes checking for et/com_err.h... yes checking ifaddrs.h usability... yes checking ifaddrs.h presence... yes checking for ifaddrs.h... yes checking for an ANSI C-conforming const... yes checking for uid_t in sys/types.h... yes checking for inline... inline checking for off_t... yes checking for pid_t... yes checking for size_t... yes checking whether time.h and sys/time.h may both be included... yes checking whether struct tm is in sys/time.h or time.h... time.h checking for working alloca.h... yes checking for alloca... yes checking for dirent.h that defines DIR... yes checking for library containing opendir... none required checking whether closedir returns void... no checking for error_at_line... yes checking vfork.h usability... no checking vfork.h presence... no checking for vfork.h... no checking for fork... yes checking for vfork... yes checking for working fork... yes checking for working vfork... (cached) yes checking type of array argument to getgroups... gid_t checking for getgroups... yes checking for working getgroups... yes checking for library containing getmntent... none required checking whether x86_64-pld-linux-gnux32-gcc needs -traditional... no checking whether lstat correctly handles trailing slash... yes checking whether lstat accepts an empty string... no checking whether lstat correctly handles trailing slash... (cached) yes checking whether sys/types.h defines makedev... no checking sys/mkdev.h usability... no checking sys/mkdev.h presence... no checking for sys/mkdev.h... no checking sys/sysmacros.h usability... yes checking sys/sysmacros.h presence... yes checking for sys/sysmacros.h... yes checking for working memcmp... yes checking sys/select.h usability... yes checking sys/select.h presence... yes checking for sys/select.h... yes checking for sys/socket.h... (cached) yes checking types of arguments for select... int,fd_set *,struct timeval * checking return type of signal handlers... void checking whether stat accepts an empty string... no checking for vprintf... yes checking for _doprnt... no checking for alarm... yes checking for atexit... yes checking for dup2... yes checking for fdatasync... yes checking for ftruncate... yes checking for getcwd... yes checking for gethostbyaddr... yes checking for gethostbyname... (cached) yes checking for gethostname... yes checking for getmntent... (cached) yes checking for getnameinfo... (cached) yes checking for getrpcbyname... yes checking for getrpcbynumber... yes checking for getrpcbynumber_r... yes checking for getifaddrs... (cached) yes checking for gettimeofday... yes checking for hasmntopt... yes checking for inet_ntoa... yes checking for innetgr... yes checking for memset... yes checking for mkdir... yes checking for pathconf... yes checking for ppoll... yes checking for realpath... yes checking for rmdir... yes checking for select... yes checking for socket... yes checking for strcasecmp... yes checking for strchr... yes checking for strdup... yes checking for strerror... yes checking for strrchr... yes checking for strtol... yes checking for strtoul... yes checking for sigprocmask... yes checking for name_to_handle_at... yes checking size of short... 2 checking size of int... 4 checking size of long... 4 checking size of size_t... 4 checking size of socklen_t... 4 checking whether CC supports -Werror=format-overflow=2... yes checking whether CC supports -Werror=int-conversion... yes checking whether CC supports -Werror=incompatible-pointer-types... yes checking whether CC supports -Werror=misleading-indentation... yes checking that generated files are newer than configure... done configure: creating ./config.status config.status: creating Makefile config.status: creating systemd/rpc-gssd.service config.status: creating linux-nfs/Makefile config.status: creating support/Makefile config.status: creating support/export/Makefile config.status: creating support/include/nfs/Makefile config.status: creating support/include/rpcsvc/Makefile config.status: creating support/include/sys/fs/Makefile config.status: creating support/include/sys/Makefile config.status: creating support/include/Makefile config.status: creating support/junction/Makefile config.status: creating support/misc/Makefile config.status: creating support/nfs/Makefile config.status: creating support/nsm/Makefile config.status: creating support/nfsidmap/Makefile config.status: creating support/nfsidmap/libnfsidmap.pc config.status: creating tools/Makefile config.status: creating tools/locktest/Makefile config.status: creating tools/nlmtest/Makefile config.status: creating tools/rpcdebug/Makefile config.status: creating tools/rpcgen/Makefile config.status: creating tools/mountstats/Makefile config.status: creating tools/nfs-iostat/Makefile config.status: creating tools/nfsconf/Makefile config.status: creating utils/Makefile config.status: creating utils/blkmapd/Makefile config.status: creating utils/nfsdcltrack/Makefile config.status: creating utils/exportfs/Makefile config.status: creating utils/gssd/Makefile config.status: creating utils/idmapd/Makefile config.status: creating utils/mount/Makefile config.status: creating utils/mountd/Makefile config.status: creating utils/nfsd/Makefile config.status: creating utils/nfsref/Makefile config.status: creating utils/nfsstat/Makefile config.status: creating utils/nfsidmap/Makefile config.status: creating utils/showmount/Makefile config.status: creating utils/statd/Makefile config.status: creating utils/osd_login/Makefile config.status: creating systemd/Makefile config.status: creating tests/Makefile config.status: creating tests/nsm_client/Makefile config.status: creating support/include/config.h config.status: executing depfiles commands config.status: executing libtool commands + /usr/bin/make -Otarget -j9 Making all in support Making all in export make[2]: Entering directory '/tmp/B.P3wIU5/BUILD/nfs-utils-2.3.3/support/export' test -f mount_clnt.c && rm -rf mount_clnt.c || true /usr/bin/rpcgen -l -o mount_clnt.c mount.x make[2]: Leaving directory '/tmp/B.P3wIU5/BUILD/nfs-utils-2.3.3/support/export' make[2]: Entering directory '/tmp/B.P3wIU5/BUILD/nfs-utils-2.3.3/support/export' test -f mount_xdr.c && rm -rf mount_xdr.c || true /usr/bin/rpcgen -c -i 0 -o mount_xdr.c mount.x make[2]: Leaving directory '/tmp/B.P3wIU5/BUILD/nfs-utils-2.3.3/support/export' make[2]: Entering directory '/tmp/B.P3wIU5/BUILD/nfs-utils-2.3.3/support/export' test -f mount.h && rm -rf mount.h || true /usr/bin/rpcgen -h -o mount.h mount.x rm -f ../../support/include/mount.h ln -s ../export/mount.h ../../support/include/mount.h make[2]: Leaving directory '/tmp/B.P3wIU5/BUILD/nfs-utils-2.3.3/support/export' /usr/bin/make all-am make[3]: Entering directory '/tmp/B.P3wIU5/BUILD/nfs-utils-2.3.3/support/export' x86_64-pld-linux-gnux32-gcc -DHAVE_CONFIG_H -I. -I../../support/include -I/usr/include/tirpc -D_GNU_SOURCE -pipe -Wall -Wextra -Werror=strict-prototypes -Werror=missing-prototypes -Werror=missing-declarations -Werror=format=2 -Werror=undef -Werror=missing-include-dirs -Werror=strict-aliasing=2 -Werror=init-self -Werror=implicit-function-declaration -Werror=return-type -Werror=switch -Werror=overflow -Werror=parentheses -Werror=aggregate-return -Werror=unused-result -fno-strict-aliasing -Werror=format-overflow=2 -Werror=int-conversion -Werror=incompatible-pointer-types -Werror=misleading-indentation -O2 -fwrapv -pipe -Wformat -Werror=format-security -gdwarf-4 -fno-debug-types-section -fvar-tracking-assignments -g2 -Wp,-D_FORTIFY_SOURCE=2 -fstack-protector-strong --param=ssp-buffer-size=4 -fPIC -mtune=generic -march=x86-64 -gdwarf-4 -fno-debug-types-section -fvar-tracking-assignments -g2 -MT mount_xdr.o -MD -MP -MF .deps/mount_xdr.Tpo -c -o mount_xdr.o mount_xdr.c mv -f .deps/mount_xdr.Tpo .deps/mount_xdr.Po make[3]: Leaving directory '/tmp/B.P3wIU5/BUILD/nfs-utils-2.3.3/support/export' make[3]: Entering directory '/tmp/B.P3wIU5/BUILD/nfs-utils-2.3.3/support/export' x86_64-pld-linux-gnux32-gcc -DHAVE_CONFIG_H -I. -I../../support/include -I/usr/include/tirpc -D_GNU_SOURCE -pipe -Wall -Wextra -Werror=strict-prototypes -Werror=missing-prototypes -Werror=missing-declarations -Werror=format=2 -Werror=undef -Werror=missing-include-dirs -Werror=strict-aliasing=2 -Werror=init-self -Werror=implicit-function-declaration -Werror=return-type -Werror=switch -Werror=overflow -Werror=parentheses -Werror=aggregate-return -Werror=unused-result -fno-strict-aliasing -Werror=format-overflow=2 -Werror=int-conversion -Werror=incompatible-pointer-types -Werror=misleading-indentation -O2 -fwrapv -pipe -Wformat -Werror=format-security -gdwarf-4 -fno-debug-types-section -fvar-tracking-assignments -g2 -Wp,-D_FORTIFY_SOURCE=2 -fstack-protector-strong --param=ssp-buffer-size=4 -fPIC -mtune=generic -march=x86-64 -gdwarf-4 -fno-debug-types-section -fvar-tracking-assignments -g2 -MT hostname.o -MD -MP -MF .deps/hostname.Tpo -c -o hostname.o hostname.c mv -f .deps/hostname.Tpo .deps/hostname.Po make[3]: Leaving directory '/tmp/B.P3wIU5/BUILD/nfs-utils-2.3.3/support/export' make[3]: Entering directory '/tmp/B.P3wIU5/BUILD/nfs-utils-2.3.3/support/export' x86_64-pld-linux-gnux32-gcc -DHAVE_CONFIG_H -I. -I../../support/include -I/usr/include/tirpc -D_GNU_SOURCE -pipe -Wall -Wextra -Werror=strict-prototypes -Werror=missing-prototypes -Werror=missing-declarations -Werror=format=2 -Werror=undef -Werror=missing-include-dirs -Werror=strict-aliasing=2 -Werror=init-self -Werror=implicit-function-declaration -Werror=return-type -Werror=switch -Werror=overflow -Werror=parentheses -Werror=aggregate-return -Werror=unused-result -fno-strict-aliasing -Werror=format-overflow=2 -Werror=int-conversion -Werror=incompatible-pointer-types -Werror=misleading-indentation -O2 -fwrapv -pipe -Wformat -Werror=format-security -gdwarf-4 -fno-debug-types-section -fvar-tracking-assignments -g2 -Wp,-D_FORTIFY_SOURCE=2 -fstack-protector-strong --param=ssp-buffer-size=4 -fPIC -mtune=generic -march=x86-64 -gdwarf-4 -fno-debug-types-section -fvar-tracking-assignments -g2 -MT xtab.o -MD -MP -MF .deps/xtab.Tpo -c -o xtab.o xtab.c mv -f .deps/xtab.Tpo .deps/xtab.Po make[3]: Leaving directory '/tmp/B.P3wIU5/BUILD/nfs-utils-2.3.3/support/export' make[3]: Entering directory '/tmp/B.P3wIU5/BUILD/nfs-utils-2.3.3/support/export' x86_64-pld-linux-gnux32-gcc -DHAVE_CONFIG_H -I. -I../../support/include -I/usr/include/tirpc -D_GNU_SOURCE -pipe -Wall -Wextra -Werror=strict-prototypes -Werror=missing-prototypes -Werror=missing-declarations -Werror=format=2 -Werror=undef -Werror=missing-include-dirs -Werror=strict-aliasing=2 -Werror=init-self -Werror=implicit-function-declaration -Werror=return-type -Werror=switch -Werror=overflow -Werror=parentheses -Werror=aggregate-return -Werror=unused-result -fno-strict-aliasing -Werror=format-overflow=2 -Werror=int-conversion -Werror=incompatible-pointer-types -Werror=misleading-indentation -O2 -fwrapv -pipe -Wformat -Werror=format-security -gdwarf-4 -fno-debug-types-section -fvar-tracking-assignments -g2 -Wp,-D_FORTIFY_SOURCE=2 -fstack-protector-strong --param=ssp-buffer-size=4 -fPIC -mtune=generic -march=x86-64 -gdwarf-4 -fno-debug-types-section -fvar-tracking-assignments -g2 -MT mount_clnt.o -MD -MP -MF .deps/mount_clnt.Tpo -c -o mount_clnt.o mount_clnt.c In file included from /usr/include/tirpc/rpc/rpc.h:49, from mount.h:9, from mount_clnt.c:7: mount_clnt.c: In function 'mountproc_null_1': mount_clnt.c:51:3: warning: cast between incompatible function types from 'bool_t (*)(void)' {aka 'int (*)(void)'} to 'bool_t (*)(XDR *, ...)' {aka 'int (*)(struct __rpc_xdr *, ...)'} [-Wcast-function-type] (xdrproc_t) xdr_void, (caddr_t) argp, ^ /usr/include/tirpc/rpc/clnt.h:166:38: note: in definition of macro 'clnt_call' ((*(rh)->cl_ops->cl_call)(rh, proc, xargs, \ ^~~~~ mount_clnt.c:52:3: warning: cast between incompatible function types from 'bool_t (*)(void)' {aka 'int (*)(void)'} to 'bool_t (*)(XDR *, ...)' {aka 'int (*)(struct __rpc_xdr *, ...)'} [-Wcast-function-type] (xdrproc_t) xdr_void, (caddr_t) &clnt_res, ^ /usr/include/tirpc/rpc/clnt.h:167:10: note: in definition of macro 'clnt_call' argsp, xres, resp, secs)) ^~~~ mount_clnt.c: In function 'mountproc_dump_1': mount_clnt.c:81:3: warning: cast between incompatible function types from 'bool_t (*)(void)' {aka 'int (*)(void)'} to 'bool_t (*)(XDR *, ...)' {aka 'int (*)(struct __rpc_xdr *, ...)'} [-Wcast-function-type] (xdrproc_t) xdr_void, (caddr_t) argp, ^ /usr/include/tirpc/rpc/clnt.h:166:38: note: in definition of macro 'clnt_call' ((*(rh)->cl_ops->cl_call)(rh, proc, xargs, \ ^~~~~ mount_clnt.c: In function 'mountproc_umnt_1': mount_clnt.c:97:3: warning: cast between incompatible function types from 'bool_t (*)(void)' {aka 'int (*)(void)'} to 'bool_t (*)(XDR *, ...)' {aka 'int (*)(struct __rpc_xdr *, ...)'} [-Wcast-function-type] (xdrproc_t) xdr_void, (caddr_t) &clnt_res, ^ /usr/include/tirpc/rpc/clnt.h:167:10: note: in definition of macro 'clnt_call' argsp, xres, resp, secs)) ^~~~ mount_clnt.c: In function 'mountproc_umntall_1': mount_clnt.c:111:3: warning: cast between incompatible function types from 'bool_t (*)(void)' {aka 'int (*)(void)'} to 'bool_t (*)(XDR *, ...)' {aka 'int (*)(struct __rpc_xdr *, ...)'} [-Wcast-function-type] (xdrproc_t) xdr_void, (caddr_t) argp, ^ /usr/include/tirpc/rpc/clnt.h:166:38: note: in definition of macro 'clnt_call' ((*(rh)->cl_ops->cl_call)(rh, proc, xargs, \ ^~~~~ mount_clnt.c:112:3: warning: cast between incompatible function types from 'bool_t (*)(void)' {aka 'int (*)(void)'} to 'bool_t (*)(XDR *, ...)' {aka 'int (*)(struct __rpc_xdr *, ...)'} [-Wcast-function-type] (xdrproc_t) xdr_void, (caddr_t) &clnt_res, ^ /usr/include/tirpc/rpc/clnt.h:167:10: note: in definition of macro 'clnt_call' argsp, xres, resp, secs)) ^~~~ mount_clnt.c: In function 'mountproc_export_1': mount_clnt.c:126:3: warning: cast between incompatible function types from 'bool_t (*)(void)' {aka 'int (*)(void)'} to 'bool_t (*)(XDR *, ...)' {aka 'int (*)(struct __rpc_xdr *, ...)'} [-Wcast-function-type] (xdrproc_t) xdr_void, (caddr_t) argp, ^ /usr/include/tirpc/rpc/clnt.h:166:38: note: in definition of macro 'clnt_call' ((*(rh)->cl_ops->cl_call)(rh, proc, xargs, \ ^~~~~ mount_clnt.c: In function 'mountproc_exportall_1': mount_clnt.c:141:3: warning: cast between incompatible function types from 'bool_t (*)(void)' {aka 'int (*)(void)'} to 'bool_t (*)(XDR *, ...)' {aka 'int (*)(struct __rpc_xdr *, ...)'} [-Wcast-function-type] (xdrproc_t) xdr_void, (caddr_t) argp, ^ /usr/include/tirpc/rpc/clnt.h:166:38: note: in definition of macro 'clnt_call' ((*(rh)->cl_ops->cl_call)(rh, proc, xargs, \ ^~~~~ mount_clnt.c: In function 'mountproc_null_2': mount_clnt.c:156:3: warning: cast between incompatible function types from 'bool_t (*)(void)' {aka 'int (*)(void)'} to 'bool_t (*)(XDR *, ...)' {aka 'int (*)(struct __rpc_xdr *, ...)'} [-Wcast-function-type] (xdrproc_t) xdr_void, (caddr_t) argp, ^ /usr/include/tirpc/rpc/clnt.h:166:38: note: in definition of macro 'clnt_call' ((*(rh)->cl_ops->cl_call)(rh, proc, xargs, \ ^~~~~ mount_clnt.c:157:3: warning: cast between incompatible function types from 'bool_t (*)(void)' {aka 'int (*)(void)'} to 'bool_t (*)(XDR *, ...)' {aka 'int (*)(struct __rpc_xdr *, ...)'} [-Wcast-function-type] (xdrproc_t) xdr_void, (caddr_t) &clnt_res, ^ /usr/include/tirpc/rpc/clnt.h:167:10: note: in definition of macro 'clnt_call' argsp, xres, resp, secs)) ^~~~ mount_clnt.c: In function 'mountproc_dump_2': mount_clnt.c:186:3: warning: cast between incompatible function types from 'bool_t (*)(void)' {aka 'int (*)(void)'} to 'bool_t (*)(XDR *, ...)' {aka 'int (*)(struct __rpc_xdr *, ...)'} [-Wcast-function-type] (xdrproc_t) xdr_void, (caddr_t) argp, ^ /usr/include/tirpc/rpc/clnt.h:166:38: note: in definition of macro 'clnt_call' ((*(rh)->cl_ops->cl_call)(rh, proc, xargs, \ ^~~~~ mount_clnt.c: In function 'mountproc_umnt_2': mount_clnt.c:202:3: warning: cast between incompatible function types from 'bool_t (*)(void)' {aka 'int (*)(void)'} to 'bool_t (*)(XDR *, ...)' {aka 'int (*)(struct __rpc_xdr *, ...)'} [-Wcast-function-type] (xdrproc_t) xdr_void, (caddr_t) &clnt_res, ^ /usr/include/tirpc/rpc/clnt.h:167:10: note: in definition of macro 'clnt_call' argsp, xres, resp, secs)) ^~~~ mount_clnt.c: In function 'mountproc_umntall_2': mount_clnt.c:216:3: warning: cast between incompatible function types from 'bool_t (*)(void)' {aka 'int (*)(void)'} to 'bool_t (*)(XDR *, ...)' {aka 'int (*)(struct __rpc_xdr *, ...)'} [-Wcast-function-type] (xdrproc_t) xdr_void, (caddr_t) argp, ^ /usr/include/tirpc/rpc/clnt.h:166:38: note: in definition of macro 'clnt_call' ((*(rh)->cl_ops->cl_call)(rh, proc, xargs, \ ^~~~~ mount_clnt.c:217:3: warning: cast between incompatible function types from 'bool_t (*)(void)' {aka 'int (*)(void)'} to 'bool_t (*)(XDR *, ...)' {aka 'int (*)(struct __rpc_xdr *, ...)'} [-Wcast-function-type] (xdrproc_t) xdr_void, (caddr_t) &clnt_res, ^ /usr/include/tirpc/rpc/clnt.h:167:10: note: in definition of macro 'clnt_call' argsp, xres, resp, secs)) ^~~~ mount_clnt.c: In function 'mountproc_export_2': mount_clnt.c:231:3: warning: cast between incompatible function types from 'bool_t (*)(void)' {aka 'int (*)(void)'} to 'bool_t (*)(XDR *, ...)' {aka 'int (*)(struct __rpc_xdr *, ...)'} [-Wcast-function-type] (xdrproc_t) xdr_void, (caddr_t) argp, ^ /usr/include/tirpc/rpc/clnt.h:166:38: note: in definition of macro 'clnt_call' ((*(rh)->cl_ops->cl_call)(rh, proc, xargs, \ ^~~~~ mount_clnt.c: In function 'mountproc_exportall_2': mount_clnt.c:246:3: warning: cast between incompatible function types from 'bool_t (*)(void)' {aka 'int (*)(void)'} to 'bool_t (*)(XDR *, ...)' {aka 'int (*)(struct __rpc_xdr *, ...)'} [-Wcast-function-type] (xdrproc_t) xdr_void, (caddr_t) argp, ^ /usr/include/tirpc/rpc/clnt.h:166:38: note: in definition of macro 'clnt_call' ((*(rh)->cl_ops->cl_call)(rh, proc, xargs, \ ^~~~~ mount_clnt.c: In function 'mountproc3_null_3': mount_clnt.c:276:3: warning: cast between incompatible function types from 'bool_t (*)(void)' {aka 'int (*)(void)'} to 'bool_t (*)(XDR *, ...)' {aka 'int (*)(struct __rpc_xdr *, ...)'} [-Wcast-function-type] (xdrproc_t) xdr_void, (caddr_t) argp, ^ /usr/include/tirpc/rpc/clnt.h:166:38: note: in definition of macro 'clnt_call' ((*(rh)->cl_ops->cl_call)(rh, proc, xargs, \ ^~~~~ mount_clnt.c:277:3: warning: cast between incompatible function types from 'bool_t (*)(void)' {aka 'int (*)(void)'} to 'bool_t (*)(XDR *, ...)' {aka 'int (*)(struct __rpc_xdr *, ...)'} [-Wcast-function-type] (xdrproc_t) xdr_void, (caddr_t) &clnt_res, ^ /usr/include/tirpc/rpc/clnt.h:167:10: note: in definition of macro 'clnt_call' argsp, xres, resp, secs)) ^~~~ mount_clnt.c: In function 'mountproc3_dump_3': mount_clnt.c:306:3: warning: cast between incompatible function types from 'bool_t (*)(void)' {aka 'int (*)(void)'} to 'bool_t (*)(XDR *, ...)' {aka 'int (*)(struct __rpc_xdr *, ...)'} [-Wcast-function-type] (xdrproc_t) xdr_void, (caddr_t) argp, ^ /usr/include/tirpc/rpc/clnt.h:166:38: note: in definition of macro 'clnt_call' ((*(rh)->cl_ops->cl_call)(rh, proc, xargs, \ ^~~~~ mount_clnt.c: In function 'mountproc3_umnt_3': mount_clnt.c:322:3: warning: cast between incompatible function types from 'bool_t (*)(void)' {aka 'int (*)(void)'} to 'bool_t (*)(XDR *, ...)' {aka 'int (*)(struct __rpc_xdr *, ...)'} [-Wcast-function-type] (xdrproc_t) xdr_void, (caddr_t) &clnt_res, ^ /usr/include/tirpc/rpc/clnt.h:167:10: note: in definition of macro 'clnt_call' argsp, xres, resp, secs)) ^~~~ mount_clnt.c: In function 'mountproc3_umntall_3': mount_clnt.c:336:3: warning: cast between incompatible function types from 'bool_t (*)(void)' {aka 'int (*)(void)'} to 'bool_t (*)(XDR *, ...)' {aka 'int (*)(struct __rpc_xdr *, ...)'} [-Wcast-function-type] (xdrproc_t) xdr_void, (caddr_t) argp, ^ /usr/include/tirpc/rpc/clnt.h:166:38: note: in definition of macro 'clnt_call' ((*(rh)->cl_ops->cl_call)(rh, proc, xargs, \ ^~~~~ mount_clnt.c:337:3: warning: cast between incompatible function types from 'bool_t (*)(void)' {aka 'int (*)(void)'} to 'bool_t (*)(XDR *, ...)' {aka 'int (*)(struct __rpc_xdr *, ...)'} [-Wcast-function-type] (xdrproc_t) xdr_void, (caddr_t) &clnt_res, ^ /usr/include/tirpc/rpc/clnt.h:167:10: note: in definition of macro 'clnt_call' argsp, xres, resp, secs)) ^~~~ mount_clnt.c: In function 'mountproc3_export_3': mount_clnt.c:351:3: warning: cast between incompatible function types from 'bool_t (*)(void)' {aka 'int (*)(void)'} to 'bool_t (*)(XDR *, ...)' {aka 'int (*)(struct __rpc_xdr *, ...)'} [-Wcast-function-type] (xdrproc_t) xdr_void, (caddr_t) argp, ^ /usr/include/tirpc/rpc/clnt.h:166:38: note: in definition of macro 'clnt_call' ((*(rh)->cl_ops->cl_call)(rh, proc, xargs, \ ^~~~~ mv -f .deps/mount_clnt.Tpo .deps/mount_clnt.Po make[3]: Leaving directory '/tmp/B.P3wIU5/BUILD/nfs-utils-2.3.3/support/export' make[3]: Entering directory '/tmp/B.P3wIU5/BUILD/nfs-utils-2.3.3/support/export' x86_64-pld-linux-gnux32-gcc -DHAVE_CONFIG_H -I. -I../../support/include -I/usr/include/tirpc -D_GNU_SOURCE -pipe -Wall -Wextra -Werror=strict-prototypes -Werror=missing-prototypes -Werror=missing-declarations -Werror=format=2 -Werror=undef -Werror=missing-include-dirs -Werror=strict-aliasing=2 -Werror=init-self -Werror=implicit-function-declaration -Werror=return-type -Werror=switch -Werror=overflow -Werror=parentheses -Werror=aggregate-return -Werror=unused-result -fno-strict-aliasing -Werror=format-overflow=2 -Werror=int-conversion -Werror=incompatible-pointer-types -Werror=misleading-indentation -O2 -fwrapv -pipe -Wformat -Werror=format-security -gdwarf-4 -fno-debug-types-section -fvar-tracking-assignments -g2 -Wp,-D_FORTIFY_SOURCE=2 -fstack-protector-strong --param=ssp-buffer-size=4 -fPIC -mtune=generic -march=x86-64 -gdwarf-4 -fno-debug-types-section -fvar-tracking-assignments -g2 -MT export.o -MD -MP -MF .deps/export.Tpo -c -o export.o export.c mv -f .deps/export.Tpo .deps/export.Po make[3]: Leaving directory '/tmp/B.P3wIU5/BUILD/nfs-utils-2.3.3/support/export' make[3]: Entering directory '/tmp/B.P3wIU5/BUILD/nfs-utils-2.3.3/support/export' x86_64-pld-linux-gnux32-gcc -DHAVE_CONFIG_H -I. -I../../support/include -I/usr/include/tirpc -D_GNU_SOURCE -pipe -Wall -Wextra -Werror=strict-prototypes -Werror=missing-prototypes -Werror=missing-declarations -Werror=format=2 -Werror=undef -Werror=missing-include-dirs -Werror=strict-aliasing=2 -Werror=init-self -Werror=implicit-function-declaration -Werror=return-type -Werror=switch -Werror=overflow -Werror=parentheses -Werror=aggregate-return -Werror=unused-result -fno-strict-aliasing -Werror=format-overflow=2 -Werror=int-conversion -Werror=incompatible-pointer-types -Werror=misleading-indentation -O2 -fwrapv -pipe -Wformat -Werror=format-security -gdwarf-4 -fno-debug-types-section -fvar-tracking-assignments -g2 -Wp,-D_FORTIFY_SOURCE=2 -fstack-protector-strong --param=ssp-buffer-size=4 -fPIC -mtune=generic -march=x86-64 -gdwarf-4 -fno-debug-types-section -fvar-tracking-assignments -g2 -MT client.o -MD -MP -MF .deps/client.Tpo -c -o client.o client.c mv -f .deps/client.Tpo .deps/client.Po make[3]: Leaving directory '/tmp/B.P3wIU5/BUILD/nfs-utils-2.3.3/support/export' make[3]: Entering directory '/tmp/B.P3wIU5/BUILD/nfs-utils-2.3.3/support/export' rm -f libexport.a ar cru libexport.a client.o export.o hostname.o xtab.o mount_clnt.o mount_xdr.o ranlib libexport.a make[3]: Leaving directory '/tmp/B.P3wIU5/BUILD/nfs-utils-2.3.3/support/export' Making all in include /usr/bin/make all-recursive Making all in nfs make[4]: Nothing to be done for 'all'. Making all in rpcsvc make[4]: Nothing to be done for 'all'. Making all in sys Making all in fs make[5]: Nothing to be done for 'all'. make[5]: Nothing to be done for 'all-am'. Making all in misc make[2]: Entering directory '/tmp/B.P3wIU5/BUILD/nfs-utils-2.3.3/support/misc' x86_64-pld-linux-gnux32-gcc -DHAVE_CONFIG_H -I. -I../../support/include -I/usr/include/tirpc -D_GNU_SOURCE -pipe -Wall -Wextra -Werror=strict-prototypes -Werror=missing-prototypes -Werror=missing-declarations -Werror=format=2 -Werror=undef -Werror=missing-include-dirs -Werror=strict-aliasing=2 -Werror=init-self -Werror=implicit-function-declaration -Werror=return-type -Werror=switch -Werror=overflow -Werror=parentheses -Werror=aggregate-return -Werror=unused-result -fno-strict-aliasing -Werror=format-overflow=2 -Werror=int-conversion -Werror=incompatible-pointer-types -Werror=misleading-indentation -O2 -fwrapv -pipe -Wformat -Werror=format-security -gdwarf-4 -fno-debug-types-section -fvar-tracking-assignments -g2 -Wp,-D_FORTIFY_SOURCE=2 -fstack-protector-strong --param=ssp-buffer-size=4 -fPIC -mtune=generic -march=x86-64 -gdwarf-4 -fno-debug-types-section -fvar-tracking-assignments -g2 -MT mountpoint.o -MD -MP -MF .deps/mountpoint.Tpo -c -o mountpoint.o mountpoint.c mv -f .deps/mountpoint.Tpo .deps/mountpoint.Po make[2]: Leaving directory '/tmp/B.P3wIU5/BUILD/nfs-utils-2.3.3/support/misc' make[2]: Entering directory '/tmp/B.P3wIU5/BUILD/nfs-utils-2.3.3/support/misc' x86_64-pld-linux-gnux32-gcc -DHAVE_CONFIG_H -I. -I../../support/include -I/usr/include/tirpc -D_GNU_SOURCE -pipe -Wall -Wextra -Werror=strict-prototypes -Werror=missing-prototypes -Werror=missing-declarations -Werror=format=2 -Werror=undef -Werror=missing-include-dirs -Werror=strict-aliasing=2 -Werror=init-self -Werror=implicit-function-declaration -Werror=return-type -Werror=switch -Werror=overflow -Werror=parentheses -Werror=aggregate-return -Werror=unused-result -fno-strict-aliasing -Werror=format-overflow=2 -Werror=int-conversion -Werror=incompatible-pointer-types -Werror=misleading-indentation -O2 -fwrapv -pipe -Wformat -Werror=format-security -gdwarf-4 -fno-debug-types-section -fvar-tracking-assignments -g2 -Wp,-D_FORTIFY_SOURCE=2 -fstack-protector-strong --param=ssp-buffer-size=4 -fPIC -mtune=generic -march=x86-64 -gdwarf-4 -fno-debug-types-section -fvar-tracking-assignments -g2 -MT file.o -MD -MP -MF .deps/file.Tpo -c -o file.o file.c mv -f .deps/file.Tpo .deps/file.Po make[2]: Leaving directory '/tmp/B.P3wIU5/BUILD/nfs-utils-2.3.3/support/misc' make[2]: Entering directory '/tmp/B.P3wIU5/BUILD/nfs-utils-2.3.3/support/misc' x86_64-pld-linux-gnux32-gcc -DHAVE_CONFIG_H -I. -I../../support/include -I/usr/include/tirpc -D_GNU_SOURCE -pipe -Wall -Wextra -Werror=strict-prototypes -Werror=missing-prototypes -Werror=missing-declarations -Werror=format=2 -Werror=undef -Werror=missing-include-dirs -Werror=strict-aliasing=2 -Werror=init-self -Werror=implicit-function-declaration -Werror=return-type -Werror=switch -Werror=overflow -Werror=parentheses -Werror=aggregate-return -Werror=unused-result -fno-strict-aliasing -Werror=format-overflow=2 -Werror=int-conversion -Werror=incompatible-pointer-types -Werror=misleading-indentation -O2 -fwrapv -pipe -Wformat -Werror=format-security -gdwarf-4 -fno-debug-types-section -fvar-tracking-assignments -g2 -Wp,-D_FORTIFY_SOURCE=2 -fstack-protector-strong --param=ssp-buffer-size=4 -fPIC -mtune=generic -march=x86-64 -gdwarf-4 -fno-debug-types-section -fvar-tracking-assignments -g2 -MT from_local.o -MD -MP -MF .deps/from_local.Tpo -c -o from_local.o from_local.c mv -f .deps/from_local.Tpo .deps/from_local.Po make[2]: Leaving directory '/tmp/B.P3wIU5/BUILD/nfs-utils-2.3.3/support/misc' make[2]: Entering directory '/tmp/B.P3wIU5/BUILD/nfs-utils-2.3.3/support/misc' x86_64-pld-linux-gnux32-gcc -DHAVE_CONFIG_H -I. -I../../support/include -I/usr/include/tirpc -D_GNU_SOURCE -pipe -Wall -Wextra -Werror=strict-prototypes -Werror=missing-prototypes -Werror=missing-declarations -Werror=format=2 -Werror=undef -Werror=missing-include-dirs -Werror=strict-aliasing=2 -Werror=init-self -Werror=implicit-function-declaration -Werror=return-type -Werror=switch -Werror=overflow -Werror=parentheses -Werror=aggregate-return -Werror=unused-result -fno-strict-aliasing -Werror=format-overflow=2 -Werror=int-conversion -Werror=incompatible-pointer-types -Werror=misleading-indentation -O2 -fwrapv -pipe -Wformat -Werror=format-security -gdwarf-4 -fno-debug-types-section -fvar-tracking-assignments -g2 -Wp,-D_FORTIFY_SOURCE=2 -fstack-protector-strong --param=ssp-buffer-size=4 -fPIC -mtune=generic -march=x86-64 -gdwarf-4 -fno-debug-types-section -fvar-tracking-assignments -g2 -MT tcpwrapper.o -MD -MP -MF .deps/tcpwrapper.Tpo -c -o tcpwrapper.o tcpwrapper.c mv -f .deps/tcpwrapper.Tpo .deps/tcpwrapper.Po make[2]: Leaving directory '/tmp/B.P3wIU5/BUILD/nfs-utils-2.3.3/support/misc' make[2]: Entering directory '/tmp/B.P3wIU5/BUILD/nfs-utils-2.3.3/support/misc' rm -f libmisc.a ar cru libmisc.a tcpwrapper.o from_local.o mountpoint.o file.o ranlib libmisc.a make[2]: Leaving directory '/tmp/B.P3wIU5/BUILD/nfs-utils-2.3.3/support/misc' Making all in nfs make[2]: Entering directory '/tmp/B.P3wIU5/BUILD/nfs-utils-2.3.3/support/nfs' /bin/sh ../../libtool --tag=CC --mode=compile x86_64-pld-linux-gnux32-gcc -DHAVE_CONFIG_H -I. -I../../support/include -I/usr/include/tirpc -D_GNU_SOURCE -pipe -Wall -Wextra -Werror=strict-prototypes -Werror=missing-prototypes -Werror=missing-declarations -Werror=format=2 -Werror=undef -Werror=missing-include-dirs -Werror=strict-aliasing=2 -Werror=init-self -Werror=implicit-function-declaration -Werror=return-type -Werror=switch -Werror=overflow -Werror=parentheses -Werror=aggregate-return -Werror=unused-result -fno-strict-aliasing -Werror=format-overflow=2 -Werror=int-conversion -Werror=incompatible-pointer-types -Werror=misleading-indentation -O2 -fwrapv -pipe -Wformat -Werror=format-security -gdwarf-4 -fno-debug-types-section -fvar-tracking-assignments -g2 -Wp,-D_FORTIFY_SOURCE=2 -fstack-protector-strong --param=ssp-buffer-size=4 -fPIC -mtune=generic -march=x86-64 -gdwarf-4 -fno-debug-types-section -fvar-tracking-assignments -g2 -MT rpcdispatch.lo -MD -MP -MF .deps/rpcdispatch.Tpo -c -o rpcdispatch.lo rpcdispatch.c libtool: compile: x86_64-pld-linux-gnux32-gcc -DHAVE_CONFIG_H -I. -I../../support/include -I/usr/include/tirpc -D_GNU_SOURCE -pipe -Wall -Wextra -Werror=strict-prototypes -Werror=missing-prototypes -Werror=missing-declarations -Werror=format=2 -Werror=undef -Werror=missing-include-dirs -Werror=strict-aliasing=2 -Werror=init-self -Werror=implicit-function-declaration -Werror=return-type -Werror=switch -Werror=overflow -Werror=parentheses -Werror=aggregate-return -Werror=unused-result -fno-strict-aliasing -Werror=format-overflow=2 -Werror=int-conversion -Werror=incompatible-pointer-types -Werror=misleading-indentation -O2 -fwrapv -pipe -Wformat -Werror=format-security -gdwarf-4 -fno-debug-types-section -fvar-tracking-assignments -g2 -Wp,-D_FORTIFY_SOURCE=2 -fstack-protector-strong --param=ssp-buffer-size=4 -fPIC -mtune=generic -march=x86-64 -gdwarf-4 -fno-debug-types-section -fvar-tracking-assignments -g2 -MT rpcdispatch.lo -MD -MP -MF .deps/rpcdispatch.Tpo -c rpcdispatch.c -fPIC -DPIC -o .libs/rpcdispatch.o libtool: compile: x86_64-pld-linux-gnux32-gcc -DHAVE_CONFIG_H -I. -I../../support/include -I/usr/include/tirpc -D_GNU_SOURCE -pipe -Wall -Wextra -Werror=strict-prototypes -Werror=missing-prototypes -Werror=missing-declarations -Werror=format=2 -Werror=undef -Werror=missing-include-dirs -Werror=strict-aliasing=2 -Werror=init-self -Werror=implicit-function-declaration -Werror=return-type -Werror=switch -Werror=overflow -Werror=parentheses -Werror=aggregate-return -Werror=unused-result -fno-strict-aliasing -Werror=format-overflow=2 -Werror=int-conversion -Werror=incompatible-pointer-types -Werror=misleading-indentation -O2 -fwrapv -pipe -Wformat -Werror=format-security -gdwarf-4 -fno-debug-types-section -fvar-tracking-assignments -g2 -Wp,-D_FORTIFY_SOURCE=2 -fstack-protector-strong --param=ssp-buffer-size=4 -fPIC -mtune=generic -march=x86-64 -gdwarf-4 -fno-debug-types-section -fvar-tracking-assignments -g2 -MT rpcdispatch.lo -MD -MP -MF .deps/rpcdispatch.Tpo -c rpcdispatch.c -o rpcdispatch.o >/dev/null 2>&1 mv -f .deps/rpcdispatch.Tpo .deps/rpcdispatch.Plo make[2]: Leaving directory '/tmp/B.P3wIU5/BUILD/nfs-utils-2.3.3/support/nfs' make[2]: Entering directory '/tmp/B.P3wIU5/BUILD/nfs-utils-2.3.3/support/nfs' /bin/sh ../../libtool --tag=CC --mode=compile x86_64-pld-linux-gnux32-gcc -DHAVE_CONFIG_H -I. -I../../support/include -I/usr/include/tirpc -D_GNU_SOURCE -pipe -Wall -Wextra -Werror=strict-prototypes -Werror=missing-prototypes -Werror=missing-declarations -Werror=format=2 -Werror=undef -Werror=missing-include-dirs -Werror=strict-aliasing=2 -Werror=init-self -Werror=implicit-function-declaration -Werror=return-type -Werror=switch -Werror=overflow -Werror=parentheses -Werror=aggregate-return -Werror=unused-result -fno-strict-aliasing -Werror=format-overflow=2 -Werror=int-conversion -Werror=incompatible-pointer-types -Werror=misleading-indentation -O2 -fwrapv -pipe -Wformat -Werror=format-security -gdwarf-4 -fno-debug-types-section -fvar-tracking-assignments -g2 -Wp,-D_FORTIFY_SOURCE=2 -fstack-protector-strong --param=ssp-buffer-size=4 -fPIC -mtune=generic -march=x86-64 -gdwarf-4 -fno-debug-types-section -fvar-tracking-assignments -g2 -MT mydaemon.lo -MD -MP -MF .deps/mydaemon.Tpo -c -o mydaemon.lo mydaemon.c libtool: compile: x86_64-pld-linux-gnux32-gcc -DHAVE_CONFIG_H -I. -I../../support/include -I/usr/include/tirpc -D_GNU_SOURCE -pipe -Wall -Wextra -Werror=strict-prototypes -Werror=missing-prototypes -Werror=missing-declarations -Werror=format=2 -Werror=undef -Werror=missing-include-dirs -Werror=strict-aliasing=2 -Werror=init-self -Werror=implicit-function-declaration -Werror=return-type -Werror=switch -Werror=overflow -Werror=parentheses -Werror=aggregate-return -Werror=unused-result -fno-strict-aliasing -Werror=format-overflow=2 -Werror=int-conversion -Werror=incompatible-pointer-types -Werror=misleading-indentation -O2 -fwrapv -pipe -Wformat -Werror=format-security -gdwarf-4 -fno-debug-types-section -fvar-tracking-assignments -g2 -Wp,-D_FORTIFY_SOURCE=2 -fstack-protector-strong --param=ssp-buffer-size=4 -fPIC -mtune=generic -march=x86-64 -gdwarf-4 -fno-debug-types-section -fvar-tracking-assignments -g2 -MT mydaemon.lo -MD -MP -MF .deps/mydaemon.Tpo -c mydaemon.c -fPIC -DPIC -o .libs/mydaemon.o libtool: compile: x86_64-pld-linux-gnux32-gcc -DHAVE_CONFIG_H -I. -I../../support/include -I/usr/include/tirpc -D_GNU_SOURCE -pipe -Wall -Wextra -Werror=strict-prototypes -Werror=missing-prototypes -Werror=missing-declarations -Werror=format=2 -Werror=undef -Werror=missing-include-dirs -Werror=strict-aliasing=2 -Werror=init-self -Werror=implicit-function-declaration -Werror=return-type -Werror=switch -Werror=overflow -Werror=parentheses -Werror=aggregate-return -Werror=unused-result -fno-strict-aliasing -Werror=format-overflow=2 -Werror=int-conversion -Werror=incompatible-pointer-types -Werror=misleading-indentation -O2 -fwrapv -pipe -Wformat -Werror=format-security -gdwarf-4 -fno-debug-types-section -fvar-tracking-assignments -g2 -Wp,-D_FORTIFY_SOURCE=2 -fstack-protector-strong --param=ssp-buffer-size=4 -fPIC -mtune=generic -march=x86-64 -gdwarf-4 -fno-debug-types-section -fvar-tracking-assignments -g2 -MT mydaemon.lo -MD -MP -MF .deps/mydaemon.Tpo -c mydaemon.c -o mydaemon.o >/dev/null 2>&1 mv -f .deps/mydaemon.Tpo .deps/mydaemon.Plo make[2]: Leaving directory '/tmp/B.P3wIU5/BUILD/nfs-utils-2.3.3/support/nfs' make[2]: Entering directory '/tmp/B.P3wIU5/BUILD/nfs-utils-2.3.3/support/nfs' /bin/sh ../../libtool --tag=CC --mode=compile x86_64-pld-linux-gnux32-gcc -DHAVE_CONFIG_H -I. -I../../support/include -I/usr/include/tirpc -D_GNU_SOURCE -pipe -Wall -Wextra -Werror=strict-prototypes -Werror=missing-prototypes -Werror=missing-declarations -Werror=format=2 -Werror=undef -Werror=missing-include-dirs -Werror=strict-aliasing=2 -Werror=init-self -Werror=implicit-function-declaration -Werror=return-type -Werror=switch -Werror=overflow -Werror=parentheses -Werror=aggregate-return -Werror=unused-result -fno-strict-aliasing -Werror=format-overflow=2 -Werror=int-conversion -Werror=incompatible-pointer-types -Werror=misleading-indentation -O2 -fwrapv -pipe -Wformat -Werror=format-security -gdwarf-4 -fno-debug-types-section -fvar-tracking-assignments -g2 -Wp,-D_FORTIFY_SOURCE=2 -fstack-protector-strong --param=ssp-buffer-size=4 -fPIC -mtune=generic -march=x86-64 -gdwarf-4 -fno-debug-types-section -fvar-tracking-assignments -g2 -MT rmtab.lo -MD -MP -MF .deps/rmtab.Tpo -c -o rmtab.lo rmtab.c libtool: compile: x86_64-pld-linux-gnux32-gcc -DHAVE_CONFIG_H -I. -I../../support/include -I/usr/include/tirpc -D_GNU_SOURCE -pipe -Wall -Wextra -Werror=strict-prototypes -Werror=missing-prototypes -Werror=missing-declarations -Werror=format=2 -Werror=undef -Werror=missing-include-dirs -Werror=strict-aliasing=2 -Werror=init-self -Werror=implicit-function-declaration -Werror=return-type -Werror=switch -Werror=overflow -Werror=parentheses -Werror=aggregate-return -Werror=unused-result -fno-strict-aliasing -Werror=format-overflow=2 -Werror=int-conversion -Werror=incompatible-pointer-types -Werror=misleading-indentation -O2 -fwrapv -pipe -Wformat -Werror=format-security -gdwarf-4 -fno-debug-types-section -fvar-tracking-assignments -g2 -Wp,-D_FORTIFY_SOURCE=2 -fstack-protector-strong --param=ssp-buffer-size=4 -fPIC -mtune=generic -march=x86-64 -gdwarf-4 -fno-debug-types-section -fvar-tracking-assignments -g2 -MT rmtab.lo -MD -MP -MF .deps/rmtab.Tpo -c rmtab.c -fPIC -DPIC -o .libs/rmtab.o libtool: compile: x86_64-pld-linux-gnux32-gcc -DHAVE_CONFIG_H -I. -I../../support/include -I/usr/include/tirpc -D_GNU_SOURCE -pipe -Wall -Wextra -Werror=strict-prototypes -Werror=missing-prototypes -Werror=missing-declarations -Werror=format=2 -Werror=undef -Werror=missing-include-dirs -Werror=strict-aliasing=2 -Werror=init-self -Werror=implicit-function-declaration -Werror=return-type -Werror=switch -Werror=overflow -Werror=parentheses -Werror=aggregate-return -Werror=unused-result -fno-strict-aliasing -Werror=format-overflow=2 -Werror=int-conversion -Werror=incompatible-pointer-types -Werror=misleading-indentation -O2 -fwrapv -pipe -Wformat -Werror=format-security -gdwarf-4 -fno-debug-types-section -fvar-tracking-assignments -g2 -Wp,-D_FORTIFY_SOURCE=2 -fstack-protector-strong --param=ssp-buffer-size=4 -fPIC -mtune=generic -march=x86-64 -gdwarf-4 -fno-debug-types-section -fvar-tracking-assignments -g2 -MT rmtab.lo -MD -MP -MF .deps/rmtab.Tpo -c rmtab.c -o rmtab.o >/dev/null 2>&1 mv -f .deps/rmtab.Tpo .deps/rmtab.Plo make[2]: Leaving directory '/tmp/B.P3wIU5/BUILD/nfs-utils-2.3.3/support/nfs' make[2]: Entering directory '/tmp/B.P3wIU5/BUILD/nfs-utils-2.3.3/support/nfs' /bin/sh ../../libtool --tag=CC --mode=compile x86_64-pld-linux-gnux32-gcc -DHAVE_CONFIG_H -I. -I../../support/include -I/usr/include/tirpc -D_GNU_SOURCE -pipe -Wall -Wextra -Werror=strict-prototypes -Werror=missing-prototypes -Werror=missing-declarations -Werror=format=2 -Werror=undef -Werror=missing-include-dirs -Werror=strict-aliasing=2 -Werror=init-self -Werror=implicit-function-declaration -Werror=return-type -Werror=switch -Werror=overflow -Werror=parentheses -Werror=aggregate-return -Werror=unused-result -fno-strict-aliasing -Werror=format-overflow=2 -Werror=int-conversion -Werror=incompatible-pointer-types -Werror=misleading-indentation -O2 -fwrapv -pipe -Wformat -Werror=format-security -gdwarf-4 -fno-debug-types-section -fvar-tracking-assignments -g2 -Wp,-D_FORTIFY_SOURCE=2 -fstack-protector-strong --param=ssp-buffer-size=4 -fPIC -mtune=generic -march=x86-64 -gdwarf-4 -fno-debug-types-section -fvar-tracking-assignments -g2 -MT xio.lo -MD -MP -MF .deps/xio.Tpo -c -o xio.lo xio.c libtool: compile: x86_64-pld-linux-gnux32-gcc -DHAVE_CONFIG_H -I. -I../../support/include -I/usr/include/tirpc -D_GNU_SOURCE -pipe -Wall -Wextra -Werror=strict-prototypes -Werror=missing-prototypes -Werror=missing-declarations -Werror=format=2 -Werror=undef -Werror=missing-include-dirs -Werror=strict-aliasing=2 -Werror=init-self -Werror=implicit-function-declaration -Werror=return-type -Werror=switch -Werror=overflow -Werror=parentheses -Werror=aggregate-return -Werror=unused-result -fno-strict-aliasing -Werror=format-overflow=2 -Werror=int-conversion -Werror=incompatible-pointer-types -Werror=misleading-indentation -O2 -fwrapv -pipe -Wformat -Werror=format-security -gdwarf-4 -fno-debug-types-section -fvar-tracking-assignments -g2 -Wp,-D_FORTIFY_SOURCE=2 -fstack-protector-strong --param=ssp-buffer-size=4 -fPIC -mtune=generic -march=x86-64 -gdwarf-4 -fno-debug-types-section -fvar-tracking-assignments -g2 -MT xio.lo -MD -MP -MF .deps/xio.Tpo -c xio.c -fPIC -DPIC -o .libs/xio.o libtool: compile: x86_64-pld-linux-gnux32-gcc -DHAVE_CONFIG_H -I. -I../../support/include -I/usr/include/tirpc -D_GNU_SOURCE -pipe -Wall -Wextra -Werror=strict-prototypes -Werror=missing-prototypes -Werror=missing-declarations -Werror=format=2 -Werror=undef -Werror=missing-include-dirs -Werror=strict-aliasing=2 -Werror=init-self -Werror=implicit-function-declaration -Werror=return-type -Werror=switch -Werror=overflow -Werror=parentheses -Werror=aggregate-return -Werror=unused-result -fno-strict-aliasing -Werror=format-overflow=2 -Werror=int-conversion -Werror=incompatible-pointer-types -Werror=misleading-indentation -O2 -fwrapv -pipe -Wformat -Werror=format-security -gdwarf-4 -fno-debug-types-section -fvar-tracking-assignments -g2 -Wp,-D_FORTIFY_SOURCE=2 -fstack-protector-strong --param=ssp-buffer-size=4 -fPIC -mtune=generic -march=x86-64 -gdwarf-4 -fno-debug-types-section -fvar-tracking-assignments -g2 -MT xio.lo -MD -MP -MF .deps/xio.Tpo -c xio.c -o xio.o >/dev/null 2>&1 mv -f .deps/xio.Tpo .deps/xio.Plo make[2]: Leaving directory '/tmp/B.P3wIU5/BUILD/nfs-utils-2.3.3/support/nfs' make[2]: Entering directory '/tmp/B.P3wIU5/BUILD/nfs-utils-2.3.3/support/nfs' /bin/sh ../../libtool --tag=CC --mode=compile x86_64-pld-linux-gnux32-gcc -DHAVE_CONFIG_H -I. -I../../support/include -I/usr/include/tirpc -D_GNU_SOURCE -pipe -Wall -Wextra -Werror=strict-prototypes -Werror=missing-prototypes -Werror=missing-declarations -Werror=format=2 -Werror=undef -Werror=missing-include-dirs -Werror=strict-aliasing=2 -Werror=init-self -Werror=implicit-function-declaration -Werror=return-type -Werror=switch -Werror=overflow -Werror=parentheses -Werror=aggregate-return -Werror=unused-result -fno-strict-aliasing -Werror=format-overflow=2 -Werror=int-conversion -Werror=incompatible-pointer-types -Werror=misleading-indentation -O2 -fwrapv -pipe -Wformat -Werror=format-security -gdwarf-4 -fno-debug-types-section -fvar-tracking-assignments -g2 -Wp,-D_FORTIFY_SOURCE=2 -fstack-protector-strong --param=ssp-buffer-size=4 -fPIC -mtune=generic -march=x86-64 -gdwarf-4 -fno-debug-types-section -fvar-tracking-assignments -g2 -MT wildmat.lo -MD -MP -MF .deps/wildmat.Tpo -c -o wildmat.lo wildmat.c libtool: compile: x86_64-pld-linux-gnux32-gcc -DHAVE_CONFIG_H -I. -I../../support/include -I/usr/include/tirpc -D_GNU_SOURCE -pipe -Wall -Wextra -Werror=strict-prototypes -Werror=missing-prototypes -Werror=missing-declarations -Werror=format=2 -Werror=undef -Werror=missing-include-dirs -Werror=strict-aliasing=2 -Werror=init-self -Werror=implicit-function-declaration -Werror=return-type -Werror=switch -Werror=overflow -Werror=parentheses -Werror=aggregate-return -Werror=unused-result -fno-strict-aliasing -Werror=format-overflow=2 -Werror=int-conversion -Werror=incompatible-pointer-types -Werror=misleading-indentation -O2 -fwrapv -pipe -Wformat -Werror=format-security -gdwarf-4 -fno-debug-types-section -fvar-tracking-assignments -g2 -Wp,-D_FORTIFY_SOURCE=2 -fstack-protector-strong --param=ssp-buffer-size=4 -fPIC -mtune=generic -march=x86-64 -gdwarf-4 -fno-debug-types-section -fvar-tracking-assignments -g2 -MT wildmat.lo -MD -MP -MF .deps/wildmat.Tpo -c wildmat.c -fPIC -DPIC -o .libs/wildmat.o libtool: compile: x86_64-pld-linux-gnux32-gcc -DHAVE_CONFIG_H -I. -I../../support/include -I/usr/include/tirpc -D_GNU_SOURCE -pipe -Wall -Wextra -Werror=strict-prototypes -Werror=missing-prototypes -Werror=missing-declarations -Werror=format=2 -Werror=undef -Werror=missing-include-dirs -Werror=strict-aliasing=2 -Werror=init-self -Werror=implicit-function-declaration -Werror=return-type -Werror=switch -Werror=overflow -Werror=parentheses -Werror=aggregate-return -Werror=unused-result -fno-strict-aliasing -Werror=format-overflow=2 -Werror=int-conversion -Werror=incompatible-pointer-types -Werror=misleading-indentation -O2 -fwrapv -pipe -Wformat -Werror=format-security -gdwarf-4 -fno-debug-types-section -fvar-tracking-assignments -g2 -Wp,-D_FORTIFY_SOURCE=2 -fstack-protector-strong --param=ssp-buffer-size=4 -fPIC -mtune=generic -march=x86-64 -gdwarf-4 -fno-debug-types-section -fvar-tracking-assignments -g2 -MT wildmat.lo -MD -MP -MF .deps/wildmat.Tpo -c wildmat.c -o wildmat.o >/dev/null 2>&1 mv -f .deps/wildmat.Tpo .deps/wildmat.Plo make[2]: Leaving directory '/tmp/B.P3wIU5/BUILD/nfs-utils-2.3.3/support/nfs' make[2]: Entering directory '/tmp/B.P3wIU5/BUILD/nfs-utils-2.3.3/support/nfs' /bin/sh ../../libtool --tag=CC --mode=compile x86_64-pld-linux-gnux32-gcc -DHAVE_CONFIG_H -I. -I../../support/include -I/usr/include/tirpc -D_GNU_SOURCE -pipe -Wall -Wextra -Werror=strict-prototypes -Werror=missing-prototypes -Werror=missing-declarations -Werror=format=2 -Werror=undef -Werror=missing-include-dirs -Werror=strict-aliasing=2 -Werror=init-self -Werror=implicit-function-declaration -Werror=return-type -Werror=switch -Werror=overflow -Werror=parentheses -Werror=aggregate-return -Werror=unused-result -fno-strict-aliasing -Werror=format-overflow=2 -Werror=int-conversion -Werror=incompatible-pointer-types -Werror=misleading-indentation -O2 -fwrapv -pipe -Wformat -Werror=format-security -gdwarf-4 -fno-debug-types-section -fvar-tracking-assignments -g2 -Wp,-D_FORTIFY_SOURCE=2 -fstack-protector-strong --param=ssp-buffer-size=4 -fPIC -mtune=generic -march=x86-64 -gdwarf-4 -fno-debug-types-section -fvar-tracking-assignments -g2 -MT xcommon.lo -MD -MP -MF .deps/xcommon.Tpo -c -o xcommon.lo xcommon.c libtool: compile: x86_64-pld-linux-gnux32-gcc -DHAVE_CONFIG_H -I. -I../../support/include -I/usr/include/tirpc -D_GNU_SOURCE -pipe -Wall -Wextra -Werror=strict-prototypes -Werror=missing-prototypes -Werror=missing-declarations -Werror=format=2 -Werror=undef -Werror=missing-include-dirs -Werror=strict-aliasing=2 -Werror=init-self -Werror=implicit-function-declaration -Werror=return-type -Werror=switch -Werror=overflow -Werror=parentheses -Werror=aggregate-return -Werror=unused-result -fno-strict-aliasing -Werror=format-overflow=2 -Werror=int-conversion -Werror=incompatible-pointer-types -Werror=misleading-indentation -O2 -fwrapv -pipe -Wformat -Werror=format-security -gdwarf-4 -fno-debug-types-section -fvar-tracking-assignments -g2 -Wp,-D_FORTIFY_SOURCE=2 -fstack-protector-strong --param=ssp-buffer-size=4 -fPIC -mtune=generic -march=x86-64 -gdwarf-4 -fno-debug-types-section -fvar-tracking-assignments -g2 -MT xcommon.lo -MD -MP -MF .deps/xcommon.Tpo -c xcommon.c -fPIC -DPIC -o .libs/xcommon.o libtool: compile: x86_64-pld-linux-gnux32-gcc -DHAVE_CONFIG_H -I. -I../../support/include -I/usr/include/tirpc -D_GNU_SOURCE -pipe -Wall -Wextra -Werror=strict-prototypes -Werror=missing-prototypes -Werror=missing-declarations -Werror=format=2 -Werror=undef -Werror=missing-include-dirs -Werror=strict-aliasing=2 -Werror=init-self -Werror=implicit-function-declaration -Werror=return-type -Werror=switch -Werror=overflow -Werror=parentheses -Werror=aggregate-return -Werror=unused-result -fno-strict-aliasing -Werror=format-overflow=2 -Werror=int-conversion -Werror=incompatible-pointer-types -Werror=misleading-indentation -O2 -fwrapv -pipe -Wformat -Werror=format-security -gdwarf-4 -fno-debug-types-section -fvar-tracking-assignments -g2 -Wp,-D_FORTIFY_SOURCE=2 -fstack-protector-strong --param=ssp-buffer-size=4 -fPIC -mtune=generic -march=x86-64 -gdwarf-4 -fno-debug-types-section -fvar-tracking-assignments -g2 -MT xcommon.lo -MD -MP -MF .deps/xcommon.Tpo -c xcommon.c -o xcommon.o >/dev/null 2>&1 mv -f .deps/xcommon.Tpo .deps/xcommon.Plo make[2]: Leaving directory '/tmp/B.P3wIU5/BUILD/nfs-utils-2.3.3/support/nfs' make[2]: Entering directory '/tmp/B.P3wIU5/BUILD/nfs-utils-2.3.3/support/nfs' /bin/sh ../../libtool --tag=CC --mode=compile x86_64-pld-linux-gnux32-gcc -DHAVE_CONFIG_H -I. -I../../support/include -I/usr/include/tirpc -D_GNU_SOURCE -pipe -Wall -Wextra -Werror=strict-prototypes -Werror=missing-prototypes -Werror=missing-declarations -Werror=format=2 -Werror=undef -Werror=missing-include-dirs -Werror=strict-aliasing=2 -Werror=init-self -Werror=implicit-function-declaration -Werror=return-type -Werror=switch -Werror=overflow -Werror=parentheses -Werror=aggregate-return -Werror=unused-result -fno-strict-aliasing -Werror=format-overflow=2 -Werror=int-conversion -Werror=incompatible-pointer-types -Werror=misleading-indentation -O2 -fwrapv -pipe -Wformat -Werror=format-security -gdwarf-4 -fno-debug-types-section -fvar-tracking-assignments -g2 -Wp,-D_FORTIFY_SOURCE=2 -fstack-protector-strong --param=ssp-buffer-size=4 -fPIC -mtune=generic -march=x86-64 -gdwarf-4 -fno-debug-types-section -fvar-tracking-assignments -g2 -MT rpcmisc.lo -MD -MP -MF .deps/rpcmisc.Tpo -c -o rpcmisc.lo rpcmisc.c libtool: compile: x86_64-pld-linux-gnux32-gcc -DHAVE_CONFIG_H -I. -I../../support/include -I/usr/include/tirpc -D_GNU_SOURCE -pipe -Wall -Wextra -Werror=strict-prototypes -Werror=missing-prototypes -Werror=missing-declarations -Werror=format=2 -Werror=undef -Werror=missing-include-dirs -Werror=strict-aliasing=2 -Werror=init-self -Werror=implicit-function-declaration -Werror=return-type -Werror=switch -Werror=overflow -Werror=parentheses -Werror=aggregate-return -Werror=unused-result -fno-strict-aliasing -Werror=format-overflow=2 -Werror=int-conversion -Werror=incompatible-pointer-types -Werror=misleading-indentation -O2 -fwrapv -pipe -Wformat -Werror=format-security -gdwarf-4 -fno-debug-types-section -fvar-tracking-assignments -g2 -Wp,-D_FORTIFY_SOURCE=2 -fstack-protector-strong --param=ssp-buffer-size=4 -fPIC -mtune=generic -march=x86-64 -gdwarf-4 -fno-debug-types-section -fvar-tracking-assignments -g2 -MT rpcmisc.lo -MD -MP -MF .deps/rpcmisc.Tpo -c rpcmisc.c -fPIC -DPIC -o .libs/rpcmisc.o libtool: compile: x86_64-pld-linux-gnux32-gcc -DHAVE_CONFIG_H -I. -I../../support/include -I/usr/include/tirpc -D_GNU_SOURCE -pipe -Wall -Wextra -Werror=strict-prototypes -Werror=missing-prototypes -Werror=missing-declarations -Werror=format=2 -Werror=undef -Werror=missing-include-dirs -Werror=strict-aliasing=2 -Werror=init-self -Werror=implicit-function-declaration -Werror=return-type -Werror=switch -Werror=overflow -Werror=parentheses -Werror=aggregate-return -Werror=unused-result -fno-strict-aliasing -Werror=format-overflow=2 -Werror=int-conversion -Werror=incompatible-pointer-types -Werror=misleading-indentation -O2 -fwrapv -pipe -Wformat -Werror=format-security -gdwarf-4 -fno-debug-types-section -fvar-tracking-assignments -g2 -Wp,-D_FORTIFY_SOURCE=2 -fstack-protector-strong --param=ssp-buffer-size=4 -fPIC -mtune=generic -march=x86-64 -gdwarf-4 -fno-debug-types-section -fvar-tracking-assignments -g2 -MT rpcmisc.lo -MD -MP -MF .deps/rpcmisc.Tpo -c rpcmisc.c -o rpcmisc.o >/dev/null 2>&1 mv -f .deps/rpcmisc.Tpo .deps/rpcmisc.Plo make[2]: Leaving directory '/tmp/B.P3wIU5/BUILD/nfs-utils-2.3.3/support/nfs' make[2]: Entering directory '/tmp/B.P3wIU5/BUILD/nfs-utils-2.3.3/support/nfs' /bin/sh ../../libtool --tag=CC --mode=compile x86_64-pld-linux-gnux32-gcc -DHAVE_CONFIG_H -I. -I../../support/include -I/usr/include/tirpc -D_GNU_SOURCE -pipe -Wall -Wextra -Werror=strict-prototypes -Werror=missing-prototypes -Werror=missing-declarations -Werror=format=2 -Werror=undef -Werror=missing-include-dirs -Werror=strict-aliasing=2 -Werror=init-self -Werror=implicit-function-declaration -Werror=return-type -Werror=switch -Werror=overflow -Werror=parentheses -Werror=aggregate-return -Werror=unused-result -fno-strict-aliasing -Werror=format-overflow=2 -Werror=int-conversion -Werror=incompatible-pointer-types -Werror=misleading-indentation -O2 -fwrapv -pipe -Wformat -Werror=format-security -gdwarf-4 -fno-debug-types-section -fvar-tracking-assignments -g2 -Wp,-D_FORTIFY_SOURCE=2 -fstack-protector-strong --param=ssp-buffer-size=4 -fPIC -mtune=generic -march=x86-64 -gdwarf-4 -fno-debug-types-section -fvar-tracking-assignments -g2 -MT rpc_socket.lo -MD -MP -MF .deps/rpc_socket.Tpo -c -o rpc_socket.lo rpc_socket.c libtool: compile: x86_64-pld-linux-gnux32-gcc -DHAVE_CONFIG_H -I. -I../../support/include -I/usr/include/tirpc -D_GNU_SOURCE -pipe -Wall -Wextra -Werror=strict-prototypes -Werror=missing-prototypes -Werror=missing-declarations -Werror=format=2 -Werror=undef -Werror=missing-include-dirs -Werror=strict-aliasing=2 -Werror=init-self -Werror=implicit-function-declaration -Werror=return-type -Werror=switch -Werror=overflow -Werror=parentheses -Werror=aggregate-return -Werror=unused-result -fno-strict-aliasing -Werror=format-overflow=2 -Werror=int-conversion -Werror=incompatible-pointer-types -Werror=misleading-indentation -O2 -fwrapv -pipe -Wformat -Werror=format-security -gdwarf-4 -fno-debug-types-section -fvar-tracking-assignments -g2 -Wp,-D_FORTIFY_SOURCE=2 -fstack-protector-strong --param=ssp-buffer-size=4 -fPIC -mtune=generic -march=x86-64 -gdwarf-4 -fno-debug-types-section -fvar-tracking-assignments -g2 -MT rpc_socket.lo -MD -MP -MF .deps/rpc_socket.Tpo -c rpc_socket.c -fPIC -DPIC -o .libs/rpc_socket.o libtool: compile: x86_64-pld-linux-gnux32-gcc -DHAVE_CONFIG_H -I. -I../../support/include -I/usr/include/tirpc -D_GNU_SOURCE -pipe -Wall -Wextra -Werror=strict-prototypes -Werror=missing-prototypes -Werror=missing-declarations -Werror=format=2 -Werror=undef -Werror=missing-include-dirs -Werror=strict-aliasing=2 -Werror=init-self -Werror=implicit-function-declaration -Werror=return-type -Werror=switch -Werror=overflow -Werror=parentheses -Werror=aggregate-return -Werror=unused-result -fno-strict-aliasing -Werror=format-overflow=2 -Werror=int-conversion -Werror=incompatible-pointer-types -Werror=misleading-indentation -O2 -fwrapv -pipe -Wformat -Werror=format-security -gdwarf-4 -fno-debug-types-section -fvar-tracking-assignments -g2 -Wp,-D_FORTIFY_SOURCE=2 -fstack-protector-strong --param=ssp-buffer-size=4 -fPIC -mtune=generic -march=x86-64 -gdwarf-4 -fno-debug-types-section -fvar-tracking-assignments -g2 -MT rpc_socket.lo -MD -MP -MF .deps/rpc_socket.Tpo -c rpc_socket.c -o rpc_socket.o >/dev/null 2>&1 mv -f .deps/rpc_socket.Tpo .deps/rpc_socket.Plo make[2]: Leaving directory '/tmp/B.P3wIU5/BUILD/nfs-utils-2.3.3/support/nfs' make[2]: Entering directory '/tmp/B.P3wIU5/BUILD/nfs-utils-2.3.3/support/nfs' /bin/sh ../../libtool --tag=CC --mode=compile x86_64-pld-linux-gnux32-gcc -DHAVE_CONFIG_H -I. -I../../support/include -I/usr/include/tirpc -D_GNU_SOURCE -pipe -Wall -Wextra -Werror=strict-prototypes -Werror=missing-prototypes -Werror=missing-declarations -Werror=format=2 -Werror=undef -Werror=missing-include-dirs -Werror=strict-aliasing=2 -Werror=init-self -Werror=implicit-function-declaration -Werror=return-type -Werror=switch -Werror=overflow -Werror=parentheses -Werror=aggregate-return -Werror=unused-result -fno-strict-aliasing -Werror=format-overflow=2 -Werror=int-conversion -Werror=incompatible-pointer-types -Werror=misleading-indentation -O2 -fwrapv -pipe -Wformat -Werror=format-security -gdwarf-4 -fno-debug-types-section -fvar-tracking-assignments -g2 -Wp,-D_FORTIFY_SOURCE=2 -fstack-protector-strong --param=ssp-buffer-size=4 -fPIC -mtune=generic -march=x86-64 -gdwarf-4 -fno-debug-types-section -fvar-tracking-assignments -g2 -MT cacheio.lo -MD -MP -MF .deps/cacheio.Tpo -c -o cacheio.lo cacheio.c libtool: compile: x86_64-pld-linux-gnux32-gcc -DHAVE_CONFIG_H -I. -I../../support/include -I/usr/include/tirpc -D_GNU_SOURCE -pipe -Wall -Wextra -Werror=strict-prototypes -Werror=missing-prototypes -Werror=missing-declarations -Werror=format=2 -Werror=undef -Werror=missing-include-dirs -Werror=strict-aliasing=2 -Werror=init-self -Werror=implicit-function-declaration -Werror=return-type -Werror=switch -Werror=overflow -Werror=parentheses -Werror=aggregate-return -Werror=unused-result -fno-strict-aliasing -Werror=format-overflow=2 -Werror=int-conversion -Werror=incompatible-pointer-types -Werror=misleading-indentation -O2 -fwrapv -pipe -Wformat -Werror=format-security -gdwarf-4 -fno-debug-types-section -fvar-tracking-assignments -g2 -Wp,-D_FORTIFY_SOURCE=2 -fstack-protector-strong --param=ssp-buffer-size=4 -fPIC -mtune=generic -march=x86-64 -gdwarf-4 -fno-debug-types-section -fvar-tracking-assignments -g2 -MT cacheio.lo -MD -MP -MF .deps/cacheio.Tpo -c cacheio.c -fPIC -DPIC -o .libs/cacheio.o cacheio.c: In function 'cache_flush': cacheio.c:237:20: error: format '%ld' expects argument of type 'long int', but argument 3 has type '__time_t' {aka 'long long int'} [-Werror=format=] sprintf(stime, "%ld\n", stb.st_mtime); ~~^ %lld cc1: some warnings being treated as errors make[2]: *** [Makefile:505: cacheio.lo] Error 1 make[2]: Leaving directory '/tmp/B.P3wIU5/BUILD/nfs-utils-2.3.3/support/nfs' make[2]: *** Waiting for unfinished jobs.... make[2]: Entering directory '/tmp/B.P3wIU5/BUILD/nfs-utils-2.3.3/support/nfs' /bin/sh ../../libtool --tag=CC --mode=compile x86_64-pld-linux-gnux32-gcc -DHAVE_CONFIG_H -I. -I../../support/include -I/usr/include/tirpc -D_GNU_SOURCE -pipe -Wall -Wextra -Werror=strict-prototypes -Werror=missing-prototypes -Werror=missing-declarations -Werror=format=2 -Werror=undef -Werror=missing-include-dirs -Werror=strict-aliasing=2 -Werror=init-self -Werror=implicit-function-declaration -Werror=return-type -Werror=switch -Werror=overflow -Werror=parentheses -Werror=aggregate-return -Werror=unused-result -fno-strict-aliasing -Werror=format-overflow=2 -Werror=int-conversion -Werror=incompatible-pointer-types -Werror=misleading-indentation -O2 -fwrapv -pipe -Wformat -Werror=format-security -gdwarf-4 -fno-debug-types-section -fvar-tracking-assignments -g2 -Wp,-D_FORTIFY_SOURCE=2 -fstack-protector-strong --param=ssp-buffer-size=4 -fPIC -mtune=generic -march=x86-64 -gdwarf-4 -fno-debug-types-section -fvar-tracking-assignments -g2 -MT svc_socket.lo -MD -MP -MF .deps/svc_socket.Tpo -c -o svc_socket.lo svc_socket.c libtool: compile: x86_64-pld-linux-gnux32-gcc -DHAVE_CONFIG_H -I. -I../../support/include -I/usr/include/tirpc -D_GNU_SOURCE -pipe -Wall -Wextra -Werror=strict-prototypes -Werror=missing-prototypes -Werror=missing-declarations -Werror=format=2 -Werror=undef -Werror=missing-include-dirs -Werror=strict-aliasing=2 -Werror=init-self -Werror=implicit-function-declaration -Werror=return-type -Werror=switch -Werror=overflow -Werror=parentheses -Werror=aggregate-return -Werror=unused-result -fno-strict-aliasing -Werror=format-overflow=2 -Werror=int-conversion -Werror=incompatible-pointer-types -Werror=misleading-indentation -O2 -fwrapv -pipe -Wformat -Werror=format-security -gdwarf-4 -fno-debug-types-section -fvar-tracking-assignments -g2 -Wp,-D_FORTIFY_SOURCE=2 -fstack-protector-strong --param=ssp-buffer-size=4 -fPIC -mtune=generic -march=x86-64 -gdwarf-4 -fno-debug-types-section -fvar-tracking-assignments -g2 -MT svc_socket.lo -MD -MP -MF .deps/svc_socket.Tpo -c svc_socket.c -fPIC -DPIC -o .libs/svc_socket.o libtool: compile: x86_64-pld-linux-gnux32-gcc -DHAVE_CONFIG_H -I. -I../../support/include -I/usr/include/tirpc -D_GNU_SOURCE -pipe -Wall -Wextra -Werror=strict-prototypes -Werror=missing-prototypes -Werror=missing-declarations -Werror=format=2 -Werror=undef -Werror=missing-include-dirs -Werror=strict-aliasing=2 -Werror=init-self -Werror=implicit-function-declaration -Werror=return-type -Werror=switch -Werror=overflow -Werror=parentheses -Werror=aggregate-return -Werror=unused-result -fno-strict-aliasing -Werror=format-overflow=2 -Werror=int-conversion -Werror=incompatible-pointer-types -Werror=misleading-indentation -O2 -fwrapv -pipe -Wformat -Werror=format-security -gdwarf-4 -fno-debug-types-section -fvar-tracking-assignments -g2 -Wp,-D_FORTIFY_SOURCE=2 -fstack-protector-strong --param=ssp-buffer-size=4 -fPIC -mtune=generic -march=x86-64 -gdwarf-4 -fno-debug-types-section -fvar-tracking-assignments -g2 -MT svc_socket.lo -MD -MP -MF .deps/svc_socket.Tpo -c svc_socket.c -o svc_socket.o >/dev/null 2>&1 mv -f .deps/svc_socket.Tpo .deps/svc_socket.Plo make[2]: Leaving directory '/tmp/B.P3wIU5/BUILD/nfs-utils-2.3.3/support/nfs' make[2]: Entering directory '/tmp/B.P3wIU5/BUILD/nfs-utils-2.3.3/support/nfs' /bin/sh ../../libtool --tag=CC --mode=compile x86_64-pld-linux-gnux32-gcc -DHAVE_CONFIG_H -I. -I../../support/include -I/usr/include/tirpc -D_GNU_SOURCE -pipe -Wall -Wextra -Werror=strict-prototypes -Werror=missing-prototypes -Werror=missing-declarations -Werror=format=2 -Werror=undef -Werror=missing-include-dirs -Werror=strict-aliasing=2 -Werror=init-self -Werror=implicit-function-declaration -Werror=return-type -Werror=switch -Werror=overflow -Werror=parentheses -Werror=aggregate-return -Werror=unused-result -fno-strict-aliasing -Werror=format-overflow=2 -Werror=int-conversion -Werror=incompatible-pointer-types -Werror=misleading-indentation -O2 -fwrapv -pipe -Wformat -Werror=format-security -gdwarf-4 -fno-debug-types-section -fvar-tracking-assignments -g2 -Wp,-D_FORTIFY_SOURCE=2 -fstack-protector-strong --param=ssp-buffer-size=4 -fPIC -mtune=generic -march=x86-64 -gdwarf-4 -fno-debug-types-section -fvar-tracking-assignments -g2 -MT closeall.lo -MD -MP -MF .deps/closeall.Tpo -c -o closeall.lo closeall.c libtool: compile: x86_64-pld-linux-gnux32-gcc -DHAVE_CONFIG_H -I. -I../../support/include -I/usr/include/tirpc -D_GNU_SOURCE -pipe -Wall -Wextra -Werror=strict-prototypes -Werror=missing-prototypes -Werror=missing-declarations -Werror=format=2 -Werror=undef -Werror=missing-include-dirs -Werror=strict-aliasing=2 -Werror=init-self -Werror=implicit-function-declaration -Werror=return-type -Werror=switch -Werror=overflow -Werror=parentheses -Werror=aggregate-return -Werror=unused-result -fno-strict-aliasing -Werror=format-overflow=2 -Werror=int-conversion -Werror=incompatible-pointer-types -Werror=misleading-indentation -O2 -fwrapv -pipe -Wformat -Werror=format-security -gdwarf-4 -fno-debug-types-section -fvar-tracking-assignments -g2 -Wp,-D_FORTIFY_SOURCE=2 -fstack-protector-strong --param=ssp-buffer-size=4 -fPIC -mtune=generic -march=x86-64 -gdwarf-4 -fno-debug-types-section -fvar-tracking-assignments -g2 -MT closeall.lo -MD -MP -MF .deps/closeall.Tpo -c closeall.c -fPIC -DPIC -o .libs/closeall.o libtool: compile: x86_64-pld-linux-gnux32-gcc -DHAVE_CONFIG_H -I. -I../../support/include -I/usr/include/tirpc -D_GNU_SOURCE -pipe -Wall -Wextra -Werror=strict-prototypes -Werror=missing-prototypes -Werror=missing-declarations -Werror=format=2 -Werror=undef -Werror=missing-include-dirs -Werror=strict-aliasing=2 -Werror=init-self -Werror=implicit-function-declaration -Werror=return-type -Werror=switch -Werror=overflow -Werror=parentheses -Werror=aggregate-return -Werror=unused-result -fno-strict-aliasing -Werror=format-overflow=2 -Werror=int-conversion -Werror=incompatible-pointer-types -Werror=misleading-indentation -O2 -fwrapv -pipe -Wformat -Werror=format-security -gdwarf-4 -fno-debug-types-section -fvar-tracking-assignments -g2 -Wp,-D_FORTIFY_SOURCE=2 -fstack-protector-strong --param=ssp-buffer-size=4 -fPIC -mtune=generic -march=x86-64 -gdwarf-4 -fno-debug-types-section -fvar-tracking-assignments -g2 -MT closeall.lo -MD -MP -MF .deps/closeall.Tpo -c closeall.c -o closeall.o >/dev/null 2>&1 mv -f .deps/closeall.Tpo .deps/closeall.Plo make[2]: Leaving directory '/tmp/B.P3wIU5/BUILD/nfs-utils-2.3.3/support/nfs' make[2]: Entering directory '/tmp/B.P3wIU5/BUILD/nfs-utils-2.3.3/support/nfs' /bin/sh ../../libtool --tag=CC --mode=compile x86_64-pld-linux-gnux32-gcc -DHAVE_CONFIG_H -I. -I../../support/include -I/usr/include/tirpc -D_GNU_SOURCE -pipe -Wall -Wextra -Werror=strict-prototypes -Werror=missing-prototypes -Werror=missing-declarations -Werror=format=2 -Werror=undef -Werror=missing-include-dirs -Werror=strict-aliasing=2 -Werror=init-self -Werror=implicit-function-declaration -Werror=return-type -Werror=switch -Werror=overflow -Werror=parentheses -Werror=aggregate-return -Werror=unused-result -fno-strict-aliasing -Werror=format-overflow=2 -Werror=int-conversion -Werror=incompatible-pointer-types -Werror=misleading-indentation -O2 -fwrapv -pipe -Wformat -Werror=format-security -gdwarf-4 -fno-debug-types-section -fvar-tracking-assignments -g2 -Wp,-D_FORTIFY_SOURCE=2 -fstack-protector-strong --param=ssp-buffer-size=4 -fPIC -mtune=generic -march=x86-64 -gdwarf-4 -fno-debug-types-section -fvar-tracking-assignments -g2 -MT strlcat.lo -MD -MP -MF .deps/strlcat.Tpo -c -o strlcat.lo strlcat.c libtool: compile: x86_64-pld-linux-gnux32-gcc -DHAVE_CONFIG_H -I. -I../../support/include -I/usr/include/tirpc -D_GNU_SOURCE -pipe -Wall -Wextra -Werror=strict-prototypes -Werror=missing-prototypes -Werror=missing-declarations -Werror=format=2 -Werror=undef -Werror=missing-include-dirs -Werror=strict-aliasing=2 -Werror=init-self -Werror=implicit-function-declaration -Werror=return-type -Werror=switch -Werror=overflow -Werror=parentheses -Werror=aggregate-return -Werror=unused-result -fno-strict-aliasing -Werror=format-overflow=2 -Werror=int-conversion -Werror=incompatible-pointer-types -Werror=misleading-indentation -O2 -fwrapv -pipe -Wformat -Werror=format-security -gdwarf-4 -fno-debug-types-section -fvar-tracking-assignments -g2 -Wp,-D_FORTIFY_SOURCE=2 -fstack-protector-strong --param=ssp-buffer-size=4 -fPIC -mtune=generic -march=x86-64 -gdwarf-4 -fno-debug-types-section -fvar-tracking-assignments -g2 -MT strlcat.lo -MD -MP -MF .deps/strlcat.Tpo -c strlcat.c -fPIC -DPIC -o .libs/strlcat.o libtool: compile: x86_64-pld-linux-gnux32-gcc -DHAVE_CONFIG_H -I. -I../../support/include -I/usr/include/tirpc -D_GNU_SOURCE -pipe -Wall -Wextra -Werror=strict-prototypes -Werror=missing-prototypes -Werror=missing-declarations -Werror=format=2 -Werror=undef -Werror=missing-include-dirs -Werror=strict-aliasing=2 -Werror=init-self -Werror=implicit-function-declaration -Werror=return-type -Werror=switch -Werror=overflow -Werror=parentheses -Werror=aggregate-return -Werror=unused-result -fno-strict-aliasing -Werror=format-overflow=2 -Werror=int-conversion -Werror=incompatible-pointer-types -Werror=misleading-indentation -O2 -fwrapv -pipe -Wformat -Werror=format-security -gdwarf-4 -fno-debug-types-section -fvar-tracking-assignments -g2 -Wp,-D_FORTIFY_SOURCE=2 -fstack-protector-strong --param=ssp-buffer-size=4 -fPIC -mtune=generic -march=x86-64 -gdwarf-4 -fno-debug-types-section -fvar-tracking-assignments -g2 -MT strlcat.lo -MD -MP -MF .deps/strlcat.Tpo -c strlcat.c -o strlcat.o >/dev/null 2>&1 mv -f .deps/strlcat.Tpo .deps/strlcat.Plo make[2]: Leaving directory '/tmp/B.P3wIU5/BUILD/nfs-utils-2.3.3/support/nfs' make[2]: Entering directory '/tmp/B.P3wIU5/BUILD/nfs-utils-2.3.3/support/nfs' /bin/sh ../../libtool --tag=CC --mode=compile x86_64-pld-linux-gnux32-gcc -DHAVE_CONFIG_H -I. -I../../support/include -I/usr/include/tirpc -D_GNU_SOURCE -pipe -Wall -Wextra -Werror=strict-prototypes -Werror=missing-prototypes -Werror=missing-declarations -Werror=format=2 -Werror=undef -Werror=missing-include-dirs -Werror=strict-aliasing=2 -Werror=init-self -Werror=implicit-function-declaration -Werror=return-type -Werror=switch -Werror=overflow -Werror=parentheses -Werror=aggregate-return -Werror=unused-result -fno-strict-aliasing -Werror=format-overflow=2 -Werror=int-conversion -Werror=incompatible-pointer-types -Werror=misleading-indentation -O2 -fwrapv -pipe -Wformat -Werror=format-security -gdwarf-4 -fno-debug-types-section -fvar-tracking-assignments -g2 -Wp,-D_FORTIFY_SOURCE=2 -fstack-protector-strong --param=ssp-buffer-size=4 -fPIC -mtune=generic -march=x86-64 -gdwarf-4 -fno-debug-types-section -fvar-tracking-assignments -g2 -MT atomicio.lo -MD -MP -MF .deps/atomicio.Tpo -c -o atomicio.lo atomicio.c libtool: compile: x86_64-pld-linux-gnux32-gcc -DHAVE_CONFIG_H -I. -I../../support/include -I/usr/include/tirpc -D_GNU_SOURCE -pipe -Wall -Wextra -Werror=strict-prototypes -Werror=missing-prototypes -Werror=missing-declarations -Werror=format=2 -Werror=undef -Werror=missing-include-dirs -Werror=strict-aliasing=2 -Werror=init-self -Werror=implicit-function-declaration -Werror=return-type -Werror=switch -Werror=overflow -Werror=parentheses -Werror=aggregate-return -Werror=unused-result -fno-strict-aliasing -Werror=format-overflow=2 -Werror=int-conversion -Werror=incompatible-pointer-types -Werror=misleading-indentation -O2 -fwrapv -pipe -Wformat -Werror=format-security -gdwarf-4 -fno-debug-types-section -fvar-tracking-assignments -g2 -Wp,-D_FORTIFY_SOURCE=2 -fstack-protector-strong --param=ssp-buffer-size=4 -fPIC -mtune=generic -march=x86-64 -gdwarf-4 -fno-debug-types-section -fvar-tracking-assignments -g2 -MT atomicio.lo -MD -MP -MF .deps/atomicio.Tpo -c atomicio.c -fPIC -DPIC -o .libs/atomicio.o libtool: compile: x86_64-pld-linux-gnux32-gcc -DHAVE_CONFIG_H -I. -I../../support/include -I/usr/include/tirpc -D_GNU_SOURCE -pipe -Wall -Wextra -Werror=strict-prototypes -Werror=missing-prototypes -Werror=missing-declarations -Werror=format=2 -Werror=undef -Werror=missing-include-dirs -Werror=strict-aliasing=2 -Werror=init-self -Werror=implicit-function-declaration -Werror=return-type -Werror=switch -Werror=overflow -Werror=parentheses -Werror=aggregate-return -Werror=unused-result -fno-strict-aliasing -Werror=format-overflow=2 -Werror=int-conversion -Werror=incompatible-pointer-types -Werror=misleading-indentation -O2 -fwrapv -pipe -Wformat -Werror=format-security -gdwarf-4 -fno-debug-types-section -fvar-tracking-assignments -g2 -Wp,-D_FORTIFY_SOURCE=2 -fstack-protector-strong --param=ssp-buffer-size=4 -fPIC -mtune=generic -march=x86-64 -gdwarf-4 -fno-debug-types-section -fvar-tracking-assignments -g2 -MT atomicio.lo -MD -MP -MF .deps/atomicio.Tpo -c atomicio.c -o atomicio.o >/dev/null 2>&1 mv -f .deps/atomicio.Tpo .deps/atomicio.Plo make[2]: Leaving directory '/tmp/B.P3wIU5/BUILD/nfs-utils-2.3.3/support/nfs' make[2]: Entering directory '/tmp/B.P3wIU5/BUILD/nfs-utils-2.3.3/support/nfs' /bin/sh ../../libtool --tag=CC --mode=compile x86_64-pld-linux-gnux32-gcc -DHAVE_CONFIG_H -I. -I../../support/include -I/usr/include/tirpc -D_GNU_SOURCE -pipe -Wall -Wextra -Werror=strict-prototypes -Werror=missing-prototypes -Werror=missing-declarations -Werror=format=2 -Werror=undef -Werror=missing-include-dirs -Werror=strict-aliasing=2 -Werror=init-self -Werror=implicit-function-declaration -Werror=return-type -Werror=switch -Werror=overflow -Werror=parentheses -Werror=aggregate-return -Werror=unused-result -fno-strict-aliasing -Werror=format-overflow=2 -Werror=int-conversion -Werror=incompatible-pointer-types -Werror=misleading-indentation -O2 -fwrapv -pipe -Wformat -Werror=format-security -gdwarf-4 -fno-debug-types-section -fvar-tracking-assignments -g2 -Wp,-D_FORTIFY_SOURCE=2 -fstack-protector-strong --param=ssp-buffer-size=4 -fPIC -mtune=generic -march=x86-64 -gdwarf-4 -fno-debug-types-section -fvar-tracking-assignments -g2 -MT nfs_mntent.lo -MD -MP -MF .deps/nfs_mntent.Tpo -c -o nfs_mntent.lo nfs_mntent.c libtool: compile: x86_64-pld-linux-gnux32-gcc -DHAVE_CONFIG_H -I. -I../../support/include -I/usr/include/tirpc -D_GNU_SOURCE -pipe -Wall -Wextra -Werror=strict-prototypes -Werror=missing-prototypes -Werror=missing-declarations -Werror=format=2 -Werror=undef -Werror=missing-include-dirs -Werror=strict-aliasing=2 -Werror=init-self -Werror=implicit-function-declaration -Werror=return-type -Werror=switch -Werror=overflow -Werror=parentheses -Werror=aggregate-return -Werror=unused-result -fno-strict-aliasing -Werror=format-overflow=2 -Werror=int-conversion -Werror=incompatible-pointer-types -Werror=misleading-indentation -O2 -fwrapv -pipe -Wformat -Werror=format-security -gdwarf-4 -fno-debug-types-section -fvar-tracking-assignments -g2 -Wp,-D_FORTIFY_SOURCE=2 -fstack-protector-strong --param=ssp-buffer-size=4 -fPIC -mtune=generic -march=x86-64 -gdwarf-4 -fno-debug-types-section -fvar-tracking-assignments -g2 -MT nfs_mntent.lo -MD -MP -MF .deps/nfs_mntent.Tpo -c nfs_mntent.c -fPIC -DPIC -o .libs/nfs_mntent.o libtool: compile: x86_64-pld-linux-gnux32-gcc -DHAVE_CONFIG_H -I. -I../../support/include -I/usr/include/tirpc -D_GNU_SOURCE -pipe -Wall -Wextra -Werror=strict-prototypes -Werror=missing-prototypes -Werror=missing-declarations -Werror=format=2 -Werror=undef -Werror=missing-include-dirs -Werror=strict-aliasing=2 -Werror=init-self -Werror=implicit-function-declaration -Werror=return-type -Werror=switch -Werror=overflow -Werror=parentheses -Werror=aggregate-return -Werror=unused-result -fno-strict-aliasing -Werror=format-overflow=2 -Werror=int-conversion -Werror=incompatible-pointer-types -Werror=misleading-indentation -O2 -fwrapv -pipe -Wformat -Werror=format-security -gdwarf-4 -fno-debug-types-section -fvar-tracking-assignments -g2 -Wp,-D_FORTIFY_SOURCE=2 -fstack-protector-strong --param=ssp-buffer-size=4 -fPIC -mtune=generic -march=x86-64 -gdwarf-4 -fno-debug-types-section -fvar-tracking-assignments -g2 -MT nfs_mntent.lo -MD -MP -MF .deps/nfs_mntent.Tpo -c nfs_mntent.c -o nfs_mntent.o >/dev/null 2>&1 mv -f .deps/nfs_mntent.Tpo .deps/nfs_mntent.Plo make[2]: Leaving directory '/tmp/B.P3wIU5/BUILD/nfs-utils-2.3.3/support/nfs' make[2]: Entering directory '/tmp/B.P3wIU5/BUILD/nfs-utils-2.3.3/support/nfs' /bin/sh ../../libtool --tag=CC --mode=compile x86_64-pld-linux-gnux32-gcc -DHAVE_CONFIG_H -I. -I../../support/include -I/usr/include/tirpc -D_GNU_SOURCE -pipe -Wall -Wextra -Werror=strict-prototypes -Werror=missing-prototypes -Werror=missing-declarations -Werror=format=2 -Werror=undef -Werror=missing-include-dirs -Werror=strict-aliasing=2 -Werror=init-self -Werror=implicit-function-declaration -Werror=return-type -Werror=switch -Werror=overflow -Werror=parentheses -Werror=aggregate-return -Werror=unused-result -fno-strict-aliasing -Werror=format-overflow=2 -Werror=int-conversion -Werror=incompatible-pointer-types -Werror=misleading-indentation -O2 -fwrapv -pipe -Wformat -Werror=format-security -gdwarf-4 -fno-debug-types-section -fvar-tracking-assignments -g2 -Wp,-D_FORTIFY_SOURCE=2 -fstack-protector-strong --param=ssp-buffer-size=4 -fPIC -mtune=generic -march=x86-64 -gdwarf-4 -fno-debug-types-section -fvar-tracking-assignments -g2 -MT svc_create.lo -MD -MP -MF .deps/svc_create.Tpo -c -o svc_create.lo svc_create.c libtool: compile: x86_64-pld-linux-gnux32-gcc -DHAVE_CONFIG_H -I. -I../../support/include -I/usr/include/tirpc -D_GNU_SOURCE -pipe -Wall -Wextra -Werror=strict-prototypes -Werror=missing-prototypes -Werror=missing-declarations -Werror=format=2 -Werror=undef -Werror=missing-include-dirs -Werror=strict-aliasing=2 -Werror=init-self -Werror=implicit-function-declaration -Werror=return-type -Werror=switch -Werror=overflow -Werror=parentheses -Werror=aggregate-return -Werror=unused-result -fno-strict-aliasing -Werror=format-overflow=2 -Werror=int-conversion -Werror=incompatible-pointer-types -Werror=misleading-indentation -O2 -fwrapv -pipe -Wformat -Werror=format-security -gdwarf-4 -fno-debug-types-section -fvar-tracking-assignments -g2 -Wp,-D_FORTIFY_SOURCE=2 -fstack-protector-strong --param=ssp-buffer-size=4 -fPIC -mtune=generic -march=x86-64 -gdwarf-4 -fno-debug-types-section -fvar-tracking-assignments -g2 -MT svc_create.lo -MD -MP -MF .deps/svc_create.Tpo -c svc_create.c -fPIC -DPIC -o .libs/svc_create.o libtool: compile: x86_64-pld-linux-gnux32-gcc -DHAVE_CONFIG_H -I. -I../../support/include -I/usr/include/tirpc -D_GNU_SOURCE -pipe -Wall -Wextra -Werror=strict-prototypes -Werror=missing-prototypes -Werror=missing-declarations -Werror=format=2 -Werror=undef -Werror=missing-include-dirs -Werror=strict-aliasing=2 -Werror=init-self -Werror=implicit-function-declaration -Werror=return-type -Werror=switch -Werror=overflow -Werror=parentheses -Werror=aggregate-return -Werror=unused-result -fno-strict-aliasing -Werror=format-overflow=2 -Werror=int-conversion -Werror=incompatible-pointer-types -Werror=misleading-indentation -O2 -fwrapv -pipe -Wformat -Werror=format-security -gdwarf-4 -fno-debug-types-section -fvar-tracking-assignments -g2 -Wp,-D_FORTIFY_SOURCE=2 -fstack-protector-strong --param=ssp-buffer-size=4 -fPIC -mtune=generic -march=x86-64 -gdwarf-4 -fno-debug-types-section -fvar-tracking-assignments -g2 -MT svc_create.lo -MD -MP -MF .deps/svc_create.Tpo -c svc_create.c -o svc_create.o >/dev/null 2>&1 mv -f .deps/svc_create.Tpo .deps/svc_create.Plo make[2]: Leaving directory '/tmp/B.P3wIU5/BUILD/nfs-utils-2.3.3/support/nfs' make[2]: Entering directory '/tmp/B.P3wIU5/BUILD/nfs-utils-2.3.3/support/nfs' /bin/sh ../../libtool --tag=CC --mode=compile x86_64-pld-linux-gnux32-gcc -DHAVE_CONFIG_H -I. -I../../support/include -I/usr/include/tirpc -D_GNU_SOURCE -pipe -Wall -Wextra -Werror=strict-prototypes -Werror=missing-prototypes -Werror=missing-declarations -Werror=format=2 -Werror=undef -Werror=missing-include-dirs -Werror=strict-aliasing=2 -Werror=init-self -Werror=implicit-function-declaration -Werror=return-type -Werror=switch -Werror=overflow -Werror=parentheses -Werror=aggregate-return -Werror=unused-result -fno-strict-aliasing -Werror=format-overflow=2 -Werror=int-conversion -Werror=incompatible-pointer-types -Werror=misleading-indentation -O2 -fwrapv -pipe -Wformat -Werror=format-security -gdwarf-4 -fno-debug-types-section -fvar-tracking-assignments -g2 -Wp,-D_FORTIFY_SOURCE=2 -fstack-protector-strong --param=ssp-buffer-size=4 -fPIC -mtune=generic -march=x86-64 -gdwarf-4 -fno-debug-types-section -fvar-tracking-assignments -g2 -MT getport.lo -MD -MP -MF .deps/getport.Tpo -c -o getport.lo getport.c libtool: compile: x86_64-pld-linux-gnux32-gcc -DHAVE_CONFIG_H -I. -I../../support/include -I/usr/include/tirpc -D_GNU_SOURCE -pipe -Wall -Wextra -Werror=strict-prototypes -Werror=missing-prototypes -Werror=missing-declarations -Werror=format=2 -Werror=undef -Werror=missing-include-dirs -Werror=strict-aliasing=2 -Werror=init-self -Werror=implicit-function-declaration -Werror=return-type -Werror=switch -Werror=overflow -Werror=parentheses -Werror=aggregate-return -Werror=unused-result -fno-strict-aliasing -Werror=format-overflow=2 -Werror=int-conversion -Werror=incompatible-pointer-types -Werror=misleading-indentation -O2 -fwrapv -pipe -Wformat -Werror=format-security -gdwarf-4 -fno-debug-types-section -fvar-tracking-assignments -g2 -Wp,-D_FORTIFY_SOURCE=2 -fstack-protector-strong --param=ssp-buffer-size=4 -fPIC -mtune=generic -march=x86-64 -gdwarf-4 -fno-debug-types-section -fvar-tracking-assignments -g2 -MT getport.lo -MD -MP -MF .deps/getport.Tpo -c getport.c -fPIC -DPIC -o .libs/getport.o In file included from /usr/include/tirpc/rpc/rpc.h:49, from getport.c:40: getport.c: In function 'nfs_gp_ping': getport.c:501:7: warning: cast between incompatible function types from 'bool_t (*)(void)' {aka 'int (*)(void)'} to 'bool_t (*)(XDR *, ...)' {aka 'int (*)(struct __rpc_xdr *, ...)'} [-Wcast-function-type] (xdrproc_t)xdr_void, NULL, ^ /usr/include/tirpc/rpc/clnt.h:163:38: note: in definition of macro 'CLNT_CALL' ((*(rh)->cl_ops->cl_call)(rh, proc, xargs, \ ^~~~~ getport.c:502:7: warning: cast between incompatible function types from 'bool_t (*)(void)' {aka 'int (*)(void)'} to 'bool_t (*)(XDR *, ...)' {aka 'int (*)(struct __rpc_xdr *, ...)'} [-Wcast-function-type] (xdrproc_t)xdr_void, NULL, ^ /usr/include/tirpc/rpc/clnt.h:164:10: note: in definition of macro 'CLNT_CALL' argsp, xres, resp, secs)) ^~~~ libtool: compile: x86_64-pld-linux-gnux32-gcc -DHAVE_CONFIG_H -I. -I../../support/include -I/usr/include/tirpc -D_GNU_SOURCE -pipe -Wall -Wextra -Werror=strict-prototypes -Werror=missing-prototypes -Werror=missing-declarations -Werror=format=2 -Werror=undef -Werror=missing-include-dirs -Werror=strict-aliasing=2 -Werror=init-self -Werror=implicit-function-declaration -Werror=return-type -Werror=switch -Werror=overflow -Werror=parentheses -Werror=aggregate-return -Werror=unused-result -fno-strict-aliasing -Werror=format-overflow=2 -Werror=int-conversion -Werror=incompatible-pointer-types -Werror=misleading-indentation -O2 -fwrapv -pipe -Wformat -Werror=format-security -gdwarf-4 -fno-debug-types-section -fvar-tracking-assignments -g2 -Wp,-D_FORTIFY_SOURCE=2 -fstack-protector-strong --param=ssp-buffer-size=4 -fPIC -mtune=generic -march=x86-64 -gdwarf-4 -fno-debug-types-section -fvar-tracking-assignments -g2 -MT getport.lo -MD -MP -MF .deps/getport.Tpo -c getport.c -o getport.o >/dev/null 2>&1 mv -f .deps/getport.Tpo .deps/getport.Plo make[2]: Leaving directory '/tmp/B.P3wIU5/BUILD/nfs-utils-2.3.3/support/nfs' make[2]: Entering directory '/tmp/B.P3wIU5/BUILD/nfs-utils-2.3.3/support/nfs' /bin/sh ../../libtool --tag=CC --mode=compile x86_64-pld-linux-gnux32-gcc -DHAVE_CONFIG_H -I. -I../../support/include -I/usr/include/tirpc -D_GNU_SOURCE -pipe -Wall -Wextra -Werror=strict-prototypes -Werror=missing-prototypes -Werror=missing-declarations -Werror=format=2 -Werror=undef -Werror=missing-include-dirs -Werror=strict-aliasing=2 -Werror=init-self -Werror=implicit-function-declaration -Werror=return-type -Werror=switch -Werror=overflow -Werror=parentheses -Werror=aggregate-return -Werror=unused-result -fno-strict-aliasing -Werror=format-overflow=2 -Werror=int-conversion -Werror=incompatible-pointer-types -Werror=misleading-indentation -O2 -fwrapv -pipe -Wformat -Werror=format-security -gdwarf-4 -fno-debug-types-section -fvar-tracking-assignments -g2 -Wp,-D_FORTIFY_SOURCE=2 -fstack-protector-strong --param=ssp-buffer-size=4 -fPIC -mtune=generic -march=x86-64 -gdwarf-4 -fno-debug-types-section -fvar-tracking-assignments -g2 -MT exports.lo -MD -MP -MF .deps/exports.Tpo -c -o exports.lo exports.c libtool: compile: x86_64-pld-linux-gnux32-gcc -DHAVE_CONFIG_H -I. -I../../support/include -I/usr/include/tirpc -D_GNU_SOURCE -pipe -Wall -Wextra -Werror=strict-prototypes -Werror=missing-prototypes -Werror=missing-declarations -Werror=format=2 -Werror=undef -Werror=missing-include-dirs -Werror=strict-aliasing=2 -Werror=init-self -Werror=implicit-function-declaration -Werror=return-type -Werror=switch -Werror=overflow -Werror=parentheses -Werror=aggregate-return -Werror=unused-result -fno-strict-aliasing -Werror=format-overflow=2 -Werror=int-conversion -Werror=incompatible-pointer-types -Werror=misleading-indentation -O2 -fwrapv -pipe -Wformat -Werror=format-security -gdwarf-4 -fno-debug-types-section -fvar-tracking-assignments -g2 -Wp,-D_FORTIFY_SOURCE=2 -fstack-protector-strong --param=ssp-buffer-size=4 -fPIC -mtune=generic -march=x86-64 -gdwarf-4 -fno-debug-types-section -fvar-tracking-assignments -g2 -MT exports.lo -MD -MP -MF .deps/exports.Tpo -c exports.c -fPIC -DPIC -o .libs/exports.o libtool: compile: x86_64-pld-linux-gnux32-gcc -DHAVE_CONFIG_H -I. -I../../support/include -I/usr/include/tirpc -D_GNU_SOURCE -pipe -Wall -Wextra -Werror=strict-prototypes -Werror=missing-prototypes -Werror=missing-declarations -Werror=format=2 -Werror=undef -Werror=missing-include-dirs -Werror=strict-aliasing=2 -Werror=init-self -Werror=implicit-function-declaration -Werror=return-type -Werror=switch -Werror=overflow -Werror=parentheses -Werror=aggregate-return -Werror=unused-result -fno-strict-aliasing -Werror=format-overflow=2 -Werror=int-conversion -Werror=incompatible-pointer-types -Werror=misleading-indentation -O2 -fwrapv -pipe -Wformat -Werror=format-security -gdwarf-4 -fno-debug-types-section -fvar-tracking-assignments -g2 -Wp,-D_FORTIFY_SOURCE=2 -fstack-protector-strong --param=ssp-buffer-size=4 -fPIC -mtune=generic -march=x86-64 -gdwarf-4 -fno-debug-types-section -fvar-tracking-assignments -g2 -MT exports.lo -MD -MP -MF .deps/exports.Tpo -c exports.c -o exports.o >/dev/null 2>&1 mv -f .deps/exports.Tpo .deps/exports.Plo make[2]: Leaving directory '/tmp/B.P3wIU5/BUILD/nfs-utils-2.3.3/support/nfs' make[1]: *** [Makefile:436: all-recursive] Error 1 make: *** [Makefile:475: all-recursive] Error 1 error: Bad exit status from /tmp/B.P3wIU5/BUILD/tmp/rpm-tmp.76985 (%build) RPM build errors: Bad exit status from /tmp/B.P3wIU5/BUILD/tmp/rpm-tmp.76985 (%build) ended at: Mon Nov 26 00:33:17 2018, done in 0:00:27.474114 error: No files produced. + chmod -R u+rwX /tmp/B.P3wIU5/BUILD + rm -rf /tmp/B.P3wIU5/tmp /tmp/B.P3wIU5/BUILD + rm -rf /tmp/B.P3wIU5 Begin-PLD-Builder-Info Build-Time: user:25.38s sys:3.77s real:30.50s (faults io:0 non-io:1738341) End-PLD-Builder-Info
[Back to list of logs] [View rpm -qa of builder]