FailedOk

th/SRPMS[OK]
th/x32[OK]
th/i686[OK]
th/x86_64[OK]

ac/SRPMS[OK]
ac/i386[OK]
ac/i586[OK]
ac/i686[OK]
ac/alpha[OK]
ac/amd64[OK]
ac/athlon[OK]
ac/ppc[OK]
ac/sparc[OK]
ac/sparc64[OK]

Advanced Search
main()
Powered by PLD Linux
(c) 2002-2018 PLD Team
$Revision: 1.37 $
Powered by VAX.
Your IP: 34.235.127.68

nfs-utils 0656943a-cdc5-4d2e-aa1d-b8cd1a948ab2

Status:Failed
Source URL:ftp://buildlogs.pld-linux.org/th/x32/FAIL/nfs-utils,0656943a-cdc5-4d2e-aa1d-b8cd1a948ab2.bz2
text/plain URL:View!
full text:View!
rpm -qa of builder:View!
Date:2018/11/26 00:33:17
Runtime:0:00:27.474114

Toc:

  • error 1
  • cacheio.c:237:20: error: format '%ld' expects argument of type 'long int', but argument 3 has type '__time_t' {aka 'long long int'} [-Werror=format=]
  • error 2
  • make[2]: *** [Makefile:505: cacheio.lo] Error 1
  • error 3
  • make[1]: *** [Makefile:436: all-recursive] Error 1
  • error 4
  • error: Bad exit status from /tmp/B.P3wIU5/BUILD/tmp/rpm-tmp.76985 (%build)
  • error 5
  • RPM build errors:
  • error 6
  • error: No files produced.

Content:

make[3]: Leaving directory '/tmp/B.P3wIU5/BUILD/nfs-utils-2.3.3/support/export'
make[3]: Entering directory '/tmp/B.P3wIU5/BUILD/nfs-utils-2.3.3/support/export'
x86_64-pld-linux-gnux32-gcc -DHAVE_CONFIG_H -I. -I../../support/include  -I/usr/include/tirpc -D_GNU_SOURCE -pipe  -Wall  -Wextra  -Werror=strict-prototypes  -Werror=missing-prototypes  -Werror=missing-declarations  -Werror=format=2  -Werror=undef  -Werror=missing-include-dirs  -Werror=strict-aliasing=2  -Werror=init-self  -Werror=implicit-function-declaration  -Werror=return-type  -Werror=switch  -Werror=overflow  -Werror=parentheses  -Werror=aggregate-return  -Werror=unused-result  -fno-strict-aliasing  -Werror=format-overflow=2 -Werror=int-conversion -Werror=incompatible-pointer-types -Werror=misleading-indentation -O2 -fwrapv -pipe -Wformat -Werror=format-security -gdwarf-4 -fno-debug-types-section -fvar-tracking-assignments -g2 -Wp,-D_FORTIFY_SOURCE=2 -fstack-protector-strong --param=ssp-buffer-size=4 -fPIC -mtune=generic -march=x86-64 -gdwarf-4 -fno-debug-types-section -fvar-tracking-assignments -g2  -MT export.o -MD -MP -MF .deps/export.Tpo -c -o export.o export.c
mv -f .deps/export.Tpo .deps/export.Po
make[3]: Leaving directory '/tmp/B.P3wIU5/BUILD/nfs-utils-2.3.3/support/export'
make[3]: Entering directory '/tmp/B.P3wIU5/BUILD/nfs-utils-2.3.3/support/export'
x86_64-pld-linux-gnux32-gcc -DHAVE_CONFIG_H -I. -I../../support/include  -I/usr/include/tirpc -D_GNU_SOURCE -pipe  -Wall  -Wextra  -Werror=strict-prototypes  -Werror=missing-prototypes  -Werror=missing-declarations  -Werror=format=2  -Werror=undef  -Werror=missing-include-dirs  -Werror=strict-aliasing=2  -Werror=init-self  -Werror=implicit-function-declaration  -Werror=return-type  -Werror=switch  -Werror=overflow  -Werror=parentheses  -Werror=aggregate-return  -Werror=unused-result  -fno-strict-aliasing  -Werror=format-overflow=2 -Werror=int-conversion -Werror=incompatible-pointer-types -Werror=misleading-indentation -O2 -fwrapv -pipe -Wformat -Werror=format-security -gdwarf-4 -fno-debug-types-section -fvar-tracking-assignments -g2 -Wp,-D_FORTIFY_SOURCE=2 -fstack-protector-strong --param=ssp-buffer-size=4 -fPIC -mtune=generic -march=x86-64 -gdwarf-4 -fno-debug-types-section -fvar-tracking-assignments -g2  -MT client.o -MD -MP -MF .deps/client.Tpo -c -o client.o client.c
mv -f .deps/client.Tpo .deps/client.Po
make[3]: Leaving directory '/tmp/B.P3wIU5/BUILD/nfs-utils-2.3.3/support/export'
make[3]: Entering directory '/tmp/B.P3wIU5/BUILD/nfs-utils-2.3.3/support/export'
rm -f libexport.a
ar cru libexport.a client.o export.o hostname.o xtab.o mount_clnt.o mount_xdr.o 
ranlib libexport.a
make[3]: Leaving directory '/tmp/B.P3wIU5/BUILD/nfs-utils-2.3.3/support/export'
Making all in include
/usr/bin/make  all-recursive
Making all in nfs
make[4]: Nothing to be done for 'all'.
Making all in rpcsvc
make[4]: Nothing to be done for 'all'.
Making all in sys
Making all in fs
make[5]: Nothing to be done for 'all'.
make[5]: Nothing to be done for 'all-am'.
Making all in misc
make[2]: Entering directory '/tmp/B.P3wIU5/BUILD/nfs-utils-2.3.3/support/misc'
x86_64-pld-linux-gnux32-gcc -DHAVE_CONFIG_H -I. -I../../support/include  -I/usr/include/tirpc -D_GNU_SOURCE -pipe  -Wall  -Wextra  -Werror=strict-prototypes  -Werror=missing-prototypes  -Werror=missing-declarations  -Werror=format=2  -Werror=undef  -Werror=missing-include-dirs  -Werror=strict-aliasing=2  -Werror=init-self  -Werror=implicit-function-declaration  -Werror=return-type  -Werror=switch  -Werror=overflow  -Werror=parentheses  -Werror=aggregate-return  -Werror=unused-result  -fno-strict-aliasing  -Werror=format-overflow=2 -Werror=int-conversion -Werror=incompatible-pointer-types -Werror=misleading-indentation -O2 -fwrapv -pipe -Wformat -Werror=format-security -gdwarf-4 -fno-debug-types-section -fvar-tracking-assignments -g2 -Wp,-D_FORTIFY_SOURCE=2 -fstack-protector-strong --param=ssp-buffer-size=4 -fPIC -mtune=generic -march=x86-64 -gdwarf-4 -fno-debug-types-section -fvar-tracking-assignments -g2  -MT mountpoint.o -MD -MP -MF .deps/mountpoint.Tpo -c -o mountpoint.o mountpoint.c
mv -f .deps/mountpoint.Tpo .deps/mountpoint.Po
make[2]: Leaving directory '/tmp/B.P3wIU5/BUILD/nfs-utils-2.3.3/support/misc'
make[2]: Entering directory '/tmp/B.P3wIU5/BUILD/nfs-utils-2.3.3/support/misc'
x86_64-pld-linux-gnux32-gcc -DHAVE_CONFIG_H -I. -I../../support/include  -I/usr/include/tirpc -D_GNU_SOURCE -pipe  -Wall  -Wextra  -Werror=strict-prototypes  -Werror=missing-prototypes  -Werror=missing-declarations  -Werror=format=2  -Werror=undef  -Werror=missing-include-dirs  -Werror=strict-aliasing=2  -Werror=init-self  -Werror=implicit-function-declaration  -Werror=return-type  -Werror=switch  -Werror=overflow  -Werror=parentheses  -Werror=aggregate-return  -Werror=unused-result  -fno-strict-aliasing  -Werror=format-overflow=2 -Werror=int-conversion -Werror=incompatible-pointer-types -Werror=misleading-indentation -O2 -fwrapv -pipe -Wformat -Werror=format-security -gdwarf-4 -fno-debug-types-section -fvar-tracking-assignments -g2 -Wp,-D_FORTIFY_SOURCE=2 -fstack-protector-strong --param=ssp-buffer-size=4 -fPIC -mtune=generic -march=x86-64 -gdwarf-4 -fno-debug-types-section -fvar-tracking-assignments -g2  -MT file.o -MD -MP -MF .deps/file.Tpo -c -o file.o file.c
mv -f .deps/file.Tpo .deps/file.Po
make[2]: Leaving directory '/tmp/B.P3wIU5/BUILD/nfs-utils-2.3.3/support/misc'
make[2]: Entering directory '/tmp/B.P3wIU5/BUILD/nfs-utils-2.3.3/support/misc'
x86_64-pld-linux-gnux32-gcc -DHAVE_CONFIG_H -I. -I../../support/include  -I/usr/include/tirpc -D_GNU_SOURCE -pipe  -Wall  -Wextra  -Werror=strict-prototypes  -Werror=missing-prototypes  -Werror=missing-declarations  -Werror=format=2  -Werror=undef  -Werror=missing-include-dirs  -Werror=strict-aliasing=2  -Werror=init-self  -Werror=implicit-function-declaration  -Werror=return-type  -Werror=switch  -Werror=overflow  -Werror=parentheses  -Werror=aggregate-return  -Werror=unused-result  -fno-strict-aliasing  -Werror=format-overflow=2 -Werror=int-conversion -Werror=incompatible-pointer-types -Werror=misleading-indentation -O2 -fwrapv -pipe -Wformat -Werror=format-security -gdwarf-4 -fno-debug-types-section -fvar-tracking-assignments -g2 -Wp,-D_FORTIFY_SOURCE=2 -fstack-protector-strong --param=ssp-buffer-size=4 -fPIC -mtune=generic -march=x86-64 -gdwarf-4 -fno-debug-types-section -fvar-tracking-assignments -g2  -MT from_local.o -MD -MP -MF .deps/from_local.Tpo -c -o from_local.o from_local.c
mv -f .deps/from_local.Tpo .deps/from_local.Po
make[2]: Leaving directory '/tmp/B.P3wIU5/BUILD/nfs-utils-2.3.3/support/misc'
make[2]: Entering directory '/tmp/B.P3wIU5/BUILD/nfs-utils-2.3.3/support/misc'
x86_64-pld-linux-gnux32-gcc -DHAVE_CONFIG_H -I. -I../../support/include  -I/usr/include/tirpc -D_GNU_SOURCE -pipe  -Wall  -Wextra  -Werror=strict-prototypes  -Werror=missing-prototypes  -Werror=missing-declarations  -Werror=format=2  -Werror=undef  -Werror=missing-include-dirs  -Werror=strict-aliasing=2  -Werror=init-self  -Werror=implicit-function-declaration  -Werror=return-type  -Werror=switch  -Werror=overflow  -Werror=parentheses  -Werror=aggregate-return  -Werror=unused-result  -fno-strict-aliasing  -Werror=format-overflow=2 -Werror=int-conversion -Werror=incompatible-pointer-types -Werror=misleading-indentation -O2 -fwrapv -pipe -Wformat -Werror=format-security -gdwarf-4 -fno-debug-types-section -fvar-tracking-assignments -g2 -Wp,-D_FORTIFY_SOURCE=2 -fstack-protector-strong --param=ssp-buffer-size=4 -fPIC -mtune=generic -march=x86-64 -gdwarf-4 -fno-debug-types-section -fvar-tracking-assignments -g2  -MT tcpwrapper.o -MD -MP -MF .deps/tcpwrapper.Tpo -c -o tcpwrapper.o tcpwrapper.c
mv -f .deps/tcpwrapper.Tpo .deps/tcpwrapper.Po
make[2]: Leaving directory '/tmp/B.P3wIU5/BUILD/nfs-utils-2.3.3/support/misc'
make[2]: Entering directory '/tmp/B.P3wIU5/BUILD/nfs-utils-2.3.3/support/misc'
rm -f libmisc.a
ar cru libmisc.a tcpwrapper.o from_local.o mountpoint.o file.o 
ranlib libmisc.a
make[2]: Leaving directory '/tmp/B.P3wIU5/BUILD/nfs-utils-2.3.3/support/misc'
Making all in nfs
make[2]: Entering directory '/tmp/B.P3wIU5/BUILD/nfs-utils-2.3.3/support/nfs'
/bin/sh ../../libtool  --tag=CC   --mode=compile x86_64-pld-linux-gnux32-gcc -DHAVE_CONFIG_H -I. -I../../support/include  -I/usr/include/tirpc -D_GNU_SOURCE -pipe  -Wall  -Wextra  -Werror=strict-prototypes  -Werror=missing-prototypes  -Werror=missing-declarations  -Werror=format=2  -Werror=undef  -Werror=missing-include-dirs  -Werror=strict-aliasing=2  -Werror=init-self  -Werror=implicit-function-declaration  -Werror=return-type  -Werror=switch  -Werror=overflow  -Werror=parentheses  -Werror=aggregate-return  -Werror=unused-result  -fno-strict-aliasing  -Werror=format-overflow=2 -Werror=int-conversion -Werror=incompatible-pointer-types -Werror=misleading-indentation -O2 -fwrapv -pipe -Wformat -Werror=format-security -gdwarf-4 -fno-debug-types-section -fvar-tracking-assignments -g2 -Wp,-D_FORTIFY_SOURCE=2 -fstack-protector-strong --param=ssp-buffer-size=4 -fPIC -mtune=generic -march=x86-64 -gdwarf-4 -fno-debug-types-section -fvar-tracking-assignments -g2  -MT rpcdispatch.lo -MD -MP -MF .deps/rpcdispatch.Tpo -c -o rpcdispatch.lo rpcdispatch.c
libtool: compile:  x86_64-pld-linux-gnux32-gcc -DHAVE_CONFIG_H -I. -I../../support/include -I/usr/include/tirpc -D_GNU_SOURCE -pipe -Wall -Wextra -Werror=strict-prototypes -Werror=missing-prototypes -Werror=missing-declarations -Werror=format=2 -Werror=undef -Werror=missing-include-dirs -Werror=strict-aliasing=2 -Werror=init-self -Werror=implicit-function-declaration -Werror=return-type -Werror=switch -Werror=overflow -Werror=parentheses -Werror=aggregate-return -Werror=unused-result -fno-strict-aliasing -Werror=format-overflow=2 -Werror=int-conversion -Werror=incompatible-pointer-types -Werror=misleading-indentation -O2 -fwrapv -pipe -Wformat -Werror=format-security -gdwarf-4 -fno-debug-types-section -fvar-tracking-assignments -g2 -Wp,-D_FORTIFY_SOURCE=2 -fstack-protector-strong --param=ssp-buffer-size=4 -fPIC -mtune=generic -march=x86-64 -gdwarf-4 -fno-debug-types-section -fvar-tracking-assignments -g2 -MT rpcdispatch.lo -MD -MP -MF .deps/rpcdispatch.Tpo -c rpcdispatch.c  -fPIC -DPIC -o .libs/rpcdispatch.o
libtool: compile:  x86_64-pld-linux-gnux32-gcc -DHAVE_CONFIG_H -I. -I../../support/include -I/usr/include/tirpc -D_GNU_SOURCE -pipe -Wall -Wextra -Werror=strict-prototypes -Werror=missing-prototypes -Werror=missing-declarations -Werror=format=2 -Werror=undef -Werror=missing-include-dirs -Werror=strict-aliasing=2 -Werror=init-self -Werror=implicit-function-declaration -Werror=return-type -Werror=switch -Werror=overflow -Werror=parentheses -Werror=aggregate-return -Werror=unused-result -fno-strict-aliasing -Werror=format-overflow=2 -Werror=int-conversion -Werror=incompatible-pointer-types -Werror=misleading-indentation -O2 -fwrapv -pipe -Wformat -Werror=format-security -gdwarf-4 -fno-debug-types-section -fvar-tracking-assignments -g2 -Wp,-D_FORTIFY_SOURCE=2 -fstack-protector-strong --param=ssp-buffer-size=4 -fPIC -mtune=generic -march=x86-64 -gdwarf-4 -fno-debug-types-section -fvar-tracking-assignments -g2 -MT rpcdispatch.lo -MD -MP -MF .deps/rpcdispatch.Tpo -c rpcdispatch.c -o rpcdispatch.o >/dev/null 2>&1
mv -f .deps/rpcdispatch.Tpo .deps/rpcdispatch.Plo
make[2]: Leaving directory '/tmp/B.P3wIU5/BUILD/nfs-utils-2.3.3/support/nfs'
make[2]: Entering directory '/tmp/B.P3wIU5/BUILD/nfs-utils-2.3.3/support/nfs'
/bin/sh ../../libtool  --tag=CC   --mode=compile x86_64-pld-linux-gnux32-gcc -DHAVE_CONFIG_H -I. -I../../support/include  -I/usr/include/tirpc -D_GNU_SOURCE -pipe  -Wall  -Wextra  -Werror=strict-prototypes  -Werror=missing-prototypes  -Werror=missing-declarations  -Werror=format=2  -Werror=undef  -Werror=missing-include-dirs  -Werror=strict-aliasing=2  -Werror=init-self  -Werror=implicit-function-declaration  -Werror=return-type  -Werror=switch  -Werror=overflow  -Werror=parentheses  -Werror=aggregate-return  -Werror=unused-result  -fno-strict-aliasing  -Werror=format-overflow=2 -Werror=int-conversion -Werror=incompatible-pointer-types -Werror=misleading-indentation -O2 -fwrapv -pipe -Wformat -Werror=format-security -gdwarf-4 -fno-debug-types-section -fvar-tracking-assignments -g2 -Wp,-D_FORTIFY_SOURCE=2 -fstack-protector-strong --param=ssp-buffer-size=4 -fPIC -mtune=generic -march=x86-64 -gdwarf-4 -fno-debug-types-section -fvar-tracking-assignments -g2  -MT mydaemon.lo -MD -MP -MF .deps/mydaemon.Tpo -c -o mydaemon.lo mydaemon.c
libtool: compile:  x86_64-pld-linux-gnux32-gcc -DHAVE_CONFIG_H -I. -I../../support/include -I/usr/include/tirpc -D_GNU_SOURCE -pipe -Wall -Wextra -Werror=strict-prototypes -Werror=missing-prototypes -Werror=missing-declarations -Werror=format=2 -Werror=undef -Werror=missing-include-dirs -Werror=strict-aliasing=2 -Werror=init-self -Werror=implicit-function-declaration -Werror=return-type -Werror=switch -Werror=overflow -Werror=parentheses -Werror=aggregate-return -Werror=unused-result -fno-strict-aliasing -Werror=format-overflow=2 -Werror=int-conversion -Werror=incompatible-pointer-types -Werror=misleading-indentation -O2 -fwrapv -pipe -Wformat -Werror=format-security -gdwarf-4 -fno-debug-types-section -fvar-tracking-assignments -g2 -Wp,-D_FORTIFY_SOURCE=2 -fstack-protector-strong --param=ssp-buffer-size=4 -fPIC -mtune=generic -march=x86-64 -gdwarf-4 -fno-debug-types-section -fvar-tracking-assignments -g2 -MT mydaemon.lo -MD -MP -MF .deps/mydaemon.Tpo -c mydaemon.c  -fPIC -DPIC -o .libs/mydaemon.o
libtool: compile:  x86_64-pld-linux-gnux32-gcc -DHAVE_CONFIG_H -I. -I../../support/include -I/usr/include/tirpc -D_GNU_SOURCE -pipe -Wall -Wextra -Werror=strict-prototypes -Werror=missing-prototypes -Werror=missing-declarations -Werror=format=2 -Werror=undef -Werror=missing-include-dirs -Werror=strict-aliasing=2 -Werror=init-self -Werror=implicit-function-declaration -Werror=return-type -Werror=switch -Werror=overflow -Werror=parentheses -Werror=aggregate-return -Werror=unused-result -fno-strict-aliasing -Werror=format-overflow=2 -Werror=int-conversion -Werror=incompatible-pointer-types -Werror=misleading-indentation -O2 -fwrapv -pipe -Wformat -Werror=format-security -gdwarf-4 -fno-debug-types-section -fvar-tracking-assignments -g2 -Wp,-D_FORTIFY_SOURCE=2 -fstack-protector-strong --param=ssp-buffer-size=4 -fPIC -mtune=generic -march=x86-64 -gdwarf-4 -fno-debug-types-section -fvar-tracking-assignments -g2 -MT mydaemon.lo -MD -MP -MF .deps/mydaemon.Tpo -c mydaemon.c -o mydaemon.o >/dev/null 2>&1
mv -f .deps/mydaemon.Tpo .deps/mydaemon.Plo
make[2]: Leaving directory '/tmp/B.P3wIU5/BUILD/nfs-utils-2.3.3/support/nfs'
make[2]: Entering directory '/tmp/B.P3wIU5/BUILD/nfs-utils-2.3.3/support/nfs'
/bin/sh ../../libtool  --tag=CC   --mode=compile x86_64-pld-linux-gnux32-gcc -DHAVE_CONFIG_H -I. -I../../support/include  -I/usr/include/tirpc -D_GNU_SOURCE -pipe  -Wall  -Wextra  -Werror=strict-prototypes  -Werror=missing-prototypes  -Werror=missing-declarations  -Werror=format=2  -Werror=undef  -Werror=missing-include-dirs  -Werror=strict-aliasing=2  -Werror=init-self  -Werror=implicit-function-declaration  -Werror=return-type  -Werror=switch  -Werror=overflow  -Werror=parentheses  -Werror=aggregate-return  -Werror=unused-result  -fno-strict-aliasing  -Werror=format-overflow=2 -Werror=int-conversion -Werror=incompatible-pointer-types -Werror=misleading-indentation -O2 -fwrapv -pipe -Wformat -Werror=format-security -gdwarf-4 -fno-debug-types-section -fvar-tracking-assignments -g2 -Wp,-D_FORTIFY_SOURCE=2 -fstack-protector-strong --param=ssp-buffer-size=4 -fPIC -mtune=generic -march=x86-64 -gdwarf-4 -fno-debug-types-section -fvar-tracking-assignments -g2  -MT rmtab.lo -MD -MP -MF .deps/rmtab.Tpo -c -o rmtab.lo rmtab.c
libtool: compile:  x86_64-pld-linux-gnux32-gcc -DHAVE_CONFIG_H -I. -I../../support/include -I/usr/include/tirpc -D_GNU_SOURCE -pipe -Wall -Wextra -Werror=strict-prototypes -Werror=missing-prototypes -Werror=missing-declarations -Werror=format=2 -Werror=undef -Werror=missing-include-dirs -Werror=strict-aliasing=2 -Werror=init-self -Werror=implicit-function-declaration -Werror=return-type -Werror=switch -Werror=overflow -Werror=parentheses -Werror=aggregate-return -Werror=unused-result -fno-strict-aliasing -Werror=format-overflow=2 -Werror=int-conversion -Werror=incompatible-pointer-types -Werror=misleading-indentation -O2 -fwrapv -pipe -Wformat -Werror=format-security -gdwarf-4 -fno-debug-types-section -fvar-tracking-assignments -g2 -Wp,-D_FORTIFY_SOURCE=2 -fstack-protector-strong --param=ssp-buffer-size=4 -fPIC -mtune=generic -march=x86-64 -gdwarf-4 -fno-debug-types-section -fvar-tracking-assignments -g2 -MT rmtab.lo -MD -MP -MF .deps/rmtab.Tpo -c rmtab.c  -fPIC -DPIC -o .libs/rmtab.o
libtool: compile:  x86_64-pld-linux-gnux32-gcc -DHAVE_CONFIG_H -I. -I../../support/include -I/usr/include/tirpc -D_GNU_SOURCE -pipe -Wall -Wextra -Werror=strict-prototypes -Werror=missing-prototypes -Werror=missing-declarations -Werror=format=2 -Werror=undef -Werror=missing-include-dirs -Werror=strict-aliasing=2 -Werror=init-self -Werror=implicit-function-declaration -Werror=return-type -Werror=switch -Werror=overflow -Werror=parentheses -Werror=aggregate-return -Werror=unused-result -fno-strict-aliasing -Werror=format-overflow=2 -Werror=int-conversion -Werror=incompatible-pointer-types -Werror=misleading-indentation -O2 -fwrapv -pipe -Wformat -Werror=format-security -gdwarf-4 -fno-debug-types-section -fvar-tracking-assignments -g2 -Wp,-D_FORTIFY_SOURCE=2 -fstack-protector-strong --param=ssp-buffer-size=4 -fPIC -mtune=generic -march=x86-64 -gdwarf-4 -fno-debug-types-section -fvar-tracking-assignments -g2 -MT rmtab.lo -MD -MP -MF .deps/rmtab.Tpo -c rmtab.c -o rmtab.o >/dev/null 2>&1
mv -f .deps/rmtab.Tpo .deps/rmtab.Plo
make[2]: Leaving directory '/tmp/B.P3wIU5/BUILD/nfs-utils-2.3.3/support/nfs'
make[2]: Entering directory '/tmp/B.P3wIU5/BUILD/nfs-utils-2.3.3/support/nfs'
/bin/sh ../../libtool  --tag=CC   --mode=compile x86_64-pld-linux-gnux32-gcc -DHAVE_CONFIG_H -I. -I../../support/include  -I/usr/include/tirpc -D_GNU_SOURCE -pipe  -Wall  -Wextra  -Werror=strict-prototypes  -Werror=missing-prototypes  -Werror=missing-declarations  -Werror=format=2  -Werror=undef  -Werror=missing-include-dirs  -Werror=strict-aliasing=2  -Werror=init-self  -Werror=implicit-function-declaration  -Werror=return-type  -Werror=switch  -Werror=overflow  -Werror=parentheses  -Werror=aggregate-return  -Werror=unused-result  -fno-strict-aliasing  -Werror=format-overflow=2 -Werror=int-conversion -Werror=incompatible-pointer-types -Werror=misleading-indentation -O2 -fwrapv -pipe -Wformat -Werror=format-security -gdwarf-4 -fno-debug-types-section -fvar-tracking-assignments -g2 -Wp,-D_FORTIFY_SOURCE=2 -fstack-protector-strong --param=ssp-buffer-size=4 -fPIC -mtune=generic -march=x86-64 -gdwarf-4 -fno-debug-types-section -fvar-tracking-assignments -g2  -MT xio.lo -MD -MP -MF .deps/xio.Tpo -c -o xio.lo xio.c
libtool: compile:  x86_64-pld-linux-gnux32-gcc -DHAVE_CONFIG_H -I. -I../../support/include -I/usr/include/tirpc -D_GNU_SOURCE -pipe -Wall -Wextra -Werror=strict-prototypes -Werror=missing-prototypes -Werror=missing-declarations -Werror=format=2 -Werror=undef -Werror=missing-include-dirs -Werror=strict-aliasing=2 -Werror=init-self -Werror=implicit-function-declaration -Werror=return-type -Werror=switch -Werror=overflow -Werror=parentheses -Werror=aggregate-return -Werror=unused-result -fno-strict-aliasing -Werror=format-overflow=2 -Werror=int-conversion -Werror=incompatible-pointer-types -Werror=misleading-indentation -O2 -fwrapv -pipe -Wformat -Werror=format-security -gdwarf-4 -fno-debug-types-section -fvar-tracking-assignments -g2 -Wp,-D_FORTIFY_SOURCE=2 -fstack-protector-strong --param=ssp-buffer-size=4 -fPIC -mtune=generic -march=x86-64 -gdwarf-4 -fno-debug-types-section -fvar-tracking-assignments -g2 -MT xio.lo -MD -MP -MF .deps/xio.Tpo -c xio.c  -fPIC -DPIC -o .libs/xio.o
libtool: compile:  x86_64-pld-linux-gnux32-gcc -DHAVE_CONFIG_H -I. -I../../support/include -I/usr/include/tirpc -D_GNU_SOURCE -pipe -Wall -Wextra -Werror=strict-prototypes -Werror=missing-prototypes -Werror=missing-declarations -Werror=format=2 -Werror=undef -Werror=missing-include-dirs -Werror=strict-aliasing=2 -Werror=init-self -Werror=implicit-function-declaration -Werror=return-type -Werror=switch -Werror=overflow -Werror=parentheses -Werror=aggregate-return -Werror=unused-result -fno-strict-aliasing -Werror=format-overflow=2 -Werror=int-conversion -Werror=incompatible-pointer-types -Werror=misleading-indentation -O2 -fwrapv -pipe -Wformat -Werror=format-security -gdwarf-4 -fno-debug-types-section -fvar-tracking-assignments -g2 -Wp,-D_FORTIFY_SOURCE=2 -fstack-protector-strong --param=ssp-buffer-size=4 -fPIC -mtune=generic -march=x86-64 -gdwarf-4 -fno-debug-types-section -fvar-tracking-assignments -g2 -MT xio.lo -MD -MP -MF .deps/xio.Tpo -c xio.c -o xio.o >/dev/null 2>&1
mv -f .deps/xio.Tpo .deps/xio.Plo
make[2]: Leaving directory '/tmp/B.P3wIU5/BUILD/nfs-utils-2.3.3/support/nfs'
make[2]: Entering directory '/tmp/B.P3wIU5/BUILD/nfs-utils-2.3.3/support/nfs'
/bin/sh ../../libtool  --tag=CC   --mode=compile x86_64-pld-linux-gnux32-gcc -DHAVE_CONFIG_H -I. -I../../support/include  -I/usr/include/tirpc -D_GNU_SOURCE -pipe  -Wall  -Wextra  -Werror=strict-prototypes  -Werror=missing-prototypes  -Werror=missing-declarations  -Werror=format=2  -Werror=undef  -Werror=missing-include-dirs  -Werror=strict-aliasing=2  -Werror=init-self  -Werror=implicit-function-declaration  -Werror=return-type  -Werror=switch  -Werror=overflow  -Werror=parentheses  -Werror=aggregate-return  -Werror=unused-result  -fno-strict-aliasing  -Werror=format-overflow=2 -Werror=int-conversion -Werror=incompatible-pointer-types -Werror=misleading-indentation -O2 -fwrapv -pipe -Wformat -Werror=format-security -gdwarf-4 -fno-debug-types-section -fvar-tracking-assignments -g2 -Wp,-D_FORTIFY_SOURCE=2 -fstack-protector-strong --param=ssp-buffer-size=4 -fPIC -mtune=generic -march=x86-64 -gdwarf-4 -fno-debug-types-section -fvar-tracking-assignments -g2  -MT wildmat.lo -MD -MP -MF .deps/wildmat.Tpo -c -o wildmat.lo wildmat.c
libtool: compile:  x86_64-pld-linux-gnux32-gcc -DHAVE_CONFIG_H -I. -I../../support/include -I/usr/include/tirpc -D_GNU_SOURCE -pipe -Wall -Wextra -Werror=strict-prototypes -Werror=missing-prototypes -Werror=missing-declarations -Werror=format=2 -Werror=undef -Werror=missing-include-dirs -Werror=strict-aliasing=2 -Werror=init-self -Werror=implicit-function-declaration -Werror=return-type -Werror=switch -Werror=overflow -Werror=parentheses -Werror=aggregate-return -Werror=unused-result -fno-strict-aliasing -Werror=format-overflow=2 -Werror=int-conversion -Werror=incompatible-pointer-types -Werror=misleading-indentation -O2 -fwrapv -pipe -Wformat -Werror=format-security -gdwarf-4 -fno-debug-types-section -fvar-tracking-assignments -g2 -Wp,-D_FORTIFY_SOURCE=2 -fstack-protector-strong --param=ssp-buffer-size=4 -fPIC -mtune=generic -march=x86-64 -gdwarf-4 -fno-debug-types-section -fvar-tracking-assignments -g2 -MT wildmat.lo -MD -MP -MF .deps/wildmat.Tpo -c wildmat.c  -fPIC -DPIC -o .libs/wildmat.o
libtool: compile:  x86_64-pld-linux-gnux32-gcc -DHAVE_CONFIG_H -I. -I../../support/include -I/usr/include/tirpc -D_GNU_SOURCE -pipe -Wall -Wextra -Werror=strict-prototypes -Werror=missing-prototypes -Werror=missing-declarations -Werror=format=2 -Werror=undef -Werror=missing-include-dirs -Werror=strict-aliasing=2 -Werror=init-self -Werror=implicit-function-declaration -Werror=return-type -Werror=switch -Werror=overflow -Werror=parentheses -Werror=aggregate-return -Werror=unused-result -fno-strict-aliasing -Werror=format-overflow=2 -Werror=int-conversion -Werror=incompatible-pointer-types -Werror=misleading-indentation -O2 -fwrapv -pipe -Wformat -Werror=format-security -gdwarf-4 -fno-debug-types-section -fvar-tracking-assignments -g2 -Wp,-D_FORTIFY_SOURCE=2 -fstack-protector-strong --param=ssp-buffer-size=4 -fPIC -mtune=generic -march=x86-64 -gdwarf-4 -fno-debug-types-section -fvar-tracking-assignments -g2 -MT wildmat.lo -MD -MP -MF .deps/wildmat.Tpo -c wildmat.c -o wildmat.o >/dev/null 2>&1
mv -f .deps/wildmat.Tpo .deps/wildmat.Plo
make[2]: Leaving directory '/tmp/B.P3wIU5/BUILD/nfs-utils-2.3.3/support/nfs'
make[2]: Entering directory '/tmp/B.P3wIU5/BUILD/nfs-utils-2.3.3/support/nfs'
/bin/sh ../../libtool  --tag=CC   --mode=compile x86_64-pld-linux-gnux32-gcc -DHAVE_CONFIG_H -I. -I../../support/include  -I/usr/include/tirpc -D_GNU_SOURCE -pipe  -Wall  -Wextra  -Werror=strict-prototypes  -Werror=missing-prototypes  -Werror=missing-declarations  -Werror=format=2  -Werror=undef  -Werror=missing-include-dirs  -Werror=strict-aliasing=2  -Werror=init-self  -Werror=implicit-function-declaration  -Werror=return-type  -Werror=switch  -Werror=overflow  -Werror=parentheses  -Werror=aggregate-return  -Werror=unused-result  -fno-strict-aliasing  -Werror=format-overflow=2 -Werror=int-conversion -Werror=incompatible-pointer-types -Werror=misleading-indentation -O2 -fwrapv -pipe -Wformat -Werror=format-security -gdwarf-4 -fno-debug-types-section -fvar-tracking-assignments -g2 -Wp,-D_FORTIFY_SOURCE=2 -fstack-protector-strong --param=ssp-buffer-size=4 -fPIC -mtune=generic -march=x86-64 -gdwarf-4 -fno-debug-types-section -fvar-tracking-assignments -g2  -MT xcommon.lo -MD -MP -MF .deps/xcommon.Tpo -c -o xcommon.lo xcommon.c
libtool: compile:  x86_64-pld-linux-gnux32-gcc -DHAVE_CONFIG_H -I. -I../../support/include -I/usr/include/tirpc -D_GNU_SOURCE -pipe -Wall -Wextra -Werror=strict-prototypes -Werror=missing-prototypes -Werror=missing-declarations -Werror=format=2 -Werror=undef -Werror=missing-include-dirs -Werror=strict-aliasing=2 -Werror=init-self -Werror=implicit-function-declaration -Werror=return-type -Werror=switch -Werror=overflow -Werror=parentheses -Werror=aggregate-return -Werror=unused-result -fno-strict-aliasing -Werror=format-overflow=2 -Werror=int-conversion -Werror=incompatible-pointer-types -Werror=misleading-indentation -O2 -fwrapv -pipe -Wformat -Werror=format-security -gdwarf-4 -fno-debug-types-section -fvar-tracking-assignments -g2 -Wp,-D_FORTIFY_SOURCE=2 -fstack-protector-strong --param=ssp-buffer-size=4 -fPIC -mtune=generic -march=x86-64 -gdwarf-4 -fno-debug-types-section -fvar-tracking-assignments -g2 -MT xcommon.lo -MD -MP -MF .deps/xcommon.Tpo -c xcommon.c  -fPIC -DPIC -o .libs/xcommon.o
libtool: compile:  x86_64-pld-linux-gnux32-gcc -DHAVE_CONFIG_H -I. -I../../support/include -I/usr/include/tirpc -D_GNU_SOURCE -pipe -Wall -Wextra -Werror=strict-prototypes -Werror=missing-prototypes -Werror=missing-declarations -Werror=format=2 -Werror=undef -Werror=missing-include-dirs -Werror=strict-aliasing=2 -Werror=init-self -Werror=implicit-function-declaration -Werror=return-type -Werror=switch -Werror=overflow -Werror=parentheses -Werror=aggregate-return -Werror=unused-result -fno-strict-aliasing -Werror=format-overflow=2 -Werror=int-conversion -Werror=incompatible-pointer-types -Werror=misleading-indentation -O2 -fwrapv -pipe -Wformat -Werror=format-security -gdwarf-4 -fno-debug-types-section -fvar-tracking-assignments -g2 -Wp,-D_FORTIFY_SOURCE=2 -fstack-protector-strong --param=ssp-buffer-size=4 -fPIC -mtune=generic -march=x86-64 -gdwarf-4 -fno-debug-types-section -fvar-tracking-assignments -g2 -MT xcommon.lo -MD -MP -MF .deps/xcommon.Tpo -c xcommon.c -o xcommon.o >/dev/null 2>&1
mv -f .deps/xcommon.Tpo .deps/xcommon.Plo
make[2]: Leaving directory '/tmp/B.P3wIU5/BUILD/nfs-utils-2.3.3/support/nfs'
make[2]: Entering directory '/tmp/B.P3wIU5/BUILD/nfs-utils-2.3.3/support/nfs'
/bin/sh ../../libtool  --tag=CC   --mode=compile x86_64-pld-linux-gnux32-gcc -DHAVE_CONFIG_H -I. -I../../support/include  -I/usr/include/tirpc -D_GNU_SOURCE -pipe  -Wall  -Wextra  -Werror=strict-prototypes  -Werror=missing-prototypes  -Werror=missing-declarations  -Werror=format=2  -Werror=undef  -Werror=missing-include-dirs  -Werror=strict-aliasing=2  -Werror=init-self  -Werror=implicit-function-declaration  -Werror=return-type  -Werror=switch  -Werror=overflow  -Werror=parentheses  -Werror=aggregate-return  -Werror=unused-result  -fno-strict-aliasing  -Werror=format-overflow=2 -Werror=int-conversion -Werror=incompatible-pointer-types -Werror=misleading-indentation -O2 -fwrapv -pipe -Wformat -Werror=format-security -gdwarf-4 -fno-debug-types-section -fvar-tracking-assignments -g2 -Wp,-D_FORTIFY_SOURCE=2 -fstack-protector-strong --param=ssp-buffer-size=4 -fPIC -mtune=generic -march=x86-64 -gdwarf-4 -fno-debug-types-section -fvar-tracking-assignments -g2  -MT rpcmisc.lo -MD -MP -MF .deps/rpcmisc.Tpo -c -o rpcmisc.lo rpcmisc.c
libtool: compile:  x86_64-pld-linux-gnux32-gcc -DHAVE_CONFIG_H -I. -I../../support/include -I/usr/include/tirpc -D_GNU_SOURCE -pipe -Wall -Wextra -Werror=strict-prototypes -Werror=missing-prototypes -Werror=missing-declarations -Werror=format=2 -Werror=undef -Werror=missing-include-dirs -Werror=strict-aliasing=2 -Werror=init-self -Werror=implicit-function-declaration -Werror=return-type -Werror=switch -Werror=overflow -Werror=parentheses -Werror=aggregate-return -Werror=unused-result -fno-strict-aliasing -Werror=format-overflow=2 -Werror=int-conversion -Werror=incompatible-pointer-types -Werror=misleading-indentation -O2 -fwrapv -pipe -Wformat -Werror=format-security -gdwarf-4 -fno-debug-types-section -fvar-tracking-assignments -g2 -Wp,-D_FORTIFY_SOURCE=2 -fstack-protector-strong --param=ssp-buffer-size=4 -fPIC -mtune=generic -march=x86-64 -gdwarf-4 -fno-debug-types-section -fvar-tracking-assignments -g2 -MT rpcmisc.lo -MD -MP -MF .deps/rpcmisc.Tpo -c rpcmisc.c  -fPIC -DPIC -o .libs/rpcmisc.o
libtool: compile:  x86_64-pld-linux-gnux32-gcc -DHAVE_CONFIG_H -I. -I../../support/include -I/usr/include/tirpc -D_GNU_SOURCE -pipe -Wall -Wextra -Werror=strict-prototypes -Werror=missing-prototypes -Werror=missing-declarations -Werror=format=2 -Werror=undef -Werror=missing-include-dirs -Werror=strict-aliasing=2 -Werror=init-self -Werror=implicit-function-declaration -Werror=return-type -Werror=switch -Werror=overflow -Werror=parentheses -Werror=aggregate-return -Werror=unused-result -fno-strict-aliasing -Werror=format-overflow=2 -Werror=int-conversion -Werror=incompatible-pointer-types -Werror=misleading-indentation -O2 -fwrapv -pipe -Wformat -Werror=format-security -gdwarf-4 -fno-debug-types-section -fvar-tracking-assignments -g2 -Wp,-D_FORTIFY_SOURCE=2 -fstack-protector-strong --param=ssp-buffer-size=4 -fPIC -mtune=generic -march=x86-64 -gdwarf-4 -fno-debug-types-section -fvar-tracking-assignments -g2 -MT rpcmisc.lo -MD -MP -MF .deps/rpcmisc.Tpo -c rpcmisc.c -o rpcmisc.o >/dev/null 2>&1
mv -f .deps/rpcmisc.Tpo .deps/rpcmisc.Plo
make[2]: Leaving directory '/tmp/B.P3wIU5/BUILD/nfs-utils-2.3.3/support/nfs'
make[2]: Entering directory '/tmp/B.P3wIU5/BUILD/nfs-utils-2.3.3/support/nfs'
/bin/sh ../../libtool  --tag=CC   --mode=compile x86_64-pld-linux-gnux32-gcc -DHAVE_CONFIG_H -I. -I../../support/include  -I/usr/include/tirpc -D_GNU_SOURCE -pipe  -Wall  -Wextra  -Werror=strict-prototypes  -Werror=missing-prototypes  -Werror=missing-declarations  -Werror=format=2  -Werror=undef  -Werror=missing-include-dirs  -Werror=strict-aliasing=2  -Werror=init-self  -Werror=implicit-function-declaration  -Werror=return-type  -Werror=switch  -Werror=overflow  -Werror=parentheses  -Werror=aggregate-return  -Werror=unused-result  -fno-strict-aliasing  -Werror=format-overflow=2 -Werror=int-conversion -Werror=incompatible-pointer-types -Werror=misleading-indentation -O2 -fwrapv -pipe -Wformat -Werror=format-security -gdwarf-4 -fno-debug-types-section -fvar-tracking-assignments -g2 -Wp,-D_FORTIFY_SOURCE=2 -fstack-protector-strong --param=ssp-buffer-size=4 -fPIC -mtune=generic -march=x86-64 -gdwarf-4 -fno-debug-types-section -fvar-tracking-assignments -g2  -MT rpc_socket.lo -MD -MP -MF .deps/rpc_socket.Tpo -c -o rpc_socket.lo rpc_socket.c
libtool: compile:  x86_64-pld-linux-gnux32-gcc -DHAVE_CONFIG_H -I. -I../../support/include -I/usr/include/tirpc -D_GNU_SOURCE -pipe -Wall -Wextra -Werror=strict-prototypes -Werror=missing-prototypes -Werror=missing-declarations -Werror=format=2 -Werror=undef -Werror=missing-include-dirs -Werror=strict-aliasing=2 -Werror=init-self -Werror=implicit-function-declaration -Werror=return-type -Werror=switch -Werror=overflow -Werror=parentheses -Werror=aggregate-return -Werror=unused-result -fno-strict-aliasing -Werror=format-overflow=2 -Werror=int-conversion -Werror=incompatible-pointer-types -Werror=misleading-indentation -O2 -fwrapv -pipe -Wformat -Werror=format-security -gdwarf-4 -fno-debug-types-section -fvar-tracking-assignments -g2 -Wp,-D_FORTIFY_SOURCE=2 -fstack-protector-strong --param=ssp-buffer-size=4 -fPIC -mtune=generic -march=x86-64 -gdwarf-4 -fno-debug-types-section -fvar-tracking-assignments -g2 -MT rpc_socket.lo -MD -MP -MF .deps/rpc_socket.Tpo -c rpc_socket.c  -fPIC -DPIC -o .libs/rpc_socket.o
libtool: compile:  x86_64-pld-linux-gnux32-gcc -DHAVE_CONFIG_H -I. -I../../support/include -I/usr/include/tirpc -D_GNU_SOURCE -pipe -Wall -Wextra -Werror=strict-prototypes -Werror=missing-prototypes -Werror=missing-declarations -Werror=format=2 -Werror=undef -Werror=missing-include-dirs -Werror=strict-aliasing=2 -Werror=init-self -Werror=implicit-function-declaration -Werror=return-type -Werror=switch -Werror=overflow -Werror=parentheses -Werror=aggregate-return -Werror=unused-result -fno-strict-aliasing -Werror=format-overflow=2 -Werror=int-conversion -Werror=incompatible-pointer-types -Werror=misleading-indentation -O2 -fwrapv -pipe -Wformat -Werror=format-security -gdwarf-4 -fno-debug-types-section -fvar-tracking-assignments -g2 -Wp,-D_FORTIFY_SOURCE=2 -fstack-protector-strong --param=ssp-buffer-size=4 -fPIC -mtune=generic -march=x86-64 -gdwarf-4 -fno-debug-types-section -fvar-tracking-assignments -g2 -MT rpc_socket.lo -MD -MP -MF .deps/rpc_socket.Tpo -c rpc_socket.c -o rpc_socket.o >/dev/null 2>&1
mv -f .deps/rpc_socket.Tpo .deps/rpc_socket.Plo
make[2]: Leaving directory '/tmp/B.P3wIU5/BUILD/nfs-utils-2.3.3/support/nfs'
make[2]: Entering directory '/tmp/B.P3wIU5/BUILD/nfs-utils-2.3.3/support/nfs'
/bin/sh ../../libtool  --tag=CC   --mode=compile x86_64-pld-linux-gnux32-gcc -DHAVE_CONFIG_H -I. -I../../support/include  -I/usr/include/tirpc -D_GNU_SOURCE -pipe  -Wall  -Wextra  -Werror=strict-prototypes  -Werror=missing-prototypes  -Werror=missing-declarations  -Werror=format=2  -Werror=undef  -Werror=missing-include-dirs  -Werror=strict-aliasing=2  -Werror=init-self  -Werror=implicit-function-declaration  -Werror=return-type  -Werror=switch  -Werror=overflow  -Werror=parentheses  -Werror=aggregate-return  -Werror=unused-result  -fno-strict-aliasing  -Werror=format-overflow=2 -Werror=int-conversion -Werror=incompatible-pointer-types -Werror=misleading-indentation -O2 -fwrapv -pipe -Wformat -Werror=format-security -gdwarf-4 -fno-debug-types-section -fvar-tracking-assignments -g2 -Wp,-D_FORTIFY_SOURCE=2 -fstack-protector-strong --param=ssp-buffer-size=4 -fPIC -mtune=generic -march=x86-64 -gdwarf-4 -fno-debug-types-section -fvar-tracking-assignments -g2  -MT cacheio.lo -MD -MP -MF .deps/cacheio.Tpo -c -o cacheio.lo cacheio.c
libtool: compile:  x86_64-pld-linux-gnux32-gcc -DHAVE_CONFIG_H -I. -I../../support/include -I/usr/include/tirpc -D_GNU_SOURCE -pipe -Wall -Wextra -Werror=strict-prototypes -Werror=missing-prototypes -Werror=missing-declarations -Werror=format=2 -Werror=undef -Werror=missing-include-dirs -Werror=strict-aliasing=2 -Werror=init-self -Werror=implicit-function-declaration -Werror=return-type -Werror=switch -Werror=overflow -Werror=parentheses -Werror=aggregate-return -Werror=unused-result -fno-strict-aliasing -Werror=format-overflow=2 -Werror=int-conversion -Werror=incompatible-pointer-types -Werror=misleading-indentation -O2 -fwrapv -pipe -Wformat -Werror=format-security -gdwarf-4 -fno-debug-types-section -fvar-tracking-assignments -g2 -Wp,-D_FORTIFY_SOURCE=2 -fstack-protector-strong --param=ssp-buffer-size=4 -fPIC -mtune=generic -march=x86-64 -gdwarf-4 -fno-debug-types-section -fvar-tracking-assignments -g2 -MT cacheio.lo -MD -MP -MF .deps/cacheio.Tpo -c cacheio.c  -fPIC -DPIC -o .libs/cacheio.o
cacheio.c: In function 'cache_flush':
cacheio.c:237:20: error: format '%ld' expects argument of type 'long int', but argument 3 has type '__time_t' {aka 'long long int'} [-Werror=format=]
  sprintf(stime, "%ld\n", stb.st_mtime);
                  ~~^
                  %lld
cc1: some warnings being treated as errors
make[2]: *** [Makefile:505: cacheio.lo] Error 1
make[2]: Leaving directory '/tmp/B.P3wIU5/BUILD/nfs-utils-2.3.3/support/nfs'
make[2]: *** Waiting for unfinished jobs....
make[2]: Entering directory '/tmp/B.P3wIU5/BUILD/nfs-utils-2.3.3/support/nfs'
/bin/sh ../../libtool  --tag=CC   --mode=compile x86_64-pld-linux-gnux32-gcc -DHAVE_CONFIG_H -I. -I../../support/include  -I/usr/include/tirpc -D_GNU_SOURCE -pipe  -Wall  -Wextra  -Werror=strict-prototypes  -Werror=missing-prototypes  -Werror=missing-declarations  -Werror=format=2  -Werror=undef  -Werror=missing-include-dirs  -Werror=strict-aliasing=2  -Werror=init-self  -Werror=implicit-function-declaration  -Werror=return-type  -Werror=switch  -Werror=overflow  -Werror=parentheses  -Werror=aggregate-return  -Werror=unused-result  -fno-strict-aliasing  -Werror=format-overflow=2 -Werror=int-conversion -Werror=incompatible-pointer-types -Werror=misleading-indentation -O2 -fwrapv -pipe -Wformat -Werror=format-security -gdwarf-4 -fno-debug-types-section -fvar-tracking-assignments -g2 -Wp,-D_FORTIFY_SOURCE=2 -fstack-protector-strong --param=ssp-buffer-size=4 -fPIC -mtune=generic -march=x86-64 -gdwarf-4 -fno-debug-types-section -fvar-tracking-assignments -g2  -MT svc_socket.lo -MD -MP -MF .deps/svc_socket.Tpo -c -o svc_socket.lo svc_socket.c
libtool: compile:  x86_64-pld-linux-gnux32-gcc -DHAVE_CONFIG_H -I. -I../../support/include -I/usr/include/tirpc -D_GNU_SOURCE -pipe -Wall -Wextra -Werror=strict-prototypes -Werror=missing-prototypes -Werror=missing-declarations -Werror=format=2 -Werror=undef -Werror=missing-include-dirs -Werror=strict-aliasing=2 -Werror=init-self -Werror=implicit-function-declaration -Werror=return-type -Werror=switch -Werror=overflow -Werror=parentheses -Werror=aggregate-return -Werror=unused-result -fno-strict-aliasing -Werror=format-overflow=2 -Werror=int-conversion -Werror=incompatible-pointer-types -Werror=misleading-indentation -O2 -fwrapv -pipe -Wformat -Werror=format-security -gdwarf-4 -fno-debug-types-section -fvar-tracking-assignments -g2 -Wp,-D_FORTIFY_SOURCE=2 -fstack-protector-strong --param=ssp-buffer-size=4 -fPIC -mtune=generic -march=x86-64 -gdwarf-4 -fno-debug-types-section -fvar-tracking-assignments -g2 -MT svc_socket.lo -MD -MP -MF .deps/svc_socket.Tpo -c svc_socket.c  -fPIC -DPIC -o .libs/svc_socket.o
libtool: compile:  x86_64-pld-linux-gnux32-gcc -DHAVE_CONFIG_H -I. -I../../support/include -I/usr/include/tirpc -D_GNU_SOURCE -pipe -Wall -Wextra -Werror=strict-prototypes -Werror=missing-prototypes -Werror=missing-declarations -Werror=format=2 -Werror=undef -Werror=missing-include-dirs -Werror=strict-aliasing=2 -Werror=init-self -Werror=implicit-function-declaration -Werror=return-type -Werror=switch -Werror=overflow -Werror=parentheses -Werror=aggregate-return -Werror=unused-result -fno-strict-aliasing -Werror=format-overflow=2 -Werror=int-conversion -Werror=incompatible-pointer-types -Werror=misleading-indentation -O2 -fwrapv -pipe -Wformat -Werror=format-security -gdwarf-4 -fno-debug-types-section -fvar-tracking-assignments -g2 -Wp,-D_FORTIFY_SOURCE=2 -fstack-protector-strong --param=ssp-buffer-size=4 -fPIC -mtune=generic -march=x86-64 -gdwarf-4 -fno-debug-types-section -fvar-tracking-assignments -g2 -MT svc_socket.lo -MD -MP -MF .deps/svc_socket.Tpo -c svc_socket.c -o svc_socket.o >/dev/null 2>&1
mv -f .deps/svc_socket.Tpo .deps/svc_socket.Plo
make[2]: Leaving directory '/tmp/B.P3wIU5/BUILD/nfs-utils-2.3.3/support/nfs'
make[2]: Entering directory '/tmp/B.P3wIU5/BUILD/nfs-utils-2.3.3/support/nfs'
/bin/sh ../../libtool  --tag=CC   --mode=compile x86_64-pld-linux-gnux32-gcc -DHAVE_CONFIG_H -I. -I../../support/include  -I/usr/include/tirpc -D_GNU_SOURCE -pipe  -Wall  -Wextra  -Werror=strict-prototypes  -Werror=missing-prototypes  -Werror=missing-declarations  -Werror=format=2  -Werror=undef  -Werror=missing-include-dirs  -Werror=strict-aliasing=2  -Werror=init-self  -Werror=implicit-function-declaration  -Werror=return-type  -Werror=switch  -Werror=overflow  -Werror=parentheses  -Werror=aggregate-return  -Werror=unused-result  -fno-strict-aliasing  -Werror=format-overflow=2 -Werror=int-conversion -Werror=incompatible-pointer-types -Werror=misleading-indentation -O2 -fwrapv -pipe -Wformat -Werror=format-security -gdwarf-4 -fno-debug-types-section -fvar-tracking-assignments -g2 -Wp,-D_FORTIFY_SOURCE=2 -fstack-protector-strong --param=ssp-buffer-size=4 -fPIC -mtune=generic -march=x86-64 -gdwarf-4 -fno-debug-types-section -fvar-tracking-assignments -g2  -MT closeall.lo -MD -MP -MF .deps/closeall.Tpo -c -o closeall.lo closeall.c
libtool: compile:  x86_64-pld-linux-gnux32-gcc -DHAVE_CONFIG_H -I. -I../../support/include -I/usr/include/tirpc -D_GNU_SOURCE -pipe -Wall -Wextra -Werror=strict-prototypes -Werror=missing-prototypes -Werror=missing-declarations -Werror=format=2 -Werror=undef -Werror=missing-include-dirs -Werror=strict-aliasing=2 -Werror=init-self -Werror=implicit-function-declaration -Werror=return-type -Werror=switch -Werror=overflow -Werror=parentheses -Werror=aggregate-return -Werror=unused-result -fno-strict-aliasing -Werror=format-overflow=2 -Werror=int-conversion -Werror=incompatible-pointer-types -Werror=misleading-indentation -O2 -fwrapv -pipe -Wformat -Werror=format-security -gdwarf-4 -fno-debug-types-section -fvar-tracking-assignments -g2 -Wp,-D_FORTIFY_SOURCE=2 -fstack-protector-strong --param=ssp-buffer-size=4 -fPIC -mtune=generic -march=x86-64 -gdwarf-4 -fno-debug-types-section -fvar-tracking-assignments -g2 -MT closeall.lo -MD -MP -MF .deps/closeall.Tpo -c closeall.c  -fPIC -DPIC -o .libs/closeall.o
libtool: compile:  x86_64-pld-linux-gnux32-gcc -DHAVE_CONFIG_H -I. -I../../support/include -I/usr/include/tirpc -D_GNU_SOURCE -pipe -Wall -Wextra -Werror=strict-prototypes -Werror=missing-prototypes -Werror=missing-declarations -Werror=format=2 -Werror=undef -Werror=missing-include-dirs -Werror=strict-aliasing=2 -Werror=init-self -Werror=implicit-function-declaration -Werror=return-type -Werror=switch -Werror=overflow -Werror=parentheses -Werror=aggregate-return -Werror=unused-result -fno-strict-aliasing -Werror=format-overflow=2 -Werror=int-conversion -Werror=incompatible-pointer-types -Werror=misleading-indentation -O2 -fwrapv -pipe -Wformat -Werror=format-security -gdwarf-4 -fno-debug-types-section -fvar-tracking-assignments -g2 -Wp,-D_FORTIFY_SOURCE=2 -fstack-protector-strong --param=ssp-buffer-size=4 -fPIC -mtune=generic -march=x86-64 -gdwarf-4 -fno-debug-types-section -fvar-tracking-assignments -g2 -MT closeall.lo -MD -MP -MF .deps/closeall.Tpo -c closeall.c -o closeall.o >/dev/null 2>&1
mv -f .deps/closeall.Tpo .deps/closeall.Plo
make[2]: Leaving directory '/tmp/B.P3wIU5/BUILD/nfs-utils-2.3.3/support/nfs'
make[2]: Entering directory '/tmp/B.P3wIU5/BUILD/nfs-utils-2.3.3/support/nfs'
/bin/sh ../../libtool  --tag=CC   --mode=compile x86_64-pld-linux-gnux32-gcc -DHAVE_CONFIG_H -I. -I../../support/include  -I/usr/include/tirpc -D_GNU_SOURCE -pipe  -Wall  -Wextra  -Werror=strict-prototypes  -Werror=missing-prototypes  -Werror=missing-declarations  -Werror=format=2  -Werror=undef  -Werror=missing-include-dirs  -Werror=strict-aliasing=2  -Werror=init-self  -Werror=implicit-function-declaration  -Werror=return-type  -Werror=switch  -Werror=overflow  -Werror=parentheses  -Werror=aggregate-return  -Werror=unused-result  -fno-strict-aliasing  -Werror=format-overflow=2 -Werror=int-conversion -Werror=incompatible-pointer-types -Werror=misleading-indentation -O2 -fwrapv -pipe -Wformat -Werror=format-security -gdwarf-4 -fno-debug-types-section -fvar-tracking-assignments -g2 -Wp,-D_FORTIFY_SOURCE=2 -fstack-protector-strong --param=ssp-buffer-size=4 -fPIC -mtune=generic -march=x86-64 -gdwarf-4 -fno-debug-types-section -fvar-tracking-assignments -g2  -MT strlcat.lo -MD -MP -MF .deps/strlcat.Tpo -c -o strlcat.lo strlcat.c
libtool: compile:  x86_64-pld-linux-gnux32-gcc -DHAVE_CONFIG_H -I. -I../../support/include -I/usr/include/tirpc -D_GNU_SOURCE -pipe -Wall -Wextra -Werror=strict-prototypes -Werror=missing-prototypes -Werror=missing-declarations -Werror=format=2 -Werror=undef -Werror=missing-include-dirs -Werror=strict-aliasing=2 -Werror=init-self -Werror=implicit-function-declaration -Werror=return-type -Werror=switch -Werror=overflow -Werror=parentheses -Werror=aggregate-return -Werror=unused-result -fno-strict-aliasing -Werror=format-overflow=2 -Werror=int-conversion -Werror=incompatible-pointer-types -Werror=misleading-indentation -O2 -fwrapv -pipe -Wformat -Werror=format-security -gdwarf-4 -fno-debug-types-section -fvar-tracking-assignments -g2 -Wp,-D_FORTIFY_SOURCE=2 -fstack-protector-strong --param=ssp-buffer-size=4 -fPIC -mtune=generic -march=x86-64 -gdwarf-4 -fno-debug-types-section -fvar-tracking-assignments -g2 -MT strlcat.lo -MD -MP -MF .deps/strlcat.Tpo -c strlcat.c  -fPIC -DPIC -o .libs/strlcat.o
libtool: compile:  x86_64-pld-linux-gnux32-gcc -DHAVE_CONFIG_H -I. -I../../support/include -I/usr/include/tirpc -D_GNU_SOURCE -pipe -Wall -Wextra -Werror=strict-prototypes -Werror=missing-prototypes -Werror=missing-declarations -Werror=format=2 -Werror=undef -Werror=missing-include-dirs -Werror=strict-aliasing=2 -Werror=init-self -Werror=implicit-function-declaration -Werror=return-type -Werror=switch -Werror=overflow -Werror=parentheses -Werror=aggregate-return -Werror=unused-result -fno-strict-aliasing -Werror=format-overflow=2 -Werror=int-conversion -Werror=incompatible-pointer-types -Werror=misleading-indentation -O2 -fwrapv -pipe -Wformat -Werror=format-security -gdwarf-4 -fno-debug-types-section -fvar-tracking-assignments -g2 -Wp,-D_FORTIFY_SOURCE=2 -fstack-protector-strong --param=ssp-buffer-size=4 -fPIC -mtune=generic -march=x86-64 -gdwarf-4 -fno-debug-types-section -fvar-tracking-assignments -g2 -MT strlcat.lo -MD -MP -MF .deps/strlcat.Tpo -c strlcat.c -o strlcat.o >/dev/null 2>&1
mv -f .deps/strlcat.Tpo .deps/strlcat.Plo
make[2]: Leaving directory '/tmp/B.P3wIU5/BUILD/nfs-utils-2.3.3/support/nfs'
make[2]: Entering directory '/tmp/B.P3wIU5/BUILD/nfs-utils-2.3.3/support/nfs'
/bin/sh ../../libtool  --tag=CC   --mode=compile x86_64-pld-linux-gnux32-gcc -DHAVE_CONFIG_H -I. -I../../support/include  -I/usr/include/tirpc -D_GNU_SOURCE -pipe  -Wall  -Wextra  -Werror=strict-prototypes  -Werror=missing-prototypes  -Werror=missing-declarations  -Werror=format=2  -Werror=undef  -Werror=missing-include-dirs  -Werror=strict-aliasing=2  -Werror=init-self  -Werror=implicit-function-declaration  -Werror=return-type  -Werror=switch  -Werror=overflow  -Werror=parentheses  -Werror=aggregate-return  -Werror=unused-result  -fno-strict-aliasing  -Werror=format-overflow=2 -Werror=int-conversion -Werror=incompatible-pointer-types -Werror=misleading-indentation -O2 -fwrapv -pipe -Wformat -Werror=format-security -gdwarf-4 -fno-debug-types-section -fvar-tracking-assignments -g2 -Wp,-D_FORTIFY_SOURCE=2 -fstack-protector-strong --param=ssp-buffer-size=4 -fPIC -mtune=generic -march=x86-64 -gdwarf-4 -fno-debug-types-section -fvar-tracking-assignments -g2  -MT atomicio.lo -MD -MP -MF .deps/atomicio.Tpo -c -o atomicio.lo atomicio.c
libtool: compile:  x86_64-pld-linux-gnux32-gcc -DHAVE_CONFIG_H -I. -I../../support/include -I/usr/include/tirpc -D_GNU_SOURCE -pipe -Wall -Wextra -Werror=strict-prototypes -Werror=missing-prototypes -Werror=missing-declarations -Werror=format=2 -Werror=undef -Werror=missing-include-dirs -Werror=strict-aliasing=2 -Werror=init-self -Werror=implicit-function-declaration -Werror=return-type -Werror=switch -Werror=overflow -Werror=parentheses -Werror=aggregate-return -Werror=unused-result -fno-strict-aliasing -Werror=format-overflow=2 -Werror=int-conversion -Werror=incompatible-pointer-types -Werror=misleading-indentation -O2 -fwrapv -pipe -Wformat -Werror=format-security -gdwarf-4 -fno-debug-types-section -fvar-tracking-assignments -g2 -Wp,-D_FORTIFY_SOURCE=2 -fstack-protector-strong --param=ssp-buffer-size=4 -fPIC -mtune=generic -march=x86-64 -gdwarf-4 -fno-debug-types-section -fvar-tracking-assignments -g2 -MT atomicio.lo -MD -MP -MF .deps/atomicio.Tpo -c atomicio.c  -fPIC -DPIC -o .libs/atomicio.o
libtool: compile:  x86_64-pld-linux-gnux32-gcc -DHAVE_CONFIG_H -I. -I../../support/include -I/usr/include/tirpc -D_GNU_SOURCE -pipe -Wall -Wextra -Werror=strict-prototypes -Werror=missing-prototypes -Werror=missing-declarations -Werror=format=2 -Werror=undef -Werror=missing-include-dirs -Werror=strict-aliasing=2 -Werror=init-self -Werror=implicit-function-declaration -Werror=return-type -Werror=switch -Werror=overflow -Werror=parentheses -Werror=aggregate-return -Werror=unused-result -fno-strict-aliasing -Werror=format-overflow=2 -Werror=int-conversion -Werror=incompatible-pointer-types -Werror=misleading-indentation -O2 -fwrapv -pipe -Wformat -Werror=format-security -gdwarf-4 -fno-debug-types-section -fvar-tracking-assignments -g2 -Wp,-D_FORTIFY_SOURCE=2 -fstack-protector-strong --param=ssp-buffer-size=4 -fPIC -mtune=generic -march=x86-64 -gdwarf-4 -fno-debug-types-section -fvar-tracking-assignments -g2 -MT atomicio.lo -MD -MP -MF .deps/atomicio.Tpo -c atomicio.c -o atomicio.o >/dev/null 2>&1
mv -f .deps/atomicio.Tpo .deps/atomicio.Plo
make[2]: Leaving directory '/tmp/B.P3wIU5/BUILD/nfs-utils-2.3.3/support/nfs'
make[2]: Entering directory '/tmp/B.P3wIU5/BUILD/nfs-utils-2.3.3/support/nfs'
/bin/sh ../../libtool  --tag=CC   --mode=compile x86_64-pld-linux-gnux32-gcc -DHAVE_CONFIG_H -I. -I../../support/include  -I/usr/include/tirpc -D_GNU_SOURCE -pipe  -Wall  -Wextra  -Werror=strict-prototypes  -Werror=missing-prototypes  -Werror=missing-declarations  -Werror=format=2  -Werror=undef  -Werror=missing-include-dirs  -Werror=strict-aliasing=2  -Werror=init-self  -Werror=implicit-function-declaration  -Werror=return-type  -Werror=switch  -Werror=overflow  -Werror=parentheses  -Werror=aggregate-return  -Werror=unused-result  -fno-strict-aliasing  -Werror=format-overflow=2 -Werror=int-conversion -Werror=incompatible-pointer-types -Werror=misleading-indentation -O2 -fwrapv -pipe -Wformat -Werror=format-security -gdwarf-4 -fno-debug-types-section -fvar-tracking-assignments -g2 -Wp,-D_FORTIFY_SOURCE=2 -fstack-protector-strong --param=ssp-buffer-size=4 -fPIC -mtune=generic -march=x86-64 -gdwarf-4 -fno-debug-types-section -fvar-tracking-assignments -g2  -MT nfs_mntent.lo -MD -MP -MF .deps/nfs_mntent.Tpo -c -o nfs_mntent.lo nfs_mntent.c
libtool: compile:  x86_64-pld-linux-gnux32-gcc -DHAVE_CONFIG_H -I. -I../../support/include -I/usr/include/tirpc -D_GNU_SOURCE -pipe -Wall -Wextra -Werror=strict-prototypes -Werror=missing-prototypes -Werror=missing-declarations -Werror=format=2 -Werror=undef -Werror=missing-include-dirs -Werror=strict-aliasing=2 -Werror=init-self -Werror=implicit-function-declaration -Werror=return-type -Werror=switch -Werror=overflow -Werror=parentheses -Werror=aggregate-return -Werror=unused-result -fno-strict-aliasing -Werror=format-overflow=2 -Werror=int-conversion -Werror=incompatible-pointer-types -Werror=misleading-indentation -O2 -fwrapv -pipe -Wformat -Werror=format-security -gdwarf-4 -fno-debug-types-section -fvar-tracking-assignments -g2 -Wp,-D_FORTIFY_SOURCE=2 -fstack-protector-strong --param=ssp-buffer-size=4 -fPIC -mtune=generic -march=x86-64 -gdwarf-4 -fno-debug-types-section -fvar-tracking-assignments -g2 -MT nfs_mntent.lo -MD -MP -MF .deps/nfs_mntent.Tpo -c nfs_mntent.c  -fPIC -DPIC -o .libs/nfs_mntent.o
libtool: compile:  x86_64-pld-linux-gnux32-gcc -DHAVE_CONFIG_H -I. -I../../support/include -I/usr/include/tirpc -D_GNU_SOURCE -pipe -Wall -Wextra -Werror=strict-prototypes -Werror=missing-prototypes -Werror=missing-declarations -Werror=format=2 -Werror=undef -Werror=missing-include-dirs -Werror=strict-aliasing=2 -Werror=init-self -Werror=implicit-function-declaration -Werror=return-type -Werror=switch -Werror=overflow -Werror=parentheses -Werror=aggregate-return -Werror=unused-result -fno-strict-aliasing -Werror=format-overflow=2 -Werror=int-conversion -Werror=incompatible-pointer-types -Werror=misleading-indentation -O2 -fwrapv -pipe -Wformat -Werror=format-security -gdwarf-4 -fno-debug-types-section -fvar-tracking-assignments -g2 -Wp,-D_FORTIFY_SOURCE=2 -fstack-protector-strong --param=ssp-buffer-size=4 -fPIC -mtune=generic -march=x86-64 -gdwarf-4 -fno-debug-types-section -fvar-tracking-assignments -g2 -MT nfs_mntent.lo -MD -MP -MF .deps/nfs_mntent.Tpo -c nfs_mntent.c -o nfs_mntent.o >/dev/null 2>&1
mv -f .deps/nfs_mntent.Tpo .deps/nfs_mntent.Plo
make[2]: Leaving directory '/tmp/B.P3wIU5/BUILD/nfs-utils-2.3.3/support/nfs'
make[2]: Entering directory '/tmp/B.P3wIU5/BUILD/nfs-utils-2.3.3/support/nfs'
/bin/sh ../../libtool  --tag=CC   --mode=compile x86_64-pld-linux-gnux32-gcc -DHAVE_CONFIG_H -I. -I../../support/include  -I/usr/include/tirpc -D_GNU_SOURCE -pipe  -Wall  -Wextra  -Werror=strict-prototypes  -Werror=missing-prototypes  -Werror=missing-declarations  -Werror=format=2  -Werror=undef  -Werror=missing-include-dirs  -Werror=strict-aliasing=2  -Werror=init-self  -Werror=implicit-function-declaration  -Werror=return-type  -Werror=switch  -Werror=overflow  -Werror=parentheses  -Werror=aggregate-return  -Werror=unused-result  -fno-strict-aliasing  -Werror=format-overflow=2 -Werror=int-conversion -Werror=incompatible-pointer-types -Werror=misleading-indentation -O2 -fwrapv -pipe -Wformat -Werror=format-security -gdwarf-4 -fno-debug-types-section -fvar-tracking-assignments -g2 -Wp,-D_FORTIFY_SOURCE=2 -fstack-protector-strong --param=ssp-buffer-size=4 -fPIC -mtune=generic -march=x86-64 -gdwarf-4 -fno-debug-types-section -fvar-tracking-assignments -g2  -MT svc_create.lo -MD -MP -MF .deps/svc_create.Tpo -c -o svc_create.lo svc_create.c
libtool: compile:  x86_64-pld-linux-gnux32-gcc -DHAVE_CONFIG_H -I. -I../../support/include -I/usr/include/tirpc -D_GNU_SOURCE -pipe -Wall -Wextra -Werror=strict-prototypes -Werror=missing-prototypes -Werror=missing-declarations -Werror=format=2 -Werror=undef -Werror=missing-include-dirs -Werror=strict-aliasing=2 -Werror=init-self -Werror=implicit-function-declaration -Werror=return-type -Werror=switch -Werror=overflow -Werror=parentheses -Werror=aggregate-return -Werror=unused-result -fno-strict-aliasing -Werror=format-overflow=2 -Werror=int-conversion -Werror=incompatible-pointer-types -Werror=misleading-indentation -O2 -fwrapv -pipe -Wformat -Werror=format-security -gdwarf-4 -fno-debug-types-section -fvar-tracking-assignments -g2 -Wp,-D_FORTIFY_SOURCE=2 -fstack-protector-strong --param=ssp-buffer-size=4 -fPIC -mtune=generic -march=x86-64 -gdwarf-4 -fno-debug-types-section -fvar-tracking-assignments -g2 -MT svc_create.lo -MD -MP -MF .deps/svc_create.Tpo -c svc_create.c  -fPIC -DPIC -o .libs/svc_create.o
libtool: compile:  x86_64-pld-linux-gnux32-gcc -DHAVE_CONFIG_H -I. -I../../support/include -I/usr/include/tirpc -D_GNU_SOURCE -pipe -Wall -Wextra -Werror=strict-prototypes -Werror=missing-prototypes -Werror=missing-declarations -Werror=format=2 -Werror=undef -Werror=missing-include-dirs -Werror=strict-aliasing=2 -Werror=init-self -Werror=implicit-function-declaration -Werror=return-type -Werror=switch -Werror=overflow -Werror=parentheses -Werror=aggregate-return -Werror=unused-result -fno-strict-aliasing -Werror=format-overflow=2 -Werror=int-conversion -Werror=incompatible-pointer-types -Werror=misleading-indentation -O2 -fwrapv -pipe -Wformat -Werror=format-security -gdwarf-4 -fno-debug-types-section -fvar-tracking-assignments -g2 -Wp,-D_FORTIFY_SOURCE=2 -fstack-protector-strong --param=ssp-buffer-size=4 -fPIC -mtune=generic -march=x86-64 -gdwarf-4 -fno-debug-types-section -fvar-tracking-assignments -g2 -MT svc_create.lo -MD -MP -MF .deps/svc_create.Tpo -c svc_create.c -o svc_create.o >/dev/null 2>&1
mv -f .deps/svc_create.Tpo .deps/svc_create.Plo
make[2]: Leaving directory '/tmp/B.P3wIU5/BUILD/nfs-utils-2.3.3/support/nfs'
make[2]: Entering directory '/tmp/B.P3wIU5/BUILD/nfs-utils-2.3.3/support/nfs'
/bin/sh ../../libtool  --tag=CC   --mode=compile x86_64-pld-linux-gnux32-gcc -DHAVE_CONFIG_H -I. -I../../support/include  -I/usr/include/tirpc -D_GNU_SOURCE -pipe  -Wall  -Wextra  -Werror=strict-prototypes  -Werror=missing-prototypes  -Werror=missing-declarations  -Werror=format=2  -Werror=undef  -Werror=missing-include-dirs  -Werror=strict-aliasing=2  -Werror=init-self  -Werror=implicit-function-declaration  -Werror=return-type  -Werror=switch  -Werror=overflow  -Werror=parentheses  -Werror=aggregate-return  -Werror=unused-result  -fno-strict-aliasing  -Werror=format-overflow=2 -Werror=int-conversion -Werror=incompatible-pointer-types -Werror=misleading-indentation -O2 -fwrapv -pipe -Wformat -Werror=format-security -gdwarf-4 -fno-debug-types-section -fvar-tracking-assignments -g2 -Wp,-D_FORTIFY_SOURCE=2 -fstack-protector-strong --param=ssp-buffer-size=4 -fPIC -mtune=generic -march=x86-64 -gdwarf-4 -fno-debug-types-section -fvar-tracking-assignments -g2  -MT getport.lo -MD -MP -MF .deps/getport.Tpo -c -o getport.lo getport.c
libtool: compile:  x86_64-pld-linux-gnux32-gcc -DHAVE_CONFIG_H -I. -I../../support/include -I/usr/include/tirpc -D_GNU_SOURCE -pipe -Wall -Wextra -Werror=strict-prototypes -Werror=missing-prototypes -Werror=missing-declarations -Werror=format=2 -Werror=undef -Werror=missing-include-dirs -Werror=strict-aliasing=2 -Werror=init-self -Werror=implicit-function-declaration -Werror=return-type -Werror=switch -Werror=overflow -Werror=parentheses -Werror=aggregate-return -Werror=unused-result -fno-strict-aliasing -Werror=format-overflow=2 -Werror=int-conversion -Werror=incompatible-pointer-types -Werror=misleading-indentation -O2 -fwrapv -pipe -Wformat -Werror=format-security -gdwarf-4 -fno-debug-types-section -fvar-tracking-assignments -g2 -Wp,-D_FORTIFY_SOURCE=2 -fstack-protector-strong --param=ssp-buffer-size=4 -fPIC -mtune=generic -march=x86-64 -gdwarf-4 -fno-debug-types-section -fvar-tracking-assignments -g2 -MT getport.lo -MD -MP -MF .deps/getport.Tpo -c getport.c  -fPIC -DPIC -o .libs/getport.o
In file included from /usr/include/tirpc/rpc/rpc.h:49,
                 from getport.c:40:
getport.c: In function 'nfs_gp_ping':
getport.c:501:7: warning: cast between incompatible function types from 'bool_t (*)(void)' {aka 'int (*)(void)'} to 'bool_t (*)(XDR *, ...)' {aka 'int (*)(struct __rpc_xdr *, ...)'} [-Wcast-function-type]
       (xdrproc_t)xdr_void, NULL,
       ^
/usr/include/tirpc/rpc/clnt.h:163:38: note: in definition of macro 'CLNT_CALL'
  ((*(rh)->cl_ops->cl_call)(rh, proc, xargs, \
                                      ^~~~~
getport.c:502:7: warning: cast between incompatible function types from 'bool_t (*)(void)' {aka 'int (*)(void)'} to 'bool_t (*)(XDR *, ...)' {aka 'int (*)(struct __rpc_xdr *, ...)'} [-Wcast-function-type]
       (xdrproc_t)xdr_void, NULL,
       ^
/usr/include/tirpc/rpc/clnt.h:164:10: note: in definition of macro 'CLNT_CALL'
   argsp, xres, resp, secs))
          ^~~~
libtool: compile:  x86_64-pld-linux-gnux32-gcc -DHAVE_CONFIG_H -I. -I../../support/include -I/usr/include/tirpc -D_GNU_SOURCE -pipe -Wall -Wextra -Werror=strict-prototypes -Werror=missing-prototypes -Werror=missing-declarations -Werror=format=2 -Werror=undef -Werror=missing-include-dirs -Werror=strict-aliasing=2 -Werror=init-self -Werror=implicit-function-declaration -Werror=return-type -Werror=switch -Werror=overflow -Werror=parentheses -Werror=aggregate-return -Werror=unused-result -fno-strict-aliasing -Werror=format-overflow=2 -Werror=int-conversion -Werror=incompatible-pointer-types -Werror=misleading-indentation -O2 -fwrapv -pipe -Wformat -Werror=format-security -gdwarf-4 -fno-debug-types-section -fvar-tracking-assignments -g2 -Wp,-D_FORTIFY_SOURCE=2 -fstack-protector-strong --param=ssp-buffer-size=4 -fPIC -mtune=generic -march=x86-64 -gdwarf-4 -fno-debug-types-section -fvar-tracking-assignments -g2 -MT getport.lo -MD -MP -MF .deps/getport.Tpo -c getport.c -o getport.o >/dev/null 2>&1
mv -f .deps/getport.Tpo .deps/getport.Plo
make[2]: Leaving directory '/tmp/B.P3wIU5/BUILD/nfs-utils-2.3.3/support/nfs'
make[2]: Entering directory '/tmp/B.P3wIU5/BUILD/nfs-utils-2.3.3/support/nfs'
/bin/sh ../../libtool  --tag=CC   --mode=compile x86_64-pld-linux-gnux32-gcc -DHAVE_CONFIG_H -I. -I../../support/include  -I/usr/include/tirpc -D_GNU_SOURCE -pipe  -Wall  -Wextra  -Werror=strict-prototypes  -Werror=missing-prototypes  -Werror=missing-declarations  -Werror=format=2  -Werror=undef  -Werror=missing-include-dirs  -Werror=strict-aliasing=2  -Werror=init-self  -Werror=implicit-function-declaration  -Werror=return-type  -Werror=switch  -Werror=overflow  -Werror=parentheses  -Werror=aggregate-return  -Werror=unused-result  -fno-strict-aliasing  -Werror=format-overflow=2 -Werror=int-conversion -Werror=incompatible-pointer-types -Werror=misleading-indentation -O2 -fwrapv -pipe -Wformat -Werror=format-security -gdwarf-4 -fno-debug-types-section -fvar-tracking-assignments -g2 -Wp,-D_FORTIFY_SOURCE=2 -fstack-protector-strong --param=ssp-buffer-size=4 -fPIC -mtune=generic -march=x86-64 -gdwarf-4 -fno-debug-types-section -fvar-tracking-assignments -g2  -MT exports.lo -MD -MP -MF .deps/exports.Tpo -c -o exports.lo exports.c
libtool: compile:  x86_64-pld-linux-gnux32-gcc -DHAVE_CONFIG_H -I. -I../../support/include -I/usr/include/tirpc -D_GNU_SOURCE -pipe -Wall -Wextra -Werror=strict-prototypes -Werror=missing-prototypes -Werror=missing-declarations -Werror=format=2 -Werror=undef -Werror=missing-include-dirs -Werror=strict-aliasing=2 -Werror=init-self -Werror=implicit-function-declaration -Werror=return-type -Werror=switch -Werror=overflow -Werror=parentheses -Werror=aggregate-return -Werror=unused-result -fno-strict-aliasing -Werror=format-overflow=2 -Werror=int-conversion -Werror=incompatible-pointer-types -Werror=misleading-indentation -O2 -fwrapv -pipe -Wformat -Werror=format-security -gdwarf-4 -fno-debug-types-section -fvar-tracking-assignments -g2 -Wp,-D_FORTIFY_SOURCE=2 -fstack-protector-strong --param=ssp-buffer-size=4 -fPIC -mtune=generic -march=x86-64 -gdwarf-4 -fno-debug-types-section -fvar-tracking-assignments -g2 -MT exports.lo -MD -MP -MF .deps/exports.Tpo -c exports.c  -fPIC -DPIC -o .libs/exports.o
libtool: compile:  x86_64-pld-linux-gnux32-gcc -DHAVE_CONFIG_H -I. -I../../support/include -I/usr/include/tirpc -D_GNU_SOURCE -pipe -Wall -Wextra -Werror=strict-prototypes -Werror=missing-prototypes -Werror=missing-declarations -Werror=format=2 -Werror=undef -Werror=missing-include-dirs -Werror=strict-aliasing=2 -Werror=init-self -Werror=implicit-function-declaration -Werror=return-type -Werror=switch -Werror=overflow -Werror=parentheses -Werror=aggregate-return -Werror=unused-result -fno-strict-aliasing -Werror=format-overflow=2 -Werror=int-conversion -Werror=incompatible-pointer-types -Werror=misleading-indentation -O2 -fwrapv -pipe -Wformat -Werror=format-security -gdwarf-4 -fno-debug-types-section -fvar-tracking-assignments -g2 -Wp,-D_FORTIFY_SOURCE=2 -fstack-protector-strong --param=ssp-buffer-size=4 -fPIC -mtune=generic -march=x86-64 -gdwarf-4 -fno-debug-types-section -fvar-tracking-assignments -g2 -MT exports.lo -MD -MP -MF .deps/exports.Tpo -c exports.c -o exports.o >/dev/null 2>&1
mv -f .deps/exports.Tpo .deps/exports.Plo
make[2]: Leaving directory '/tmp/B.P3wIU5/BUILD/nfs-utils-2.3.3/support/nfs'
make[1]: *** [Makefile:436: all-recursive] Error 1
make: *** [Makefile:475: all-recursive] Error 1
error: Bad exit status from /tmp/B.P3wIU5/BUILD/tmp/rpm-tmp.76985 (%build)


RPM build errors:
    Bad exit status from /tmp/B.P3wIU5/BUILD/tmp/rpm-tmp.76985 (%build)
ended at: Mon Nov 26 00:33:17 2018, done in 0:00:27.474114
error: No files produced.
+ chmod -R u+rwX /tmp/B.P3wIU5/BUILD
+ rm -rf /tmp/B.P3wIU5/tmp /tmp/B.P3wIU5/BUILD
+ rm -rf /tmp/B.P3wIU5
Begin-PLD-Builder-Info
Build-Time: user:25.38s sys:3.77s real:30.50s (faults io:0 non-io:1738341)

End-PLD-Builder-Info
[Back to list of logs] [View rpm -qa of builder]