FailedOk

th/SRPMS[OK]
th/x32[OK]
th/i686[OK]
th/x86_64[OK]

ac/SRPMS[OK]
ac/i386[OK]
ac/i586[OK]
ac/i686[OK]
ac/alpha[OK]
ac/amd64[OK]
ac/athlon[OK]
ac/ppc[OK]
ac/sparc[OK]
ac/sparc64[OK]

Advanced Search
main()
Powered by PLD Linux
(c) 2002-2019 PLD Team
$Revision: 1.37 $
Powered by matrix.
Your IP: 3.226.243.10

openvpn-plugin-auth-ldap aab6b520-63c6-4d86-aa7d-3c2f66db964a

Status:Failed
Source URL:ftp://buildlogs.pld-linux.org/th/x32/FAIL/openvpn-plugin-auth-ldap,aab6b520-63c6-4d86-aa7d-3c2f66db964a.bz2
text/plain URL:View!
full text:View!
rpm -qa of builder:View!
Date:2019/08/06 15:34:33
Runtime:0:00:04.390005

Toc:

  • error 1
  • TRObject.m:106:5: error: 'for' loop initial declarations are only allowed in C99 or C11 mode
  • error 2
  • make[1]: *** [../Mk/compile.mk:6: TRObject.o] Error 1
  • error 3
  • error: Bad exit status from /tmp/B.xquLYd/BUILD/tmp/rpm-tmp.43479 (%build)
  • error 4
  • RPM build errors:
  • error 5
  • error: No files produced.

Content:

checking for ANSI C header files... yes
checking for the pthreads library -lpthreads... no
checking whether pthreads work without any flags... no
checking whether pthreads work with -Kthread... no
checking whether pthreads work with -kthread... no
checking for the pthreads library -llthread... no
checking whether pthreads work with -pthread... yes
checking for joinable pthread attribute... PTHREAD_CREATE_JOINABLE
checking if more special flags are required for pthreads... no
checking for BSD pf(4) support... no
configure: WARNING: pf(4) table support will not be included.
checking for strlcpy... no
checking for openldap... yes
checking for openssl... yes
checking for NSStringFromSelector in Foundation framework... no
checking for openvpn-plugin.h... yes
checking how to run the Objective C preprocessor... x86_64-pld-linux-gnux32-gcc -E
checking for sys/types.h... yes
checking for sys/stat.h... yes
checking for stdlib.h... yes
checking for string.h... yes
checking for memory.h... yes
checking for strings.h... yes
checking for inttypes.h... yes
checking for stdint.h... yes
checking for unistd.h... yes
checking objc/objc.h usability... yes
checking objc/objc.h presence... yes
checking for objc/objc.h... yes
checking if linking libobjc requires pthreads... no
checking for GNU Objective C runtime... yes
configure: Using GNU Objective-C runtime
configure: creating ./config.status
config.status: creating Makefile
config.status: creating docs/Makefile
config.status: creating docs/doxyfile
config.status: creating Mk/autoconf.mk
config.status: creating Mk/compile.mk
config.status: creating Mk/subdir.mk
config.status: creating src/Makefile
config.status: creating tests/Makefile
config.status: creating tools/Makefile
config.status: creating config.h
configure: WARNING: unrecognized options: --with-check
+ /usr/bin/make -Otarget -j9
===> making all in tools
make[1]: Entering directory '/tmp/B.xquLYd/BUILD/openvpn-auth-ldap-auth-ldap-2.0.4/tools'
x86_64-pld-linux-gnux32-gcc  -c makeheaders.c -o makeheaders.o -I. -I../src -I.. -I../src -I. -I../tests -I../tests
make[1]: Leaving directory '/tmp/B.xquLYd/BUILD/openvpn-auth-ldap-auth-ldap-2.0.4/tools'
make[1]: Entering directory '/tmp/B.xquLYd/BUILD/openvpn-auth-ldap-auth-ldap-2.0.4/tools'
x86_64-pld-linux-gnux32-gcc  -o makeheaders makeheaders.o  -export-dynamic
make[1]: Leaving directory '/tmp/B.xquLYd/BUILD/openvpn-auth-ldap-auth-ldap-2.0.4/tools'
make[1]: Entering directory '/tmp/B.xquLYd/BUILD/openvpn-auth-ldap-auth-ldap-2.0.4/tools'
x86_64-pld-linux-gnux32-gcc  -c lemon.c -o lemon.o -I. -I../src -I.. -I../src -I. -I../tests -I../tests
make[1]: Leaving directory '/tmp/B.xquLYd/BUILD/openvpn-auth-ldap-auth-ldap-2.0.4/tools'
make[1]: Entering directory '/tmp/B.xquLYd/BUILD/openvpn-auth-ldap-auth-ldap-2.0.4/tools'
x86_64-pld-linux-gnux32-gcc  -o lemon lemon.o  -export-dynamic
make[1]: Leaving directory '/tmp/B.xquLYd/BUILD/openvpn-auth-ldap-auth-ldap-2.0.4/tools'
===> making all in src
make[1]: Entering directory '/tmp/B.xquLYd/BUILD/openvpn-auth-ldap-auth-ldap-2.0.4/src'
/usr/bin/re2c -o TRConfigLexer.m TRConfigLexer.re
make[1]: Leaving directory '/tmp/B.xquLYd/BUILD/openvpn-auth-ldap-auth-ldap-2.0.4/src'
make[1]: Entering directory '/tmp/B.xquLYd/BUILD/openvpn-auth-ldap-auth-ldap-2.0.4/src'
../tools/lemon -T../tools/lempar.c -m -q TRConfigParser.lemon -OTRConfigParser.m
../tools/makeheaders TRConfigParser.m
make[1]: Leaving directory '/tmp/B.xquLYd/BUILD/openvpn-auth-ldap-auth-ldap-2.0.4/src'
make[1]: Entering directory '/tmp/B.xquLYd/BUILD/openvpn-auth-ldap-auth-ldap-2.0.4/src'
x86_64-pld-linux-gnux32-gcc -fPIC -g -O2  -pthread -fobjc-exceptions -fno-strict-aliasing -O2 -fwrapv -pipe -Wformat -Werror=format-security -gdwarf-4 -fno-debug-types-section -fvar-tracking-assignments -g2 -Wp,-D_FORTIFY_SOURCE=2 -fstack-protector-strong --param=ssp-buffer-size=4 -Werror=trampolines -fPIC -mtune=generic -march=x86-64 -gdwarf-4 -fno-debug-types-section -fvar-tracking-assignments -g2  -DHAVE_CONFIG_H -Wall -I/usr/include -I/usr -I/usr/include -I/usr -c TREnumerator.m -o TREnumerator.o -I. -I../src -I.. -I../src -I. -I../tests -I../tests
make[1]: Leaving directory '/tmp/B.xquLYd/BUILD/openvpn-auth-ldap-auth-ldap-2.0.4/src'
make[1]: Entering directory '/tmp/B.xquLYd/BUILD/openvpn-auth-ldap-auth-ldap-2.0.4/src'
x86_64-pld-linux-gnux32-gcc -fPIC -g -O2  -pthread -fobjc-exceptions -fno-strict-aliasing -O2 -fwrapv -pipe -Wformat -Werror=format-security -gdwarf-4 -fno-debug-types-section -fvar-tracking-assignments -g2 -Wp,-D_FORTIFY_SOURCE=2 -fstack-protector-strong --param=ssp-buffer-size=4 -Werror=trampolines -fPIC -mtune=generic -march=x86-64 -gdwarf-4 -fno-debug-types-section -fvar-tracking-assignments -g2  -DHAVE_CONFIG_H -Wall -I/usr/include -I/usr -I/usr/include -I/usr -c TRConfig.m -o TRConfig.o -I. -I../src -I.. -I../src -I. -I../tests -I../tests
make[1]: Leaving directory '/tmp/B.xquLYd/BUILD/openvpn-auth-ldap-auth-ldap-2.0.4/src'
make[1]: Entering directory '/tmp/B.xquLYd/BUILD/openvpn-auth-ldap-auth-ldap-2.0.4/src'
x86_64-pld-linux-gnux32-gcc -fPIC -g -O2  -pthread -fobjc-exceptions -fno-strict-aliasing -O2 -fwrapv -pipe -Wformat -Werror=format-security -gdwarf-4 -fno-debug-types-section -fvar-tracking-assignments -g2 -Wp,-D_FORTIFY_SOURCE=2 -fstack-protector-strong --param=ssp-buffer-size=4 -Werror=trampolines -fPIC -mtune=generic -march=x86-64 -gdwarf-4 -fno-debug-types-section -fvar-tracking-assignments -g2  -DHAVE_CONFIG_H -Wall -I/usr/include -I/usr -I/usr/include -I/usr -c TRConfigToken.m -o TRConfigToken.o -I. -I../src -I.. -I../src -I. -I../tests -I../tests
make[1]: Leaving directory '/tmp/B.xquLYd/BUILD/openvpn-auth-ldap-auth-ldap-2.0.4/src'
make[1]: Entering directory '/tmp/B.xquLYd/BUILD/openvpn-auth-ldap-auth-ldap-2.0.4/src'
x86_64-pld-linux-gnux32-gcc -fPIC -g -O2  -pthread -fobjc-exceptions -fno-strict-aliasing -O2 -fwrapv -pipe -Wformat -Werror=format-security -gdwarf-4 -fno-debug-types-section -fvar-tracking-assignments -g2 -Wp,-D_FORTIFY_SOURCE=2 -fstack-protector-strong --param=ssp-buffer-size=4 -Werror=trampolines -fPIC -mtune=generic -march=x86-64 -gdwarf-4 -fno-debug-types-section -fvar-tracking-assignments -g2  -DHAVE_CONFIG_H -Wall -I/usr/include -I/usr -I/usr/include -I/usr -c TRAutoreleasePool.m -o TRAutoreleasePool.o -I. -I../src -I.. -I../src -I. -I../tests -I../tests
make[1]: Leaving directory '/tmp/B.xquLYd/BUILD/openvpn-auth-ldap-auth-ldap-2.0.4/src'
make[1]: Entering directory '/tmp/B.xquLYd/BUILD/openvpn-auth-ldap-auth-ldap-2.0.4/src'
x86_64-pld-linux-gnux32-gcc -fPIC -g -O2  -pthread -fobjc-exceptions -fno-strict-aliasing -O2 -fwrapv -pipe -Wformat -Werror=format-security -gdwarf-4 -fno-debug-types-section -fvar-tracking-assignments -g2 -Wp,-D_FORTIFY_SOURCE=2 -fstack-protector-strong --param=ssp-buffer-size=4 -Werror=trampolines -fPIC -mtune=generic -march=x86-64 -gdwarf-4 -fno-debug-types-section -fvar-tracking-assignments -g2  -DHAVE_CONFIG_H -Wall -I/usr/include -I/usr -I/usr/include -I/usr -c TRHash.m -o TRHash.o -I. -I../src -I.. -I../src -I. -I../tests -I../tests
make[1]: Leaving directory '/tmp/B.xquLYd/BUILD/openvpn-auth-ldap-auth-ldap-2.0.4/src'
make[1]: Entering directory '/tmp/B.xquLYd/BUILD/openvpn-auth-ldap-auth-ldap-2.0.4/src'
x86_64-pld-linux-gnux32-gcc -fPIC -g -O2  -pthread -fobjc-exceptions -fno-strict-aliasing -O2 -fwrapv -pipe -Wformat -Werror=format-security -gdwarf-4 -fno-debug-types-section -fvar-tracking-assignments -g2 -Wp,-D_FORTIFY_SOURCE=2 -fstack-protector-strong --param=ssp-buffer-size=4 -Werror=trampolines -fPIC -mtune=generic -march=x86-64 -gdwarf-4 -fno-debug-types-section -fvar-tracking-assignments -g2  -DHAVE_CONFIG_H -Wall -I/usr/include -I/usr -I/usr/include -I/usr -c TRArray.m -o TRArray.o -I. -I../src -I.. -I../src -I. -I../tests -I../tests
make[1]: Leaving directory '/tmp/B.xquLYd/BUILD/openvpn-auth-ldap-auth-ldap-2.0.4/src'
make[1]: Entering directory '/tmp/B.xquLYd/BUILD/openvpn-auth-ldap-auth-ldap-2.0.4/src'
x86_64-pld-linux-gnux32-gcc -fPIC -g -O2  -pthread -fobjc-exceptions -fno-strict-aliasing -O2 -fwrapv -pipe -Wformat -Werror=format-security -gdwarf-4 -fno-debug-types-section -fvar-tracking-assignments -g2 -Wp,-D_FORTIFY_SOURCE=2 -fstack-protector-strong --param=ssp-buffer-size=4 -Werror=trampolines -fPIC -mtune=generic -march=x86-64 -gdwarf-4 -fno-debug-types-section -fvar-tracking-assignments -g2  -DHAVE_CONFIG_H -Wall -I/usr/include -I/usr -I/usr/include -I/usr -c TRLDAPAccountRepository.m -o TRLDAPAccountRepository.o -I. -I../src -I.. -I../src -I. -I../tests -I../tests
make[1]: Leaving directory '/tmp/B.xquLYd/BUILD/openvpn-auth-ldap-auth-ldap-2.0.4/src'
make[1]: Entering directory '/tmp/B.xquLYd/BUILD/openvpn-auth-ldap-auth-ldap-2.0.4/src'
x86_64-pld-linux-gnux32-gcc -fPIC -g -O2  -pthread -fobjc-exceptions -fno-strict-aliasing -O2 -fwrapv -pipe -Wformat -Werror=format-security -gdwarf-4 -fno-debug-types-section -fvar-tracking-assignments -g2 -Wp,-D_FORTIFY_SOURCE=2 -fstack-protector-strong --param=ssp-buffer-size=4 -Werror=trampolines -fPIC -mtune=generic -march=x86-64 -gdwarf-4 -fno-debug-types-section -fvar-tracking-assignments -g2  -DHAVE_CONFIG_H -Wall -I/usr/include -I/usr -I/usr/include -I/usr -c TRLDAPEntry.m -o TRLDAPEntry.o -I. -I../src -I.. -I../src -I. -I../tests -I../tests
make[1]: Leaving directory '/tmp/B.xquLYd/BUILD/openvpn-auth-ldap-auth-ldap-2.0.4/src'
make[1]: Entering directory '/tmp/B.xquLYd/BUILD/openvpn-auth-ldap-auth-ldap-2.0.4/src'
x86_64-pld-linux-gnux32-gcc -fPIC -g -O2  -pthread -fobjc-exceptions -fno-strict-aliasing -O2 -fwrapv -pipe -Wformat -Werror=format-security -gdwarf-4 -fno-debug-types-section -fvar-tracking-assignments -g2 -Wp,-D_FORTIFY_SOURCE=2 -fstack-protector-strong --param=ssp-buffer-size=4 -Werror=trampolines -fPIC -mtune=generic -march=x86-64 -gdwarf-4 -fno-debug-types-section -fvar-tracking-assignments -g2  -DHAVE_CONFIG_H -Wall -I/usr/include -I/usr -I/usr/include -I/usr -c TRLocalPacketFilter.m -o TRLocalPacketFilter.o -I. -I../src -I.. -I../src -I. -I../tests -I../tests
make[1]: Leaving directory '/tmp/B.xquLYd/BUILD/openvpn-auth-ldap-auth-ldap-2.0.4/src'
make[1]: Entering directory '/tmp/B.xquLYd/BUILD/openvpn-auth-ldap-auth-ldap-2.0.4/src'
x86_64-pld-linux-gnux32-gcc -fPIC -g -O2  -pthread -fobjc-exceptions -fno-strict-aliasing -O2 -fwrapv -pipe -Wformat -Werror=format-security -gdwarf-4 -fno-debug-types-section -fvar-tracking-assignments -g2 -Wp,-D_FORTIFY_SOURCE=2 -fstack-protector-strong --param=ssp-buffer-size=4 -Werror=trampolines -fPIC -mtune=generic -march=x86-64 -gdwarf-4 -fno-debug-types-section -fvar-tracking-assignments -g2  -DHAVE_CONFIG_H -Wall -I/usr/include -I/usr -I/usr/include -I/usr -c TRLDAPGroupConfig.m -o TRLDAPGroupConfig.o -I. -I../src -I.. -I../src -I. -I../tests -I../tests
make[1]: Leaving directory '/tmp/B.xquLYd/BUILD/openvpn-auth-ldap-auth-ldap-2.0.4/src'
make[1]: Entering directory '/tmp/B.xquLYd/BUILD/openvpn-auth-ldap-auth-ldap-2.0.4/src'
x86_64-pld-linux-gnux32-gcc -fPIC -g -O2  -pthread -fobjc-exceptions -fno-strict-aliasing -O2 -fwrapv -pipe -Wformat -Werror=format-security -gdwarf-4 -fno-debug-types-section -fvar-tracking-assignments -g2 -Wp,-D_FORTIFY_SOURCE=2 -fstack-protector-strong --param=ssp-buffer-size=4 -Werror=trampolines -fPIC -mtune=generic -march=x86-64 -gdwarf-4 -fno-debug-types-section -fvar-tracking-assignments -g2  -DHAVE_CONFIG_H -Wall -I/usr/include -I/usr -I/usr/include -I/usr -c TRObject.m -o TRObject.o -I. -I../src -I.. -I../src -I. -I../tests -I../tests
TRObject.m: In function '-[TRObject isKindOfClass:]':
TRObject.m:106:5: error: 'for' loop initial declarations are only allowed in C99 or C11 mode
     for (Class superClass = selfClass; superClass != NULL; superClass = class_getSuperclass(superClass)) {
     ^~~
TRObject.m:106:5: note: use option -std=c99, -std=gnu99, -std=c11 or -std=gnu11 to compile your code
make[1]: *** [../Mk/compile.mk:6: TRObject.o] Error 1
make[1]: Leaving directory '/tmp/B.xquLYd/BUILD/openvpn-auth-ldap-auth-ldap-2.0.4/src'
make[1]: *** Waiting for unfinished jobs....
make[1]: Entering directory '/tmp/B.xquLYd/BUILD/openvpn-auth-ldap-auth-ldap-2.0.4/src'
x86_64-pld-linux-gnux32-gcc -fPIC -g -O2  -pthread -fobjc-exceptions -fno-strict-aliasing -O2 -fwrapv -pipe -Wformat -Werror=format-security -gdwarf-4 -fno-debug-types-section -fvar-tracking-assignments -g2 -Wp,-D_FORTIFY_SOURCE=2 -fstack-protector-strong --param=ssp-buffer-size=4 -Werror=trampolines -fPIC -mtune=generic -march=x86-64 -gdwarf-4 -fno-debug-types-section -fvar-tracking-assignments -g2  -DHAVE_CONFIG_H -Wall -I/usr/include -I/usr -I/usr/include -I/usr -c TRConfigParser.m -o TRConfigParser.o -I. -I../src -I.. -I../src -I. -I../tests -I../tests
make[1]: Leaving directory '/tmp/B.xquLYd/BUILD/openvpn-auth-ldap-auth-ldap-2.0.4/src'
make[1]: Entering directory '/tmp/B.xquLYd/BUILD/openvpn-auth-ldap-auth-ldap-2.0.4/src'
x86_64-pld-linux-gnux32-gcc -fPIC -g -O2  -pthread -fobjc-exceptions -fno-strict-aliasing -O2 -fwrapv -pipe -Wformat -Werror=format-security -gdwarf-4 -fno-debug-types-section -fvar-tracking-assignments -g2 -Wp,-D_FORTIFY_SOURCE=2 -fstack-protector-strong --param=ssp-buffer-size=4 -Werror=trampolines -fPIC -mtune=generic -march=x86-64 -gdwarf-4 -fno-debug-types-section -fvar-tracking-assignments -g2  -DHAVE_CONFIG_H -Wall -I/usr/include -I/usr -I/usr/include -I/usr -c TRLDAPSearchFilter.m -o TRLDAPSearchFilter.o -I. -I../src -I.. -I../src -I. -I../tests -I../tests
make[1]: Leaving directory '/tmp/B.xquLYd/BUILD/openvpn-auth-ldap-auth-ldap-2.0.4/src'
make[1]: Entering directory '/tmp/B.xquLYd/BUILD/openvpn-auth-ldap-auth-ldap-2.0.4/src'
x86_64-pld-linux-gnux32-gcc -fPIC -g -O2  -pthread -fobjc-exceptions -fno-strict-aliasing -O2 -fwrapv -pipe -Wformat -Werror=format-security -gdwarf-4 -fno-debug-types-section -fvar-tracking-assignments -g2 -Wp,-D_FORTIFY_SOURCE=2 -fstack-protector-strong --param=ssp-buffer-size=4 -Werror=trampolines -fPIC -mtune=generic -march=x86-64 -gdwarf-4 -fno-debug-types-section -fvar-tracking-assignments -g2  -DHAVE_CONFIG_H -Wall -I/usr/include -I/usr -I/usr/include -I/usr -c TRConfigLexer.m -o TRConfigLexer.o -I. -I../src -I.. -I../src -I. -I../tests -I../tests
make[1]: Leaving directory '/tmp/B.xquLYd/BUILD/openvpn-auth-ldap-auth-ldap-2.0.4/src'
make[1]: Entering directory '/tmp/B.xquLYd/BUILD/openvpn-auth-ldap-auth-ldap-2.0.4/src'
x86_64-pld-linux-gnux32-gcc -fPIC -g -O2  -pthread -fobjc-exceptions -fno-strict-aliasing -O2 -fwrapv -pipe -Wformat -Werror=format-security -gdwarf-4 -fno-debug-types-section -fvar-tracking-assignments -g2 -Wp,-D_FORTIFY_SOURCE=2 -fstack-protector-strong --param=ssp-buffer-size=4 -Werror=trampolines -fPIC -mtune=generic -march=x86-64 -gdwarf-4 -fno-debug-types-section -fvar-tracking-assignments -g2  -DHAVE_CONFIG_H -Wall -I/usr/include -I/usr -I/usr/include -I/usr -c TRLog.m -o TRLog.o -I. -I../src -I.. -I../src -I. -I../tests -I../tests
make[1]: Leaving directory '/tmp/B.xquLYd/BUILD/openvpn-auth-ldap-auth-ldap-2.0.4/src'
make[1]: Entering directory '/tmp/B.xquLYd/BUILD/openvpn-auth-ldap-auth-ldap-2.0.4/src'
x86_64-pld-linux-gnux32-gcc -fPIC -g -O2  -pthread -fobjc-exceptions -fno-strict-aliasing -O2 -fwrapv -pipe -Wformat -Werror=format-security -gdwarf-4 -fno-debug-types-section -fvar-tracking-assignments -g2 -Wp,-D_FORTIFY_SOURCE=2 -fstack-protector-strong --param=ssp-buffer-size=4 -Werror=trampolines -fPIC -mtune=generic -march=x86-64 -gdwarf-4 -fno-debug-types-section -fvar-tracking-assignments -g2  -DHAVE_CONFIG_H -Wall -I/usr/include -I/usr -I/usr/include -I/usr -c TRPacketFilter.m -o TRPacketFilter.o -I. -I../src -I.. -I../src -I. -I../tests -I../tests
make[1]: Leaving directory '/tmp/B.xquLYd/BUILD/openvpn-auth-ldap-auth-ldap-2.0.4/src'
make[1]: Entering directory '/tmp/B.xquLYd/BUILD/openvpn-auth-ldap-auth-ldap-2.0.4/src'
x86_64-pld-linux-gnux32-gcc -fPIC -g -O2  -pthread -fobjc-exceptions -fno-strict-aliasing -O2 -fwrapv -pipe -Wformat -Werror=format-security -gdwarf-4 -fno-debug-types-section -fvar-tracking-assignments -g2 -Wp,-D_FORTIFY_SOURCE=2 -fstack-protector-strong --param=ssp-buffer-size=4 -Werror=trampolines -fPIC -mtune=generic -march=x86-64 -gdwarf-4 -fno-debug-types-section -fvar-tracking-assignments -g2  -DHAVE_CONFIG_H -Wall -I/usr/include -I/usr -I/usr/include -I/usr -c TRPFAddress.m -o TRPFAddress.o -I. -I../src -I.. -I../src -I. -I../tests -I../tests
make[1]: Leaving directory '/tmp/B.xquLYd/BUILD/openvpn-auth-ldap-auth-ldap-2.0.4/src'
make[1]: Entering directory '/tmp/B.xquLYd/BUILD/openvpn-auth-ldap-auth-ldap-2.0.4/src'
x86_64-pld-linux-gnux32-gcc -fPIC -g -O2  -pthread -fobjc-exceptions -fno-strict-aliasing -O2 -fwrapv -pipe -Wformat -Werror=format-security -gdwarf-4 -fno-debug-types-section -fvar-tracking-assignments -g2 -Wp,-D_FORTIFY_SOURCE=2 -fstack-protector-strong --param=ssp-buffer-size=4 -Werror=trampolines -fPIC -mtune=generic -march=x86-64 -gdwarf-4 -fno-debug-types-section -fvar-tracking-assignments -g2  -DHAVE_CONFIG_H -Wall -I/usr/include -I/usr -I/usr/include -I/usr -c TRLDAPConnection.m -o TRLDAPConnection.o -I. -I../src -I.. -I../src -I. -I../tests -I../tests
make[1]: Leaving directory '/tmp/B.xquLYd/BUILD/openvpn-auth-ldap-auth-ldap-2.0.4/src'
make[1]: Entering directory '/tmp/B.xquLYd/BUILD/openvpn-auth-ldap-auth-ldap-2.0.4/src'
x86_64-pld-linux-gnux32-gcc -fPIC -g -O2  -pthread -fobjc-exceptions -fno-strict-aliasing -O2 -fwrapv -pipe -Wformat -Werror=format-security -gdwarf-4 -fno-debug-types-section -fvar-tracking-assignments -g2 -Wp,-D_FORTIFY_SOURCE=2 -fstack-protector-strong --param=ssp-buffer-size=4 -Werror=trampolines -fPIC -mtune=generic -march=x86-64 -gdwarf-4 -fno-debug-types-section -fvar-tracking-assignments -g2  -DHAVE_CONFIG_H -Wall -I/usr/include -I/usr -I/usr/include -I/usr -c TRAuthLDAPConfig.m -o TRAuthLDAPConfig.o -I. -I../src -I.. -I../src -I. -I../tests -I../tests
make[1]: Leaving directory '/tmp/B.xquLYd/BUILD/openvpn-auth-ldap-auth-ldap-2.0.4/src'
make: *** [Mk/subdir.mk:8: all] Error 1
error: Bad exit status from /tmp/B.xquLYd/BUILD/tmp/rpm-tmp.43479 (%build)


RPM build errors:
    Bad exit status from /tmp/B.xquLYd/BUILD/tmp/rpm-tmp.43479 (%build)
ended at: Tue Aug  6 15:34:33 2019, done in 0:00:04.390005
error: No files produced.
+ chmod -R u+rwX /tmp/B.xquLYd/BUILD
+ rm -rf /tmp/B.xquLYd/tmp /tmp/B.xquLYd/BUILD
+ rm -rf /tmp/B.xquLYd
Begin-PLD-Builder-Info
Build-Time: user:5.85s sys:0.88s real:7.09s (faults io:0 non-io:394987)

End-PLD-Builder-Info
[Back to list of logs] [View rpm -qa of builder]