FailedOk

th/SRPMS[OK]
th/x32[OK]
th/i686[OK]
th/x86_64[OK]

ac/SRPMS[OK]
ac/i386[OK]
ac/i586[OK]
ac/i686[OK]
ac/alpha[OK]
ac/amd64[OK]
ac/athlon[OK]
ac/ppc[OK]
ac/sparc[OK]
ac/sparc64[OK]

Advanced Search
main()
Powered by PLD Linux
(c) 2002-2020 PLD Team
$Revision: 1.37 $
Powered by coffee.
Your IP: 34.200.222.93

pdns 180c8379-8da4-4cca-929b-aba69e6f3d12

Status:Failed
Source URL:https://buildlogs.pld-linux.org/pld/th/x32/FAIL/pdns,180c8379-8da4-4cca-929b-aba69e6f3d12.bz2
text/plain URL:View!
full text:View!
rpm -qa of builder:View!
Date:2020/07/28 19:50:25
Runtime:0:03:50.873992

Toc:

  • error 1
  • webserver.cc:110:74: error: '_1' was not declared in this scope
  • error 2
  • webserver.cc:110:78: error: '_2' was not declared in this scope
  • error 3
  • webserver.cc:182:74: error: '_1' was not declared in this scope
  • error 4
  • webserver.cc:182:78: error: '_2' was not declared in this scope
  • error 5
  • webserver.cc:199:74: error: '_1' was not declared in this scope
  • error 6
  • webserver.cc:199:78: error: '_2' was not declared in this scope
  • error 7
  • make[3]: *** [Makefile:3120: webserver.o] Error 1
  • error 8
  • ws-auth.cc:2331:93: error: '_1' was not declared in this scope
  • error 9
  • ws-auth.cc:2331:97: error: '_2' was not declared in this scope
  • error 10
  • make[3]: *** [Makefile:3120: ws-auth.o] Error 1
  • error 11
  • make[2]: *** [Makefile:2631: all] Error 2
  • error 12
  • make[1]: *** [Makefile:568: all-recursive] Error 1
  • error 13
  • error: Bad exit status from /tmp/B.TRQXp7/BUILD/tmp/rpm-tmp.38047 (%build)
  • error 14
  • RPM build errors:
  • error 15
  • error: No files produced.

Content:

make[3]: Leaving directory '/tmp/B.TRQXp7/BUILD/pdns-4.3.0/pdns'
make[3]: Entering directory '/tmp/B.TRQXp7/BUILD/pdns-4.3.0/pdns'
depbase=`echo calidns.o | sed 's|[^/]*$|.deps/&|;s|\.o$||'`;\
x86_64-pld-linux-gnux32-g++ -DHAVE_CONFIG_H -I. -I..  -I.. -I.. -pthread  -I../ext/json11 -I../ext/yahttp       -I/usr/include/lua5.3   -DHAVE_NAMESPACE_STD -DHAVE_CXX_STRING_HEADER -DDLLIMPORT="" -DSYSCONFDIR=\"/etc/pdns\" -DPKGLIBDIR=\"/usr/libx32/pdns\" -DLOCALSTATEDIR=\"/var/run\" -fPIE -DPIE -U_FORTIFY_SOURCE -D_FORTIFY_SOURCE=2 --param ssp-buffer-size=4 -fstack-protector -g -O2 -Wall -Wextra -Wshadow -Wno-unused-parameter -O2 -fwrapv -pipe -Wformat -Werror=format-security -gdwarf-4 -fno-debug-types-section -fvar-tracking-assignments -g2 -Wp,-D_FORTIFY_SOURCE=2 -fstack-protector-strong --param=ssp-buffer-size=4 -Werror=trampolines -fPIC -mtune=generic -march=x86-64 -gdwarf-4 -fno-debug-types-section -fvar-tracking-assignments -g2  -MT calidns.o -MD -MP -MF $depbase.Tpo -c -o calidns.o calidns.cc &&\
mv -f $depbase.Tpo $depbase.Po
make[3]: Leaving directory '/tmp/B.TRQXp7/BUILD/pdns-4.3.0/pdns'
make[3]: Entering directory '/tmp/B.TRQXp7/BUILD/pdns-4.3.0/pdns'
depbase=`echo auth-carbon.o | sed 's|[^/]*$|.deps/&|;s|\.o$||'`;\
x86_64-pld-linux-gnux32-g++ -DHAVE_CONFIG_H -I. -I..  -I.. -I.. -pthread  -I../ext/json11 -I../ext/yahttp       -I/usr/include/lua5.3   -DHAVE_NAMESPACE_STD -DHAVE_CXX_STRING_HEADER -DDLLIMPORT="" -DSYSCONFDIR=\"/etc/pdns\" -DPKGLIBDIR=\"/usr/libx32/pdns\" -DLOCALSTATEDIR=\"/var/run\" -fPIE -DPIE -U_FORTIFY_SOURCE -D_FORTIFY_SOURCE=2 --param ssp-buffer-size=4 -fstack-protector -g -O2 -Wall -Wextra -Wshadow -Wno-unused-parameter -O2 -fwrapv -pipe -Wformat -Werror=format-security -gdwarf-4 -fno-debug-types-section -fvar-tracking-assignments -g2 -Wp,-D_FORTIFY_SOURCE=2 -fstack-protector-strong --param=ssp-buffer-size=4 -Werror=trampolines -fPIC -mtune=generic -march=x86-64 -gdwarf-4 -fno-debug-types-section -fvar-tracking-assignments -g2  -MT auth-carbon.o -MD -MP -MF $depbase.Tpo -c -o auth-carbon.o auth-carbon.cc &&\
mv -f $depbase.Tpo $depbase.Po
make[3]: Leaving directory '/tmp/B.TRQXp7/BUILD/pdns-4.3.0/pdns'
make[3]: Entering directory '/tmp/B.TRQXp7/BUILD/pdns-4.3.0/pdns'
depbase=`echo communicator.o | sed 's|[^/]*$|.deps/&|;s|\.o$||'`;\
x86_64-pld-linux-gnux32-g++ -DHAVE_CONFIG_H -I. -I..  -I.. -I.. -pthread  -I../ext/json11 -I../ext/yahttp       -I/usr/include/lua5.3   -DHAVE_NAMESPACE_STD -DHAVE_CXX_STRING_HEADER -DDLLIMPORT="" -DSYSCONFDIR=\"/etc/pdns\" -DPKGLIBDIR=\"/usr/libx32/pdns\" -DLOCALSTATEDIR=\"/var/run\" -fPIE -DPIE -U_FORTIFY_SOURCE -D_FORTIFY_SOURCE=2 --param ssp-buffer-size=4 -fstack-protector -g -O2 -Wall -Wextra -Wshadow -Wno-unused-parameter -O2 -fwrapv -pipe -Wformat -Werror=format-security -gdwarf-4 -fno-debug-types-section -fvar-tracking-assignments -g2 -Wp,-D_FORTIFY_SOURCE=2 -fstack-protector-strong --param=ssp-buffer-size=4 -Werror=trampolines -fPIC -mtune=generic -march=x86-64 -gdwarf-4 -fno-debug-types-section -fvar-tracking-assignments -g2  -MT communicator.o -MD -MP -MF $depbase.Tpo -c -o communicator.o communicator.cc &&\
mv -f $depbase.Tpo $depbase.Po
make[3]: Leaving directory '/tmp/B.TRQXp7/BUILD/pdns-4.3.0/pdns'
make[3]: Entering directory '/tmp/B.TRQXp7/BUILD/pdns-4.3.0/pdns'
depbase=`echo dnsproxy.o | sed 's|[^/]*$|.deps/&|;s|\.o$||'`;\
x86_64-pld-linux-gnux32-g++ -DHAVE_CONFIG_H -I. -I..  -I.. -I.. -pthread  -I../ext/json11 -I../ext/yahttp       -I/usr/include/lua5.3   -DHAVE_NAMESPACE_STD -DHAVE_CXX_STRING_HEADER -DDLLIMPORT="" -DSYSCONFDIR=\"/etc/pdns\" -DPKGLIBDIR=\"/usr/libx32/pdns\" -DLOCALSTATEDIR=\"/var/run\" -fPIE -DPIE -U_FORTIFY_SOURCE -D_FORTIFY_SOURCE=2 --param ssp-buffer-size=4 -fstack-protector -g -O2 -Wall -Wextra -Wshadow -Wno-unused-parameter -O2 -fwrapv -pipe -Wformat -Werror=format-security -gdwarf-4 -fno-debug-types-section -fvar-tracking-assignments -g2 -Wp,-D_FORTIFY_SOURCE=2 -fstack-protector-strong --param=ssp-buffer-size=4 -Werror=trampolines -fPIC -mtune=generic -march=x86-64 -gdwarf-4 -fno-debug-types-section -fvar-tracking-assignments -g2  -MT dnsproxy.o -MD -MP -MF $depbase.Tpo -c -o dnsproxy.o dnsproxy.cc &&\
mv -f $depbase.Tpo $depbase.Po
make[3]: Leaving directory '/tmp/B.TRQXp7/BUILD/pdns-4.3.0/pdns'
make[3]: Entering directory '/tmp/B.TRQXp7/BUILD/pdns-4.3.0/pdns'
depbase=`echo dnstcpbench.o | sed 's|[^/]*$|.deps/&|;s|\.o$||'`;\
x86_64-pld-linux-gnux32-g++ -DHAVE_CONFIG_H -I. -I..  -I.. -I.. -pthread  -I../ext/json11 -I../ext/yahttp       -I/usr/include/lua5.3   -DHAVE_NAMESPACE_STD -DHAVE_CXX_STRING_HEADER -DDLLIMPORT="" -DSYSCONFDIR=\"/etc/pdns\" -DPKGLIBDIR=\"/usr/libx32/pdns\" -DLOCALSTATEDIR=\"/var/run\" -fPIE -DPIE -U_FORTIFY_SOURCE -D_FORTIFY_SOURCE=2 --param ssp-buffer-size=4 -fstack-protector -g -O2 -Wall -Wextra -Wshadow -Wno-unused-parameter -O2 -fwrapv -pipe -Wformat -Werror=format-security -gdwarf-4 -fno-debug-types-section -fvar-tracking-assignments -g2 -Wp,-D_FORTIFY_SOURCE=2 -fstack-protector-strong --param=ssp-buffer-size=4 -Werror=trampolines -fPIC -mtune=generic -march=x86-64 -gdwarf-4 -fno-debug-types-section -fvar-tracking-assignments -g2  -MT dnstcpbench.o -MD -MP -MF $depbase.Tpo -c -o dnstcpbench.o dnstcpbench.cc &&\
mv -f $depbase.Tpo $depbase.Po
make[3]: Leaving directory '/tmp/B.TRQXp7/BUILD/pdns-4.3.0/pdns'
make[3]: Entering directory '/tmp/B.TRQXp7/BUILD/pdns-4.3.0/pdns'
depbase=`echo nameserver.o | sed 's|[^/]*$|.deps/&|;s|\.o$||'`;\
x86_64-pld-linux-gnux32-g++ -DHAVE_CONFIG_H -I. -I..  -I.. -I.. -pthread  -I../ext/json11 -I../ext/yahttp       -I/usr/include/lua5.3   -DHAVE_NAMESPACE_STD -DHAVE_CXX_STRING_HEADER -DDLLIMPORT="" -DSYSCONFDIR=\"/etc/pdns\" -DPKGLIBDIR=\"/usr/libx32/pdns\" -DLOCALSTATEDIR=\"/var/run\" -fPIE -DPIE -U_FORTIFY_SOURCE -D_FORTIFY_SOURCE=2 --param ssp-buffer-size=4 -fstack-protector -g -O2 -Wall -Wextra -Wshadow -Wno-unused-parameter -O2 -fwrapv -pipe -Wformat -Werror=format-security -gdwarf-4 -fno-debug-types-section -fvar-tracking-assignments -g2 -Wp,-D_FORTIFY_SOURCE=2 -fstack-protector-strong --param=ssp-buffer-size=4 -Werror=trampolines -fPIC -mtune=generic -march=x86-64 -gdwarf-4 -fno-debug-types-section -fvar-tracking-assignments -g2  -MT nameserver.o -MD -MP -MF $depbase.Tpo -c -o nameserver.o nameserver.cc &&\
mv -f $depbase.Tpo $depbase.Po
make[3]: Leaving directory '/tmp/B.TRQXp7/BUILD/pdns-4.3.0/pdns'
make[3]: Entering directory '/tmp/B.TRQXp7/BUILD/pdns-4.3.0/pdns'
depbase=`echo mastercommunicator.o | sed 's|[^/]*$|.deps/&|;s|\.o$||'`;\
x86_64-pld-linux-gnux32-g++ -DHAVE_CONFIG_H -I. -I..  -I.. -I.. -pthread  -I../ext/json11 -I../ext/yahttp       -I/usr/include/lua5.3   -DHAVE_NAMESPACE_STD -DHAVE_CXX_STRING_HEADER -DDLLIMPORT="" -DSYSCONFDIR=\"/etc/pdns\" -DPKGLIBDIR=\"/usr/libx32/pdns\" -DLOCALSTATEDIR=\"/var/run\" -fPIE -DPIE -U_FORTIFY_SOURCE -D_FORTIFY_SOURCE=2 --param ssp-buffer-size=4 -fstack-protector -g -O2 -Wall -Wextra -Wshadow -Wno-unused-parameter -O2 -fwrapv -pipe -Wformat -Werror=format-security -gdwarf-4 -fno-debug-types-section -fvar-tracking-assignments -g2 -Wp,-D_FORTIFY_SOURCE=2 -fstack-protector-strong --param=ssp-buffer-size=4 -Werror=trampolines -fPIC -mtune=generic -march=x86-64 -gdwarf-4 -fno-debug-types-section -fvar-tracking-assignments -g2  -MT mastercommunicator.o -MD -MP -MF $depbase.Tpo -c -o mastercommunicator.o mastercommunicator.cc &&\
mv -f $depbase.Tpo $depbase.Po
make[3]: Leaving directory '/tmp/B.TRQXp7/BUILD/pdns-4.3.0/pdns'
make[3]: Entering directory '/tmp/B.TRQXp7/BUILD/pdns-4.3.0/pdns'
depbase=`echo dnsbulktest.o | sed 's|[^/]*$|.deps/&|;s|\.o$||'`;\
x86_64-pld-linux-gnux32-g++ -DHAVE_CONFIG_H -I. -I..  -I.. -I.. -pthread  -I../ext/json11 -I../ext/yahttp       -I/usr/include/lua5.3   -DHAVE_NAMESPACE_STD -DHAVE_CXX_STRING_HEADER -DDLLIMPORT="" -DSYSCONFDIR=\"/etc/pdns\" -DPKGLIBDIR=\"/usr/libx32/pdns\" -DLOCALSTATEDIR=\"/var/run\" -fPIE -DPIE -U_FORTIFY_SOURCE -D_FORTIFY_SOURCE=2 --param ssp-buffer-size=4 -fstack-protector -g -O2 -Wall -Wextra -Wshadow -Wno-unused-parameter -O2 -fwrapv -pipe -Wformat -Werror=format-security -gdwarf-4 -fno-debug-types-section -fvar-tracking-assignments -g2 -Wp,-D_FORTIFY_SOURCE=2 -fstack-protector-strong --param=ssp-buffer-size=4 -Werror=trampolines -fPIC -mtune=generic -march=x86-64 -gdwarf-4 -fno-debug-types-section -fvar-tracking-assignments -g2  -MT dnsbulktest.o -MD -MP -MF $depbase.Tpo -c -o dnsbulktest.o dnsbulktest.cc &&\
mv -f $depbase.Tpo $depbase.Po
make[3]: Leaving directory '/tmp/B.TRQXp7/BUILD/pdns-4.3.0/pdns'
make[3]: Entering directory '/tmp/B.TRQXp7/BUILD/pdns-4.3.0/pdns'
depbase=`echo dynhandler.o | sed 's|[^/]*$|.deps/&|;s|\.o$||'`;\
x86_64-pld-linux-gnux32-g++ -DHAVE_CONFIG_H -I. -I..  -I.. -I.. -pthread  -I../ext/json11 -I../ext/yahttp       -I/usr/include/lua5.3   -DHAVE_NAMESPACE_STD -DHAVE_CXX_STRING_HEADER -DDLLIMPORT="" -DSYSCONFDIR=\"/etc/pdns\" -DPKGLIBDIR=\"/usr/libx32/pdns\" -DLOCALSTATEDIR=\"/var/run\" -fPIE -DPIE -U_FORTIFY_SOURCE -D_FORTIFY_SOURCE=2 --param ssp-buffer-size=4 -fstack-protector -g -O2 -Wall -Wextra -Wshadow -Wno-unused-parameter -O2 -fwrapv -pipe -Wformat -Werror=format-security -gdwarf-4 -fno-debug-types-section -fvar-tracking-assignments -g2 -Wp,-D_FORTIFY_SOURCE=2 -fstack-protector-strong --param=ssp-buffer-size=4 -Werror=trampolines -fPIC -mtune=generic -march=x86-64 -gdwarf-4 -fno-debug-types-section -fvar-tracking-assignments -g2  -MT dynhandler.o -MD -MP -MF $depbase.Tpo -c -o dynhandler.o dynhandler.cc &&\
mv -f $depbase.Tpo $depbase.Po
make[3]: Leaving directory '/tmp/B.TRQXp7/BUILD/pdns-4.3.0/pdns'
make[3]: Entering directory '/tmp/B.TRQXp7/BUILD/pdns-4.3.0/pdns'
depbase=`echo common_startup.o | sed 's|[^/]*$|.deps/&|;s|\.o$||'`;\
x86_64-pld-linux-gnux32-g++ -DHAVE_CONFIG_H -I. -I..  -I.. -I.. -pthread  -I../ext/json11 -I../ext/yahttp       -I/usr/include/lua5.3   -DHAVE_NAMESPACE_STD -DHAVE_CXX_STRING_HEADER -DDLLIMPORT="" -DSYSCONFDIR=\"/etc/pdns\" -DPKGLIBDIR=\"/usr/libx32/pdns\" -DLOCALSTATEDIR=\"/var/run\" -fPIE -DPIE -U_FORTIFY_SOURCE -D_FORTIFY_SOURCE=2 --param ssp-buffer-size=4 -fstack-protector -g -O2 -Wall -Wextra -Wshadow -Wno-unused-parameter -O2 -fwrapv -pipe -Wformat -Werror=format-security -gdwarf-4 -fno-debug-types-section -fvar-tracking-assignments -g2 -Wp,-D_FORTIFY_SOURCE=2 -fstack-protector-strong --param=ssp-buffer-size=4 -Werror=trampolines -fPIC -mtune=generic -march=x86-64 -gdwarf-4 -fno-debug-types-section -fvar-tracking-assignments -g2  -MT common_startup.o -MD -MP -MF $depbase.Tpo -c -o common_startup.o common_startup.cc &&\
mv -f $depbase.Tpo $depbase.Po
make[3]: Leaving directory '/tmp/B.TRQXp7/BUILD/pdns-4.3.0/pdns'
make[3]: Entering directory '/tmp/B.TRQXp7/BUILD/pdns-4.3.0/pdns'
depbase=`echo responsestats-auth.o | sed 's|[^/]*$|.deps/&|;s|\.o$||'`;\
x86_64-pld-linux-gnux32-g++ -DHAVE_CONFIG_H -I. -I..  -I.. -I.. -pthread  -I../ext/json11 -I../ext/yahttp       -I/usr/include/lua5.3   -DHAVE_NAMESPACE_STD -DHAVE_CXX_STRING_HEADER -DDLLIMPORT="" -DSYSCONFDIR=\"/etc/pdns\" -DPKGLIBDIR=\"/usr/libx32/pdns\" -DLOCALSTATEDIR=\"/var/run\" -fPIE -DPIE -U_FORTIFY_SOURCE -D_FORTIFY_SOURCE=2 --param ssp-buffer-size=4 -fstack-protector -g -O2 -Wall -Wextra -Wshadow -Wno-unused-parameter -O2 -fwrapv -pipe -Wformat -Werror=format-security -gdwarf-4 -fno-debug-types-section -fvar-tracking-assignments -g2 -Wp,-D_FORTIFY_SOURCE=2 -fstack-protector-strong --param=ssp-buffer-size=4 -Werror=trampolines -fPIC -mtune=generic -march=x86-64 -gdwarf-4 -fno-debug-types-section -fvar-tracking-assignments -g2  -MT responsestats-auth.o -MD -MP -MF $depbase.Tpo -c -o responsestats-auth.o responsestats-auth.cc &&\
mv -f $depbase.Tpo $depbase.Po
make[3]: Leaving directory '/tmp/B.TRQXp7/BUILD/pdns-4.3.0/pdns'
make[3]: Entering directory '/tmp/B.TRQXp7/BUILD/pdns-4.3.0/pdns'
depbase=`echo secpoll.o | sed 's|[^/]*$|.deps/&|;s|\.o$||'`;\
x86_64-pld-linux-gnux32-g++ -DHAVE_CONFIG_H -I. -I..  -I.. -I.. -pthread  -I../ext/json11 -I../ext/yahttp       -I/usr/include/lua5.3   -DHAVE_NAMESPACE_STD -DHAVE_CXX_STRING_HEADER -DDLLIMPORT="" -DSYSCONFDIR=\"/etc/pdns\" -DPKGLIBDIR=\"/usr/libx32/pdns\" -DLOCALSTATEDIR=\"/var/run\" -fPIE -DPIE -U_FORTIFY_SOURCE -D_FORTIFY_SOURCE=2 --param ssp-buffer-size=4 -fstack-protector -g -O2 -Wall -Wextra -Wshadow -Wno-unused-parameter -O2 -fwrapv -pipe -Wformat -Werror=format-security -gdwarf-4 -fno-debug-types-section -fvar-tracking-assignments -g2 -Wp,-D_FORTIFY_SOURCE=2 -fstack-protector-strong --param=ssp-buffer-size=4 -Werror=trampolines -fPIC -mtune=generic -march=x86-64 -gdwarf-4 -fno-debug-types-section -fvar-tracking-assignments -g2  -MT secpoll.o -MD -MP -MF $depbase.Tpo -c -o secpoll.o secpoll.cc &&\
mv -f $depbase.Tpo $depbase.Po
make[3]: Leaving directory '/tmp/B.TRQXp7/BUILD/pdns-4.3.0/pdns'
make[3]: Entering directory '/tmp/B.TRQXp7/BUILD/pdns-4.3.0/pdns'
depbase=`echo responsestats.o | sed 's|[^/]*$|.deps/&|;s|\.o$||'`;\
x86_64-pld-linux-gnux32-g++ -DHAVE_CONFIG_H -I. -I..  -I.. -I.. -pthread  -I../ext/json11 -I../ext/yahttp       -I/usr/include/lua5.3   -DHAVE_NAMESPACE_STD -DHAVE_CXX_STRING_HEADER -DDLLIMPORT="" -DSYSCONFDIR=\"/etc/pdns\" -DPKGLIBDIR=\"/usr/libx32/pdns\" -DLOCALSTATEDIR=\"/var/run\" -fPIE -DPIE -U_FORTIFY_SOURCE -D_FORTIFY_SOURCE=2 --param ssp-buffer-size=4 -fstack-protector -g -O2 -Wall -Wextra -Wshadow -Wno-unused-parameter -O2 -fwrapv -pipe -Wformat -Werror=format-security -gdwarf-4 -fno-debug-types-section -fvar-tracking-assignments -g2 -Wp,-D_FORTIFY_SOURCE=2 -fstack-protector-strong --param=ssp-buffer-size=4 -Werror=trampolines -fPIC -mtune=generic -march=x86-64 -gdwarf-4 -fno-debug-types-section -fvar-tracking-assignments -g2  -MT responsestats.o -MD -MP -MF $depbase.Tpo -c -o responsestats.o responsestats.cc &&\
mv -f $depbase.Tpo $depbase.Po
make[3]: Leaving directory '/tmp/B.TRQXp7/BUILD/pdns-4.3.0/pdns'
make[3]: Entering directory '/tmp/B.TRQXp7/BUILD/pdns-4.3.0/pdns'
depbase=`echo receiver.o | sed 's|[^/]*$|.deps/&|;s|\.o$||'`;\
x86_64-pld-linux-gnux32-g++ -DHAVE_CONFIG_H -I. -I..  -I.. -I.. -pthread  -I../ext/json11 -I../ext/yahttp       -I/usr/include/lua5.3   -DHAVE_NAMESPACE_STD -DHAVE_CXX_STRING_HEADER -DDLLIMPORT="" -DSYSCONFDIR=\"/etc/pdns\" -DPKGLIBDIR=\"/usr/libx32/pdns\" -DLOCALSTATEDIR=\"/var/run\" -fPIE -DPIE -U_FORTIFY_SOURCE -D_FORTIFY_SOURCE=2 --param ssp-buffer-size=4 -fstack-protector -g -O2 -Wall -Wextra -Wshadow -Wno-unused-parameter -O2 -fwrapv -pipe -Wformat -Werror=format-security -gdwarf-4 -fno-debug-types-section -fvar-tracking-assignments -g2 -Wp,-D_FORTIFY_SOURCE=2 -fstack-protector-strong --param=ssp-buffer-size=4 -Werror=trampolines -fPIC -mtune=generic -march=x86-64 -gdwarf-4 -fno-debug-types-section -fvar-tracking-assignments -g2  -MT receiver.o -MD -MP -MF $depbase.Tpo -c -o receiver.o receiver.cc &&\
mv -f $depbase.Tpo $depbase.Po
make[3]: Leaving directory '/tmp/B.TRQXp7/BUILD/pdns-4.3.0/pdns'
make[3]: Entering directory '/tmp/B.TRQXp7/BUILD/pdns-4.3.0/pdns'
depbase=`echo secpoll-auth.o | sed 's|[^/]*$|.deps/&|;s|\.o$||'`;\
x86_64-pld-linux-gnux32-g++ -DHAVE_CONFIG_H -I. -I..  -I.. -I.. -pthread  -I../ext/json11 -I../ext/yahttp       -I/usr/include/lua5.3   -DHAVE_NAMESPACE_STD -DHAVE_CXX_STRING_HEADER -DDLLIMPORT="" -DSYSCONFDIR=\"/etc/pdns\" -DPKGLIBDIR=\"/usr/libx32/pdns\" -DLOCALSTATEDIR=\"/var/run\" -fPIE -DPIE -U_FORTIFY_SOURCE -D_FORTIFY_SOURCE=2 --param ssp-buffer-size=4 -fstack-protector -g -O2 -Wall -Wextra -Wshadow -Wno-unused-parameter -O2 -fwrapv -pipe -Wformat -Werror=format-security -gdwarf-4 -fno-debug-types-section -fvar-tracking-assignments -g2 -Wp,-D_FORTIFY_SOURCE=2 -fstack-protector-strong --param=ssp-buffer-size=4 -Werror=trampolines -fPIC -mtune=generic -march=x86-64 -gdwarf-4 -fno-debug-types-section -fvar-tracking-assignments -g2  -MT secpoll-auth.o -MD -MP -MF $depbase.Tpo -c -o secpoll-auth.o secpoll-auth.cc &&\
mv -f $depbase.Tpo $depbase.Po
make[3]: Leaving directory '/tmp/B.TRQXp7/BUILD/pdns-4.3.0/pdns'
make[3]: Entering directory '/tmp/B.TRQXp7/BUILD/pdns-4.3.0/pdns'
depbase=`echo packethandler.o | sed 's|[^/]*$|.deps/&|;s|\.o$||'`;\
x86_64-pld-linux-gnux32-g++ -DHAVE_CONFIG_H -I. -I..  -I.. -I.. -pthread  -I../ext/json11 -I../ext/yahttp       -I/usr/include/lua5.3   -DHAVE_NAMESPACE_STD -DHAVE_CXX_STRING_HEADER -DDLLIMPORT="" -DSYSCONFDIR=\"/etc/pdns\" -DPKGLIBDIR=\"/usr/libx32/pdns\" -DLOCALSTATEDIR=\"/var/run\" -fPIE -DPIE -U_FORTIFY_SOURCE -D_FORTIFY_SOURCE=2 --param ssp-buffer-size=4 -fstack-protector -g -O2 -Wall -Wextra -Wshadow -Wno-unused-parameter -O2 -fwrapv -pipe -Wformat -Werror=format-security -gdwarf-4 -fno-debug-types-section -fvar-tracking-assignments -g2 -Wp,-D_FORTIFY_SOURCE=2 -fstack-protector-strong --param=ssp-buffer-size=4 -Werror=trampolines -fPIC -mtune=generic -march=x86-64 -gdwarf-4 -fno-debug-types-section -fvar-tracking-assignments -g2  -MT packethandler.o -MD -MP -MF $depbase.Tpo -c -o packethandler.o packethandler.cc &&\
mv -f $depbase.Tpo $depbase.Po
make[3]: Leaving directory '/tmp/B.TRQXp7/BUILD/pdns-4.3.0/pdns'
make[3]: Entering directory '/tmp/B.TRQXp7/BUILD/pdns-4.3.0/pdns'
depbase=`echo unix_semaphore.o | sed 's|[^/]*$|.deps/&|;s|\.o$||'`;\
x86_64-pld-linux-gnux32-g++ -DHAVE_CONFIG_H -I. -I..  -I.. -I.. -pthread  -I../ext/json11 -I../ext/yahttp       -I/usr/include/lua5.3   -DHAVE_NAMESPACE_STD -DHAVE_CXX_STRING_HEADER -DDLLIMPORT="" -DSYSCONFDIR=\"/etc/pdns\" -DPKGLIBDIR=\"/usr/libx32/pdns\" -DLOCALSTATEDIR=\"/var/run\" -fPIE -DPIE -U_FORTIFY_SOURCE -D_FORTIFY_SOURCE=2 --param ssp-buffer-size=4 -fstack-protector -g -O2 -Wall -Wextra -Wshadow -Wno-unused-parameter -O2 -fwrapv -pipe -Wformat -Werror=format-security -gdwarf-4 -fno-debug-types-section -fvar-tracking-assignments -g2 -Wp,-D_FORTIFY_SOURCE=2 -fstack-protector-strong --param=ssp-buffer-size=4 -Werror=trampolines -fPIC -mtune=generic -march=x86-64 -gdwarf-4 -fno-debug-types-section -fvar-tracking-assignments -g2  -MT unix_semaphore.o -MD -MP -MF $depbase.Tpo -c -o unix_semaphore.o unix_semaphore.cc &&\
mv -f $depbase.Tpo $depbase.Po
make[3]: Leaving directory '/tmp/B.TRQXp7/BUILD/pdns-4.3.0/pdns'
make[3]: Entering directory '/tmp/B.TRQXp7/BUILD/pdns-4.3.0/pdns'
depbase=`echo version.o | sed 's|[^/]*$|.deps/&|;s|\.o$||'`;\
x86_64-pld-linux-gnux32-g++ -DHAVE_CONFIG_H -I. -I..  -I.. -I.. -pthread  -I../ext/json11 -I../ext/yahttp       -I/usr/include/lua5.3   -DHAVE_NAMESPACE_STD -DHAVE_CXX_STRING_HEADER -DDLLIMPORT="" -DSYSCONFDIR=\"/etc/pdns\" -DPKGLIBDIR=\"/usr/libx32/pdns\" -DLOCALSTATEDIR=\"/var/run\" -fPIE -DPIE -U_FORTIFY_SOURCE -D_FORTIFY_SOURCE=2 --param ssp-buffer-size=4 -fstack-protector -g -O2 -Wall -Wextra -Wshadow -Wno-unused-parameter -O2 -fwrapv -pipe -Wformat -Werror=format-security -gdwarf-4 -fno-debug-types-section -fvar-tracking-assignments -g2 -Wp,-D_FORTIFY_SOURCE=2 -fstack-protector-strong --param=ssp-buffer-size=4 -Werror=trampolines -fPIC -mtune=generic -march=x86-64 -gdwarf-4 -fno-debug-types-section -fvar-tracking-assignments -g2  -MT version.o -MD -MP -MF $depbase.Tpo -c -o version.o version.cc &&\
mv -f $depbase.Tpo $depbase.Po
make[3]: Leaving directory '/tmp/B.TRQXp7/BUILD/pdns-4.3.0/pdns'
make[3]: Entering directory '/tmp/B.TRQXp7/BUILD/pdns-4.3.0/pdns'
sed -e 's![@]sbindir[@]!/usr/sbin!' -e 's![@]service_user[@]!pdns!' -e 's![@]service_group[@]!pdns!' < pdns.service.in > pdns.service
make[3]: Leaving directory '/tmp/B.TRQXp7/BUILD/pdns-4.3.0/pdns'
make[3]: Entering directory '/tmp/B.TRQXp7/BUILD/pdns-4.3.0/pdns'
depbase=`echo webserver.o | sed 's|[^/]*$|.deps/&|;s|\.o$||'`;\
x86_64-pld-linux-gnux32-g++ -DHAVE_CONFIG_H -I. -I..  -I.. -I.. -pthread  -I../ext/json11 -I../ext/yahttp       -I/usr/include/lua5.3   -DHAVE_NAMESPACE_STD -DHAVE_CXX_STRING_HEADER -DDLLIMPORT="" -DSYSCONFDIR=\"/etc/pdns\" -DPKGLIBDIR=\"/usr/libx32/pdns\" -DLOCALSTATEDIR=\"/var/run\" -fPIE -DPIE -U_FORTIFY_SOURCE -D_FORTIFY_SOURCE=2 --param ssp-buffer-size=4 -fstack-protector -g -O2 -Wall -Wextra -Wshadow -Wno-unused-parameter -O2 -fwrapv -pipe -Wformat -Werror=format-security -gdwarf-4 -fno-debug-types-section -fvar-tracking-assignments -g2 -Wp,-D_FORTIFY_SOURCE=2 -fstack-protector-strong --param=ssp-buffer-size=4 -Werror=trampolines -fPIC -mtune=generic -march=x86-64 -gdwarf-4 -fno-debug-types-section -fvar-tracking-assignments -g2  -MT webserver.o -MD -MP -MF $depbase.Tpo -c -o webserver.o webserver.cc &&\
mv -f $depbase.Tpo $depbase.Po
webserver.cc: In member function 'void WebServer::registerBareHandler(const string&, WebServer::HandlerFunction)':
webserver.cc:110:74: error: '_1' was not declared in this scope
  110 |   YaHTTP::THandlerFunction f = boost::bind(&bareHandlerWrapper, handler, _1, _2);
      |                                                                          ^~
webserver.cc:110:74: note: suggested alternatives:
In file included from /usr/include/boost/mpl/aux_/include_preprocessed.hpp:37,
                 from /usr/include/boost/mpl/placeholders.hpp:43,
                 from /usr/include/boost/iterator/iterator_categories.hpp:16,
                 from /usr/include/boost/iterator/iterator_facade.hpp:13,
                 from /usr/include/boost/range/iterator_range_core.hpp:27,
                 from /usr/include/boost/range/iterator_range.hpp:13,
                 from /usr/include/boost/range/as_literal.hpp:22,
                 from /usr/include/boost/algorithm/string/trim.hpp:19,
                 from /usr/include/boost/algorithm/string.hpp:19,
                 from namespaces.hh:30,
                 from utility.hh:45,
                 from webserver.cc:25:
/usr/include/boost/mpl/aux_/preprocessed/gcc/placeholders.hpp:29:16: note:   'mpl_::_1'
   29 | typedef arg<1> _1;
      |                ^~
In file included from /usr/include/boost/smart_ptr/detail/shared_count.hpp:39,
                 from /usr/include/boost/smart_ptr/shared_ptr.hpp:28,
                 from /usr/include/boost/smart_ptr/shared_array.hpp:24,
                 from /usr/include/boost/shared_array.hpp:17,
                 from namespaces.hh:24,
                 from utility.hh:45,
                 from webserver.cc:25:
/usr/include/c++/10.2.0/functional:221:34: note:   'std::placeholders::_1'
  221 |     extern const _Placeholder<1> _1;
      |                                  ^~
In file included from /usr/include/boost/mpl/aux_/include_preprocessed.hpp:37,
                 from /usr/include/boost/mpl/placeholders.hpp:43,
                 from /usr/include/boost/iterator/iterator_categories.hpp:16,
                 from /usr/include/boost/iterator/iterator_facade.hpp:13,
                 from /usr/include/boost/range/iterator_range_core.hpp:27,
                 from /usr/include/boost/range/iterator_range.hpp:13,
                 from /usr/include/boost/range/as_literal.hpp:22,
                 from /usr/include/boost/algorithm/string/trim.hpp:19,
                 from /usr/include/boost/algorithm/string.hpp:19,
                 from namespaces.hh:30,
                 from utility.hh:45,
                 from webserver.cc:25:
/usr/include/boost/mpl/aux_/preprocessed/gcc/placeholders.hpp:29:16: note:   'mpl_::_1'
   29 | typedef arg<1> _1;
      |                ^~
In file included from /usr/include/boost/bind/bind.hpp:2356,
                 from /usr/include/boost/multi_index/detail/ord_index_impl.hpp:81,
                 from /usr/include/boost/multi_index/ordered_index.hpp:17,
                 from misc.hh:31,
                 from iputils.hh:32,
                 from sstuff.hh:26,
                 from webserver.hh:30,
                 from webserver.cc:26:
/usr/include/boost/bind/placeholders.hpp:46:38: note:   'boost::placeholders::_1'
   46 | BOOST_STATIC_CONSTEXPR boost::arg<1> _1;
      |                                      ^~
In file included from /usr/include/boost/mpl/aux_/include_preprocessed.hpp:37,
                 from /usr/include/boost/mpl/placeholders.hpp:43,
                 from /usr/include/boost/iterator/iterator_categories.hpp:16,
                 from /usr/include/boost/iterator/iterator_facade.hpp:13,
                 from /usr/include/boost/range/iterator_range_core.hpp:27,
                 from /usr/include/boost/range/iterator_range.hpp:13,
                 from /usr/include/boost/range/as_literal.hpp:22,
                 from /usr/include/boost/algorithm/string/trim.hpp:19,
                 from /usr/include/boost/algorithm/string.hpp:19,
                 from namespaces.hh:30,
                 from utility.hh:45,
                 from webserver.cc:25:
/usr/include/boost/mpl/aux_/preprocessed/gcc/placeholders.hpp:29:16: note:   'mpl_::_1'
   29 | typedef arg<1> _1;
      |                ^~
webserver.cc:110:78: error: '_2' was not declared in this scope
  110 |   YaHTTP::THandlerFunction f = boost::bind(&bareHandlerWrapper, handler, _1, _2);
      |                                                                              ^~
webserver.cc:110:78: note: suggested alternatives:
In file included from /usr/include/boost/mpl/aux_/include_preprocessed.hpp:37,
                 from /usr/include/boost/mpl/placeholders.hpp:43,
                 from /usr/include/boost/iterator/iterator_categories.hpp:16,
                 from /usr/include/boost/iterator/iterator_facade.hpp:13,
                 from /usr/include/boost/range/iterator_range_core.hpp:27,
                 from /usr/include/boost/range/iterator_range.hpp:13,
                 from /usr/include/boost/range/as_literal.hpp:22,
                 from /usr/include/boost/algorithm/string/trim.hpp:19,
                 from /usr/include/boost/algorithm/string.hpp:19,
                 from namespaces.hh:30,
                 from utility.hh:45,
                 from webserver.cc:25:
/usr/include/boost/mpl/aux_/preprocessed/gcc/placeholders.hpp:42:16: note:   'mpl_::_2'
   42 | typedef arg<2> _2;
      |                ^~
In file included from /usr/include/boost/smart_ptr/detail/shared_count.hpp:39,
                 from /usr/include/boost/smart_ptr/shared_ptr.hpp:28,
                 from /usr/include/boost/smart_ptr/shared_array.hpp:24,
                 from /usr/include/boost/shared_array.hpp:17,
                 from namespaces.hh:24,
                 from utility.hh:45,
                 from webserver.cc:25:
/usr/include/c++/10.2.0/functional:222:34: note:   'std::placeholders::_2'
  222 |     extern const _Placeholder<2> _2;
      |                                  ^~
In file included from /usr/include/boost/mpl/aux_/include_preprocessed.hpp:37,
                 from /usr/include/boost/mpl/placeholders.hpp:43,
                 from /usr/include/boost/iterator/iterator_categories.hpp:16,
                 from /usr/include/boost/iterator/iterator_facade.hpp:13,
                 from /usr/include/boost/range/iterator_range_core.hpp:27,
                 from /usr/include/boost/range/iterator_range.hpp:13,
                 from /usr/include/boost/range/as_literal.hpp:22,
                 from /usr/include/boost/algorithm/string/trim.hpp:19,
                 from /usr/include/boost/algorithm/string.hpp:19,
                 from namespaces.hh:30,
                 from utility.hh:45,
                 from webserver.cc:25:
/usr/include/boost/mpl/aux_/preprocessed/gcc/placeholders.hpp:42:16: note:   'mpl_::_2'
   42 | typedef arg<2> _2;
      |                ^~
In file included from /usr/include/boost/bind/bind.hpp:2356,
                 from /usr/include/boost/multi_index/detail/ord_index_impl.hpp:81,
                 from /usr/include/boost/multi_index/ordered_index.hpp:17,
                 from misc.hh:31,
                 from iputils.hh:32,
                 from sstuff.hh:26,
                 from webserver.hh:30,
                 from webserver.cc:26:
/usr/include/boost/bind/placeholders.hpp:47:38: note:   'boost::placeholders::_2'
   47 | BOOST_STATIC_CONSTEXPR boost::arg<2> _2;
      |                                      ^~
In file included from /usr/include/boost/mpl/aux_/include_preprocessed.hpp:37,
                 from /usr/include/boost/mpl/placeholders.hpp:43,
                 from /usr/include/boost/iterator/iterator_categories.hpp:16,
                 from /usr/include/boost/iterator/iterator_facade.hpp:13,
                 from /usr/include/boost/range/iterator_range_core.hpp:27,
                 from /usr/include/boost/range/iterator_range.hpp:13,
                 from /usr/include/boost/range/as_literal.hpp:22,
                 from /usr/include/boost/algorithm/string/trim.hpp:19,
                 from /usr/include/boost/algorithm/string.hpp:19,
                 from namespaces.hh:30,
                 from utility.hh:45,
                 from webserver.cc:25:
/usr/include/boost/mpl/aux_/preprocessed/gcc/placeholders.hpp:42:16: note:   'mpl_::_2'
   42 | typedef arg<2> _2;
      |                ^~
webserver.cc: In member function 'void WebServer::registerApiHandler(const string&, WebServer::HandlerFunction, bool)':
webserver.cc:182:74: error: '_1' was not declared in this scope
  182 |   HandlerFunction f = boost::bind(&WebServer::apiWrapper, this, handler, _1, _2, allowPassword);
      |                                                                          ^~
webserver.cc:182:74: note: suggested alternatives:
In file included from /usr/include/boost/mpl/aux_/include_preprocessed.hpp:37,
                 from /usr/include/boost/mpl/placeholders.hpp:43,
                 from /usr/include/boost/iterator/iterator_categories.hpp:16,
                 from /usr/include/boost/iterator/iterator_facade.hpp:13,
                 from /usr/include/boost/range/iterator_range_core.hpp:27,
                 from /usr/include/boost/range/iterator_range.hpp:13,
                 from /usr/include/boost/range/as_literal.hpp:22,
                 from /usr/include/boost/algorithm/string/trim.hpp:19,
                 from /usr/include/boost/algorithm/string.hpp:19,
                 from namespaces.hh:30,
                 from utility.hh:45,
                 from webserver.cc:25:
/usr/include/boost/mpl/aux_/preprocessed/gcc/placeholders.hpp:29:16: note:   'mpl_::_1'
   29 | typedef arg<1> _1;
      |                ^~
In file included from /usr/include/boost/smart_ptr/detail/shared_count.hpp:39,
                 from /usr/include/boost/smart_ptr/shared_ptr.hpp:28,
                 from /usr/include/boost/smart_ptr/shared_array.hpp:24,
                 from /usr/include/boost/shared_array.hpp:17,
                 from namespaces.hh:24,
                 from utility.hh:45,
                 from webserver.cc:25:
/usr/include/c++/10.2.0/functional:221:34: note:   'std::placeholders::_1'
  221 |     extern const _Placeholder<1> _1;
      |                                  ^~
In file included from /usr/include/boost/mpl/aux_/include_preprocessed.hpp:37,
                 from /usr/include/boost/mpl/placeholders.hpp:43,
                 from /usr/include/boost/iterator/iterator_categories.hpp:16,
                 from /usr/include/boost/iterator/iterator_facade.hpp:13,
                 from /usr/include/boost/range/iterator_range_core.hpp:27,
                 from /usr/include/boost/range/iterator_range.hpp:13,
                 from /usr/include/boost/range/as_literal.hpp:22,
                 from /usr/include/boost/algorithm/string/trim.hpp:19,
                 from /usr/include/boost/algorithm/string.hpp:19,
                 from namespaces.hh:30,
                 from utility.hh:45,
                 from webserver.cc:25:
/usr/include/boost/mpl/aux_/preprocessed/gcc/placeholders.hpp:29:16: note:   'mpl_::_1'
   29 | typedef arg<1> _1;
      |                ^~
In file included from /usr/include/boost/bind/bind.hpp:2356,
                 from /usr/include/boost/multi_index/detail/ord_index_impl.hpp:81,
                 from /usr/include/boost/multi_index/ordered_index.hpp:17,
                 from misc.hh:31,
                 from iputils.hh:32,
                 from sstuff.hh:26,
                 from webserver.hh:30,
                 from webserver.cc:26:
/usr/include/boost/bind/placeholders.hpp:46:38: note:   'boost::placeholders::_1'
   46 | BOOST_STATIC_CONSTEXPR boost::arg<1> _1;
      |                                      ^~
In file included from /usr/include/boost/mpl/aux_/include_preprocessed.hpp:37,
                 from /usr/include/boost/mpl/placeholders.hpp:43,
                 from /usr/include/boost/iterator/iterator_categories.hpp:16,
                 from /usr/include/boost/iterator/iterator_facade.hpp:13,
                 from /usr/include/boost/range/iterator_range_core.hpp:27,
                 from /usr/include/boost/range/iterator_range.hpp:13,
                 from /usr/include/boost/range/as_literal.hpp:22,
                 from /usr/include/boost/algorithm/string/trim.hpp:19,
                 from /usr/include/boost/algorithm/string.hpp:19,
                 from namespaces.hh:30,
                 from utility.hh:45,
                 from webserver.cc:25:
/usr/include/boost/mpl/aux_/preprocessed/gcc/placeholders.hpp:29:16: note:   'mpl_::_1'
   29 | typedef arg<1> _1;
      |                ^~
webserver.cc:182:78: error: '_2' was not declared in this scope
  182 |   HandlerFunction f = boost::bind(&WebServer::apiWrapper, this, handler, _1, _2, allowPassword);
      |                                                                              ^~
webserver.cc:182:78: note: suggested alternatives:
In file included from /usr/include/boost/mpl/aux_/include_preprocessed.hpp:37,
                 from /usr/include/boost/mpl/placeholders.hpp:43,
                 from /usr/include/boost/iterator/iterator_categories.hpp:16,
                 from /usr/include/boost/iterator/iterator_facade.hpp:13,
                 from /usr/include/boost/range/iterator_range_core.hpp:27,
                 from /usr/include/boost/range/iterator_range.hpp:13,
                 from /usr/include/boost/range/as_literal.hpp:22,
                 from /usr/include/boost/algorithm/string/trim.hpp:19,
                 from /usr/include/boost/algorithm/string.hpp:19,
                 from namespaces.hh:30,
                 from utility.hh:45,
                 from webserver.cc:25:
/usr/include/boost/mpl/aux_/preprocessed/gcc/placeholders.hpp:42:16: note:   'mpl_::_2'
   42 | typedef arg<2> _2;
      |                ^~
In file included from /usr/include/boost/smart_ptr/detail/shared_count.hpp:39,
                 from /usr/include/boost/smart_ptr/shared_ptr.hpp:28,
                 from /usr/include/boost/smart_ptr/shared_array.hpp:24,
                 from /usr/include/boost/shared_array.hpp:17,
                 from namespaces.hh:24,
                 from utility.hh:45,
                 from webserver.cc:25:
/usr/include/c++/10.2.0/functional:222:34: note:   'std::placeholders::_2'
  222 |     extern const _Placeholder<2> _2;
      |                                  ^~
In file included from /usr/include/boost/mpl/aux_/include_preprocessed.hpp:37,
                 from /usr/include/boost/mpl/placeholders.hpp:43,
                 from /usr/include/boost/iterator/iterator_categories.hpp:16,
                 from /usr/include/boost/iterator/iterator_facade.hpp:13,
                 from /usr/include/boost/range/iterator_range_core.hpp:27,
                 from /usr/include/boost/range/iterator_range.hpp:13,
                 from /usr/include/boost/range/as_literal.hpp:22,
                 from /usr/include/boost/algorithm/string/trim.hpp:19,
                 from /usr/include/boost/algorithm/string.hpp:19,
                 from namespaces.hh:30,
                 from utility.hh:45,
                 from webserver.cc:25:
/usr/include/boost/mpl/aux_/preprocessed/gcc/placeholders.hpp:42:16: note:   'mpl_::_2'
   42 | typedef arg<2> _2;
      |                ^~
In file included from /usr/include/boost/bind/bind.hpp:2356,
                 from /usr/include/boost/multi_index/detail/ord_index_impl.hpp:81,
                 from /usr/include/boost/multi_index/ordered_index.hpp:17,
                 from misc.hh:31,
                 from iputils.hh:32,
                 from sstuff.hh:26,
                 from webserver.hh:30,
                 from webserver.cc:26:
/usr/include/boost/bind/placeholders.hpp:47:38: note:   'boost::placeholders::_2'
   47 | BOOST_STATIC_CONSTEXPR boost::arg<2> _2;
      |                                      ^~
In file included from /usr/include/boost/mpl/aux_/include_preprocessed.hpp:37,
                 from /usr/include/boost/mpl/placeholders.hpp:43,
                 from /usr/include/boost/iterator/iterator_categories.hpp:16,
                 from /usr/include/boost/iterator/iterator_facade.hpp:13,
                 from /usr/include/boost/range/iterator_range_core.hpp:27,
                 from /usr/include/boost/range/iterator_range.hpp:13,
                 from /usr/include/boost/range/as_literal.hpp:22,
                 from /usr/include/boost/algorithm/string/trim.hpp:19,
                 from /usr/include/boost/algorithm/string.hpp:19,
                 from namespaces.hh:30,
                 from utility.hh:45,
                 from webserver.cc:25:
/usr/include/boost/mpl/aux_/preprocessed/gcc/placeholders.hpp:42:16: note:   'mpl_::_2'
   42 | typedef arg<2> _2;
      |                ^~
webserver.cc: In member function 'void WebServer::registerWebHandler(const string&, WebServer::HandlerFunction)':
webserver.cc:199:74: error: '_1' was not declared in this scope
  199 |   HandlerFunction f = boost::bind(&WebServer::webWrapper, this, handler, _1, _2);
      |                                                                          ^~
webserver.cc:199:74: note: suggested alternatives:
In file included from /usr/include/boost/mpl/aux_/include_preprocessed.hpp:37,
                 from /usr/include/boost/mpl/placeholders.hpp:43,
                 from /usr/include/boost/iterator/iterator_categories.hpp:16,
                 from /usr/include/boost/iterator/iterator_facade.hpp:13,
                 from /usr/include/boost/range/iterator_range_core.hpp:27,
                 from /usr/include/boost/range/iterator_range.hpp:13,
                 from /usr/include/boost/range/as_literal.hpp:22,
                 from /usr/include/boost/algorithm/string/trim.hpp:19,
                 from /usr/include/boost/algorithm/string.hpp:19,
                 from namespaces.hh:30,
                 from utility.hh:45,
                 from webserver.cc:25:
/usr/include/boost/mpl/aux_/preprocessed/gcc/placeholders.hpp:29:16: note:   'mpl_::_1'
   29 | typedef arg<1> _1;
      |                ^~
In file included from /usr/include/boost/smart_ptr/detail/shared_count.hpp:39,
                 from /usr/include/boost/smart_ptr/shared_ptr.hpp:28,
                 from /usr/include/boost/smart_ptr/shared_array.hpp:24,
                 from /usr/include/boost/shared_array.hpp:17,
                 from namespaces.hh:24,
                 from utility.hh:45,
                 from webserver.cc:25:
/usr/include/c++/10.2.0/functional:221:34: note:   'std::placeholders::_1'
  221 |     extern const _Placeholder<1> _1;
      |                                  ^~
In file included from /usr/include/boost/mpl/aux_/include_preprocessed.hpp:37,
                 from /usr/include/boost/mpl/placeholders.hpp:43,
                 from /usr/include/boost/iterator/iterator_categories.hpp:16,
                 from /usr/include/boost/iterator/iterator_facade.hpp:13,
                 from /usr/include/boost/range/iterator_range_core.hpp:27,
                 from /usr/include/boost/range/iterator_range.hpp:13,
                 from /usr/include/boost/range/as_literal.hpp:22,
                 from /usr/include/boost/algorithm/string/trim.hpp:19,
                 from /usr/include/boost/algorithm/string.hpp:19,
                 from namespaces.hh:30,
                 from utility.hh:45,
                 from webserver.cc:25:
/usr/include/boost/mpl/aux_/preprocessed/gcc/placeholders.hpp:29:16: note:   'mpl_::_1'
   29 | typedef arg<1> _1;
      |                ^~
In file included from /usr/include/boost/bind/bind.hpp:2356,
                 from /usr/include/boost/multi_index/detail/ord_index_impl.hpp:81,
                 from /usr/include/boost/multi_index/ordered_index.hpp:17,
                 from misc.hh:31,
                 from iputils.hh:32,
                 from sstuff.hh:26,
                 from webserver.hh:30,
                 from webserver.cc:26:
/usr/include/boost/bind/placeholders.hpp:46:38: note:   'boost::placeholders::_1'
   46 | BOOST_STATIC_CONSTEXPR boost::arg<1> _1;
      |                                      ^~
In file included from /usr/include/boost/mpl/aux_/include_preprocessed.hpp:37,
                 from /usr/include/boost/mpl/placeholders.hpp:43,
                 from /usr/include/boost/iterator/iterator_categories.hpp:16,
                 from /usr/include/boost/iterator/iterator_facade.hpp:13,
                 from /usr/include/boost/range/iterator_range_core.hpp:27,
                 from /usr/include/boost/range/iterator_range.hpp:13,
                 from /usr/include/boost/range/as_literal.hpp:22,
                 from /usr/include/boost/algorithm/string/trim.hpp:19,
                 from /usr/include/boost/algorithm/string.hpp:19,
                 from namespaces.hh:30,
                 from utility.hh:45,
                 from webserver.cc:25:
/usr/include/boost/mpl/aux_/preprocessed/gcc/placeholders.hpp:29:16: note:   'mpl_::_1'
   29 | typedef arg<1> _1;
      |                ^~
webserver.cc:199:78: error: '_2' was not declared in this scope
  199 |   HandlerFunction f = boost::bind(&WebServer::webWrapper, this, handler, _1, _2);
      |                                                                              ^~
webserver.cc:199:78: note: suggested alternatives:
In file included from /usr/include/boost/mpl/aux_/include_preprocessed.hpp:37,
                 from /usr/include/boost/mpl/placeholders.hpp:43,
                 from /usr/include/boost/iterator/iterator_categories.hpp:16,
                 from /usr/include/boost/iterator/iterator_facade.hpp:13,
                 from /usr/include/boost/range/iterator_range_core.hpp:27,
                 from /usr/include/boost/range/iterator_range.hpp:13,
                 from /usr/include/boost/range/as_literal.hpp:22,
                 from /usr/include/boost/algorithm/string/trim.hpp:19,
                 from /usr/include/boost/algorithm/string.hpp:19,
                 from namespaces.hh:30,
                 from utility.hh:45,
                 from webserver.cc:25:
/usr/include/boost/mpl/aux_/preprocessed/gcc/placeholders.hpp:42:16: note:   'mpl_::_2'
   42 | typedef arg<2> _2;
      |                ^~
In file included from /usr/include/boost/smart_ptr/detail/shared_count.hpp:39,
                 from /usr/include/boost/smart_ptr/shared_ptr.hpp:28,
                 from /usr/include/boost/smart_ptr/shared_array.hpp:24,
                 from /usr/include/boost/shared_array.hpp:17,
                 from namespaces.hh:24,
                 from utility.hh:45,
                 from webserver.cc:25:
/usr/include/c++/10.2.0/functional:222:34: note:   'std::placeholders::_2'
  222 |     extern const _Placeholder<2> _2;
      |                                  ^~
In file included from /usr/include/boost/mpl/aux_/include_preprocessed.hpp:37,
                 from /usr/include/boost/mpl/placeholders.hpp:43,
                 from /usr/include/boost/iterator/iterator_categories.hpp:16,
                 from /usr/include/boost/iterator/iterator_facade.hpp:13,
                 from /usr/include/boost/range/iterator_range_core.hpp:27,
                 from /usr/include/boost/range/iterator_range.hpp:13,
                 from /usr/include/boost/range/as_literal.hpp:22,
                 from /usr/include/boost/algorithm/string/trim.hpp:19,
                 from /usr/include/boost/algorithm/string.hpp:19,
                 from namespaces.hh:30,
                 from utility.hh:45,
                 from webserver.cc:25:
/usr/include/boost/mpl/aux_/preprocessed/gcc/placeholders.hpp:42:16: note:   'mpl_::_2'
   42 | typedef arg<2> _2;
      |                ^~
In file included from /usr/include/boost/bind/bind.hpp:2356,
                 from /usr/include/boost/multi_index/detail/ord_index_impl.hpp:81,
                 from /usr/include/boost/multi_index/ordered_index.hpp:17,
                 from misc.hh:31,
                 from iputils.hh:32,
                 from sstuff.hh:26,
                 from webserver.hh:30,
                 from webserver.cc:26:
/usr/include/boost/bind/placeholders.hpp:47:38: note:   'boost::placeholders::_2'
   47 | BOOST_STATIC_CONSTEXPR boost::arg<2> _2;
      |                                      ^~
In file included from /usr/include/boost/mpl/aux_/include_preprocessed.hpp:37,
                 from /usr/include/boost/mpl/placeholders.hpp:43,
                 from /usr/include/boost/iterator/iterator_categories.hpp:16,
                 from /usr/include/boost/iterator/iterator_facade.hpp:13,
                 from /usr/include/boost/range/iterator_range_core.hpp:27,
                 from /usr/include/boost/range/iterator_range.hpp:13,
                 from /usr/include/boost/range/as_literal.hpp:22,
                 from /usr/include/boost/algorithm/string/trim.hpp:19,
                 from /usr/include/boost/algorithm/string.hpp:19,
                 from namespaces.hh:30,
                 from utility.hh:45,
                 from webserver.cc:25:
/usr/include/boost/mpl/aux_/preprocessed/gcc/placeholders.hpp:42:16: note:   'mpl_::_2'
   42 | typedef arg<2> _2;
      |                ^~
make[3]: *** [Makefile:3120: webserver.o] Error 1
make[3]: Leaving directory '/tmp/B.TRQXp7/BUILD/pdns-4.3.0/pdns'
make[3]: *** Waiting for unfinished jobs....
make[3]: Entering directory '/tmp/B.TRQXp7/BUILD/pdns-4.3.0/pdns'
depbase=`echo tkey.o | sed 's|[^/]*$|.deps/&|;s|\.o$||'`;\
x86_64-pld-linux-gnux32-g++ -DHAVE_CONFIG_H -I. -I..  -I.. -I.. -pthread  -I../ext/json11 -I../ext/yahttp       -I/usr/include/lua5.3   -DHAVE_NAMESPACE_STD -DHAVE_CXX_STRING_HEADER -DDLLIMPORT="" -DSYSCONFDIR=\"/etc/pdns\" -DPKGLIBDIR=\"/usr/libx32/pdns\" -DLOCALSTATEDIR=\"/var/run\" -fPIE -DPIE -U_FORTIFY_SOURCE -D_FORTIFY_SOURCE=2 --param ssp-buffer-size=4 -fstack-protector -g -O2 -Wall -Wextra -Wshadow -Wno-unused-parameter -O2 -fwrapv -pipe -Wformat -Werror=format-security -gdwarf-4 -fno-debug-types-section -fvar-tracking-assignments -g2 -Wp,-D_FORTIFY_SOURCE=2 -fstack-protector-strong --param=ssp-buffer-size=4 -Werror=trampolines -fPIC -mtune=generic -march=x86-64 -gdwarf-4 -fno-debug-types-section -fvar-tracking-assignments -g2  -MT tkey.o -MD -MP -MF $depbase.Tpo -c -o tkey.o tkey.cc &&\
mv -f $depbase.Tpo $depbase.Po
make[3]: Leaving directory '/tmp/B.TRQXp7/BUILD/pdns-4.3.0/pdns'
make[3]: Entering directory '/tmp/B.TRQXp7/BUILD/pdns-4.3.0/pdns'
/bin/sh ../libtool  --tag=CXX   --mode=link x86_64-pld-linux-gnux32-g++ -DSYSCONFDIR=\"/etc/pdns\" -DPKGLIBDIR=\"/usr/libx32/pdns\" -DLOCALSTATEDIR=\"/var/run\" -fPIE -DPIE -U_FORTIFY_SOURCE -D_FORTIFY_SOURCE=2 --param ssp-buffer-size=4 -fstack-protector -g -O2 -Wall -Wextra -Wshadow -Wno-unused-parameter -O2 -fwrapv -pipe -Wformat -Werror=format-security -gdwarf-4 -fno-debug-types-section -fvar-tracking-assignments -g2 -Wp,-D_FORTIFY_SOURCE=2 -fstack-protector-strong --param=ssp-buffer-size=4 -Werror=trampolines -fPIC -mtune=generic -march=x86-64 -gdwarf-4 -fno-debug-types-section -fvar-tracking-assignments -g2  -pie  -pthread -Wl,-z -Wl,relro -Wl,-z -Wl,now -Wl,--as-needed -Wl,--no-copy-dt-needed-entries -Wl,-z,relro -Wl,-z,combreloc  -o pdns_control arguments.o dynloader.o dynmessenger.o logger.o misc.o qtype.o statbag.o unix_utility.o dnsname.o dnslabeltext.o  
libtool: link: x86_64-pld-linux-gnux32-g++ -DSYSCONFDIR=\"/etc/pdns\" -DPKGLIBDIR=\"/usr/libx32/pdns\" -DLOCALSTATEDIR=\"/var/run\" -fPIE -DPIE -U_FORTIFY_SOURCE -D_FORTIFY_SOURCE=2 --param ssp-buffer-size=4 -fstack-protector -g -O2 -Wall -Wextra -Wshadow -Wno-unused-parameter -O2 -fwrapv -pipe -Wformat -Werror=format-security -gdwarf-4 -fno-debug-types-section -fvar-tracking-assignments -g2 -Wp,-D_FORTIFY_SOURCE=2 -fstack-protector-strong --param=ssp-buffer-size=4 -Werror=trampolines -fPIC -mtune=generic -march=x86-64 -gdwarf-4 -fno-debug-types-section -fvar-tracking-assignments -g2 -pie -pthread -Wl,-z -Wl,relro -Wl,-z -Wl,now -Wl,--as-needed -Wl,--no-copy-dt-needed-entries -Wl,-z -Wl,relro -Wl,-z -Wl,combreloc -o pdns_control arguments.o dynloader.o dynmessenger.o logger.o misc.o qtype.o statbag.o unix_utility.o dnsname.o dnslabeltext.o  -pthread
make[3]: Leaving directory '/tmp/B.TRQXp7/BUILD/pdns-4.3.0/pdns'
make[3]: Entering directory '/tmp/B.TRQXp7/BUILD/pdns-4.3.0/pdns'
depbase=`echo rfc2136handler.o | sed 's|[^/]*$|.deps/&|;s|\.o$||'`;\
x86_64-pld-linux-gnux32-g++ -DHAVE_CONFIG_H -I. -I..  -I.. -I.. -pthread  -I../ext/json11 -I../ext/yahttp       -I/usr/include/lua5.3   -DHAVE_NAMESPACE_STD -DHAVE_CXX_STRING_HEADER -DDLLIMPORT="" -DSYSCONFDIR=\"/etc/pdns\" -DPKGLIBDIR=\"/usr/libx32/pdns\" -DLOCALSTATEDIR=\"/var/run\" -fPIE -DPIE -U_FORTIFY_SOURCE -D_FORTIFY_SOURCE=2 --param ssp-buffer-size=4 -fstack-protector -g -O2 -Wall -Wextra -Wshadow -Wno-unused-parameter -O2 -fwrapv -pipe -Wformat -Werror=format-security -gdwarf-4 -fno-debug-types-section -fvar-tracking-assignments -g2 -Wp,-D_FORTIFY_SOURCE=2 -fstack-protector-strong --param=ssp-buffer-size=4 -Werror=trampolines -fPIC -mtune=generic -march=x86-64 -gdwarf-4 -fno-debug-types-section -fvar-tracking-assignments -g2  -MT rfc2136handler.o -MD -MP -MF $depbase.Tpo -c -o rfc2136handler.o rfc2136handler.cc &&\
mv -f $depbase.Tpo $depbase.Po
make[3]: Leaving directory '/tmp/B.TRQXp7/BUILD/pdns-4.3.0/pdns'
make[3]: Entering directory '/tmp/B.TRQXp7/BUILD/pdns-4.3.0/pdns'
depbase=`echo ws-auth.o | sed 's|[^/]*$|.deps/&|;s|\.o$||'`;\
x86_64-pld-linux-gnux32-g++ -DHAVE_CONFIG_H -I. -I..  -I.. -I.. -pthread  -I../ext/json11 -I../ext/yahttp       -I/usr/include/lua5.3   -DHAVE_NAMESPACE_STD -DHAVE_CXX_STRING_HEADER -DDLLIMPORT="" -DSYSCONFDIR=\"/etc/pdns\" -DPKGLIBDIR=\"/usr/libx32/pdns\" -DLOCALSTATEDIR=\"/var/run\" -fPIE -DPIE -U_FORTIFY_SOURCE -D_FORTIFY_SOURCE=2 --param ssp-buffer-size=4 -fstack-protector -g -O2 -Wall -Wextra -Wshadow -Wno-unused-parameter -O2 -fwrapv -pipe -Wformat -Werror=format-security -gdwarf-4 -fno-debug-types-section -fvar-tracking-assignments -g2 -Wp,-D_FORTIFY_SOURCE=2 -fstack-protector-strong --param=ssp-buffer-size=4 -Werror=trampolines -fPIC -mtune=generic -march=x86-64 -gdwarf-4 -fno-debug-types-section -fvar-tracking-assignments -g2  -MT ws-auth.o -MD -MP -MF $depbase.Tpo -c -o ws-auth.o ws-auth.cc &&\
mv -f $depbase.Tpo $depbase.Po
ws-auth.cc: In member function 'void AuthWebServer::webThread()':
ws-auth.cc:2331:93: error: '_1' was not declared in this scope
 2331 |       d_ws->registerWebHandler("/style.css", boost::bind(&AuthWebServer::cssfunction, this, _1, _2));
      |                                                                                             ^~
ws-auth.cc:2331:93: note: suggested alternatives:
In file included from /usr/include/boost/mpl/aux_/include_preprocessed.hpp:37,
                 from /usr/include/boost/mpl/placeholders.hpp:43,
                 from /usr/include/boost/iterator/iterator_categories.hpp:16,
                 from /usr/include/boost/iterator/iterator_facade.hpp:13,
                 from /usr/include/boost/range/iterator_range_core.hpp:27,
                 from /usr/include/boost/range/iterator_range.hpp:13,
                 from /usr/include/boost/range/as_literal.hpp:22,
                 from /usr/include/boost/algorithm/string/trim.hpp:19,
                 from /usr/include/boost/algorithm/string.hpp:19,
                 from namespaces.hh:30,
                 from utility.hh:45,
                 from ws-auth.cc:25:
/usr/include/boost/mpl/aux_/preprocessed/gcc/placeholders.hpp:29:16: note:   'mpl_::_1'
   29 | typedef arg<1> _1;
      |                ^~
In file included from /usr/include/boost/smart_ptr/detail/shared_count.hpp:39,
                 from /usr/include/boost/smart_ptr/shared_ptr.hpp:28,
                 from /usr/include/boost/smart_ptr/shared_array.hpp:24,
                 from /usr/include/boost/shared_array.hpp:17,
                 from namespaces.hh:24,
                 from utility.hh:45,
                 from ws-auth.cc:25:
/usr/include/c++/10.2.0/functional:221:34: note:   'std::placeholders::_1'
  221 |     extern const _Placeholder<1> _1;
      |                                  ^~
In file included from /usr/include/boost/mpl/aux_/include_preprocessed.hpp:37,
                 from /usr/include/boost/mpl/placeholders.hpp:43,
                 from /usr/include/boost/iterator/iterator_categories.hpp:16,
                 from /usr/include/boost/iterator/iterator_facade.hpp:13,
                 from /usr/include/boost/range/iterator_range_core.hpp:27,
                 from /usr/include/boost/range/iterator_range.hpp:13,
                 from /usr/include/boost/range/as_literal.hpp:22,
                 from /usr/include/boost/algorithm/string/trim.hpp:19,
                 from /usr/include/boost/algorithm/string.hpp:19,
                 from namespaces.hh:30,
                 from utility.hh:45,
                 from ws-auth.cc:25:
/usr/include/boost/mpl/aux_/preprocessed/gcc/placeholders.hpp:29:16: note:   'mpl_::_1'
   29 | typedef arg<1> _1;
      |                ^~
In file included from /usr/include/boost/bind/bind.hpp:2356,
                 from /usr/include/boost/multi_index/detail/ord_index_impl.hpp:81,
                 from /usr/include/boost/multi_index/ordered_index.hpp:17,
                 from misc.hh:31,
                 from iputils.hh:32,
                 from dynlistener.hh:30,
                 from ws-auth.cc:26:
/usr/include/boost/bind/placeholders.hpp:46:38: note:   'boost::placeholders::_1'
   46 | BOOST_STATIC_CONSTEXPR boost::arg<1> _1;
      |                                      ^~
In file included from /usr/include/boost/mpl/aux_/include_preprocessed.hpp:37,
                 from /usr/include/boost/mpl/placeholders.hpp:43,
                 from /usr/include/boost/iterator/iterator_categories.hpp:16,
                 from /usr/include/boost/iterator/iterator_facade.hpp:13,
                 from /usr/include/boost/range/iterator_range_core.hpp:27,
                 from /usr/include/boost/range/iterator_range.hpp:13,
                 from /usr/include/boost/range/as_literal.hpp:22,
                 from /usr/include/boost/algorithm/string/trim.hpp:19,
                 from /usr/include/boost/algorithm/string.hpp:19,
                 from namespaces.hh:30,
                 from utility.hh:45,
                 from ws-auth.cc:25:
/usr/include/boost/mpl/aux_/preprocessed/gcc/placeholders.hpp:29:16: note:   'mpl_::_1'
   29 | typedef arg<1> _1;
      |                ^~
ws-auth.cc:2331:97: error: '_2' was not declared in this scope
 2331 |       d_ws->registerWebHandler("/style.css", boost::bind(&AuthWebServer::cssfunction, this, _1, _2));
      |                                                                                                 ^~
ws-auth.cc:2331:97: note: suggested alternatives:
In file included from /usr/include/boost/mpl/aux_/include_preprocessed.hpp:37,
                 from /usr/include/boost/mpl/placeholders.hpp:43,
                 from /usr/include/boost/iterator/iterator_categories.hpp:16,
                 from /usr/include/boost/iterator/iterator_facade.hpp:13,
                 from /usr/include/boost/range/iterator_range_core.hpp:27,
                 from /usr/include/boost/range/iterator_range.hpp:13,
                 from /usr/include/boost/range/as_literal.hpp:22,
                 from /usr/include/boost/algorithm/string/trim.hpp:19,
                 from /usr/include/boost/algorithm/string.hpp:19,
                 from namespaces.hh:30,
                 from utility.hh:45,
                 from ws-auth.cc:25:
/usr/include/boost/mpl/aux_/preprocessed/gcc/placeholders.hpp:42:16: note:   'mpl_::_2'
   42 | typedef arg<2> _2;
      |                ^~
In file included from /usr/include/boost/smart_ptr/detail/shared_count.hpp:39,
                 from /usr/include/boost/smart_ptr/shared_ptr.hpp:28,
                 from /usr/include/boost/smart_ptr/shared_array.hpp:24,
                 from /usr/include/boost/shared_array.hpp:17,
                 from namespaces.hh:24,
                 from utility.hh:45,
                 from ws-auth.cc:25:
/usr/include/c++/10.2.0/functional:222:34: note:   'std::placeholders::_2'
  222 |     extern const _Placeholder<2> _2;
      |                                  ^~
In file included from /usr/include/boost/mpl/aux_/include_preprocessed.hpp:37,
                 from /usr/include/boost/mpl/placeholders.hpp:43,
                 from /usr/include/boost/iterator/iterator_categories.hpp:16,
                 from /usr/include/boost/iterator/iterator_facade.hpp:13,
                 from /usr/include/boost/range/iterator_range_core.hpp:27,
                 from /usr/include/boost/range/iterator_range.hpp:13,
                 from /usr/include/boost/range/as_literal.hpp:22,
                 from /usr/include/boost/algorithm/string/trim.hpp:19,
                 from /usr/include/boost/algorithm/string.hpp:19,
                 from namespaces.hh:30,
                 from utility.hh:45,
                 from ws-auth.cc:25:
/usr/include/boost/mpl/aux_/preprocessed/gcc/placeholders.hpp:42:16: note:   'mpl_::_2'
   42 | typedef arg<2> _2;
      |                ^~
In file included from /usr/include/boost/bind/bind.hpp:2356,
                 from /usr/include/boost/multi_index/detail/ord_index_impl.hpp:81,
                 from /usr/include/boost/multi_index/ordered_index.hpp:17,
                 from misc.hh:31,
                 from iputils.hh:32,
                 from dynlistener.hh:30,
                 from ws-auth.cc:26:
/usr/include/boost/bind/placeholders.hpp:47:38: note:   'boost::placeholders::_2'
   47 | BOOST_STATIC_CONSTEXPR boost::arg<2> _2;
      |                                      ^~
In file included from /usr/include/boost/mpl/aux_/include_preprocessed.hpp:37,
                 from /usr/include/boost/mpl/placeholders.hpp:43,
                 from /usr/include/boost/iterator/iterator_categories.hpp:16,
                 from /usr/include/boost/iterator/iterator_facade.hpp:13,
                 from /usr/include/boost/range/iterator_range_core.hpp:27,
                 from /usr/include/boost/range/iterator_range.hpp:13,
                 from /usr/include/boost/range/as_literal.hpp:22,
                 from /usr/include/boost/algorithm/string/trim.hpp:19,
                 from /usr/include/boost/algorithm/string.hpp:19,
                 from namespaces.hh:30,
                 from utility.hh:45,
                 from ws-auth.cc:25:
/usr/include/boost/mpl/aux_/preprocessed/gcc/placeholders.hpp:42:16: note:   'mpl_::_2'
   42 | typedef arg<2> _2;
      |                ^~
make[3]: *** [Makefile:3120: ws-auth.o] Error 1
make[3]: Leaving directory '/tmp/B.TRQXp7/BUILD/pdns-4.3.0/pdns'
make[3]: Entering directory '/tmp/B.TRQXp7/BUILD/pdns-4.3.0/pdns'
depbase=`echo ws-api.o | sed 's|[^/]*$|.deps/&|;s|\.o$||'`;\
x86_64-pld-linux-gnux32-g++ -DHAVE_CONFIG_H -I. -I..  -I.. -I.. -pthread  -I../ext/json11 -I../ext/yahttp       -I/usr/include/lua5.3   -DHAVE_NAMESPACE_STD -DHAVE_CXX_STRING_HEADER -DDLLIMPORT="" -DSYSCONFDIR=\"/etc/pdns\" -DPKGLIBDIR=\"/usr/libx32/pdns\" -DLOCALSTATEDIR=\"/var/run\" -fPIE -DPIE -U_FORTIFY_SOURCE -D_FORTIFY_SOURCE=2 --param ssp-buffer-size=4 -fstack-protector -g -O2 -Wall -Wextra -Wshadow -Wno-unused-parameter -O2 -fwrapv -pipe -Wformat -Werror=format-security -gdwarf-4 -fno-debug-types-section -fvar-tracking-assignments -g2 -Wp,-D_FORTIFY_SOURCE=2 -fstack-protector-strong --param=ssp-buffer-size=4 -Werror=trampolines -fPIC -mtune=generic -march=x86-64 -gdwarf-4 -fno-debug-types-section -fvar-tracking-assignments -g2  -MT ws-api.o -MD -MP -MF $depbase.Tpo -c -o ws-api.o ws-api.cc &&\
mv -f $depbase.Tpo $depbase.Po
make[3]: Leaving directory '/tmp/B.TRQXp7/BUILD/pdns-4.3.0/pdns'
make[3]: Entering directory '/tmp/B.TRQXp7/BUILD/pdns-4.3.0/pdns'
depbase=`echo tcpreceiver.o | sed 's|[^/]*$|.deps/&|;s|\.o$||'`;\
x86_64-pld-linux-gnux32-g++ -DHAVE_CONFIG_H -I. -I..  -I.. -I.. -pthread  -I../ext/json11 -I../ext/yahttp       -I/usr/include/lua5.3   -DHAVE_NAMESPACE_STD -DHAVE_CXX_STRING_HEADER -DDLLIMPORT="" -DSYSCONFDIR=\"/etc/pdns\" -DPKGLIBDIR=\"/usr/libx32/pdns\" -DLOCALSTATEDIR=\"/var/run\" -fPIE -DPIE -U_FORTIFY_SOURCE -D_FORTIFY_SOURCE=2 --param ssp-buffer-size=4 -fstack-protector -g -O2 -Wall -Wextra -Wshadow -Wno-unused-parameter -O2 -fwrapv -pipe -Wformat -Werror=format-security -gdwarf-4 -fno-debug-types-section -fvar-tracking-assignments -g2 -Wp,-D_FORTIFY_SOURCE=2 -fstack-protector-strong --param=ssp-buffer-size=4 -Werror=trampolines -fPIC -mtune=generic -march=x86-64 -gdwarf-4 -fno-debug-types-section -fvar-tracking-assignments -g2  -MT tcpreceiver.o -MD -MP -MF $depbase.Tpo -c -o tcpreceiver.o tcpreceiver.cc &&\
mv -f $depbase.Tpo $depbase.Po
make[3]: Leaving directory '/tmp/B.TRQXp7/BUILD/pdns-4.3.0/pdns'
make[3]: Entering directory '/tmp/B.TRQXp7/BUILD/pdns-4.3.0/pdns'
depbase=`echo slavecommunicator.o | sed 's|[^/]*$|.deps/&|;s|\.o$||'`;\
x86_64-pld-linux-gnux32-g++ -DHAVE_CONFIG_H -I. -I..  -I.. -I.. -pthread  -I../ext/json11 -I../ext/yahttp       -I/usr/include/lua5.3   -DHAVE_NAMESPACE_STD -DHAVE_CXX_STRING_HEADER -DDLLIMPORT="" -DSYSCONFDIR=\"/etc/pdns\" -DPKGLIBDIR=\"/usr/libx32/pdns\" -DLOCALSTATEDIR=\"/var/run\" -fPIE -DPIE -U_FORTIFY_SOURCE -D_FORTIFY_SOURCE=2 --param ssp-buffer-size=4 -fstack-protector -g -O2 -Wall -Wextra -Wshadow -Wno-unused-parameter -O2 -fwrapv -pipe -Wformat -Werror=format-security -gdwarf-4 -fno-debug-types-section -fvar-tracking-assignments -g2 -Wp,-D_FORTIFY_SOURCE=2 -fstack-protector-strong --param=ssp-buffer-size=4 -Werror=trampolines -fPIC -mtune=generic -march=x86-64 -gdwarf-4 -fno-debug-types-section -fvar-tracking-assignments -g2  -MT slavecommunicator.o -MD -MP -MF $depbase.Tpo -c -o slavecommunicator.o slavecommunicator.cc &&\
mv -f $depbase.Tpo $depbase.Po
make[3]: Leaving directory '/tmp/B.TRQXp7/BUILD/pdns-4.3.0/pdns'
make[3]: Entering directory '/tmp/B.TRQXp7/BUILD/pdns-4.3.0/pdns'
depbase=`echo lua-record.o | sed 's|[^/]*$|.deps/&|;s|\.o$||'`;\
x86_64-pld-linux-gnux32-g++ -DHAVE_CONFIG_H -I. -I..  -I.. -I.. -pthread  -I../ext/json11 -I../ext/yahttp       -I/usr/include/lua5.3   -DHAVE_NAMESPACE_STD -DHAVE_CXX_STRING_HEADER -DDLLIMPORT="" -DSYSCONFDIR=\"/etc/pdns\" -DPKGLIBDIR=\"/usr/libx32/pdns\" -DLOCALSTATEDIR=\"/var/run\" -fPIE -DPIE -U_FORTIFY_SOURCE -D_FORTIFY_SOURCE=2 --param ssp-buffer-size=4 -fstack-protector -g -O2 -Wall -Wextra -Wshadow -Wno-unused-parameter -O2 -fwrapv -pipe -Wformat -Werror=format-security -gdwarf-4 -fno-debug-types-section -fvar-tracking-assignments -g2 -Wp,-D_FORTIFY_SOURCE=2 -fstack-protector-strong --param=ssp-buffer-size=4 -Werror=trampolines -fPIC -mtune=generic -march=x86-64 -gdwarf-4 -fno-debug-types-section -fvar-tracking-assignments -g2  -MT lua-record.o -MD -MP -MF $depbase.Tpo -c -o lua-record.o lua-record.cc &&\
mv -f $depbase.Tpo $depbase.Po
make[3]: Leaving directory '/tmp/B.TRQXp7/BUILD/pdns-4.3.0/pdns'
make[2]: *** [Makefile:2631: all] Error 2
make[1]: *** [Makefile:568: all-recursive] Error 1
make: *** [Makefile:500: all] Error 2
error: Bad exit status from /tmp/B.TRQXp7/BUILD/tmp/rpm-tmp.38047 (%build)


RPM build errors:
    Bad exit status from /tmp/B.TRQXp7/BUILD/tmp/rpm-tmp.38047 (%build)
ended at: Tue Jul 28 19:50:25 2020, done in 0:03:50.873992
error: No files produced.
+ chmod -R u+rwX /tmp/B.TRQXp7/BUILD
+ rm -rf /tmp/B.TRQXp7/tmp /tmp/B.TRQXp7/BUILD
+ rm -rf /tmp/B.TRQXp7
Begin-PLD-Builder-Info
Build-Time: user:1051.59s sys:58.78s real:235.42s (faults io:27 non-io:12700525)

End-PLD-Builder-Info
[Back to list of logs] [View rpm -qa of builder]