FailedOk

th/SRPMS[OK]
th/x32[OK]
th/i686[OK]
th/x86_64[OK]

ac/SRPMS[OK]
ac/i386[OK]
ac/i586[OK]
ac/i686[OK]
ac/alpha[OK]
ac/amd64[OK]
ac/athlon[OK]
ac/ppc[OK]
ac/sparc[OK]
ac/sparc64[OK]

Advanced Search
main()
Powered by PLD Linux
(c) 2002-2020 PLD Team
$Revision: 1.37 $
Powered by Lunatic Corp.
Your IP: 34.234.207.100

percona-server 3C02B43A-2CF2-4F6F-A5D1-516A4B1D008F

Status:Failed
Source URL:https://buildlogs.pld-linux.org/pld/th/x32/FAIL/percona-server,3C02B43A-2CF2-4F6F-A5D1-516A4B1D008F.bz2
text/plain URL:View!
rpm -qa of builder:View!
Date:2020/10/13 10:53:05
Runtime:0:01:07.983169

Toc:

  • prep
  • Executing(%prep): /bin/sh -e /tmp/B.bSxPY4/BUILD/tmp/rpm-tmp.47719
  • build
  • Executing(%build): /bin/sh -e /tmp/B.bSxPY4/BUILD/tmp/rpm-tmp.1106
  • error 1
  • /tmp/B.bSxPY4/BUILD/percona-server-5.7.31-34/extra/coredumper/src/linux_syscall_support.h:1416: Error: incorrect register `%r15d' used with `q' suffix
  • error 2
  • /tmp/B.bSxPY4/BUILD/percona-server-5.7.31-34/extra/coredumper/src/linux_syscall_support.h:1418: Error: incorrect register `%esi' used with `q' suffix
  • error 3
  • /tmp/B.bSxPY4/BUILD/percona-server-5.7.31-34/extra/coredumper/src/linux_syscall_support.h:1421: Error: incorrect register `%esi' used with `q' suffix
  • error 4
  • /tmp/B.bSxPY4/BUILD/percona-server-5.7.31-34/extra/coredumper/src/linux_syscall_support.h:1422: Error: operand size mismatch for `movq'
  • error 5
  • /tmp/B.bSxPY4/BUILD/percona-server-5.7.31-34/extra/coredumper/src/linux_syscall_support.h:1423: Error: operand size mismatch for `movq'
  • error 6
  • /tmp/B.bSxPY4/BUILD/percona-server-5.7.31-34/extra/coredumper/src/linux_syscall_support.h:2040: Error: operand type mismatch for `movq'
  • error 7
  • /tmp/B.bSxPY4/BUILD/percona-server-5.7.31-34/extra/coredumper/src/linux_syscall_support.h:2040: Error: operand type mismatch for `movq'
  • error 8
  • /tmp/B.bSxPY4/BUILD/percona-server-5.7.31-34/extra/coredumper/src/linux_syscall_support.h:2040: Error: operand type mismatch for `movq'
  • error 9
  • /tmp/B.bSxPY4/BUILD/percona-server-5.7.31-34/extra/coredumper/src/linux_syscall_support.h:2067: Error: operand type mismatch for `movq'
  • error 10
  • make[2]: *** [extra/coredumper/src/CMakeFiles/coredumper.dir/build.make:112: extra/coredumper/src/CMakeFiles/coredumper.dir/elfcore.cc.o] Error 1
  • error 11
  • make[1]: *** [CMakeFiles/Makefile2:2117: extra/coredumper/src/CMakeFiles/coredumper.dir/all] Error 2
  • error 12
  • error: Bad exit status from /tmp/B.bSxPY4/BUILD/tmp/rpm-tmp.1106 (%build)
  • error 13
  • RPM build errors:
  • error 14
  • error: No files produced.

Content:

request from: arekm
checking if we should skip the build
started at: Tue Oct 13 10:51:17 2020
killing old processes on a builder
sending signal 9 to pid -1
Killed
cleaning up /tmp
fetching https://srcbuilder.pld-linux.org/th//srpms/3C02B43A-2CF2-4F6F-A5D1-516A4B1D008F/percona-server-5.7.31-34.1.src.rpm
fetched 152038578 bytes, 5124.3 K/s
installing srpm: percona-server-5.7.31-34.1.src.rpm
+ install -d /tmp/B.bSxPY4/BUILD /tmp/B.bSxPY4/RPMS
+ LC_ALL=en_US.UTF-8
+ rpm -qp --changelog percona-server-5.7.31-34.1.src.rpm
* Tue Oct 13 2020 PLD Linux Team <feedback@pld-linux.org>
- For complete changelog see: http://git.pld-linux.org/?p=packages/percona-server.git;a=log;h=master
* Tue Oct 13 2020 Arkadiusz Miśkiewicz <arekm@maven.pl> 69bcefa
- up to 5.7.31-34 * Wed Sep 23 2020 Jakub Bogusz <qboosh@pld-linux.org> 6889794
- rel 3 (protobuf 3.13) * Mon Jun 01 2020 Jan Rękorajski <baggins@pld-linux.org> 1809aa1
- release 2 (by relup.sh) * Sun May 24 2020 Arkadiusz Miśkiewicz <arekm@maven.pl> 7fcdbb9
- up to 5.7.30-33; fix gcc 10 build * Wed Apr 08 2020 Jan Rękorajski <baggins@pld-linux.org> bdb4833
- release 2 (by relup.sh) * Mon Feb 17 2020 Arkadiusz Miśkiewicz <arekm@maven.pl> ff291e4
- up to 5.7.29.32 * Sat Feb 08 2020 Jan Rękorajski <baggins@pld-linux.org> f2c7916
- rebuild with libevent 2.1.11 - release 2 (by relup.sh) * Sat Jan 25 2020 Jan Rękorajski <baggins@pld-linux.org> 7ab9bfd
- drop obsolete and outdated manual inclusion of rpm macros * Mon Jan 13 2020 Arkadiusz Miśkiewicz <arekm@maven.pl> 349cd2e
- up to 5.7.28; also fshould ix ocassional SHOW SESSION VARIABLES hang (https://bugs.mysql.com/bug.php?id=92387) * Thu Oct 17 2019 Arkadiusz Miśkiewicz <arekm@maven.pl> 5318361
- release 2 (by relup.sh) + rpm -Uhv --nodeps --define '_topdir /tmp/B.bSxPY4' --define '_specdir %{_topdir}' --define '_sourcedir %{_specdir}' --define '_rpmdir %{_topdir}/RPMS' --define '_builddir %{_topdir}/BUILD' percona-server-5.7.31-34.1.src.rpm Preparing... ################################################## percona-server ################################################## + rm -f percona-server-5.7.31-34.1.src.rpm + install -m 700 -d /tmp/B.bSxPY4/BUILD/tmp + TMPDIR=/tmp/B.bSxPY4/BUILD/tmp + exec nice -n 0 rpmbuild -bp --short-circuit --nodeps --define '_topdir /tmp/B.bSxPY4' --define '_specdir %{_topdir}' --define '_sourcedir %{_specdir}' --define '_rpmdir %{_topdir}/RPMS' --define '_builddir %{_topdir}/BUILD' --target x32-pld-linux --define 'prep exit 0' /tmp/B.bSxPY4/percona-server.spec Building target platforms: x32-pld-linux checking BuildConflict-ing packages no BuildConflicts found checking BR rpm: Building target platforms: x32-pld-linux no BR needed building RPM using: set -ex; : build-id: 3C02B43A-2CF2-4F6F-A5D1-516A4B1D008F; TMPDIR=/tmp/B.bSxPY4/BUILD/tmp exec nice -n 0 rpmbuild -bb --define '_smp_mflags -j9' --define '_make_opts -Otarget' --define '_pld_builder 1' --define '_topdir /tmp/B.bSxPY4' --define '_specdir %{_topdir}' --define '_sourcedir %{_specdir}' --define '_rpmdir %{_topdir}/RPMS' --define '_builddir %{_topdir}/BUILD' --target x32-pld-linux /tmp/B.bSxPY4/percona-server.spec + : build-id: 3C02B43A-2CF2-4F6F-A5D1-516A4B1D008F + TMPDIR=/tmp/B.bSxPY4/BUILD/tmp + exec nice -n 0 rpmbuild -bb --define '_smp_mflags -j9' --define '_make_opts -Otarget' --define '_pld_builder 1' --define '_topdir /tmp/B.bSxPY4' --define '_specdir %{_topdir}' --define '_sourcedir %{_specdir}' --define '_rpmdir %{_topdir}/RPMS' --define '_builddir %{_topdir}/BUILD' --target x32-pld-linux /tmp/B.bSxPY4/percona-server.spec Building target platforms: x32-pld-linux Executing(%prep): /bin/sh -e /tmp/B.bSxPY4/BUILD/tmp/rpm-tmp.47719 + umask 022 + cd /tmp/B.bSxPY4/BUILD + cd /tmp/B.bSxPY4/BUILD + rm -rf percona-server-5.7.31-34 + /bin/gzip -dc /tmp/B.bSxPY4/percona-server-5.7.31-34.tar.gz + /bin/tar -xf - + STATUS=0 + '[' 0 -ne 0 ']' + cd percona-server-5.7.31-34 + /bin/gzip -dc /tmp/B.bSxPY4/sphinx-2.2.11-release.tar.gz + /bin/tar -xf - + STATUS=0 + '[' 0 -ne 0 ']' + /usr/bin/bzip2 -dc /tmp/B.bSxPY4/boost_1_59_0.tar.bz2 + /bin/tar -xf - + STATUS=0 + '[' 0 -ne 0 ']' + /bin/id -u + '[' 1000 '=' 0 ']' + /bin/id -u + '[' 1000 '=' 0 ']' + /bin/chmod -Rf a+rX,u+w,g-w,o-w . + echo 'Patch #0 (mysql-opt.patch):' Patch #0 (mysql-opt.patch): + '[' -f /tmp/B.bSxPY4/mysql-opt.patch ']' + /bin/cat /tmp/B.bSxPY4/mysql-opt.patch + /usr/bin/patch -s -p1 + /bin/mv sphinx-2.2.11-release/mysqlse storage/sphinx + echo 'Patch #17 (mysql-sphinx.patch):' Patch #17 (mysql-sphinx.patch): + '[' -f /tmp/B.bSxPY4/mysql-sphinx.patch ']' + /bin/cat /tmp/B.bSxPY4/mysql-sphinx.patch + /usr/bin/patch -s -p1 + cd storage/sphinx + echo 'Patch #18 (mysql-5.7-sphinx.patch):' Patch #18 (mysql-5.7-sphinx.patch): + '[' -f /tmp/B.bSxPY4/mysql-5.7-sphinx.patch ']' + /bin/cat /tmp/B.bSxPY4/mysql-5.7-sphinx.patch + /usr/bin/patch -s -p2 + cd ../.. + echo 'Patch #1 (mysql-versioning.patch):' Patch #1 (mysql-versioning.patch): + '[' -f /tmp/B.bSxPY4/mysql-versioning.patch ']' + /bin/cat /tmp/B.bSxPY4/mysql-versioning.patch + /usr/bin/patch -s -p1 + echo 'Patch #2 (mysql-protobuf.patch):' Patch #2 (mysql-protobuf.patch): + '[' -f /tmp/B.bSxPY4/mysql-protobuf.patch ']' + /bin/cat /tmp/B.bSxPY4/mysql-protobuf.patch + /usr/bin/patch -s -p1 + echo 'Patch #3 (build.patch):' Patch #3 (build.patch): + '[' -f /tmp/B.bSxPY4/build.patch ']' + /bin/cat /tmp/B.bSxPY4/build.patch + /usr/bin/patch -s -p1 + echo 'Patch #19 (mysql-chain-certs.patch):' Patch #19 (mysql-chain-certs.patch): + '[' -f /tmp/B.bSxPY4/mysql-chain-certs.patch ']' + /bin/cat /tmp/B.bSxPY4/mysql-chain-certs.patch + /usr/bin/patch -s -p1 + echo 'Patch #20 (mysql-dubious-exports.patch):' Patch #20 (mysql-dubious-exports.patch): + '[' -f /tmp/B.bSxPY4/mysql-dubious-exports.patch ']' + /bin/cat /tmp/B.bSxPY4/mysql-dubious-exports.patch + /usr/bin/patch -s -p1 + echo 'Patch #24 (mysql-cmake.patch):' Patch #24 (mysql-cmake.patch): + '[' -f /tmp/B.bSxPY4/mysql-cmake.patch ']' + /bin/cat /tmp/B.bSxPY4/mysql-cmake.patch + /usr/bin/patch -s -p1 + '[' -f sql/sql_yacc.cc ']' + /bin/rm '--interactive=never' sql/sql_yacc.cc + '[' -f sql/sql_yacc.h ']' + /bin/rm '--interactive=never' sql/sql_yacc.h + exit 0 Executing(%build): /bin/sh -e /tmp/B.bSxPY4/BUILD/tmp/rpm-tmp.1106 HOME=/home/users/builder PATH=/home/users/builder/GNUstep/Tools:/bin:/usr/bin:/usr/local/bin TMPDIR=/tmp/B.bSxPY4/BUILD/tmp + umask 022 + cd /tmp/B.bSxPY4/BUILD + cd percona-server-5.7.31-34 + install -d build + cd build + FALLTHROUGH_OPT='' + CPPFLAGS='' + pwd + ls -1d ../boost_1_59_0 + CC=x86_64-pld-linux-gnux32-gcc CXX=x86_64-pld-linux-gnux32-g++ CPPFLAGS='' /usr/bin/cmake -Wno-dev '-DCMAKE_VERBOSE_MAKEFILE=ON' '-DCMAKE_BUILD_TYPE=PLD' '-DCMAKE_INSTALL_BINDIR:PATH=/usr/bin' '-DCMAKE_INSTALL_SBINDIR:PATH=/usr/sbin' '-DCMAKE_INSTALL_LIBEXECDIR:PATH=/usr/sbin' '-DCMAKE_INSTALL_SYSCONFDIR:PATH=/etc' '-DCMAKE_INSTALL_SHAREDSTATEDIRPATH:PATH=/var/lib' '-DCMAKE_INSTALL_LOCALSTATEDIRPATH:PATH=/var/lib/mysql' '-DCMAKE_INSTALL_LIBDIR:PATH=/usr/libx32' '-DCMAKE_INSTALL_INCLUDEDIR:PATH=/usr/include' '-DCMAKE_INSTALL_OLDINCLUDEDIR:PATH=/usr/include' '-DCMAKE_INSTALL_DATAROOTDIR:PATH=/usr/share' '-DCMAKE_INSTALL_DATADIR:PATH=/usr/share' '-DCMAKE_INSTALL_INFODIR:PATH=/usr/share/info' '-DCMAKE_INSTALL_LOCALEDIR:PATH=/usr/share/locale' '-DCMAKE_INSTALL_MANDIR:PATH=/usr/share/man' '-DCMAKE_INSTALL_DOCDIR:PATH=/usr/share/doc' '-DCMAKE_INSTALL_PREFIX:PATH=/usr' '-DSYSCONF_INSTALL_DIR:PATH=/etc' '-DCMAKE_CXX_FLAGS_PLD=-O2 -fwrapv -pipe -Wformat -Werror=format-security -gdwarf-4 -fno-debug-types-section -fvar-tracking-assignments -g2 -Wp,-D_FORTIFY_SOURCE=2 -fstack-protector-strong --param=ssp-buffer-size=4 -Werror=trampolines -fPIC -mtune=generic -march=x86-64 -gdwarf-4 -fno-debug-types-section -fvar-tracking-assignments -g2 -DNDEBUG -DQT_NO_DEBUG' '-DCMAKE_C_FLAGS_PLD=-O2 -fwrapv -pipe -Wformat -Werror=format-security -gdwarf-4 -fno-debug-types-section -fvar-tracking-assignments -g2 -Wp,-D_FORTIFY_SOURCE=2 -fstack-protector-strong --param=ssp-buffer-size=4 -Werror=trampolines -fPIC -mtune=generic -march=x86-64 -gdwarf-4 -fno-debug-types-section -fvar-tracking-assignments -g2 -DNDEBUG -DQT_NO_DEBUG' '-DCMAKE_Fortran_FLAGS_PLD=-O2 -fwrapv -pipe -Wformat -Werror=format-security -gdwarf-4 -fno-debug-types-section -fvar-tracking-assignments -g2 -Wp,-D_FORTIFY_SOURCE=2 -fstack-protector-strong --param=ssp-buffer-size=4 -Werror=trampolines -fPIC -mtune=generic -march=x86-64 -gdwarf-4 -fno-debug-types-section -fvar-tracking-assignments -g2 -DNDEBUG -DQT_NO_DEBUG' '-DCMAKE_EXE_LINKER_FLAGS_PLD=-Wl,--as-needed -Wl,--no-copy-dt-needed-entries -Wl,-z,relro -Wl,-z,combreloc ' '-DCMAKE_SHARED_LINKER_FLAGS_PLD=-Wl,--as-needed -Wl,--no-copy-dt-needed-entries -Wl,-z,relro -Wl,-z,combreloc ' '-DCMAKE_MODULE_LINKER_FLAGS_PLD=-Wl,--as-needed -Wl,--no-copy-dt-needed-entries -Wl,-z,relro -Wl,-z,combreloc ' '-DLIB_SUFFIX=x32' '-DBUILD_SHARED_LIBS:BOOL=ON' .. '-DCMAKE_BUILD_TYPE=RelWithDebInfo' '-DCMAKE_C_FLAGS_DEBUG=-fno-omit-frame-pointer -fno-strict-aliasing ' '-DCMAKE_CXX_FLAGS_DEBUG=-fno-omit-frame-pointer -fno-strict-aliasing ' '-DCMAKE_C_FLAGS_RELWITHDEBINFO=-O2 -fwrapv -pipe -Wformat -Werror=format-security -gdwarf-4 -fno-debug-types-section -fvar-tracking-assignments -g2 -Wp,-D_FORTIFY_SOURCE=2 -fstack-protector-strong --param=ssp-buffer-size=4 -Werror=trampolines -fPIC -mtune=generic -march=x86-64 -gdwarf-4 -fno-debug-types-section -fvar-tracking-assignments -g2 -DNDEBUG -fno-omit-frame-pointer -fno-strict-aliasing -Wno-shadow' '-DCMAKE_CXX_FLAGS_RELWITHDEBINFO=-O2 -fwrapv -pipe -Wformat -Werror=format-security -gdwarf-4 -fno-debug-types-section -fvar-tracking-assignments -g2 -Wp,-D_FORTIFY_SOURCE=2 -fstack-protector-strong --param=ssp-buffer-size=4 -Werror=trampolines -fPIC -mtune=generic -march=x86-64 -gdwarf-4 -fno-debug-types-section -fvar-tracking-assignments -g2 -DNDEBUG -fno-omit-frame-pointer -fno-strict-aliasing -Wno-shadow' '-DCOMPILATION_COMMENT=PLD/Linux Distribution Percona Server RPM' '-DCURSES_INCLUDE_PATH=/usr/include/ncurses' '-DFEATURE_SET=community' '-DINSTALL_LAYOUT=RPM' '-DINSTALL_LIBDIR=libx32' '-DINSTALL_MYSQLTESTDIR_RPM=' '-DINSTALL_PLUGINDIR=libx32/percona-server/plugin' '-DINSTALL_SQLBENCHDIR=/usr/share' '-DINSTALL_SUPPORTFILESDIR=share/percona-server-support' '-DINSTALL_MYSQLSHAREDIR=share/percona-server' '-DINSTALL_SECURE_FILE_PRIVDIR=' '-DMYSQL_UNIX_ADDR=/var/lib/mysql/mysql.sock' '-DWITHOUT_EXAMPLE_STORAGE_ENGINE=1' '-DWITH_FAST_MUTEXES=ON' '-DWITH_LIBWRAP=ON' '-DWITH_PAM=ON' '-DWITH_PERFSCHEMA_STORAGE_ENGINE=1' '-DWITH_PIC=ON' '-DWITH_SCALABILITY_METRICS=ON' '-DWITH_SSL=system' '-DWITH_UNIT_TESTS=OFF' '-DWITHOUT_TOKUDB=ON' '-DWITHOUT_ROCKSDB=ON' '-DWITH_BOOST=/tmp/B.bSxPY4/BUILD/percona-server-5.7.31-34/build/../boost_1_59_0' '-DWITH_LIBEVENT=system' '-DWITH_LZ4=system' '-DWITH_MECAB=system' '-DWITH_PROTOBUF=system' '-DWITH_READLINE=system' '-DWITH_ZLIB=system' '-DTMPDIR=/var/tmp' -- Running cmake version 3.17.2 -- Could NOT find Git (missing: GIT_EXECUTABLE) -- Configuring with MAX_INDEXES = 64U -- The C compiler identification is GNU 10.2.0 -- The CXX compiler identification is GNU 10.2.0 -- Check for working C compiler: /usr/bin/x86_64-pld-linux-gnux32-gcc -- Check for working C compiler: /usr/bin/x86_64-pld-linux-gnux32-gcc - works -- Detecting C compiler ABI info -- Detecting C compiler ABI info - done -- Detecting C compile features -- Detecting C compile features - done -- Check for working CXX compiler: /usr/bin/x86_64-pld-linux-gnux32-g++ -- Check for working CXX compiler: /usr/bin/x86_64-pld-linux-gnux32-g++ - works -- Detecting CXX compiler ABI info -- Detecting CXX compiler ABI info - done -- Detecting CXX compile features -- Detecting CXX compile features - done -- CMAKE_GENERATOR: Unix Makefiles -- Looking for SHM_HUGETLB -- Looking for SHM_HUGETLB - found -- Looking for sys/types.h -- Looking for sys/types.h - found -- Looking for stdint.h -- Looking for stdint.h - found -- Looking for stddef.h -- Looking for stddef.h - found -- Check size of void * -- Check size of void * - done -- SIZEOF_VOIDP 4 -- Performing Test HAVE_C_SHIFT_OR_OPTIMIZATION_BUG -- Performing Test HAVE_C_SHIFT_OR_OPTIMIZATION_BUG - Failed -- Performing Test HAVE_CXX_SHIFT_OR_OPTIMIZATION_BUG -- Performing Test HAVE_CXX_SHIFT_OR_OPTIMIZATION_BUG - Failed -- Performing Test HAVE_C_FLOATING_POINT_FUSED_MADD -- Performing Test HAVE_C_FLOATING_POINT_FUSED_MADD - Failed -- Performing Test HAVE_CXX_FLOATING_POINT_FUSED_MADD -- Performing Test HAVE_CXX_FLOATING_POINT_FUSED_MADD - Failed -- Performing Test HAVE_C_FP_CONTRACT_FLAG -- Performing Test HAVE_C_FP_CONTRACT_FLAG - Success -- Performing Test HAVE_CXX_FP_CONTRACT_FLAG -- Performing Test HAVE_CXX_FP_CONTRACT_FLAG - Success -- Performing Test GNU11_SUPPORTED -- Performing Test GNU11_SUPPORTED - Success -- MySQL 5.7.31-34 -- Packaging as: percona-server-5.7.31-34-Linux-i686 -- Local boost dir /tmp/B.bSxPY4/BUILD/percona-server-5.7.31-34/boost_1_59_0 -- Found /tmp/B.bSxPY4/BUILD/percona-server-5.7.31-34/boost_1_59_0/boost/version.hpp -- BOOST_VERSION_NUMBER is #define BOOST_VERSION 105900 -- BOOST_INCLUDE_DIR /tmp/B.bSxPY4/BUILD/percona-server-5.7.31-34/boost_1_59_0 -- Performing Test HAVE_LLVM_LIBCPP -- Performing Test HAVE_LLVM_LIBCPP - Failed -- Looking for pthread.h -- Looking for pthread.h - found -- Performing Test CMAKE_HAVE_LIBC_PTHREAD -- Performing Test CMAKE_HAVE_LIBC_PTHREAD - Failed -- Looking for pthread_create in pthreads -- Looking for pthread_create in pthreads - not found -- Looking for pthread_create in pthread -- Looking for pthread_create in pthread - found -- Found Threads: TRUE -- Looking for floor -- Looking for floor - not found -- Looking for floor in m -- Looking for floor in m - found -- Looking for gethostbyname_r -- Looking for gethostbyname_r - found -- Looking for bind -- Looking for bind - found -- Looking for crypt -- Looking for crypt - not found -- Looking for crypt in crypt -- Looking for crypt in crypt - found -- Looking for setsockopt -- Looking for setsockopt - found -- Looking for dlopen -- Looking for dlopen - not found -- Looking for dlopen in dl -- Looking for dlopen in dl - found -- Looking for sched_yield -- Looking for sched_yield - found -- Looking for clock_gettime -- Looking for clock_gettime - found -- Looking for timer_create -- Looking for timer_create - not found -- Looking for timer_create in rt -- Looking for timer_create in rt - found -- Looking for atomic_thread_fence -- Looking for atomic_thread_fence - not found -- Looking for atomic_thread_fence in atomic -- Looking for atomic_thread_fence in atomic - found -- Looking for backtrace -- Looking for backtrace - found -- Performing Test HAVE_LIBWRAP -- Performing Test HAVE_LIBWRAP - Success -- Performing Test HAVE_LIBWRAP_PROTOTYPES -- Performing Test HAVE_LIBWRAP_PROTOTYPES - Success -- Looking for include file alloca.h -- Looking for include file alloca.h - found -- Looking for include file arpa/inet.h -- Looking for include file arpa/inet.h - found -- Looking for include file crypt.h -- Looking for include file crypt.h - found -- Looking for include file dlfcn.h -- Looking for include file dlfcn.h - found -- Looking for include file execinfo.h -- Looking for include file execinfo.h - found -- Looking for include file fpu_control.h -- Looking for include file fpu_control.h - found -- Looking for include file grp.h -- Looking for include file grp.h - found -- Looking for include file ieeefp.h -- Looking for include file ieeefp.h - not found -- Looking for include file langinfo.h -- Looking for include file langinfo.h - found -- Looking for include file malloc.h -- Looking for include file malloc.h - found -- Looking for include file netinet/in.h -- Looking for include file netinet/in.h - found -- Looking for include file poll.h -- Looking for include file poll.h - found -- Looking for include file pwd.h -- Looking for include file pwd.h - found -- Looking for include file strings.h -- Looking for include file strings.h - found -- Looking for include file sys/ioctl.h -- Looking for include file sys/ioctl.h - found -- Looking for include file sys/mman.h -- Looking for include file sys/mman.h - found -- Looking for include file sys/resource.h -- Looking for include file sys/resource.h - found -- Looking for include file sys/select.h -- Looking for include file sys/select.h - found -- Looking for include file sys/socket.h -- Looking for include file sys/socket.h - found -- Looking for include files curses.h, term.h -- Looking for include files curses.h, term.h - found -- Looking for include file termios.h -- Looking for include file termios.h - found -- Looking for include file termio.h -- Looking for include file termio.h - found -- Looking for include file unistd.h -- Looking for include file unistd.h - found -- Looking for include file sys/wait.h -- Looking for include file sys/wait.h - found -- Looking for include file sys/param.h -- Looking for include file sys/param.h - found -- Looking for include file fnmatch.h -- Looking for include file fnmatch.h - found -- Looking for include file sys/un.h -- Looking for include file sys/un.h - found -- Looking for include file sys/devpoll.h -- Looking for include file sys/devpoll.h - not found -- Looking for include file sys/epoll.h -- Looking for include file sys/epoll.h - found -- Looking for TAILQ_FOREACH -- Looking for TAILQ_FOREACH - found -- Looking for _aligned_malloc -- Looking for _aligned_malloc - not found -- Looking for backtrace -- Looking for backtrace - found -- Looking for printstack -- Looking for printstack - not found -- Looking for index -- Looking for index - found -- Looking for clock_gettime -- Looking for clock_gettime - found -- Looking for cuserid -- Looking for cuserid - found -- Looking for directio -- Looking for directio - not found -- Looking for ftruncate -- Looking for ftruncate - found -- Looking for compress -- Looking for compress - not found -- Looking for crypt -- Looking for crypt - found -- Looking for dlopen -- Looking for dlopen - found -- Looking for fchmod -- Looking for fchmod - found -- Looking for fcntl -- Looking for fcntl - found -- Looking for fdatasync -- Looking for fdatasync - found -- Looking for fdatasync -- Looking for fdatasync - found -- Looking for fedisableexcept -- Looking for fedisableexcept - found -- Looking for fseeko -- Looking for fseeko - found -- Looking for fsync -- Looking for fsync - found -- Looking for gethostbyaddr_r -- Looking for gethostbyaddr_r - found -- Looking for gethrtime -- Looking for gethrtime - not found -- Looking for getnameinfo -- Looking for getnameinfo - found -- Looking for getpass -- Looking for getpass - found -- Looking for getpassphrase -- Looking for getpassphrase - not found -- Looking for getpwnam -- Looking for getpwnam - found -- Looking for getpwuid -- Looking for getpwuid - found -- Looking for getrlimit -- Looking for getrlimit - found -- Looking for getrusage -- Looking for getrusage - found -- Looking for initgroups -- Looking for initgroups - found -- Looking for issetugid -- Looking for issetugid - not found -- Looking for getuid -- Looking for getuid - found -- Looking for geteuid -- Looking for geteuid - found -- Looking for getgid -- Looking for getgid - found -- Looking for getegid -- Looking for getegid - found -- Looking for lstat -- Looking for lstat - found -- Looking for madvise -- Looking for madvise - found -- Looking for malloc_info -- Looking for malloc_info - found -- Looking for memrchr -- Looking for memrchr - found -- Looking for mlock -- Looking for mlock - found -- Looking for mlockall -- Looking for mlockall - found -- Looking for mmap64 -- Looking for mmap64 - found -- Looking for poll -- Looking for poll - found -- Looking for posix_fallocate -- Looking for posix_fallocate - found -- Looking for posix_memalign -- Looking for posix_memalign - found -- Looking for pread -- Looking for pread - found -- Looking for pthread_condattr_setclock -- Looking for pthread_condattr_setclock - found -- Looking for pthread_sigmask -- Looking for pthread_sigmask - found -- Looking for readlink -- Looking for readlink - found -- Looking for realpath -- Looking for realpath - found -- Looking for setfd -- Looking for setfd - not found -- Looking for sigaction -- Looking for sigaction - found -- Looking for sleep -- Looking for sleep - found -- Looking for stpcpy -- Looking for stpcpy - found -- Looking for stpncpy -- Looking for stpncpy - found -- Looking for strlcpy -- Looking for strlcpy - not found -- Looking for strndup -- Looking for strndup - found -- Looking for strnlen -- Looking for strnlen - found -- Looking for strlcat -- Looking for strlcat - not found -- Looking for strsignal -- Looking for strsignal - found -- Looking for fgetln -- Looking for fgetln - not found -- Looking for strsep -- Looking for strsep - found -- Looking for tell -- Looking for tell - not found -- Looking for vasprintf -- Looking for vasprintf - found -- Looking for memalign -- Looking for memalign - found -- Looking for nl_langinfo -- Looking for nl_langinfo - found -- Looking for ntohll -- Looking for ntohll - not found -- Looking for memset_s -- Looking for memset_s - not found -- Looking for clock_gettime -- Looking for clock_gettime - found -- Looking for epoll_create -- Looking for epoll_create - found -- Looking for inet_ntop -- Looking for inet_ntop - found -- Looking for kqueue -- Looking for kqueue - not found -- Looking for timeradd -- Looking for timeradd - found -- Looking for timerclear -- Looking for timerclear - found -- Looking for timercmp -- Looking for timercmp - found -- Looking for timerisset -- Looking for timerisset - found -- Looking for include file sys/time.h -- Looking for include file sys/time.h - found -- Looking for include file sys/times.h -- Looking for include file sys/times.h - found -- Looking for times -- Looking for times - found -- Looking for gettimeofday -- Looking for gettimeofday - found -- Looking for lrand48 -- Looking for lrand48 - found -- Looking for TIOCGWINSZ -- Looking for TIOCGWINSZ - found -- Looking for FIONREAD -- Looking for FIONREAD - found -- Looking for FIONREAD -- Looking for FIONREAD - not found -- Looking for SIGEV_THREAD_ID -- Looking for SIGEV_THREAD_ID - found -- Looking for SIGEV_PORT -- Looking for SIGEV_PORT - not found -- Looking for log2 -- Looking for log2 - found -- Looking for isinf -- Looking for isinf - found -- Performing Test HAVE_CXX_ISINF -- Performing Test HAVE_CXX_ISINF - Success -- Looking for timer_create -- Looking for timer_create - found -- Looking for timer_settime -- Looking for timer_settime - found -- Looking for kqueue -- Looking for kqueue - not found -- Looking for EVFILT_TIMER -- Looking for EVFILT_TIMER - not found -- Check if the system is big endian -- Searching 16 bit integer -- Check size of unsigned short -- Check size of unsigned short - done -- Searching 16 bit integer - Using unsigned short -- Check if the system is big endian - little endian -- Check size of char * -- Check size of char * - done -- Check size of long -- Check size of long - done -- Check size of short -- Check size of short - done -- Check size of int -- Check size of int - done -- Check size of long long -- Check size of long long - done -- Check size of off_t -- Check size of off_t - done -- Check size of time_t -- Check size of time_t - done -- Check size of struct timespec -- Check size of struct timespec - done -- Check size of uint -- Check size of uint - done -- Check size of ulong -- Check size of ulong - done -- Check size of u_int32_t -- Check size of u_int32_t - done -- Performing Test HAVE_VISIBILITY_HIDDEN -- Performing Test HAVE_VISIBILITY_HIDDEN - Success -- Checking stack direction : -1 -- Looking for include files time.h, sys/time.h -- Looking for include files time.h, sys/time.h - found -- Looking for O_NONBLOCK -- Looking for O_NONBLOCK - found -- Performing Test HAVE_PAUSE_INSTRUCTION -- Performing Test HAVE_PAUSE_INSTRUCTION - Success -- Performing Test HAVE_BUILTIN_UNREACHABLE -- Performing Test HAVE_BUILTIN_UNREACHABLE - Success -- Performing Test HAVE_BUILTIN_EXPECT -- Performing Test HAVE_BUILTIN_EXPECT - Success -- Performing Test HAVE_BUILTIN_STPCPY -- Performing Test HAVE_BUILTIN_STPCPY - Success -- Performing Test HAVE_GCC_ATOMIC_BUILTINS -- Performing Test HAVE_GCC_ATOMIC_BUILTINS - Success -- Performing Test HAVE_GCC_SYNC_BUILTINS -- Performing Test HAVE_GCC_SYNC_BUILTINS - Success -- Looking for netinet/in6.h -- Looking for netinet/in6.h - not found -- Check size of struct sockaddr_in6 -- Check size of struct sockaddr_in6 - done -- Check size of struct in6_addr -- Check size of struct in6_addr - done -- Performing Test HAVE_SOCKADDR_STORAGE_SS_FAMILY -- Performing Test HAVE_SOCKADDR_STORAGE_SS_FAMILY - Success -- Performing Test HAVE_SOCKADDR_IN_SIN_LEN -- Performing Test HAVE_SOCKADDR_IN_SIN_LEN - Failed -- Performing Test HAVE_SOCKADDR_IN6_SIN6_LEN -- Performing Test HAVE_SOCKADDR_IN6_SIN6_LEN - Failed -- Performing Test HAVE_PTHREAD_THREADID_NP -- Performing Test HAVE_PTHREAD_THREADID_NP - Failed -- Performing Test HAVE_IMPLICIT_DEPENDENT_NAME_TYPING -- Performing Test HAVE_IMPLICIT_DEPENDENT_NAME_TYPING - Failed -- Looking for chown -- Looking for chown - found -- Looking for include file numa.h -- Looking for include file numa.h - found -- Looking for include file numaif.h -- Looking for include file numaif.h - found -- Performing Test HAVE_LIBNUMA -- Performing Test HAVE_LIBNUMA - Success -- Check size of socklen_t -- Check size of socklen_t - failed -- Looking for crc32 -- Looking for crc32 - found -- Looking for compressBound -- Looking for compressBound - found -- Looking for deflateBound -- Looking for deflateBound - found -- OPENSSL_INCLUDE_DIR = /usr/include -- OPENSSL_LIBRARY = /usr/libx32/libssl.so -- CRYPTO_LIBRARY = /usr/libx32/libcrypto.so -- OPENSSL_MAJOR_VERSION = 1 -- OPENSSL_MINOR_VERSION = 01 -- OPENSSL_FIX_VERSION = 01 -- Looking for SHA512_DIGEST_LENGTH -- Looking for SHA512_DIGEST_LENGTH - found -- SSL_LIBRARIES = /usr/libx32/libssl.so;/usr/libx32/libcrypto.so;dl -- Looking for X509_check_host -- Looking for X509_check_host - found -- Looking for X509_check_ip -- Looking for X509_check_ip - found -- Check size of mbstate_t -- Check size of mbstate_t - done -- Performing Test HAVE_LANGINFO_CODESET -- Performing Test HAVE_LANGINFO_CODESET - Success -- Looking for wcsdup -- Looking for wcsdup - found -- Check size of wchar_t -- Check size of wchar_t - done -- Check size of wint_t -- Check size of wint_t - done -- Found Curses: /usr/libx32/libcurses.so -- Looking for tputs in /usr/libx32/libcurses.so -- Looking for tputs in /usr/libx32/libcurses.so - found -- Looking for 3 include files stdio.h, ..., readline/history.h -- Looking for 3 include files stdio.h, ..., readline/history.h - found -- READLINE_INCLUDE_DIR /usr/include/readline -- READLINE_LIBRARY /usr/libx32/libreadline.so -- Performing Test READLINE_HAVE_HIST_ENTRY -- Performing Test READLINE_HAVE_HIST_ENTRY - Success -- Performing Test READLINE_USE_LIBEDIT_INTERFACE -- Performing Test READLINE_USE_LIBEDIT_INTERFACE - Success -- Performing Test READLINE_USE_NEW_READLINE_INTERFACE -- Performing Test READLINE_USE_NEW_READLINE_INTERFACE - Success -- LIBEVENT_VERSION_STRING 2.1.12-stable -- LIBEVENT_VERSION (system) 2.1.12 -- Found liblz4 version 1.9.2 -- LZ4_INCLUDE_DIR /usr/include -- LZ4_LIBRARY /usr/libx32/liblz4.so -- Looking for include files sys/types.h, sasl/sasl.h -- Looking for include files sys/types.h, sasl/sasl.h - found -- SASL_LIBRARY /usr/libx32/libsasl2.so -- LBER_LIBRARY /usr/libx32/liblber.so -- LDAP_LIBRARY /usr/libx32/libldap_r.so -- Looking for lber.h -- Looking for lber.h - found -- Looking for ldap.h -- Looking for ldap.h - found -- WITH_PROTOBUF=system -- Found Protobuf: /usr/libx32/libprotobuf.so;-lpthread (found version "3.13.0") -- protobuf version is 3.3 -- Found CURL: /usr/libx32/libcurl.so (found version "7.72.0") -- CURL_LIBRARY = /usr/libx32/libcurl.so -- Build with DWITH_COREDUMPER = ON -- Check if compiler accepts -pthread -- Check if compiler accepts -pthread - yes -- Performing Test FLAG_NO_STRICT_ALIASING -- Performing Test FLAG_NO_STRICT_ALIASING - Success -- Performing Test HAVE_SYS_THREAD_SELFID -- Performing Test HAVE_SYS_THREAD_SELFID - Failed -- Performing Test HAVE_SYS_GETTID -- Performing Test HAVE_SYS_GETTID - Success -- Performing Test HAVE_PTHREAD_SETNAME_NP -- Performing Test HAVE_PTHREAD_SETNAME_NP - Failed -- Performing Test HAVE_PTHREAD_GETTHREADID_NP -- Performing Test HAVE_PTHREAD_GETTHREADID_NP - Failed -- Performing Test HAVE_INTEGER_PTHREAD_SELF -- Performing Test HAVE_INTEGER_PTHREAD_SELF - Success -- Performing Test HAVE_STRINGOP_TRUNCATION -- Performing Test HAVE_STRINGOP_TRUNCATION - Success -- Creating LDAP authentication SASL client library. -- Library perconaserverclient depends on OSLIBS -lpthread;/usr/libx32/libz.so;m;rt;atomic;coredumper;/usr/libx32/libssl.so;/usr/libx32/libcrypto.so;dl -- MERGE_CONVENIENCE_LIBRARIES TARGET perconaserverclient -- MERGE_CONVENIENCE_LIBRARIES LIBS clientlib;dbug;strings;vio;mysys;mysys_ssl -- MERGE_CONVENIENCE_LIBRARIES MYLIBS clientlib;dbug;strings;vio;mysys;mysys_ssl -- Looking for include file endian.h -- Looking for include file endian.h - found -- Looking for le64toh -- Looking for le64toh - found -- Looking for le32toh -- Looking for le32toh - found -- Looking for le16toh -- Looking for le16toh - found -- Check size of long long -- Check size of long long - done -- Check size of long -- Check size of long - done -- Check size of int -- Check size of int - done -- Check if the system is big endian -- Searching 16 bit integer -- Searching 16 bit integer - Using unsigned short -- Check if the system is big endian - little endian -- Looking for include file libaio.h -- Looking for include file libaio.h - found -- Looking for io_queue_init in aio -- Looking for io_queue_init in aio - found -- Performing Test HAVE_NO_BUILTIN_MEMCMP -- Performing Test HAVE_NO_BUILTIN_MEMCMP - Success -- Looking for sched_getcpu -- Looking for sched_getcpu - found -- Looking for nanosleep -- Looking for nanosleep - found -- Performing Test HAVE_FALLOC_PUNCH_HOLE_AND_KEEP_SIZE -- Performing Test HAVE_FALLOC_PUNCH_HOLE_AND_KEEP_SIZE - Success -- Performing Test HAVE_IB_GCC_SYNC_SYNCHRONISE -- Performing Test HAVE_IB_GCC_SYNC_SYNCHRONISE - Success -- Performing Test HAVE_IB_GCC_ATOMIC_THREAD_FENCE -- Performing Test HAVE_IB_GCC_ATOMIC_THREAD_FENCE - Success -- Performing Test HAVE_IB_GCC_ATOMIC_COMPARE_EXCHANGE -- Performing Test HAVE_IB_GCC_ATOMIC_COMPARE_EXCHANGE - Success -- Performing Test HAVE_IB_ATOMIC_PTHREAD_T_GCC -- Performing Test HAVE_IB_ATOMIC_PTHREAD_T_GCC - Success -- Performing Test HAVE_IB_LINUX_FUTEX -- Performing Test HAVE_IB_LINUX_FUTEX - Success -- Looking for asprintf -- Looking for asprintf - found -- Performing Test HAVE_CAST_FUNCTION_TYPE -- Performing Test HAVE_CAST_FUNCTION_TYPE - Success -- Using cmake version 3.17.2 -- Performing Test HAVE_CLASS_MEMACCESS -- Performing Test HAVE_CLASS_MEMACCESS - Success -- Disabling -Wclass-memaccess warning for building NDB -- Performing Test HAVE_STRICT_ALIASING -- Performing Test HAVE_STRICT_ALIASING - Success -- Disabling -Wstrict-aliasing warning for building NDB -- Performing Test HAVE_UNUSED_BUT_SET_VARIABLE -- Performing Test HAVE_UNUSED_BUT_SET_VARIABLE - Success -- Disabling -Wunused-but-set-variable warning for building NDB -- Not building NDB -- Not building with MyRocks storage engine, you must specify -DWITH_ROCKSDB=1|ON|FORCE to cmake in order to build with MyRocks. -- Not building with TokuDB storage engine, you must specify -DWITH_TOKUDB=1|ON|FORCE to cmake in order to build with TokuDB. -- Performing Test HAVE_PEERCRED -- Performing Test HAVE_PEERCRED - Success -- MECAB_INCLUDE_DIR = /usr/include -- MECAB_LIBRARY = /usr/libx32/libmecab.so -- Performing Test HAVE_UNUSED_TYPEDEFS -- Performing Test HAVE_UNUSED_TYPEDEFS - Success -- Building keyring_vault plugin -- Looking for pam_authenticate in pam -- Looking for pam_authenticate in pam - found -- Looking for getpwnam_r -- Looking for getpwnam_r - found -- Looking for getgrgid_r -- Looking for getgrgid_r - found -- Looking for include file security/pam_misc.h -- Looking for include file security/pam_misc.h - found -- Looking for include file security/openpam.h -- Looking for include file security/openpam.h - not found -- Looking for O_DIRECT -- Looking for O_DIRECT - not found -- Looking for CLOCK_REALTIME -- Looking for CLOCK_REALTIME - found -- Not building tokudb-backup-plugin -- Looking for htole64 -- Looking for htole64 - found -- Looking for htole32 -- Looking for htole32 - found -- Looking for htole16 -- Looking for htole16 - found -- Found PkgConfig: /usr/bin/pkg-config (found version "0.29.2") -- Checking for module 'libtirpc' -- Found libtirpc, version 1.2.6 -- Performing Test HAVE_STRUCT_SOCKADDR_SA_LEN -- Performing Test HAVE_STRUCT_SOCKADDR_SA_LEN - Failed -- Performing Test HAVE_STRUCT_IFREQ_IFR_NAME -- Performing Test HAVE_STRUCT_IFREQ_IFR_NAME - Success -- Performing Test HAVE_XDR_OPS_X_PUTINT32 -- Performing Test HAVE_XDR_OPS_X_PUTINT32 - Failed -- Performing Test HAVE_XDR_OPS_X_GETINT32 -- Performing Test HAVE_XDR_OPS_X_GETINT32 - Failed -- Performing Test HAVE___CONST -- Performing Test HAVE___CONST - Success -- Performing Test HAVE_RPC_INLINE_T -- Performing Test HAVE_RPC_INLINE_T - Success -- Performing Test OLD_XDR -- Performing Test OLD_XDR - Failed -- Performing Test X_GETPOSTN_NOT_USE_CONST -- Performing Test X_GETPOSTN_NOT_USE_CONST - Success -- Performing Test HAS_INCOMPATIBLE_POINTER_TYPES -- Performing Test HAS_INCOMPATIBLE_POINTER_TYPES - Success -- Performing Test X_PUTLONG_NOT_USE_CONST -- Performing Test X_PUTLONG_NOT_USE_CONST - Failed -- RPC_INCLUDE_DIRS /usr/include/tirpc -- Using Boost headers from /tmp/B.bSxPY4/BUILD/percona-server-5.7.31-34/boost_1_59_0 -- Performing Test HAVE_NO_IGNORED_QUALIFIERS -- Performing Test HAVE_NO_IGNORED_QUALIFIERS - Success -- Performing Test CXX_HAVE_SIGN_COMPARE -- Performing Test CXX_HAVE_SIGN_COMPARE - Success -- Performing Test CXX_HAVE_UNUSED_VARIABLE -- Performing Test CXX_HAVE_UNUSED_VARIABLE - Success -- MYSQLX - Text log of protobuf messages enabled -- Performing Test HAVE_UNUSED_BUT_SET -- Performing Test HAVE_UNUSED_BUT_SET - Success -- Performing Test HAVE_UNUSED_PARAMETER -- Performing Test HAVE_UNUSED_PARAMETER - Success -- Performing Test HAVE_NO_UNUSED_TYPEDEFS -- Performing Test HAVE_NO_UNUSED_TYPEDEFS - Success -- Performing Test HAVE_MISLEADING_INDENTATION -- Performing Test HAVE_MISLEADING_INDENTATION - Success CMake Warning at sql/CMakeLists.txt:486 (MESSAGE): -std=gnu++11 support is required to build TokuDB/RocksDB native partitioning -- executable target mysqld debug_target /tmp/B.bSxPY4/BUILD/percona-server-5.7.31-34/debug/sql/mysqld -- Library mysqlserver depends on OSLIBS -lpthread;/usr/libx32/libz.so;m;rt;atomic;coredumper;/usr/libx32/libssl.so;/usr/libx32/libcrypto.so;dl;crypt;aio;/usr/libx32/liblz4.so;numa -- MERGE_CONVENIENCE_LIBRARIES TARGET mysqlserver -- MERGE_CONVENIENCE_LIBRARIES LIBS dbug;strings;regex;mysys;mysys_ssl;vio;/usr/libx32/libz.so;/usr/libx32/libssl.so;/usr/libx32/libcrypto.so;dl;crypt;archive_embedded;blackhole_embedded;csv_embedded;federated_embedded;heap_embedded;innobase;/usr/libx32/liblz4.so;numa;myisam_embedded;myisammrg_embedded;partition_embedded;ngram_parser;sql_embedded -- MERGE_CONVENIENCE_LIBRARIES MYLIBS dbug;strings;regex;mysys;mysys_ssl;vio;archive_embedded;blackhole_embedded;csv_embedded;federated_embedded;heap_embedded;innobase;myisam_embedded;myisammrg_embedded;partition_embedded;ngram_parser;sql_embedded -- library target mysqlserver debug_target /tmp/B.bSxPY4/BUILD/percona-server-5.7.31-34/debug/archive_output_directory/libmysqld.a -- INSTALL perconaserverclient.pc libx32/pkgconfig -- Skipping deb packaging on unsupported platform Th. -- CMAKE_BUILD_TYPE: RelWithDebInfo -- COMPILE_DEFINITIONS: _GNU_SOURCE;_FILE_OFFSET_BITS=64;BOOST_GEOMETRY_SQRT_CHECK_FINITENESS;__STDC_WANT_LIB_EXT1__=1;HAVE_CONFIG_H;LZ4_DISABLE_DEPRECATE_WARNINGS;HAVE_TLSv13 -- CMAKE_C_FLAGS: -fPIC -Wall -Wextra -Wformat-security -Wvla -Wwrite-strings -Wdeclaration-after-statement -- CMAKE_CXX_FLAGS: -fPIC -Wall -Wextra -Wformat-security -Wvla -Woverloaded-virtual -Wno-unused-parameter -- CMAKE_C_LINK_FLAGS: -- CMAKE_CXX_LINK_FLAGS: -- CMAKE_C_FLAGS_RELWITHDEBINFO: -O3 -D_FORTIFY_SOURCE=2 -O2 -fwrapv -pipe -Wformat -Werror=format-security -gdwarf-4 -fno-debug-types-section -fvar-tracking-assignments -g2 -Wp,-D_FORTIFY_SOURCE=2 -fstack-protector-strong --param=ssp-buffer-size=4 -Werror=trampolines -fPIC -mtune=generic -march=x86-64 -gdwarf-4 -fno-debug-types-section -fvar-tracking-assignments -g2 -DNDEBUG -fno-omit-frame-pointer -fno-strict-aliasing -Wno-shadow -g -fno-omit-frame-pointer -fno-strict-aliasing -DDBUG_OFF -DNDEBUG -- CMAKE_CXX_FLAGS_RELWITHDEBINFO: -O3 -D_FORTIFY_SOURCE=2 -g -fno-omit-frame-pointer -fno-strict-aliasing -DDBUG_OFF -DNDEBUG -Wno-class-memaccess -- Configuring done -- Generating done CMake Warning: Manually-specified variables were not used by the project: CMAKE_CXX_FLAGS_PLD CMAKE_C_FLAGS_PLD CMAKE_EXE_LINKER_FLAGS_PLD CMAKE_Fortran_FLAGS_PLD CMAKE_INSTALL_BINDIR CMAKE_INSTALL_DATADIR CMAKE_INSTALL_DATAROOTDIR CMAKE_INSTALL_DOCDIR CMAKE_INSTALL_INCLUDEDIR CMAKE_INSTALL_INFODIR CMAKE_INSTALL_LIBDIR CMAKE_INSTALL_LIBEXECDIR CMAKE_INSTALL_LOCALEDIR CMAKE_INSTALL_LOCALSTATEDIRPATH CMAKE_INSTALL_MANDIR CMAKE_INSTALL_OLDINCLUDEDIR CMAKE_INSTALL_SBINDIR CMAKE_INSTALL_SHAREDSTATEDIRPATH CMAKE_INSTALL_SYSCONFDIR CMAKE_MODULE_LINKER_FLAGS_PLD CMAKE_SHARED_LINKER_FLAGS_PLD INSTALL_SQLBENCHDIR LIB_SUFFIX SYSCONF_INSTALL_DIR WITH_FAST_MUTEXES -- Build files have been written to: /tmp/B.bSxPY4/BUILD/percona-server-5.7.31-34/build + /usr/bin/make -Otarget -j9 /usr/bin/cmake -S/tmp/B.bSxPY4/BUILD/percona-server-5.7.31-34 -B/tmp/B.bSxPY4/BUILD/percona-server-5.7.31-34/build --check-build-system CMakeFiles/Makefile.cmake 0 /usr/bin/cmake -E cmake_progress_start /tmp/B.bSxPY4/BUILD/percona-server-5.7.31-34/build/CMakeFiles /tmp/B.bSxPY4/BUILD/percona-server-5.7.31-34/build/CMakeFiles/progress.marks /usr/bin/make -f CMakeFiles/Makefile2 all /usr/bin/make -f CMakeFiles/abi_check.dir/build.make CMakeFiles/abi_check.dir/depend /usr/bin/make -f CMakeFiles/INFO_SRC.dir/build.make CMakeFiles/INFO_SRC.dir/depend /usr/bin/make -f CMakeFiles/INFO_BIN.dir/build.make CMakeFiles/INFO_BIN.dir/depend /usr/bin/make -f extra/coredumper/src/CMakeFiles/coredumper.dir/build.make extra/coredumper/src/CMakeFiles/coredumper.dir/depend /usr/bin/make -f strings/CMakeFiles/strings.dir/build.make strings/CMakeFiles/strings.dir/depend /usr/bin/make -f vio/CMakeFiles/vio.dir/build.make vio/CMakeFiles/vio.dir/depend /usr/bin/make -f regex/CMakeFiles/regex.dir/build.make regex/CMakeFiles/regex.dir/depend /usr/bin/make -f libbinlogstandalone/src/CMakeFiles/binlogstandalone_shared.dir/build.make libbinlogstandalone/src/CMakeFiles/binlogstandalone_shared.dir/depend /usr/bin/make -f libbinlogstandalone/src/CMakeFiles/binlogstandalone_static.dir/build.make libbinlogstandalone/src/CMakeFiles/binlogstandalone_static.dir/depend make[2]: Entering directory '/tmp/B.bSxPY4/BUILD/percona-server-5.7.31-34/build' cd /tmp/B.bSxPY4/BUILD/percona-server-5.7.31-34/build && /usr/bin/cmake -E cmake_depends "Unix Makefiles" /tmp/B.bSxPY4/BUILD/percona-server-5.7.31-34 /tmp/B.bSxPY4/BUILD/percona-server-5.7.31-34 /tmp/B.bSxPY4/BUILD/percona-server-5.7.31-34/build /tmp/B.bSxPY4/BUILD/percona-server-5.7.31-34/build /tmp/B.bSxPY4/BUILD/percona-server-5.7.31-34/build/CMakeFiles/INFO_BIN.dir/DependInfo.cmake --color= Scanning dependencies of target INFO_BIN make[2]: Leaving directory '/tmp/B.bSxPY4/BUILD/percona-server-5.7.31-34/build' make[2]: Entering directory '/tmp/B.bSxPY4/BUILD/percona-server-5.7.31-34/build' cd /tmp/B.bSxPY4/BUILD/percona-server-5.7.31-34/build && /usr/bin/cmake -E cmake_depends "Unix Makefiles" /tmp/B.bSxPY4/BUILD/percona-server-5.7.31-34 /tmp/B.bSxPY4/BUILD/percona-server-5.7.31-34 /tmp/B.bSxPY4/BUILD/percona-server-5.7.31-34/build /tmp/B.bSxPY4/BUILD/percona-server-5.7.31-34/build /tmp/B.bSxPY4/BUILD/percona-server-5.7.31-34/build/CMakeFiles/abi_check.dir/DependInfo.cmake --color= Scanning dependencies of target abi_check make[2]: Leaving directory '/tmp/B.bSxPY4/BUILD/percona-server-5.7.31-34/build' /usr/bin/make -f CMakeFiles/INFO_BIN.dir/build.make CMakeFiles/INFO_BIN.dir/build /usr/bin/make -f CMakeFiles/abi_check.dir/build.make CMakeFiles/abi_check.dir/build make[2]: Entering directory '/tmp/B.bSxPY4/BUILD/percona-server-5.7.31-34/build' cd /tmp/B.bSxPY4/BUILD/percona-server-5.7.31-34/build && /usr/bin/cmake -E cmake_depends "Unix Makefiles" /tmp/B.bSxPY4/BUILD/percona-server-5.7.31-34 /tmp/B.bSxPY4/BUILD/percona-server-5.7.31-34/extra/coredumper/src /tmp/B.bSxPY4/BUILD/percona-server-5.7.31-34/build /tmp/B.bSxPY4/BUILD/percona-server-5.7.31-34/build/extra/coredumper/src /tmp/B.bSxPY4/BUILD/percona-server-5.7.31-34/build/extra/coredumper/src/CMakeFiles/coredumper.dir/DependInfo.cmake --color= Scanning dependencies of target coredumper make[2]: Leaving directory '/tmp/B.bSxPY4/BUILD/percona-server-5.7.31-34/build' /usr/bin/make -f extra/coredumper/src/CMakeFiles/coredumper.dir/build.make extra/coredumper/src/CMakeFiles/coredumper.dir/build make[2]: Entering directory '/tmp/B.bSxPY4/BUILD/percona-server-5.7.31-34/build' cd /tmp/B.bSxPY4/BUILD/percona-server-5.7.31-34/build && /usr/bin/cmake -E cmake_depends "Unix Makefiles" /tmp/B.bSxPY4/BUILD/percona-server-5.7.31-34 /tmp/B.bSxPY4/BUILD/percona-server-5.7.31-34 /tmp/B.bSxPY4/BUILD/percona-server-5.7.31-34/build /tmp/B.bSxPY4/BUILD/percona-server-5.7.31-34/build /tmp/B.bSxPY4/BUILD/percona-server-5.7.31-34/build/CMakeFiles/INFO_SRC.dir/DependInfo.cmake --color= Scanning dependencies of target INFO_SRC make[2]: Leaving directory '/tmp/B.bSxPY4/BUILD/percona-server-5.7.31-34/build' /usr/bin/make -f CMakeFiles/INFO_SRC.dir/build.make CMakeFiles/INFO_SRC.dir/build make[2]: Entering directory '/tmp/B.bSxPY4/BUILD/percona-server-5.7.31-34/build' cd /tmp/B.bSxPY4/BUILD/percona-server-5.7.31-34/build && /usr/bin/cmake -E cmake_depends "Unix Makefiles" /tmp/B.bSxPY4/BUILD/percona-server-5.7.31-34 /tmp/B.bSxPY4/BUILD/percona-server-5.7.31-34/libbinlogstandalone/src /tmp/B.bSxPY4/BUILD/percona-server-5.7.31-34/build /tmp/B.bSxPY4/BUILD/percona-server-5.7.31-34/build/libbinlogstandalone/src /tmp/B.bSxPY4/BUILD/percona-server-5.7.31-34/build/libbinlogstandalone/src/CMakeFiles/binlogstandalone_static.dir/DependInfo.cmake --color= Scanning dependencies of target binlogstandalone_static make[2]: Leaving directory '/tmp/B.bSxPY4/BUILD/percona-server-5.7.31-34/build' /usr/bin/make -f libbinlogstandalone/src/CMakeFiles/binlogstandalone_static.dir/build.make libbinlogstandalone/src/CMakeFiles/binlogstandalone_static.dir/build make[2]: Entering directory '/tmp/B.bSxPY4/BUILD/percona-server-5.7.31-34/build' cd /tmp/B.bSxPY4/BUILD/percona-server-5.7.31-34/build && /usr/bin/cmake -E cmake_depends "Unix Makefiles" /tmp/B.bSxPY4/BUILD/percona-server-5.7.31-34 /tmp/B.bSxPY4/BUILD/percona-server-5.7.31-34/vio /tmp/B.bSxPY4/BUILD/percona-server-5.7.31-34/build /tmp/B.bSxPY4/BUILD/percona-server-5.7.31-34/build/vio /tmp/B.bSxPY4/BUILD/percona-server-5.7.31-34/build/vio/CMakeFiles/vio.dir/DependInfo.cmake --color= Scanning dependencies of target vio make[2]: Leaving directory '/tmp/B.bSxPY4/BUILD/percona-server-5.7.31-34/build' /usr/bin/make -f vio/CMakeFiles/vio.dir/build.make vio/CMakeFiles/vio.dir/build make[2]: Entering directory '/tmp/B.bSxPY4/BUILD/percona-server-5.7.31-34/build' cd /tmp/B.bSxPY4/BUILD/percona-server-5.7.31-34/build && /usr/bin/cmake -E cmake_depends "Unix Makefiles" /tmp/B.bSxPY4/BUILD/percona-server-5.7.31-34 /tmp/B.bSxPY4/BUILD/percona-server-5.7.31-34/libbinlogstandalone/src /tmp/B.bSxPY4/BUILD/percona-server-5.7.31-34/build /tmp/B.bSxPY4/BUILD/percona-server-5.7.31-34/build/libbinlogstandalone/src /tmp/B.bSxPY4/BUILD/percona-server-5.7.31-34/build/libbinlogstandalone/src/CMakeFiles/binlogstandalone_shared.dir/DependInfo.cmake --color= Scanning dependencies of target binlogstandalone_shared make[2]: Leaving directory '/tmp/B.bSxPY4/BUILD/percona-server-5.7.31-34/build' make[2]: Entering directory '/tmp/B.bSxPY4/BUILD/percona-server-5.7.31-34/build' cd /tmp/B.bSxPY4/BUILD/percona-server-5.7.31-34/build && /usr/bin/cmake -E cmake_depends "Unix Makefiles" /tmp/B.bSxPY4/BUILD/percona-server-5.7.31-34 /tmp/B.bSxPY4/BUILD/percona-server-5.7.31-34/regex /tmp/B.bSxPY4/BUILD/percona-server-5.7.31-34/build /tmp/B.bSxPY4/BUILD/percona-server-5.7.31-34/build/regex /tmp/B.bSxPY4/BUILD/percona-server-5.7.31-34/build/regex/CMakeFiles/regex.dir/DependInfo.cmake --color= Scanning dependencies of target regex make[2]: Leaving directory '/tmp/B.bSxPY4/BUILD/percona-server-5.7.31-34/build' /usr/bin/make -f libbinlogstandalone/src/CMakeFiles/binlogstandalone_shared.dir/build.make libbinlogstandalone/src/CMakeFiles/binlogstandalone_shared.dir/build /usr/bin/make -f regex/CMakeFiles/regex.dir/build.make regex/CMakeFiles/regex.dir/build make[2]: Entering directory '/tmp/B.bSxPY4/BUILD/percona-server-5.7.31-34/build' /usr/bin/cmake -P /tmp/B.bSxPY4/BUILD/percona-server-5.7.31-34/cmake/info_bin.cmake make[2]: Leaving directory '/tmp/B.bSxPY4/BUILD/percona-server-5.7.31-34/build' make[2]: Entering directory '/tmp/B.bSxPY4/BUILD/percona-server-5.7.31-34/build' /usr/bin/cmake -P /tmp/B.bSxPY4/BUILD/percona-server-5.7.31-34/cmake/info_src.cmake make[2]: Leaving directory '/tmp/B.bSxPY4/BUILD/percona-server-5.7.31-34/build' make[1]: Entering directory '/tmp/B.bSxPY4/BUILD/percona-server-5.7.31-34/build' [ 1%] Built target INFO_BIN make[1]: Leaving directory '/tmp/B.bSxPY4/BUILD/percona-server-5.7.31-34/build' /usr/bin/make -f libservices/CMakeFiles/mysqlservices.dir/build.make libservices/CMakeFiles/mysqlservices.dir/depend make[1]: Entering directory '/tmp/B.bSxPY4/BUILD/percona-server-5.7.31-34/build' [ 1%] Built target INFO_SRC make[1]: Leaving directory '/tmp/B.bSxPY4/BUILD/percona-server-5.7.31-34/build' /usr/bin/make -f rapid/plugin/x/CMakeFiles/GenLiteProtos.dir/build.make rapid/plugin/x/CMakeFiles/GenLiteProtos.dir/depend make[2]: Entering directory '/tmp/B.bSxPY4/BUILD/percona-server-5.7.31-34/build' cd /tmp/B.bSxPY4/BUILD/percona-server-5.7.31-34/build && /usr/bin/cmake -E cmake_depends "Unix Makefiles" /tmp/B.bSxPY4/BUILD/percona-server-5.7.31-34 /tmp/B.bSxPY4/BUILD/percona-server-5.7.31-34/libservices /tmp/B.bSxPY4/BUILD/percona-server-5.7.31-34/build /tmp/B.bSxPY4/BUILD/percona-server-5.7.31-34/build/libservices /tmp/B.bSxPY4/BUILD/percona-server-5.7.31-34/build/libservices/CMakeFiles/mysqlservices.dir/DependInfo.cmake --color= Scanning dependencies of target mysqlservices make[2]: Leaving directory '/tmp/B.bSxPY4/BUILD/percona-server-5.7.31-34/build' /usr/bin/make -f libservices/CMakeFiles/mysqlservices.dir/build.make libservices/CMakeFiles/mysqlservices.dir/build make[2]: Entering directory '/tmp/B.bSxPY4/BUILD/percona-server-5.7.31-34/build' cd /tmp/B.bSxPY4/BUILD/percona-server-5.7.31-34/build && /usr/bin/cmake -E cmake_depends "Unix Makefiles" /tmp/B.bSxPY4/BUILD/percona-server-5.7.31-34 /tmp/B.bSxPY4/BUILD/percona-server-5.7.31-34/rapid/plugin/x /tmp/B.bSxPY4/BUILD/percona-server-5.7.31-34/build /tmp/B.bSxPY4/BUILD/percona-server-5.7.31-34/build/rapid/plugin/x /tmp/B.bSxPY4/BUILD/percona-server-5.7.31-34/build/rapid/plugin/x/CMakeFiles/GenLiteProtos.dir/DependInfo.cmake --color= Scanning dependencies of target GenLiteProtos make[2]: Leaving directory '/tmp/B.bSxPY4/BUILD/percona-server-5.7.31-34/build' /usr/bin/make -f rapid/plugin/x/CMakeFiles/GenLiteProtos.dir/build.make rapid/plugin/x/CMakeFiles/GenLiteProtos.dir/build make[2]: Entering directory '/tmp/B.bSxPY4/BUILD/percona-server-5.7.31-34/build' [ 1%] Building C object libservices/CMakeFiles/mysqlservices.dir/service_command.c.o cd /tmp/B.bSxPY4/BUILD/percona-server-5.7.31-34/build/libservices && /usr/bin/x86_64-pld-linux-gnux32-gcc -DBOOST_GEOMETRY_SQRT_CHECK_FINITENESS -DHAVE_CONFIG_H -DHAVE_TLSv13 -DLZ4_DISABLE_DEPRECATE_WARNINGS -D_FILE_OFFSET_BITS=64 -D_GNU_SOURCE -D__STDC_WANT_LIB_EXT1__=1 -I/tmp/B.bSxPY4/BUILD/percona-server-5.7.31-34/build/include -I/tmp/B.bSxPY4/BUILD/percona-server-5.7.31-34/extra/rapidjson/include -I/tmp/B.bSxPY4/BUILD/percona-server-5.7.31-34/build/libbinlogevents/include -I/tmp/B.bSxPY4/BUILD/percona-server-5.7.31-34/libbinlogevents/export -I/tmp/B.bSxPY4/BUILD/percona-server-5.7.31-34/include -fPIC -Wall -Wextra -Wformat-security -Wvla -Wwrite-strings -Wdeclaration-after-statement -O3 -D_FORTIFY_SOURCE=2 -O2 -fwrapv -pipe -Wformat -Werror=format-security -gdwarf-4 -fno-debug-types-section -fvar-tracking-assignments -g2 -Wp,-D_FORTIFY_SOURCE=2 -fstack-protector-strong --param=ssp-buffer-size=4 -Werror=trampolines -fPIC -mtune=generic -march=x86-64 -gdwarf-4 -fno-debug-types-section -fvar-tracking-assignments -g2 -DNDEBUG -fno-omit-frame-pointer -fno-strict-aliasing -Wno-shadow -g -fno-omit-frame-pointer -fno-strict-aliasing -DDBUG_OFF -DNDEBUG -o CMakeFiles/mysqlservices.dir/service_command.c.o -c /tmp/B.bSxPY4/BUILD/percona-server-5.7.31-34/libservices/service_command.c make[2]: Leaving directory '/tmp/B.bSxPY4/BUILD/percona-server-5.7.31-34/build' make[2]: Entering directory '/tmp/B.bSxPY4/BUILD/percona-server-5.7.31-34/build' cd /tmp/B.bSxPY4/BUILD/percona-server-5.7.31-34/build && /usr/bin/cmake -E cmake_depends "Unix Makefiles" /tmp/B.bSxPY4/BUILD/percona-server-5.7.31-34 /tmp/B.bSxPY4/BUILD/percona-server-5.7.31-34/strings /tmp/B.bSxPY4/BUILD/percona-server-5.7.31-34/build /tmp/B.bSxPY4/BUILD/percona-server-5.7.31-34/build/strings /tmp/B.bSxPY4/BUILD/percona-server-5.7.31-34/build/strings/CMakeFiles/strings.dir/DependInfo.cmake --color= Scanning dependencies of target strings make[2]: Leaving directory '/tmp/B.bSxPY4/BUILD/percona-server-5.7.31-34/build' /usr/bin/make -f strings/CMakeFiles/strings.dir/build.make strings/CMakeFiles/strings.dir/build make[2]: Entering directory '/tmp/B.bSxPY4/BUILD/percona-server-5.7.31-34/build' [ 1%] Generating generated/protobuf_lite/mysqlx.proto cd /tmp/B.bSxPY4/BUILD/percona-server-5.7.31-34/build/rapid/plugin/x && /usr/bin/cmake -D CURRENT_BINARY_DIR="/tmp/B.bSxPY4/BUILD/percona-server-5.7.31-34/build/rapid/plugin/x" -D PROTO_FILE="/tmp/B.bSxPY4/BUILD/percona-server-5.7.31-34/rapid/plugin/x/protocol/mysqlx.proto" -D PROTO_FILE_FLAGS="PROTOBUF_LITE" -P /tmp/B.bSxPY4/BUILD/percona-server-5.7.31-34/rapid/plugin/x/process_protobuf_file.cmake make[2]: Leaving directory '/tmp/B.bSxPY4/BUILD/percona-server-5.7.31-34/build' make[2]: Entering directory '/tmp/B.bSxPY4/BUILD/percona-server-5.7.31-34/build' [ 1%] Building C object libservices/CMakeFiles/mysqlservices.dir/locking_service.c.o cd /tmp/B.bSxPY4/BUILD/percona-server-5.7.31-34/build/libservices && /usr/bin/x86_64-pld-linux-gnux32-gcc -DBOOST_GEOMETRY_SQRT_CHECK_FINITENESS -DHAVE_CONFIG_H -DHAVE_TLSv13 -DLZ4_DISABLE_DEPRECATE_WARNINGS -D_FILE_OFFSET_BITS=64 -D_GNU_SOURCE -D__STDC_WANT_LIB_EXT1__=1 -I/tmp/B.bSxPY4/BUILD/percona-server-5.7.31-34/build/include -I/tmp/B.bSxPY4/BUILD/percona-server-5.7.31-34/extra/rapidjson/include -I/tmp/B.bSxPY4/BUILD/percona-server-5.7.31-34/build/libbinlogevents/include -I/tmp/B.bSxPY4/BUILD/percona-server-5.7.31-34/libbinlogevents/export -I/tmp/B.bSxPY4/BUILD/percona-server-5.7.31-34/include -fPIC -Wall -Wextra -Wformat-security -Wvla -Wwrite-strings -Wdeclaration-after-statement -O3 -D_FORTIFY_SOURCE=2 -O2 -fwrapv -pipe -Wformat -Werror=format-security -gdwarf-4 -fno-debug-types-section -fvar-tracking-assignments -g2 -Wp,-D_FORTIFY_SOURCE=2 -fstack-protector-strong --param=ssp-buffer-size=4 -Werror=trampolines -fPIC -mtune=generic -march=x86-64 -gdwarf-4 -fno-debug-types-section -fvar-tracking-assignments -g2 -DNDEBUG -fno-omit-frame-pointer -fno-strict-aliasing -Wno-shadow -g -fno-omit-frame-pointer -fno-strict-aliasing -DDBUG_OFF -DNDEBUG -o CMakeFiles/mysqlservices.dir/locking_service.c.o -c /tmp/B.bSxPY4/BUILD/percona-server-5.7.31-34/libservices/locking_service.c make[2]: Leaving directory '/tmp/B.bSxPY4/BUILD/percona-server-5.7.31-34/build' make[2]: Entering directory '/tmp/B.bSxPY4/BUILD/percona-server-5.7.31-34/build' [ 1%] Generating generated/protobuf_lite/mysqlx_datatypes.proto cd /tmp/B.bSxPY4/BUILD/percona-server-5.7.31-34/build/rapid/plugin/x && /usr/bin/cmake -D CURRENT_BINARY_DIR="/tmp/B.bSxPY4/BUILD/percona-server-5.7.31-34/build/rapid/plugin/x" -D PROTO_FILE="/tmp/B.bSxPY4/BUILD/percona-server-5.7.31-34/rapid/plugin/x/protocol/mysqlx_datatypes.proto" -D PROTO_FILE_FLAGS="PROTOBUF_LITE" -P /tmp/B.bSxPY4/BUILD/percona-server-5.7.31-34/rapid/plugin/x/process_protobuf_file.cmake make[2]: Leaving directory '/tmp/B.bSxPY4/BUILD/percona-server-5.7.31-34/build' make[2]: Entering directory '/tmp/B.bSxPY4/BUILD/percona-server-5.7.31-34/build' [ 1%] Generating generated/protobuf_lite/mysqlx_connection.proto cd /tmp/B.bSxPY4/BUILD/percona-server-5.7.31-34/build/rapid/plugin/x && /usr/bin/cmake -D CURRENT_BINARY_DIR="/tmp/B.bSxPY4/BUILD/percona-server-5.7.31-34/build/rapid/plugin/x" -D PROTO_FILE="/tmp/B.bSxPY4/BUILD/percona-server-5.7.31-34/rapid/plugin/x/protocol/mysqlx_connection.proto" -D PROTO_FILE_FLAGS="PROTOBUF_LITE" -P /tmp/B.bSxPY4/BUILD/percona-server-5.7.31-34/rapid/plugin/x/process_protobuf_file.cmake make[2]: Leaving directory '/tmp/B.bSxPY4/BUILD/percona-server-5.7.31-34/build' make[2]: Entering directory '/tmp/B.bSxPY4/BUILD/percona-server-5.7.31-34/build' [ 1%] Building C object libservices/CMakeFiles/mysqlservices.dir/srv_session_service.c.o cd /tmp/B.bSxPY4/BUILD/percona-server-5.7.31-34/build/libservices && /usr/bin/x86_64-pld-linux-gnux32-gcc -DBOOST_GEOMETRY_SQRT_CHECK_FINITENESS -DHAVE_CONFIG_H -DHAVE_TLSv13 -DLZ4_DISABLE_DEPRECATE_WARNINGS -D_FILE_OFFSET_BITS=64 -D_GNU_SOURCE -D__STDC_WANT_LIB_EXT1__=1 -I/tmp/B.bSxPY4/BUILD/percona-server-5.7.31-34/build/include -I/tmp/B.bSxPY4/BUILD/percona-server-5.7.31-34/extra/rapidjson/include -I/tmp/B.bSxPY4/BUILD/percona-server-5.7.31-34/build/libbinlogevents/include -I/tmp/B.bSxPY4/BUILD/percona-server-5.7.31-34/libbinlogevents/export -I/tmp/B.bSxPY4/BUILD/percona-server-5.7.31-34/include -fPIC -Wall -Wextra -Wformat-security -Wvla -Wwrite-strings -Wdeclaration-after-statement -O3 -D_FORTIFY_SOURCE=2 -O2 -fwrapv -pipe -Wformat -Werror=format-security -gdwarf-4 -fno-debug-types-section -fvar-tracking-assignments -g2 -Wp,-D_FORTIFY_SOURCE=2 -fstack-protector-strong --param=ssp-buffer-size=4 -Werror=trampolines -fPIC -mtune=generic -march=x86-64 -gdwarf-4 -fno-debug-types-section -fvar-tracking-assignments -g2 -DNDEBUG -fno-omit-frame-pointer -fno-strict-aliasing -Wno-shadow -g -fno-omit-frame-pointer -fno-strict-aliasing -DDBUG_OFF -DNDEBUG -o CMakeFiles/mysqlservices.dir/srv_session_service.c.o -c /tmp/B.bSxPY4/BUILD/percona-server-5.7.31-34/libservices/srv_session_service.c make[2]: Leaving directory '/tmp/B.bSxPY4/BUILD/percona-server-5.7.31-34/build' make[2]: Entering directory '/tmp/B.bSxPY4/BUILD/percona-server-5.7.31-34/build' /usr/bin/cmake -DCOMPILER=/usr/bin/x86_64-pld-linux-gnux32-gcc -DSOURCE_DIR=/tmp/B.bSxPY4/BUILD/percona-server-5.7.31-34 -DBINARY_DIR=/tmp/B.bSxPY4/BUILD/percona-server-5.7.31-34/build "-DABI_HEADERS=/tmp/B.bSxPY4/BUILD/percona-server-5.7.31-34/include/mysql/plugin_audit.h;/tmp/B.bSxPY4/BUILD/percona-server-5.7.31-34/include/mysql/plugin_ftparser.h;/tmp/B.bSxPY4/BUILD/percona-server-5.7.31-34/include/mysql.h;/tmp/B.bSxPY4/BUILD/percona-server-5.7.31-34/include/mysql/psi/psi_abi_v0.h;/tmp/B.bSxPY4/BUILD/percona-server-5.7.31-34/include/mysql/psi/psi_abi_v1.h;/tmp/B.bSxPY4/BUILD/percona-server-5.7.31-34/include/mysql/psi/psi_abi_v2.h;/tmp/B.bSxPY4/BUILD/percona-server-5.7.31-34/include/mysql/client_plugin.h;/tmp/B.bSxPY4/BUILD/percona-server-5.7.31-34/include/mysql/plugin_auth.h;/tmp/B.bSxPY4/BUILD/percona-server-5.7.31-34/include/mysql/services.h;/tmp/B.bSxPY4/BUILD/percona-server-5.7.31-34/include/mysql/plugin_keyring.h" -P /tmp/B.bSxPY4/BUILD/percona-server-5.7.31-34/cmake/do_abi_check.cmake make[2]: Leaving directory '/tmp/B.bSxPY4/BUILD/percona-server-5.7.31-34/build' make[2]: Entering directory '/tmp/B.bSxPY4/BUILD/percona-server-5.7.31-34/build' [ 0%] Building C object extra/coredumper/src/CMakeFiles/coredumper.dir/coredumper.c.o cd /tmp/B.bSxPY4/BUILD/percona-server-5.7.31-34/build/extra/coredumper/src && /usr/bin/x86_64-pld-linux-gnux32-gcc -DBOOST_GEOMETRY_SQRT_CHECK_FINITENESS -DHAVE_CONFIG_H -DHAVE_TLSv13 -DLZ4_DISABLE_DEPRECATE_WARNINGS -D_FILE_OFFSET_BITS=64 -D_GNU_SOURCE -D__STDC_WANT_LIB_EXT1__=1 -I/tmp/B.bSxPY4/BUILD/percona-server-5.7.31-34/build/include -I/tmp/B.bSxPY4/BUILD/percona-server-5.7.31-34/extra/rapidjson/include -I/tmp/B.bSxPY4/BUILD/percona-server-5.7.31-34/build/libbinlogevents/include -I/tmp/B.bSxPY4/BUILD/percona-server-5.7.31-34/libbinlogevents/export -I/tmp/B.bSxPY4/BUILD/percona-server-5.7.31-34/extra/coredumper/include -fPIC -O3 -D_FORTIFY_SOURCE=2 -O2 -fwrapv -pipe -Wformat -Werror=format-security -gdwarf-4 -fno-debug-types-section -fvar-tracking-assignments -g2 -Wp,-D_FORTIFY_SOURCE=2 -fstack-protector-strong --param=ssp-buffer-size=4 -Werror=trampolines -fPIC -mtune=generic -march=x86-64 -gdwarf-4 -fno-debug-types-section -fvar-tracking-assignments -g2 -DNDEBUG -fno-omit-frame-pointer -fno-strict-aliasing -Wno-shadow -g -fno-omit-frame-pointer -fno-strict-aliasing -DDBUG_OFF -DNDEBUG -fno-strict-aliasing -o CMakeFiles/coredumper.dir/coredumper.c.o -c /tmp/B.bSxPY4/BUILD/percona-server-5.7.31-34/extra/coredumper/src/coredumper.c make[2]: Leaving directory '/tmp/B.bSxPY4/BUILD/percona-server-5.7.31-34/build' make[1]: Entering directory '/tmp/B.bSxPY4/BUILD/percona-server-5.7.31-34/build' [ 1%] Built target abi_check make[1]: Leaving directory '/tmp/B.bSxPY4/BUILD/percona-server-5.7.31-34/build' /usr/bin/make -f extra/CMakeFiles/zlib_decompress.dir/build.make extra/CMakeFiles/zlib_decompress.dir/depend make[2]: Entering directory '/tmp/B.bSxPY4/BUILD/percona-server-5.7.31-34/build' [ 1%] Generating generated/protobuf_lite/mysqlx_expect.proto cd /tmp/B.bSxPY4/BUILD/percona-server-5.7.31-34/build/rapid/plugin/x && /usr/bin/cmake -D CURRENT_BINARY_DIR="/tmp/B.bSxPY4/BUILD/percona-server-5.7.31-34/build/rapid/plugin/x" -D PROTO_FILE="/tmp/B.bSxPY4/BUILD/percona-server-5.7.31-34/rapid/plugin/x/protocol/mysqlx_expect.proto" -D PROTO_FILE_FLAGS="PROTOBUF_LITE" -P /tmp/B.bSxPY4/BUILD/percona-server-5.7.31-34/rapid/plugin/x/process_protobuf_file.cmake make[2]: Leaving directory '/tmp/B.bSxPY4/BUILD/percona-server-5.7.31-34/build' make[2]: Entering directory '/tmp/B.bSxPY4/BUILD/percona-server-5.7.31-34/build' [ 1%] Building C object libservices/CMakeFiles/mysqlservices.dir/my_snprintf_service.c.o cd /tmp/B.bSxPY4/BUILD/percona-server-5.7.31-34/build/libservices && /usr/bin/x86_64-pld-linux-gnux32-gcc -DBOOST_GEOMETRY_SQRT_CHECK_FINITENESS -DHAVE_CONFIG_H -DHAVE_TLSv13 -DLZ4_DISABLE_DEPRECATE_WARNINGS -D_FILE_OFFSET_BITS=64 -D_GNU_SOURCE -D__STDC_WANT_LIB_EXT1__=1 -I/tmp/B.bSxPY4/BUILD/percona-server-5.7.31-34/build/include -I/tmp/B.bSxPY4/BUILD/percona-server-5.7.31-34/extra/rapidjson/include -I/tmp/B.bSxPY4/BUILD/percona-server-5.7.31-34/build/libbinlogevents/include -I/tmp/B.bSxPY4/BUILD/percona-server-5.7.31-34/libbinlogevents/export -I/tmp/B.bSxPY4/BUILD/percona-server-5.7.31-34/include -fPIC -Wall -Wextra -Wformat-security -Wvla -Wwrite-strings -Wdeclaration-after-statement -O3 -D_FORTIFY_SOURCE=2 -O2 -fwrapv -pipe -Wformat -Werror=format-security -gdwarf-4 -fno-debug-types-section -fvar-tracking-assignments -g2 -Wp,-D_FORTIFY_SOURCE=2 -fstack-protector-strong --param=ssp-buffer-size=4 -Werror=trampolines -fPIC -mtune=generic -march=x86-64 -gdwarf-4 -fno-debug-types-section -fvar-tracking-assignments -g2 -DNDEBUG -fno-omit-frame-pointer -fno-strict-aliasing -Wno-shadow -g -fno-omit-frame-pointer -fno-strict-aliasing -DDBUG_OFF -DNDEBUG -o CMakeFiles/mysqlservices.dir/my_snprintf_service.c.o -c /tmp/B.bSxPY4/BUILD/percona-server-5.7.31-34/libservices/my_snprintf_service.c make[2]: Leaving directory '/tmp/B.bSxPY4/BUILD/percona-server-5.7.31-34/build' make[2]: Entering directory '/tmp/B.bSxPY4/BUILD/percona-server-5.7.31-34/build' [ 1%] Building C object strings/CMakeFiles/strings.dir/bchange.c.o cd /tmp/B.bSxPY4/BUILD/percona-server-5.7.31-34/build/strings && /usr/bin/x86_64-pld-linux-gnux32-gcc -DBOOST_GEOMETRY_SQRT_CHECK_FINITENESS -DDISABLE_MYSQL_THREAD_H -DHAVE_CONFIG_H -DHAVE_TLSv13 -DLZ4_DISABLE_DEPRECATE_WARNINGS -D_FILE_OFFSET_BITS=64 -D_GNU_SOURCE -D__STDC_WANT_LIB_EXT1__=1 -I/tmp/B.bSxPY4/BUILD/percona-server-5.7.31-34/build/include -I/tmp/B.bSxPY4/BUILD/percona-server-5.7.31-34/extra/rapidjson/include -I/tmp/B.bSxPY4/BUILD/percona-server-5.7.31-34/build/libbinlogevents/include -I/tmp/B.bSxPY4/BUILD/percona-server-5.7.31-34/libbinlogevents/export -I/tmp/B.bSxPY4/BUILD/percona-server-5.7.31-34/include -fPIC -Wall -Wextra -Wformat-security -Wvla -Wwrite-strings -Wdeclaration-after-statement -O3 -D_FORTIFY_SOURCE=2 -O2 -fwrapv -pipe -Wformat -Werror=format-security -gdwarf-4 -fno-debug-types-section -fvar-tracking-assignments -g2 -Wp,-D_FORTIFY_SOURCE=2 -fstack-protector-strong --param=ssp-buffer-size=4 -Werror=trampolines -fPIC -mtune=generic -march=x86-64 -gdwarf-4 -fno-debug-types-section -fvar-tracking-assignments -g2 -DNDEBUG -fno-omit-frame-pointer -fno-strict-aliasing -Wno-shadow -g -fno-omit-frame-pointer -fno-strict-aliasing -DDBUG_OFF -DNDEBUG -o CMakeFiles/strings.dir/bchange.c.o -c /tmp/B.bSxPY4/BUILD/percona-server-5.7.31-34/strings/bchange.c make[2]: Leaving directory '/tmp/B.bSxPY4/BUILD/percona-server-5.7.31-34/build' make[2]: Entering directory '/tmp/B.bSxPY4/BUILD/percona-server-5.7.31-34/build' cd /tmp/B.bSxPY4/BUILD/percona-server-5.7.31-34/build && /usr/bin/cmake -E cmake_depends "Unix Makefiles" /tmp/B.bSxPY4/BUILD/percona-server-5.7.31-34 /tmp/B.bSxPY4/BUILD/percona-server-5.7.31-34/extra /tmp/B.bSxPY4/BUILD/percona-server-5.7.31-34/build /tmp/B.bSxPY4/BUILD/percona-server-5.7.31-34/build/extra /tmp/B.bSxPY4/BUILD/percona-server-5.7.31-34/build/extra/CMakeFiles/zlib_decompress.dir/DependInfo.cmake --color= Scanning dependencies of target zlib_decompress make[2]: Leaving directory '/tmp/B.bSxPY4/BUILD/percona-server-5.7.31-34/build' /usr/bin/make -f extra/CMakeFiles/zlib_decompress.dir/build.make extra/CMakeFiles/zlib_decompress.dir/build make[2]: Entering directory '/tmp/B.bSxPY4/BUILD/percona-server-5.7.31-34/build' [ 1%] Building C object extra/coredumper/src/CMakeFiles/coredumper.dir/thread_lister.c.o cd /tmp/B.bSxPY4/BUILD/percona-server-5.7.31-34/build/extra/coredumper/src && /usr/bin/x86_64-pld-linux-gnux32-gcc -DBOOST_GEOMETRY_SQRT_CHECK_FINITENESS -DHAVE_CONFIG_H -DHAVE_TLSv13 -DLZ4_DISABLE_DEPRECATE_WARNINGS -D_FILE_OFFSET_BITS=64 -D_GNU_SOURCE -D__STDC_WANT_LIB_EXT1__=1 -I/tmp/B.bSxPY4/BUILD/percona-server-5.7.31-34/build/include -I/tmp/B.bSxPY4/BUILD/percona-server-5.7.31-34/extra/rapidjson/include -I/tmp/B.bSxPY4/BUILD/percona-server-5.7.31-34/build/libbinlogevents/include -I/tmp/B.bSxPY4/BUILD/percona-server-5.7.31-34/libbinlogevents/export -I/tmp/B.bSxPY4/BUILD/percona-server-5.7.31-34/extra/coredumper/include -fPIC -O3 -D_FORTIFY_SOURCE=2 -O2 -fwrapv -pipe -Wformat -Werror=format-security -gdwarf-4 -fno-debug-types-section -fvar-tracking-assignments -g2 -Wp,-D_FORTIFY_SOURCE=2 -fstack-protector-strong --param=ssp-buffer-size=4 -Werror=trampolines -fPIC -mtune=generic -march=x86-64 -gdwarf-4 -fno-debug-types-section -fvar-tracking-assignments -g2 -DNDEBUG -fno-omit-frame-pointer -fno-strict-aliasing -Wno-shadow -g -fno-omit-frame-pointer -fno-strict-aliasing -DDBUG_OFF -DNDEBUG -fno-strict-aliasing -o CMakeFiles/coredumper.dir/thread_lister.c.o -c /tmp/B.bSxPY4/BUILD/percona-server-5.7.31-34/extra/coredumper/src/thread_lister.c make[2]: Leaving directory '/tmp/B.bSxPY4/BUILD/percona-server-5.7.31-34/build' make[2]: Entering directory '/tmp/B.bSxPY4/BUILD/percona-server-5.7.31-34/build' [ 1%] Generating generated/protobuf_lite/mysqlx_expr.proto cd /tmp/B.bSxPY4/BUILD/percona-server-5.7.31-34/build/rapid/plugin/x && /usr/bin/cmake -D CURRENT_BINARY_DIR="/tmp/B.bSxPY4/BUILD/percona-server-5.7.31-34/build/rapid/plugin/x" -D PROTO_FILE="/tmp/B.bSxPY4/BUILD/percona-server-5.7.31-34/rapid/plugin/x/protocol/mysqlx_expr.proto" -D PROTO_FILE_FLAGS="PROTOBUF_LITE" -P /tmp/B.bSxPY4/BUILD/percona-server-5.7.31-34/rapid/plugin/x/process_protobuf_file.cmake make[2]: Leaving directory '/tmp/B.bSxPY4/BUILD/percona-server-5.7.31-34/build' make[2]: Entering directory '/tmp/B.bSxPY4/BUILD/percona-server-5.7.31-34/build' [ 1%] Building C object libservices/CMakeFiles/mysqlservices.dir/thd_alloc_service.c.o cd /tmp/B.bSxPY4/BUILD/percona-server-5.7.31-34/build/libservices && /usr/bin/x86_64-pld-linux-gnux32-gcc -DBOOST_GEOMETRY_SQRT_CHECK_FINITENESS -DHAVE_CONFIG_H -DHAVE_TLSv13 -DLZ4_DISABLE_DEPRECATE_WARNINGS -D_FILE_OFFSET_BITS=64 -D_GNU_SOURCE -D__STDC_WANT_LIB_EXT1__=1 -I/tmp/B.bSxPY4/BUILD/percona-server-5.7.31-34/build/include -I/tmp/B.bSxPY4/BUILD/percona-server-5.7.31-34/extra/rapidjson/include -I/tmp/B.bSxPY4/BUILD/percona-server-5.7.31-34/build/libbinlogevents/include -I/tmp/B.bSxPY4/BUILD/percona-server-5.7.31-34/libbinlogevents/export -I/tmp/B.bSxPY4/BUILD/percona-server-5.7.31-34/include -fPIC -Wall -Wextra -Wformat-security -Wvla -Wwrite-strings -Wdeclaration-after-statement -O3 -D_FORTIFY_SOURCE=2 -O2 -fwrapv -pipe -Wformat -Werror=format-security -gdwarf-4 -fno-debug-types-section -fvar-tracking-assignments -g2 -Wp,-D_FORTIFY_SOURCE=2 -fstack-protector-strong --param=ssp-buffer-size=4 -Werror=trampolines -fPIC -mtune=generic -march=x86-64 -gdwarf-4 -fno-debug-types-section -fvar-tracking-assignments -g2 -DNDEBUG -fno-omit-frame-pointer -fno-strict-aliasing -Wno-shadow -g -fno-omit-frame-pointer -fno-strict-aliasing -DDBUG_OFF -DNDEBUG -o CMakeFiles/mysqlservices.dir/thd_alloc_service.c.o -c /tmp/B.bSxPY4/BUILD/percona-server-5.7.31-34/libservices/thd_alloc_service.c make[2]: Leaving directory '/tmp/B.bSxPY4/BUILD/percona-server-5.7.31-34/build' make[2]: Entering directory '/tmp/B.bSxPY4/BUILD/percona-server-5.7.31-34/build' [ 1%] Building C object libservices/CMakeFiles/mysqlservices.dir/thd_wait_service.c.o cd /tmp/B.bSxPY4/BUILD/percona-server-5.7.31-34/build/libservices && /usr/bin/x86_64-pld-linux-gnux32-gcc -DBOOST_GEOMETRY_SQRT_CHECK_FINITENESS -DHAVE_CONFIG_H -DHAVE_TLSv13 -DLZ4_DISABLE_DEPRECATE_WARNINGS -D_FILE_OFFSET_BITS=64 -D_GNU_SOURCE -D__STDC_WANT_LIB_EXT1__=1 -I/tmp/B.bSxPY4/BUILD/percona-server-5.7.31-34/build/include -I/tmp/B.bSxPY4/BUILD/percona-server-5.7.31-34/extra/rapidjson/include -I/tmp/B.bSxPY4/BUILD/percona-server-5.7.31-34/build/libbinlogevents/include -I/tmp/B.bSxPY4/BUILD/percona-server-5.7.31-34/libbinlogevents/export -I/tmp/B.bSxPY4/BUILD/percona-server-5.7.31-34/include -fPIC -Wall -Wextra -Wformat-security -Wvla -Wwrite-strings -Wdeclaration-after-statement -O3 -D_FORTIFY_SOURCE=2 -O2 -fwrapv -pipe -Wformat -Werror=format-security -gdwarf-4 -fno-debug-types-section -fvar-tracking-assignments -g2 -Wp,-D_FORTIFY_SOURCE=2 -fstack-protector-strong --param=ssp-buffer-size=4 -Werror=trampolines -fPIC -mtune=generic -march=x86-64 -gdwarf-4 -fno-debug-types-section -fvar-tracking-assignments -g2 -DNDEBUG -fno-omit-frame-pointer -fno-strict-aliasing -Wno-shadow -g -fno-omit-frame-pointer -fno-strict-aliasing -DDBUG_OFF -DNDEBUG -o CMakeFiles/mysqlservices.dir/thd_wait_service.c.o -c /tmp/B.bSxPY4/BUILD/percona-server-5.7.31-34/libservices/thd_wait_service.c make[2]: Leaving directory '/tmp/B.bSxPY4/BUILD/percona-server-5.7.31-34/build' make[2]: Entering directory '/tmp/B.bSxPY4/BUILD/percona-server-5.7.31-34/build' [ 1%] Generating generated/protobuf_lite/mysqlx_crud.proto cd /tmp/B.bSxPY4/BUILD/percona-server-5.7.31-34/build/rapid/plugin/x && /usr/bin/cmake -D CURRENT_BINARY_DIR="/tmp/B.bSxPY4/BUILD/percona-server-5.7.31-34/build/rapid/plugin/x" -D PROTO_FILE="/tmp/B.bSxPY4/BUILD/percona-server-5.7.31-34/rapid/plugin/x/protocol/mysqlx_crud.proto" -D PROTO_FILE_FLAGS="PROTOBUF_LITE" -P /tmp/B.bSxPY4/BUILD/percona-server-5.7.31-34/rapid/plugin/x/process_protobuf_file.cmake make[2]: Leaving directory '/tmp/B.bSxPY4/BUILD/percona-server-5.7.31-34/build' make[2]: Entering directory '/tmp/B.bSxPY4/BUILD/percona-server-5.7.31-34/build' [ 1%] Generating generated/protobuf_lite/mysqlx_sql.proto cd /tmp/B.bSxPY4/BUILD/percona-server-5.7.31-34/build/rapid/plugin/x && /usr/bin/cmake -D CURRENT_BINARY_DIR="/tmp/B.bSxPY4/BUILD/percona-server-5.7.31-34/build/rapid/plugin/x" -D PROTO_FILE="/tmp/B.bSxPY4/BUILD/percona-server-5.7.31-34/rapid/plugin/x/protocol/mysqlx_sql.proto" -D PROTO_FILE_FLAGS="PROTOBUF_LITE" -P /tmp/B.bSxPY4/BUILD/percona-server-5.7.31-34/rapid/plugin/x/process_protobuf_file.cmake make[2]: Leaving directory '/tmp/B.bSxPY4/BUILD/percona-server-5.7.31-34/build' make[2]: Entering directory '/tmp/B.bSxPY4/BUILD/percona-server-5.7.31-34/build' [ 0%] Building C object vio/CMakeFiles/vio.dir/vio.c.o cd /tmp/B.bSxPY4/BUILD/percona-server-5.7.31-34/build/vio && /usr/bin/x86_64-pld-linux-gnux32-gcc -DBOOST_GEOMETRY_SQRT_CHECK_FINITENESS -DHAVE_CONFIG_H -DHAVE_TLSv13 -DLZ4_DISABLE_DEPRECATE_WARNINGS -D_FILE_OFFSET_BITS=64 -D_GNU_SOURCE -D__STDC_WANT_LIB_EXT1__=1 -I/tmp/B.bSxPY4/BUILD/percona-server-5.7.31-34/build/include -I/tmp/B.bSxPY4/BUILD/percona-server-5.7.31-34/extra/rapidjson/include -I/tmp/B.bSxPY4/BUILD/percona-server-5.7.31-34/build/libbinlogevents/include -I/tmp/B.bSxPY4/BUILD/percona-server-5.7.31-34/libbinlogevents/export -I/tmp/B.bSxPY4/BUILD/percona-server-5.7.31-34/include -fPIC -Wall -Wextra -Wformat-security -Wvla -Wwrite-strings -Wdeclaration-after-statement -O3 -D_FORTIFY_SOURCE=2 -O2 -fwrapv -pipe -Wformat -Werror=format-security -gdwarf-4 -fno-debug-types-section -fvar-tracking-assignments -g2 -Wp,-D_FORTIFY_SOURCE=2 -fstack-protector-strong --param=ssp-buffer-size=4 -Werror=trampolines -fPIC -mtune=generic -march=x86-64 -gdwarf-4 -fno-debug-types-section -fvar-tracking-assignments -g2 -DNDEBUG -fno-omit-frame-pointer -fno-strict-aliasing -Wno-shadow -g -fno-omit-frame-pointer -fno-strict-aliasing -DDBUG_OFF -DNDEBUG -DHAVE_OPENSSL -o CMakeFiles/vio.dir/vio.c.o -c /tmp/B.bSxPY4/BUILD/percona-server-5.7.31-34/vio/vio.c make[2]: Leaving directory '/tmp/B.bSxPY4/BUILD/percona-server-5.7.31-34/build' make[2]: Entering directory '/tmp/B.bSxPY4/BUILD/percona-server-5.7.31-34/build' [ 1%] Building C object libservices/CMakeFiles/mysqlservices.dir/my_plugin_log_service.c.o cd /tmp/B.bSxPY4/BUILD/percona-server-5.7.31-34/build/libservices && /usr/bin/x86_64-pld-linux-gnux32-gcc -DBOOST_GEOMETRY_SQRT_CHECK_FINITENESS -DHAVE_CONFIG_H -DHAVE_TLSv13 -DLZ4_DISABLE_DEPRECATE_WARNINGS -D_FILE_OFFSET_BITS=64 -D_GNU_SOURCE -D__STDC_WANT_LIB_EXT1__=1 -I/tmp/B.bSxPY4/BUILD/percona-server-5.7.31-34/build/include -I/tmp/B.bSxPY4/BUILD/percona-server-5.7.31-34/extra/rapidjson/include -I/tmp/B.bSxPY4/BUILD/percona-server-5.7.31-34/build/libbinlogevents/include -I/tmp/B.bSxPY4/BUILD/percona-server-5.7.31-34/libbinlogevents/export -I/tmp/B.bSxPY4/BUILD/percona-server-5.7.31-34/include -fPIC -Wall -Wextra -Wformat-security -Wvla -Wwrite-strings -Wdeclaration-after-statement -O3 -D_FORTIFY_SOURCE=2 -O2 -fwrapv -pipe -Wformat -Werror=format-security -gdwarf-4 -fno-debug-types-section -fvar-tracking-assignments -g2 -Wp,-D_FORTIFY_SOURCE=2 -fstack-protector-strong --param=ssp-buffer-size=4 -Werror=trampolines -fPIC -mtune=generic -march=x86-64 -gdwarf-4 -fno-debug-types-section -fvar-tracking-assignments -g2 -DNDEBUG -fno-omit-frame-pointer -fno-strict-aliasing -Wno-shadow -g -fno-omit-frame-pointer -fno-strict-aliasing -DDBUG_OFF -DNDEBUG -o CMakeFiles/mysqlservices.dir/my_plugin_log_service.c.o -c /tmp/B.bSxPY4/BUILD/percona-server-5.7.31-34/libservices/my_plugin_log_service.c make[2]: Leaving directory '/tmp/B.bSxPY4/BUILD/percona-server-5.7.31-34/build' make[2]: Entering directory '/tmp/B.bSxPY4/BUILD/percona-server-5.7.31-34/build' [ 1%] Generating generated/protobuf_lite/mysqlx_session.proto cd /tmp/B.bSxPY4/BUILD/percona-server-5.7.31-34/build/rapid/plugin/x && /usr/bin/cmake -D CURRENT_BINARY_DIR="/tmp/B.bSxPY4/BUILD/percona-server-5.7.31-34/build/rapid/plugin/x" -D PROTO_FILE="/tmp/B.bSxPY4/BUILD/percona-server-5.7.31-34/rapid/plugin/x/protocol/mysqlx_session.proto" -D PROTO_FILE_FLAGS="PROTOBUF_LITE" -P /tmp/B.bSxPY4/BUILD/percona-server-5.7.31-34/rapid/plugin/x/process_protobuf_file.cmake make[2]: Leaving directory '/tmp/B.bSxPY4/BUILD/percona-server-5.7.31-34/build' make[2]: Entering directory '/tmp/B.bSxPY4/BUILD/percona-server-5.7.31-34/build' [ 1%] Generating generated/protobuf_lite/mysqlx_notice.proto cd /tmp/B.bSxPY4/BUILD/percona-server-5.7.31-34/build/rapid/plugin/x && /usr/bin/cmake -D CURRENT_BINARY_DIR="/tmp/B.bSxPY4/BUILD/percona-server-5.7.31-34/build/rapid/plugin/x" -D PROTO_FILE="/tmp/B.bSxPY4/BUILD/percona-server-5.7.31-34/rapid/plugin/x/protocol/mysqlx_notice.proto" -D PROTO_FILE_FLAGS="PROTOBUF_LITE" -P /tmp/B.bSxPY4/BUILD/percona-server-5.7.31-34/rapid/plugin/x/process_protobuf_file.cmake make[2]: Leaving directory '/tmp/B.bSxPY4/BUILD/percona-server-5.7.31-34/build' make[2]: Entering directory '/tmp/B.bSxPY4/BUILD/percona-server-5.7.31-34/build' [ 1%] Building C object libservices/CMakeFiles/mysqlservices.dir/my_thread_scheduler_service.c.o cd /tmp/B.bSxPY4/BUILD/percona-server-5.7.31-34/build/libservices && /usr/bin/x86_64-pld-linux-gnux32-gcc -DBOOST_GEOMETRY_SQRT_CHECK_FINITENESS -DHAVE_CONFIG_H -DHAVE_TLSv13 -DLZ4_DISABLE_DEPRECATE_WARNINGS -D_FILE_OFFSET_BITS=64 -D_GNU_SOURCE -D__STDC_WANT_LIB_EXT1__=1 -I/tmp/B.bSxPY4/BUILD/percona-server-5.7.31-34/build/include -I/tmp/B.bSxPY4/BUILD/percona-server-5.7.31-34/extra/rapidjson/include -I/tmp/B.bSxPY4/BUILD/percona-server-5.7.31-34/build/libbinlogevents/include -I/tmp/B.bSxPY4/BUILD/percona-server-5.7.31-34/libbinlogevents/export -I/tmp/B.bSxPY4/BUILD/percona-server-5.7.31-34/include -fPIC -Wall -Wextra -Wformat-security -Wvla -Wwrite-strings -Wdeclaration-after-statement -O3 -D_FORTIFY_SOURCE=2 -O2 -fwrapv -pipe -Wformat -Werror=format-security -gdwarf-4 -fno-debug-types-section -fvar-tracking-assignments -g2 -Wp,-D_FORTIFY_SOURCE=2 -fstack-protector-strong --param=ssp-buffer-size=4 -Werror=trampolines -fPIC -mtune=generic -march=x86-64 -gdwarf-4 -fno-debug-types-section -fvar-tracking-assignments -g2 -DNDEBUG -fno-omit-frame-pointer -fno-strict-aliasing -Wno-shadow -g -fno-omit-frame-pointer -fno-strict-aliasing -DDBUG_OFF -DNDEBUG -o CMakeFiles/mysqlservices.dir/my_thread_scheduler_service.c.o -c /tmp/B.bSxPY4/BUILD/percona-server-5.7.31-34/libservices/my_thread_scheduler_service.c make[2]: Leaving directory '/tmp/B.bSxPY4/BUILD/percona-server-5.7.31-34/build' make[2]: Entering directory '/tmp/B.bSxPY4/BUILD/percona-server-5.7.31-34/build' [ 1%] Building C object libservices/CMakeFiles/mysqlservices.dir/mysql_string_service.c.o cd /tmp/B.bSxPY4/BUILD/percona-server-5.7.31-34/build/libservices && /usr/bin/x86_64-pld-linux-gnux32-gcc -DBOOST_GEOMETRY_SQRT_CHECK_FINITENESS -DHAVE_CONFIG_H -DHAVE_TLSv13 -DLZ4_DISABLE_DEPRECATE_WARNINGS -D_FILE_OFFSET_BITS=64 -D_GNU_SOURCE -D__STDC_WANT_LIB_EXT1__=1 -I/tmp/B.bSxPY4/BUILD/percona-server-5.7.31-34/build/include -I/tmp/B.bSxPY4/BUILD/percona-server-5.7.31-34/extra/rapidjson/include -I/tmp/B.bSxPY4/BUILD/percona-server-5.7.31-34/build/libbinlogevents/include -I/tmp/B.bSxPY4/BUILD/percona-server-5.7.31-34/libbinlogevents/export -I/tmp/B.bSxPY4/BUILD/percona-server-5.7.31-34/include -fPIC -Wall -Wextra -Wformat-security -Wvla -Wwrite-strings -Wdeclaration-after-statement -O3 -D_FORTIFY_SOURCE=2 -O2 -fwrapv -pipe -Wformat -Werror=format-security -gdwarf-4 -fno-debug-types-section -fvar-tracking-assignments -g2 -Wp,-D_FORTIFY_SOURCE=2 -fstack-protector-strong --param=ssp-buffer-size=4 -Werror=trampolines -fPIC -mtune=generic -march=x86-64 -gdwarf-4 -fno-debug-types-section -fvar-tracking-assignments -g2 -DNDEBUG -fno-omit-frame-pointer -fno-strict-aliasing -Wno-shadow -g -fno-omit-frame-pointer -fno-strict-aliasing -DDBUG_OFF -DNDEBUG -o CMakeFiles/mysqlservices.dir/mysql_string_service.c.o -c /tmp/B.bSxPY4/BUILD/percona-server-5.7.31-34/libservices/mysql_string_service.c make[2]: Leaving directory '/tmp/B.bSxPY4/BUILD/percona-server-5.7.31-34/build' make[2]: Entering directory '/tmp/B.bSxPY4/BUILD/percona-server-5.7.31-34/build' [ 1%] Generating generated/protobuf_lite/mysqlx_resultset.proto cd /tmp/B.bSxPY4/BUILD/percona-server-5.7.31-34/build/rapid/plugin/x && /usr/bin/cmake -D CURRENT_BINARY_DIR="/tmp/B.bSxPY4/BUILD/percona-server-5.7.31-34/build/rapid/plugin/x" -D PROTO_FILE="/tmp/B.bSxPY4/BUILD/percona-server-5.7.31-34/rapid/plugin/x/protocol/mysqlx_resultset.proto" -D PROTO_FILE_FLAGS="PROTOBUF_LITE" -P /tmp/B.bSxPY4/BUILD/percona-server-5.7.31-34/rapid/plugin/x/process_protobuf_file.cmake make[2]: Leaving directory '/tmp/B.bSxPY4/BUILD/percona-server-5.7.31-34/build' make[1]: Entering directory '/tmp/B.bSxPY4/BUILD/percona-server-5.7.31-34/build' [ 1%] Built target GenLiteProtos make[1]: Leaving directory '/tmp/B.bSxPY4/BUILD/percona-server-5.7.31-34/build' make[2]: Entering directory '/tmp/B.bSxPY4/BUILD/percona-server-5.7.31-34/build' [ 1%] Building C object libservices/CMakeFiles/mysqlservices.dir/mysql_malloc_service.c.o cd /tmp/B.bSxPY4/BUILD/percona-server-5.7.31-34/build/libservices && /usr/bin/x86_64-pld-linux-gnux32-gcc -DBOOST_GEOMETRY_SQRT_CHECK_FINITENESS -DHAVE_CONFIG_H -DHAVE_TLSv13 -DLZ4_DISABLE_DEPRECATE_WARNINGS -D_FILE_OFFSET_BITS=64 -D_GNU_SOURCE -D__STDC_WANT_LIB_EXT1__=1 -I/tmp/B.bSxPY4/BUILD/percona-server-5.7.31-34/build/include -I/tmp/B.bSxPY4/BUILD/percona-server-5.7.31-34/extra/rapidjson/include -I/tmp/B.bSxPY4/BUILD/percona-server-5.7.31-34/build/libbinlogevents/include -I/tmp/B.bSxPY4/BUILD/percona-server-5.7.31-34/libbinlogevents/export -I/tmp/B.bSxPY4/BUILD/percona-server-5.7.31-34/include -fPIC -Wall -Wextra -Wformat-security -Wvla -Wwrite-strings -Wdeclaration-after-statement -O3 -D_FORTIFY_SOURCE=2 -O2 -fwrapv -pipe -Wformat -Werror=format-security -gdwarf-4 -fno-debug-types-section -fvar-tracking-assignments -g2 -Wp,-D_FORTIFY_SOURCE=2 -fstack-protector-strong --param=ssp-buffer-size=4 -Werror=trampolines -fPIC -mtune=generic -march=x86-64 -gdwarf-4 -fno-debug-types-section -fvar-tracking-assignments -g2 -DNDEBUG -fno-omit-frame-pointer -fno-strict-aliasing -Wno-shadow -g -fno-omit-frame-pointer -fno-strict-aliasing -DDBUG_OFF -DNDEBUG -o CMakeFiles/mysqlservices.dir/mysql_malloc_service.c.o -c /tmp/B.bSxPY4/BUILD/percona-server-5.7.31-34/libservices/mysql_malloc_service.c make[2]: Leaving directory '/tmp/B.bSxPY4/BUILD/percona-server-5.7.31-34/build' make[2]: Entering directory '/tmp/B.bSxPY4/BUILD/percona-server-5.7.31-34/build' [ 1%] Building C object libservices/CMakeFiles/mysqlservices.dir/mysql_password_policy_service.c.o cd /tmp/B.bSxPY4/BUILD/percona-server-5.7.31-34/build/libservices && /usr/bin/x86_64-pld-linux-gnux32-gcc -DBOOST_GEOMETRY_SQRT_CHECK_FINITENESS -DHAVE_CONFIG_H -DHAVE_TLSv13 -DLZ4_DISABLE_DEPRECATE_WARNINGS -D_FILE_OFFSET_BITS=64 -D_GNU_SOURCE -D__STDC_WANT_LIB_EXT1__=1 -I/tmp/B.bSxPY4/BUILD/percona-server-5.7.31-34/build/include -I/tmp/B.bSxPY4/BUILD/percona-server-5.7.31-34/extra/rapidjson/include -I/tmp/B.bSxPY4/BUILD/percona-server-5.7.31-34/build/libbinlogevents/include -I/tmp/B.bSxPY4/BUILD/percona-server-5.7.31-34/libbinlogevents/export -I/tmp/B.bSxPY4/BUILD/percona-server-5.7.31-34/include -fPIC -Wall -Wextra -Wformat-security -Wvla -Wwrite-strings -Wdeclaration-after-statement -O3 -D_FORTIFY_SOURCE=2 -O2 -fwrapv -pipe -Wformat -Werror=format-security -gdwarf-4 -fno-debug-types-section -fvar-tracking-assignments -g2 -Wp,-D_FORTIFY_SOURCE=2 -fstack-protector-strong --param=ssp-buffer-size=4 -Werror=trampolines -fPIC -mtune=generic -march=x86-64 -gdwarf-4 -fno-debug-types-section -fvar-tracking-assignments -g2 -DNDEBUG -fno-omit-frame-pointer -fno-strict-aliasing -Wno-shadow -g -fno-omit-frame-pointer -fno-strict-aliasing -DDBUG_OFF -DNDEBUG -o CMakeFiles/mysqlservices.dir/mysql_password_policy_service.c.o -c /tmp/B.bSxPY4/BUILD/percona-server-5.7.31-34/libservices/mysql_password_policy_service.c make[2]: Leaving directory '/tmp/B.bSxPY4/BUILD/percona-server-5.7.31-34/build' make[2]: Entering directory '/tmp/B.bSxPY4/BUILD/percona-server-5.7.31-34/build' [ 1%] Building CXX object extra/CMakeFiles/zlib_decompress.dir/zlib_decompress.cc.o cd /tmp/B.bSxPY4/BUILD/percona-server-5.7.31-34/build/extra && /usr/bin/x86_64-pld-linux-gnux32-g++ -DBOOST_GEOMETRY_SQRT_CHECK_FINITENESS -DHAVE_CONFIG_H -DHAVE_LZ4=1 -DHAVE_TLSv13 -DLZ4_DISABLE_DEPRECATE_WARNINGS -DMUTEX_EVENT -DUNIV_INNOCHECKSUM -D_FILE_OFFSET_BITS=64 -D_GNU_SOURCE -D__STDC_WANT_LIB_EXT1__=1 -I/tmp/B.bSxPY4/BUILD/percona-server-5.7.31-34/build/include -I/tmp/B.bSxPY4/BUILD/percona-server-5.7.31-34/extra/rapidjson/include -I/tmp/B.bSxPY4/BUILD/percona-server-5.7.31-34/build/libbinlogevents/include -I/tmp/B.bSxPY4/BUILD/percona-server-5.7.31-34/libbinlogevents/export -I/tmp/B.bSxPY4/BUILD/percona-server-5.7.31-34/include -I/tmp/B.bSxPY4/BUILD/percona-server-5.7.31-34/storage/ndb/include -I/tmp/B.bSxPY4/BUILD/percona-server-5.7.31-34/build/storage/ndb/include -I/tmp/B.bSxPY4/BUILD/percona-server-5.7.31-34/storage/ndb/include/ndbapi -I/tmp/B.bSxPY4/BUILD/percona-server-5.7.31-34/storage/ndb/include/mgmapi -I/tmp/B.bSxPY4/BUILD/percona-server-5.7.31-34/storage/innobase/include -I/tmp/B.bSxPY4/BUILD/percona-server-5.7.31-34/sql -fPIC -Wall -Wextra -Wformat-security -Wvla -Woverloaded-virtual -Wno-unused-parameter -O3 -D_FORTIFY_SOURCE=2 -g -fno-omit-frame-pointer -fno-strict-aliasing -DDBUG_OFF -DNDEBUG -Wno-class-memaccess -std=gnu++11 -o CMakeFiles/zlib_decompress.dir/zlib_decompress.cc.o -c /tmp/B.bSxPY4/BUILD/percona-server-5.7.31-34/extra/zlib_decompress.cc make[2]: Leaving directory '/tmp/B.bSxPY4/BUILD/percona-server-5.7.31-34/build' make[2]: Entering directory '/tmp/B.bSxPY4/BUILD/percona-server-5.7.31-34/build' [ 1%] Building C object libservices/CMakeFiles/mysqlservices.dir/parser_service.c.o cd /tmp/B.bSxPY4/BUILD/percona-server-5.7.31-34/build/libservices && /usr/bin/x86_64-pld-linux-gnux32-gcc -DBOOST_GEOMETRY_SQRT_CHECK_FINITENESS -DHAVE_CONFIG_H -DHAVE_TLSv13 -DLZ4_DISABLE_DEPRECATE_WARNINGS -D_FILE_OFFSET_BITS=64 -D_GNU_SOURCE -D__STDC_WANT_LIB_EXT1__=1 -I/tmp/B.bSxPY4/BUILD/percona-server-5.7.31-34/build/include -I/tmp/B.bSxPY4/BUILD/percona-server-5.7.31-34/extra/rapidjson/include -I/tmp/B.bSxPY4/BUILD/percona-server-5.7.31-34/build/libbinlogevents/include -I/tmp/B.bSxPY4/BUILD/percona-server-5.7.31-34/libbinlogevents/export -I/tmp/B.bSxPY4/BUILD/percona-server-5.7.31-34/include -fPIC -Wall -Wextra -Wformat-security -Wvla -Wwrite-strings -Wdeclaration-after-statement -O3 -D_FORTIFY_SOURCE=2 -O2 -fwrapv -pipe -Wformat -Werror=format-security -gdwarf-4 -fno-debug-types-section -fvar-tracking-assignments -g2 -Wp,-D_FORTIFY_SOURCE=2 -fstack-protector-strong --param=ssp-buffer-size=4 -Werror=trampolines -fPIC -mtune=generic -march=x86-64 -gdwarf-4 -fno-debug-types-section -fvar-tracking-assignments -g2 -DNDEBUG -fno-omit-frame-pointer -fno-strict-aliasing -Wno-shadow -g -fno-omit-frame-pointer -fno-strict-aliasing -DDBUG_OFF -DNDEBUG -o CMakeFiles/mysqlservices.dir/parser_service.c.o -c /tmp/B.bSxPY4/BUILD/percona-server-5.7.31-34/libservices/parser_service.c make[2]: Leaving directory '/tmp/B.bSxPY4/BUILD/percona-server-5.7.31-34/build' make[2]: Entering directory '/tmp/B.bSxPY4/BUILD/percona-server-5.7.31-34/build' [ 2%] Building C object libservices/CMakeFiles/mysqlservices.dir/srv_session_info_service.c.o cd /tmp/B.bSxPY4/BUILD/percona-server-5.7.31-34/build/libservices && /usr/bin/x86_64-pld-linux-gnux32-gcc -DBOOST_GEOMETRY_SQRT_CHECK_FINITENESS -DHAVE_CONFIG_H -DHAVE_TLSv13 -DLZ4_DISABLE_DEPRECATE_WARNINGS -D_FILE_OFFSET_BITS=64 -D_GNU_SOURCE -D__STDC_WANT_LIB_EXT1__=1 -I/tmp/B.bSxPY4/BUILD/percona-server-5.7.31-34/build/include -I/tmp/B.bSxPY4/BUILD/percona-server-5.7.31-34/extra/rapidjson/include -I/tmp/B.bSxPY4/BUILD/percona-server-5.7.31-34/build/libbinlogevents/include -I/tmp/B.bSxPY4/BUILD/percona-server-5.7.31-34/libbinlogevents/export -I/tmp/B.bSxPY4/BUILD/percona-server-5.7.31-34/include -fPIC -Wall -Wextra -Wformat-security -Wvla -Wwrite-strings -Wdeclaration-after-statement -O3 -D_FORTIFY_SOURCE=2 -O2 -fwrapv -pipe -Wformat -Werror=format-security -gdwarf-4 -fno-debug-types-section -fvar-tracking-assignments -g2 -Wp,-D_FORTIFY_SOURCE=2 -fstack-protector-strong --param=ssp-buffer-size=4 -Werror=trampolines -fPIC -mtune=generic -march=x86-64 -gdwarf-4 -fno-debug-types-section -fvar-tracking-assignments -g2 -DNDEBUG -fno-omit-frame-pointer -fno-strict-aliasing -Wno-shadow -g -fno-omit-frame-pointer -fno-strict-aliasing -DDBUG_OFF -DNDEBUG -o CMakeFiles/mysqlservices.dir/srv_session_info_service.c.o -c /tmp/B.bSxPY4/BUILD/percona-server-5.7.31-34/libservices/srv_session_info_service.c make[2]: Leaving directory '/tmp/B.bSxPY4/BUILD/percona-server-5.7.31-34/build' make[2]: Entering directory '/tmp/B.bSxPY4/BUILD/percona-server-5.7.31-34/build' [ 1%] Building C object strings/CMakeFiles/strings.dir/ctype-big5.c.o cd /tmp/B.bSxPY4/BUILD/percona-server-5.7.31-34/build/strings && /usr/bin/x86_64-pld-linux-gnux32-gcc -DBOOST_GEOMETRY_SQRT_CHECK_FINITENESS -DDISABLE_MYSQL_THREAD_H -DHAVE_CONFIG_H -DHAVE_TLSv13 -DLZ4_DISABLE_DEPRECATE_WARNINGS -D_FILE_OFFSET_BITS=64 -D_GNU_SOURCE -D__STDC_WANT_LIB_EXT1__=1 -I/tmp/B.bSxPY4/BUILD/percona-server-5.7.31-34/build/include -I/tmp/B.bSxPY4/BUILD/percona-server-5.7.31-34/extra/rapidjson/include -I/tmp/B.bSxPY4/BUILD/percona-server-5.7.31-34/build/libbinlogevents/include -I/tmp/B.bSxPY4/BUILD/percona-server-5.7.31-34/libbinlogevents/export -I/tmp/B.bSxPY4/BUILD/percona-server-5.7.31-34/include -fPIC -Wall -Wextra -Wformat-security -Wvla -Wwrite-strings -Wdeclaration-after-statement -O3 -D_FORTIFY_SOURCE=2 -O2 -fwrapv -pipe -Wformat -Werror=format-security -gdwarf-4 -fno-debug-types-section -fvar-tracking-assignments -g2 -Wp,-D_FORTIFY_SOURCE=2 -fstack-protector-strong --param=ssp-buffer-size=4 -Werror=trampolines -fPIC -mtune=generic -march=x86-64 -gdwarf-4 -fno-debug-types-section -fvar-tracking-assignments -g2 -DNDEBUG -fno-omit-frame-pointer -fno-strict-aliasing -Wno-shadow -g -fno-omit-frame-pointer -fno-strict-aliasing -DDBUG_OFF -DNDEBUG -o CMakeFiles/strings.dir/ctype-big5.c.o -c /tmp/B.bSxPY4/BUILD/percona-server-5.7.31-34/strings/ctype-big5.c make[2]: Leaving directory '/tmp/B.bSxPY4/BUILD/percona-server-5.7.31-34/build' make[2]: Entering directory '/tmp/B.bSxPY4/BUILD/percona-server-5.7.31-34/build' [ 2%] Linking CXX executable zlib_decompress cd /tmp/B.bSxPY4/BUILD/percona-server-5.7.31-34/build/extra && /usr/bin/cmake -E cmake_link_script CMakeFiles/zlib_decompress.dir/link.txt --verbose=1 /usr/bin/x86_64-pld-linux-gnux32-g++ -fPIC -Wall -Wextra -Wformat-security -Wvla -Woverloaded-virtual -Wno-unused-parameter -O3 -D_FORTIFY_SOURCE=2 -g -fno-omit-frame-pointer -fno-strict-aliasing -DDBUG_OFF -DNDEBUG -Wno-class-memaccess CMakeFiles/zlib_decompress.dir/zlib_decompress.cc.o -o zlib_decompress -lpthread -lz make[2]: Leaving directory '/tmp/B.bSxPY4/BUILD/percona-server-5.7.31-34/build' make[2]: Entering directory '/tmp/B.bSxPY4/BUILD/percona-server-5.7.31-34/build' [ 2%] Building C object libservices/CMakeFiles/mysqlservices.dir/rpl_transaction_ctx_service.c.o cd /tmp/B.bSxPY4/BUILD/percona-server-5.7.31-34/build/libservices && /usr/bin/x86_64-pld-linux-gnux32-gcc -DBOOST_GEOMETRY_SQRT_CHECK_FINITENESS -DHAVE_CONFIG_H -DHAVE_TLSv13 -DLZ4_DISABLE_DEPRECATE_WARNINGS -D_FILE_OFFSET_BITS=64 -D_GNU_SOURCE -D__STDC_WANT_LIB_EXT1__=1 -I/tmp/B.bSxPY4/BUILD/percona-server-5.7.31-34/build/include -I/tmp/B.bSxPY4/BUILD/percona-server-5.7.31-34/extra/rapidjson/include -I/tmp/B.bSxPY4/BUILD/percona-server-5.7.31-34/build/libbinlogevents/include -I/tmp/B.bSxPY4/BUILD/percona-server-5.7.31-34/libbinlogevents/export -I/tmp/B.bSxPY4/BUILD/percona-server-5.7.31-34/include -fPIC -Wall -Wextra -Wformat-security -Wvla -Wwrite-strings -Wdeclaration-after-statement -O3 -D_FORTIFY_SOURCE=2 -O2 -fwrapv -pipe -Wformat -Werror=format-security -gdwarf-4 -fno-debug-types-section -fvar-tracking-assignments -g2 -Wp,-D_FORTIFY_SOURCE=2 -fstack-protector-strong --param=ssp-buffer-size=4 -Werror=trampolines -fPIC -mtune=generic -march=x86-64 -gdwarf-4 -fno-debug-types-section -fvar-tracking-assignments -g2 -DNDEBUG -fno-omit-frame-pointer -fno-strict-aliasing -Wno-shadow -g -fno-omit-frame-pointer -fno-strict-aliasing -DDBUG_OFF -DNDEBUG -o CMakeFiles/mysqlservices.dir/rpl_transaction_ctx_service.c.o -c /tmp/B.bSxPY4/BUILD/percona-server-5.7.31-34/libservices/rpl_transaction_ctx_service.c make[2]: Leaving directory '/tmp/B.bSxPY4/BUILD/percona-server-5.7.31-34/build' make[1]: Entering directory '/tmp/B.bSxPY4/BUILD/percona-server-5.7.31-34/build' [ 2%] Built target zlib_decompress make[1]: Leaving directory '/tmp/B.bSxPY4/BUILD/percona-server-5.7.31-34/build' /usr/bin/make -f extra/CMakeFiles/lz4_decompress.dir/build.make extra/CMakeFiles/lz4_decompress.dir/depend make[2]: Entering directory '/tmp/B.bSxPY4/BUILD/percona-server-5.7.31-34/build' cd /tmp/B.bSxPY4/BUILD/percona-server-5.7.31-34/build && /usr/bin/cmake -E cmake_depends "Unix Makefiles" /tmp/B.bSxPY4/BUILD/percona-server-5.7.31-34 /tmp/B.bSxPY4/BUILD/percona-server-5.7.31-34/extra /tmp/B.bSxPY4/BUILD/percona-server-5.7.31-34/build /tmp/B.bSxPY4/BUILD/percona-server-5.7.31-34/build/extra /tmp/B.bSxPY4/BUILD/percona-server-5.7.31-34/build/extra/CMakeFiles/lz4_decompress.dir/DependInfo.cmake --color= Scanning dependencies of target lz4_decompress make[2]: Leaving directory '/tmp/B.bSxPY4/BUILD/percona-server-5.7.31-34/build' /usr/bin/make -f extra/CMakeFiles/lz4_decompress.dir/build.make extra/CMakeFiles/lz4_decompress.dir/build make[2]: Entering directory '/tmp/B.bSxPY4/BUILD/percona-server-5.7.31-34/build' [ 3%] Building C object libservices/CMakeFiles/mysqlservices.dir/rpl_transaction_write_set_service.c.o cd /tmp/B.bSxPY4/BUILD/percona-server-5.7.31-34/build/libservices && /usr/bin/x86_64-pld-linux-gnux32-gcc -DBOOST_GEOMETRY_SQRT_CHECK_FINITENESS -DHAVE_CONFIG_H -DHAVE_TLSv13 -DLZ4_DISABLE_DEPRECATE_WARNINGS -D_FILE_OFFSET_BITS=64 -D_GNU_SOURCE -D__STDC_WANT_LIB_EXT1__=1 -I/tmp/B.bSxPY4/BUILD/percona-server-5.7.31-34/build/include -I/tmp/B.bSxPY4/BUILD/percona-server-5.7.31-34/extra/rapidjson/include -I/tmp/B.bSxPY4/BUILD/percona-server-5.7.31-34/build/libbinlogevents/include -I/tmp/B.bSxPY4/BUILD/percona-server-5.7.31-34/libbinlogevents/export -I/tmp/B.bSxPY4/BUILD/percona-server-5.7.31-34/include -fPIC -Wall -Wextra -Wformat-security -Wvla -Wwrite-strings -Wdeclaration-after-statement -O3 -D_FORTIFY_SOURCE=2 -O2 -fwrapv -pipe -Wformat -Werror=format-security -gdwarf-4 -fno-debug-types-section -fvar-tracking-assignments -g2 -Wp,-D_FORTIFY_SOURCE=2 -fstack-protector-strong --param=ssp-buffer-size=4 -Werror=trampolines -fPIC -mtune=generic -march=x86-64 -gdwarf-4 -fno-debug-types-section -fvar-tracking-assignments -g2 -DNDEBUG -fno-omit-frame-pointer -fno-strict-aliasing -Wno-shadow -g -fno-omit-frame-pointer -fno-strict-aliasing -DDBUG_OFF -DNDEBUG -o CMakeFiles/mysqlservices.dir/rpl_transaction_write_set_service.c.o -c /tmp/B.bSxPY4/BUILD/percona-server-5.7.31-34/libservices/rpl_transaction_write_set_service.c make[2]: Leaving directory '/tmp/B.bSxPY4/BUILD/percona-server-5.7.31-34/build' make[2]: Entering directory '/tmp/B.bSxPY4/BUILD/percona-server-5.7.31-34/build' [ 1%] Building C object vio/CMakeFiles/vio.dir/viossl.c.o cd /tmp/B.bSxPY4/BUILD/percona-server-5.7.31-34/build/vio && /usr/bin/x86_64-pld-linux-gnux32-gcc -DBOOST_GEOMETRY_SQRT_CHECK_FINITENESS -DHAVE_CONFIG_H -DHAVE_TLSv13 -DLZ4_DISABLE_DEPRECATE_WARNINGS -D_FILE_OFFSET_BITS=64 -D_GNU_SOURCE -D__STDC_WANT_LIB_EXT1__=1 -I/tmp/B.bSxPY4/BUILD/percona-server-5.7.31-34/build/include -I/tmp/B.bSxPY4/BUILD/percona-server-5.7.31-34/extra/rapidjson/include -I/tmp/B.bSxPY4/BUILD/percona-server-5.7.31-34/build/libbinlogevents/include -I/tmp/B.bSxPY4/BUILD/percona-server-5.7.31-34/libbinlogevents/export -I/tmp/B.bSxPY4/BUILD/percona-server-5.7.31-34/include -fPIC -Wall -Wextra -Wformat-security -Wvla -Wwrite-strings -Wdeclaration-after-statement -O3 -D_FORTIFY_SOURCE=2 -O2 -fwrapv -pipe -Wformat -Werror=format-security -gdwarf-4 -fno-debug-types-section -fvar-tracking-assignments -g2 -Wp,-D_FORTIFY_SOURCE=2 -fstack-protector-strong --param=ssp-buffer-size=4 -Werror=trampolines -fPIC -mtune=generic -march=x86-64 -gdwarf-4 -fno-debug-types-section -fvar-tracking-assignments -g2 -DNDEBUG -fno-omit-frame-pointer -fno-strict-aliasing -Wno-shadow -g -fno-omit-frame-pointer -fno-strict-aliasing -DDBUG_OFF -DNDEBUG -DHAVE_OPENSSL -o CMakeFiles/vio.dir/viossl.c.o -c /tmp/B.bSxPY4/BUILD/percona-server-5.7.31-34/vio/viossl.c make[2]: Leaving directory '/tmp/B.bSxPY4/BUILD/percona-server-5.7.31-34/build' make[2]: Entering directory '/tmp/B.bSxPY4/BUILD/percona-server-5.7.31-34/build' [ 3%] Building C object libservices/CMakeFiles/mysqlservices.dir/security_context_service.c.o cd /tmp/B.bSxPY4/BUILD/percona-server-5.7.31-34/build/libservices && /usr/bin/x86_64-pld-linux-gnux32-gcc -DBOOST_GEOMETRY_SQRT_CHECK_FINITENESS -DHAVE_CONFIG_H -DHAVE_TLSv13 -DLZ4_DISABLE_DEPRECATE_WARNINGS -D_FILE_OFFSET_BITS=64 -D_GNU_SOURCE -D__STDC_WANT_LIB_EXT1__=1 -I/tmp/B.bSxPY4/BUILD/percona-server-5.7.31-34/build/include -I/tmp/B.bSxPY4/BUILD/percona-server-5.7.31-34/extra/rapidjson/include -I/tmp/B.bSxPY4/BUILD/percona-server-5.7.31-34/build/libbinlogevents/include -I/tmp/B.bSxPY4/BUILD/percona-server-5.7.31-34/libbinlogevents/export -I/tmp/B.bSxPY4/BUILD/percona-server-5.7.31-34/include -fPIC -Wall -Wextra -Wformat-security -Wvla -Wwrite-strings -Wdeclaration-after-statement -O3 -D_FORTIFY_SOURCE=2 -O2 -fwrapv -pipe -Wformat -Werror=format-security -gdwarf-4 -fno-debug-types-section -fvar-tracking-assignments -g2 -Wp,-D_FORTIFY_SOURCE=2 -fstack-protector-strong --param=ssp-buffer-size=4 -Werror=trampolines -fPIC -mtune=generic -march=x86-64 -gdwarf-4 -fno-debug-types-section -fvar-tracking-assignments -g2 -DNDEBUG -fno-omit-frame-pointer -fno-strict-aliasing -Wno-shadow -g -fno-omit-frame-pointer -fno-strict-aliasing -DDBUG_OFF -DNDEBUG -o CMakeFiles/mysqlservices.dir/security_context_service.c.o -c /tmp/B.bSxPY4/BUILD/percona-server-5.7.31-34/libservices/security_context_service.c make[2]: Leaving directory '/tmp/B.bSxPY4/BUILD/percona-server-5.7.31-34/build' make[2]: Entering directory '/tmp/B.bSxPY4/BUILD/percona-server-5.7.31-34/build' [ 3%] Building C object libservices/CMakeFiles/mysqlservices.dir/mysql_keyring_service.c.o cd /tmp/B.bSxPY4/BUILD/percona-server-5.7.31-34/build/libservices && /usr/bin/x86_64-pld-linux-gnux32-gcc -DBOOST_GEOMETRY_SQRT_CHECK_FINITENESS -DHAVE_CONFIG_H -DHAVE_TLSv13 -DLZ4_DISABLE_DEPRECATE_WARNINGS -D_FILE_OFFSET_BITS=64 -D_GNU_SOURCE -D__STDC_WANT_LIB_EXT1__=1 -I/tmp/B.bSxPY4/BUILD/percona-server-5.7.31-34/build/include -I/tmp/B.bSxPY4/BUILD/percona-server-5.7.31-34/extra/rapidjson/include -I/tmp/B.bSxPY4/BUILD/percona-server-5.7.31-34/build/libbinlogevents/include -I/tmp/B.bSxPY4/BUILD/percona-server-5.7.31-34/libbinlogevents/export -I/tmp/B.bSxPY4/BUILD/percona-server-5.7.31-34/include -fPIC -Wall -Wextra -Wformat-security -Wvla -Wwrite-strings -Wdeclaration-after-statement -O3 -D_FORTIFY_SOURCE=2 -O2 -fwrapv -pipe -Wformat -Werror=format-security -gdwarf-4 -fno-debug-types-section -fvar-tracking-assignments -g2 -Wp,-D_FORTIFY_SOURCE=2 -fstack-protector-strong --param=ssp-buffer-size=4 -Werror=trampolines -fPIC -mtune=generic -march=x86-64 -gdwarf-4 -fno-debug-types-section -fvar-tracking-assignments -g2 -DNDEBUG -fno-omit-frame-pointer -fno-strict-aliasing -Wno-shadow -g -fno-omit-frame-pointer -fno-strict-aliasing -DDBUG_OFF -DNDEBUG -o CMakeFiles/mysqlservices.dir/mysql_keyring_service.c.o -c /tmp/B.bSxPY4/BUILD/percona-server-5.7.31-34/libservices/mysql_keyring_service.c make[2]: Leaving directory '/tmp/B.bSxPY4/BUILD/percona-server-5.7.31-34/build' make[2]: Entering directory '/tmp/B.bSxPY4/BUILD/percona-server-5.7.31-34/build' [ 1%] Building C object regex/CMakeFiles/regex.dir/regcomp.c.o cd /tmp/B.bSxPY4/BUILD/percona-server-5.7.31-34/build/regex && /usr/bin/x86_64-pld-linux-gnux32-gcc -DBOOST_GEOMETRY_SQRT_CHECK_FINITENESS -DHAVE_CONFIG_H -DHAVE_TLSv13 -DLZ4_DISABLE_DEPRECATE_WARNINGS -D_FILE_OFFSET_BITS=64 -D_GNU_SOURCE -D__STDC_WANT_LIB_EXT1__=1 -I/tmp/B.bSxPY4/BUILD/percona-server-5.7.31-34/build/include -I/tmp/B.bSxPY4/BUILD/percona-server-5.7.31-34/extra/rapidjson/include -I/tmp/B.bSxPY4/BUILD/percona-server-5.7.31-34/build/libbinlogevents/include -I/tmp/B.bSxPY4/BUILD/percona-server-5.7.31-34/libbinlogevents/export -I/tmp/B.bSxPY4/BUILD/percona-server-5.7.31-34/include -fPIC -Wall -Wextra -Wformat-security -Wvla -Wwrite-strings -Wdeclaration-after-statement -O3 -D_FORTIFY_SOURCE=2 -O2 -fwrapv -pipe -Wformat -Werror=format-security -gdwarf-4 -fno-debug-types-section -fvar-tracking-assignments -g2 -Wp,-D_FORTIFY_SOURCE=2 -fstack-protector-strong --param=ssp-buffer-size=4 -Werror=trampolines -fPIC -mtune=generic -march=x86-64 -gdwarf-4 -fno-debug-types-section -fvar-tracking-assignments -g2 -DNDEBUG -fno-omit-frame-pointer -fno-strict-aliasing -Wno-shadow -g -fno-omit-frame-pointer -fno-strict-aliasing -DDBUG_OFF -DNDEBUG -o CMakeFiles/regex.dir/regcomp.c.o -c /tmp/B.bSxPY4/BUILD/percona-server-5.7.31-34/regex/regcomp.c make[2]: Leaving directory '/tmp/B.bSxPY4/BUILD/percona-server-5.7.31-34/build' /usr/bin/make -f scripts/CMakeFiles/comp_sql.dir/build.make scripts/CMakeFiles/comp_sql.dir/depend make[2]: Entering directory '/tmp/B.bSxPY4/BUILD/percona-server-5.7.31-34/build' [ 2%] Building C object strings/CMakeFiles/strings.dir/ctype-bin.c.o cd /tmp/B.bSxPY4/BUILD/percona-server-5.7.31-34/build/strings && /usr/bin/x86_64-pld-linux-gnux32-gcc -DBOOST_GEOMETRY_SQRT_CHECK_FINITENESS -DDISABLE_MYSQL_THREAD_H -DHAVE_CONFIG_H -DHAVE_TLSv13 -DLZ4_DISABLE_DEPRECATE_WARNINGS -D_FILE_OFFSET_BITS=64 -D_GNU_SOURCE -D__STDC_WANT_LIB_EXT1__=1 -I/tmp/B.bSxPY4/BUILD/percona-server-5.7.31-34/build/include -I/tmp/B.bSxPY4/BUILD/percona-server-5.7.31-34/extra/rapidjson/include -I/tmp/B.bSxPY4/BUILD/percona-server-5.7.31-34/build/libbinlogevents/include -I/tmp/B.bSxPY4/BUILD/percona-server-5.7.31-34/libbinlogevents/export -I/tmp/B.bSxPY4/BUILD/percona-server-5.7.31-34/include -fPIC -Wall -Wextra -Wformat-security -Wvla -Wwrite-strings -Wdeclaration-after-statement -O3 -D_FORTIFY_SOURCE=2 -O2 -fwrapv -pipe -Wformat -Werror=format-security -gdwarf-4 -fno-debug-types-section -fvar-tracking-assignments -g2 -Wp,-D_FORTIFY_SOURCE=2 -fstack-protector-strong --param=ssp-buffer-size=4 -Werror=trampolines -fPIC -mtune=generic -march=x86-64 -gdwarf-4 -fno-debug-types-section -fvar-tracking-assignments -g2 -DNDEBUG -fno-omit-frame-pointer -fno-strict-aliasing -Wno-shadow -g -fno-omit-frame-pointer -fno-strict-aliasing -DDBUG_OFF -DNDEBUG -o CMakeFiles/strings.dir/ctype-bin.c.o -c /tmp/B.bSxPY4/BUILD/percona-server-5.7.31-34/strings/ctype-bin.c make[2]: Leaving directory '/tmp/B.bSxPY4/BUILD/percona-server-5.7.31-34/build' make[2]: Entering directory '/tmp/B.bSxPY4/BUILD/percona-server-5.7.31-34/build' cd /tmp/B.bSxPY4/BUILD/percona-server-5.7.31-34/build && /usr/bin/cmake -E cmake_depends "Unix Makefiles" /tmp/B.bSxPY4/BUILD/percona-server-5.7.31-34 /tmp/B.bSxPY4/BUILD/percona-server-5.7.31-34/scripts /tmp/B.bSxPY4/BUILD/percona-server-5.7.31-34/build /tmp/B.bSxPY4/BUILD/percona-server-5.7.31-34/build/scripts /tmp/B.bSxPY4/BUILD/percona-server-5.7.31-34/build/scripts/CMakeFiles/comp_sql.dir/DependInfo.cmake --color= Scanning dependencies of target comp_sql make[2]: Leaving directory '/tmp/B.bSxPY4/BUILD/percona-server-5.7.31-34/build' /usr/bin/make -f scripts/CMakeFiles/comp_sql.dir/build.make scripts/CMakeFiles/comp_sql.dir/build make[2]: Entering directory '/tmp/B.bSxPY4/BUILD/percona-server-5.7.31-34/build' [ 1%] Building CXX object libbinlogstandalone/src/CMakeFiles/binlogstandalone_shared.dir/__/__/libbinlogevents/src/load_data_events.cpp.o cd /tmp/B.bSxPY4/BUILD/percona-server-5.7.31-34/build/libbinlogstandalone/src && /usr/bin/x86_64-pld-linux-gnux32-g++ -DBOOST_GEOMETRY_SQRT_CHECK_FINITENESS -DHAVE_CONFIG_H -DHAVE_TLSv13 -DLZ4_DISABLE_DEPRECATE_WARNINGS -DSTANDALONE_BINLOG -D_FILE_OFFSET_BITS=64 -D_GNU_SOURCE -D__STDC_WANT_LIB_EXT1__=1 -Dbinlogstandalone_shared_EXPORTS -I/tmp/B.bSxPY4/BUILD/percona-server-5.7.31-34/build/include -I/tmp/B.bSxPY4/BUILD/percona-server-5.7.31-34/extra/rapidjson/include -I/tmp/B.bSxPY4/BUILD/percona-server-5.7.31-34/build/libbinlogevents/include -I/tmp/B.bSxPY4/BUILD/percona-server-5.7.31-34/libbinlogevents/export -I/tmp/B.bSxPY4/BUILD/percona-server-5.7.31-34/include -I/tmp/B.bSxPY4/BUILD/percona-server-5.7.31-34/libbinlogevents/include -I/tmp/B.bSxPY4/BUILD/percona-server-5.7.31-34/build/libbinlogstandalone/../libbinlogevents/include -I/tmp/B.bSxPY4/BUILD/percona-server-5.7.31-34/build/libbinlogstandalone/libbinlogevents/export -fPIC -Wall -Wextra -Wformat-security -Wvla -Woverloaded-virtual -Wno-unused-parameter -O3 -D_FORTIFY_SOURCE=2 -g -fno-omit-frame-pointer -fno-strict-aliasing -DDBUG_OFF -DNDEBUG -fPIC -std=gnu++11 -o CMakeFiles/binlogstandalone_shared.dir/__/__/libbinlogevents/src/load_data_events.cpp.o -c /tmp/B.bSxPY4/BUILD/percona-server-5.7.31-34/libbinlogevents/src/load_data_events.cpp make[2]: Leaving directory '/tmp/B.bSxPY4/BUILD/percona-server-5.7.31-34/build' make[2]: Entering directory '/tmp/B.bSxPY4/BUILD/percona-server-5.7.31-34/build' [ 1%] Building C object vio/CMakeFiles/vio.dir/viosocket.c.o cd /tmp/B.bSxPY4/BUILD/percona-server-5.7.31-34/build/vio && /usr/bin/x86_64-pld-linux-gnux32-gcc -DBOOST_GEOMETRY_SQRT_CHECK_FINITENESS -DHAVE_CONFIG_H -DHAVE_TLSv13 -DLZ4_DISABLE_DEPRECATE_WARNINGS -D_FILE_OFFSET_BITS=64 -D_GNU_SOURCE -D__STDC_WANT_LIB_EXT1__=1 -I/tmp/B.bSxPY4/BUILD/percona-server-5.7.31-34/build/include -I/tmp/B.bSxPY4/BUILD/percona-server-5.7.31-34/extra/rapidjson/include -I/tmp/B.bSxPY4/BUILD/percona-server-5.7.31-34/build/libbinlogevents/include -I/tmp/B.bSxPY4/BUILD/percona-server-5.7.31-34/libbinlogevents/export -I/tmp/B.bSxPY4/BUILD/percona-server-5.7.31-34/include -fPIC -Wall -Wextra -Wformat-security -Wvla -Wwrite-strings -Wdeclaration-after-statement -O3 -D_FORTIFY_SOURCE=2 -O2 -fwrapv -pipe -Wformat -Werror=format-security -gdwarf-4 -fno-debug-types-section -fvar-tracking-assignments -g2 -Wp,-D_FORTIFY_SOURCE=2 -fstack-protector-strong --param=ssp-buffer-size=4 -Werror=trampolines -fPIC -mtune=generic -march=x86-64 -gdwarf-4 -fno-debug-types-section -fvar-tracking-assignments -g2 -DNDEBUG -fno-omit-frame-pointer -fno-strict-aliasing -Wno-shadow -g -fno-omit-frame-pointer -fno-strict-aliasing -DDBUG_OFF -DNDEBUG -DHAVE_OPENSSL -o CMakeFiles/vio.dir/viosocket.c.o -c /tmp/B.bSxPY4/BUILD/percona-server-5.7.31-34/vio/viosocket.c make[2]: Leaving directory '/tmp/B.bSxPY4/BUILD/percona-server-5.7.31-34/build' make[2]: Entering directory '/tmp/B.bSxPY4/BUILD/percona-server-5.7.31-34/build' [ 3%] Linking C static library ../archive_output_directory/libmysqlservices.a cd /tmp/B.bSxPY4/BUILD/percona-server-5.7.31-34/build/libservices && /usr/bin/cmake -P CMakeFiles/mysqlservices.dir/cmake_clean_target.cmake cd /tmp/B.bSxPY4/BUILD/percona-server-5.7.31-34/build/libservices && /usr/bin/cmake -E cmake_link_script CMakeFiles/mysqlservices.dir/link.txt --verbose=1 /usr/bin/ar qc ../archive_output_directory/libmysqlservices.a CMakeFiles/mysqlservices.dir/service_command.c.o CMakeFiles/mysqlservices.dir/locking_service.c.o CMakeFiles/mysqlservices.dir/srv_session_service.c.o CMakeFiles/mysqlservices.dir/my_snprintf_service.c.o CMakeFiles/mysqlservices.dir/thd_alloc_service.c.o CMakeFiles/mysqlservices.dir/thd_wait_service.c.o CMakeFiles/mysqlservices.dir/my_plugin_log_service.c.o CMakeFiles/mysqlservices.dir/my_thread_scheduler_service.c.o CMakeFiles/mysqlservices.dir/mysql_string_service.c.o CMakeFiles/mysqlservices.dir/mysql_malloc_service.c.o CMakeFiles/mysqlservices.dir/mysql_password_policy_service.c.o CMakeFiles/mysqlservices.dir/parser_service.c.o CMakeFiles/mysqlservices.dir/srv_session_info_service.c.o CMakeFiles/mysqlservices.dir/rpl_transaction_ctx_service.c.o CMakeFiles/mysqlservices.dir/rpl_transaction_write_set_service.c.o CMakeFiles/mysqlservices.dir/security_context_service.c.o CMakeFiles/mysqlservices.dir/mysql_keyring_service.c.o /usr/bin/ranlib ../archive_output_directory/libmysqlservices.a cd /tmp/B.bSxPY4/BUILD/percona-server-5.7.31-34/build/libservices && /usr/bin/cmake -DTARGET_NAME=mysqlservices -DTARGET_LOC=/tmp/B.bSxPY4/BUILD/percona-server-5.7.31-34/build/archive_output_directory/libmysqlservices.a -DCFG_INTDIR=. -P /tmp/B.bSxPY4/BUILD/percona-server-5.7.31-34/build/archive_output_directory/lib_location_mysqlservices.cmake make[2]: Leaving directory '/tmp/B.bSxPY4/BUILD/percona-server-5.7.31-34/build' make[2]: Entering directory '/tmp/B.bSxPY4/BUILD/percona-server-5.7.31-34/build' [ 0%] Building CXX object libbinlogstandalone/src/CMakeFiles/binlogstandalone_static.dir/__/__/libbinlogevents/src/load_data_events.cpp.o cd /tmp/B.bSxPY4/BUILD/percona-server-5.7.31-34/build/libbinlogstandalone/src && /usr/bin/x86_64-pld-linux-gnux32-g++ -DBOOST_GEOMETRY_SQRT_CHECK_FINITENESS -DHAVE_CONFIG_H -DHAVE_TLSv13 -DLZ4_DISABLE_DEPRECATE_WARNINGS -DSTANDALONE_BINLOG -D_FILE_OFFSET_BITS=64 -D_GNU_SOURCE -D__STDC_WANT_LIB_EXT1__=1 -I/tmp/B.bSxPY4/BUILD/percona-server-5.7.31-34/build/include -I/tmp/B.bSxPY4/BUILD/percona-server-5.7.31-34/extra/rapidjson/include -I/tmp/B.bSxPY4/BUILD/percona-server-5.7.31-34/build/libbinlogevents/include -I/tmp/B.bSxPY4/BUILD/percona-server-5.7.31-34/libbinlogevents/export -I/tmp/B.bSxPY4/BUILD/percona-server-5.7.31-34/include -I/tmp/B.bSxPY4/BUILD/percona-server-5.7.31-34/libbinlogevents/include -I/tmp/B.bSxPY4/BUILD/percona-server-5.7.31-34/build/libbinlogstandalone/../libbinlogevents/include -I/tmp/B.bSxPY4/BUILD/percona-server-5.7.31-34/build/libbinlogstandalone/libbinlogevents/export -fPIC -Wall -Wextra -Wformat-security -Wvla -Woverloaded-virtual -Wno-unused-parameter -O3 -D_FORTIFY_SOURCE=2 -g -fno-omit-frame-pointer -fno-strict-aliasing -DDBUG_OFF -DNDEBUG -std=gnu++11 -o CMakeFiles/binlogstandalone_static.dir/__/__/libbinlogevents/src/load_data_events.cpp.o -c /tmp/B.bSxPY4/BUILD/percona-server-5.7.31-34/libbinlogevents/src/load_data_events.cpp make[2]: Leaving directory '/tmp/B.bSxPY4/BUILD/percona-server-5.7.31-34/build' make[2]: Entering directory '/tmp/B.bSxPY4/BUILD/percona-server-5.7.31-34/build' [ 3%] Building C object regex/CMakeFiles/regex.dir/regerror.c.o cd /tmp/B.bSxPY4/BUILD/percona-server-5.7.31-34/build/regex && /usr/bin/x86_64-pld-linux-gnux32-gcc -DBOOST_GEOMETRY_SQRT_CHECK_FINITENESS -DHAVE_CONFIG_H -DHAVE_TLSv13 -DLZ4_DISABLE_DEPRECATE_WARNINGS -D_FILE_OFFSET_BITS=64 -D_GNU_SOURCE -D__STDC_WANT_LIB_EXT1__=1 -I/tmp/B.bSxPY4/BUILD/percona-server-5.7.31-34/build/include -I/tmp/B.bSxPY4/BUILD/percona-server-5.7.31-34/extra/rapidjson/include -I/tmp/B.bSxPY4/BUILD/percona-server-5.7.31-34/build/libbinlogevents/include -I/tmp/B.bSxPY4/BUILD/percona-server-5.7.31-34/libbinlogevents/export -I/tmp/B.bSxPY4/BUILD/percona-server-5.7.31-34/include -fPIC -Wall -Wextra -Wformat-security -Wvla -Wwrite-strings -Wdeclaration-after-statement -O3 -D_FORTIFY_SOURCE=2 -O2 -fwrapv -pipe -Wformat -Werror=format-security -gdwarf-4 -fno-debug-types-section -fvar-tracking-assignments -g2 -Wp,-D_FORTIFY_SOURCE=2 -fstack-protector-strong --param=ssp-buffer-size=4 -Werror=trampolines -fPIC -mtune=generic -march=x86-64 -gdwarf-4 -fno-debug-types-section -fvar-tracking-assignments -g2 -DNDEBUG -fno-omit-frame-pointer -fno-strict-aliasing -Wno-shadow -g -fno-omit-frame-pointer -fno-strict-aliasing -DDBUG_OFF -DNDEBUG -o CMakeFiles/regex.dir/regerror.c.o -c /tmp/B.bSxPY4/BUILD/percona-server-5.7.31-34/regex/regerror.c make[2]: Leaving directory '/tmp/B.bSxPY4/BUILD/percona-server-5.7.31-34/build' make[2]: Entering directory '/tmp/B.bSxPY4/BUILD/percona-server-5.7.31-34/build' [ 3%] Building CXX object extra/CMakeFiles/lz4_decompress.dir/lz4_decompress.cc.o cd /tmp/B.bSxPY4/BUILD/percona-server-5.7.31-34/build/extra && /usr/bin/x86_64-pld-linux-gnux32-g++ -DBOOST_GEOMETRY_SQRT_CHECK_FINITENESS -DHAVE_CONFIG_H -DHAVE_LZ4=1 -DHAVE_TLSv13 -DLZ4_DISABLE_DEPRECATE_WARNINGS -DMUTEX_EVENT -DUNIV_INNOCHECKSUM -D_FILE_OFFSET_BITS=64 -D_GNU_SOURCE -D__STDC_WANT_LIB_EXT1__=1 -I/tmp/B.bSxPY4/BUILD/percona-server-5.7.31-34/build/include -I/tmp/B.bSxPY4/BUILD/percona-server-5.7.31-34/extra/rapidjson/include -I/tmp/B.bSxPY4/BUILD/percona-server-5.7.31-34/build/libbinlogevents/include -I/tmp/B.bSxPY4/BUILD/percona-server-5.7.31-34/libbinlogevents/export -I/tmp/B.bSxPY4/BUILD/percona-server-5.7.31-34/include -I/tmp/B.bSxPY4/BUILD/percona-server-5.7.31-34/storage/ndb/include -I/tmp/B.bSxPY4/BUILD/percona-server-5.7.31-34/build/storage/ndb/include -I/tmp/B.bSxPY4/BUILD/percona-server-5.7.31-34/storage/ndb/include/ndbapi -I/tmp/B.bSxPY4/BUILD/percona-server-5.7.31-34/storage/ndb/include/mgmapi -I/tmp/B.bSxPY4/BUILD/percona-server-5.7.31-34/storage/innobase/include -I/tmp/B.bSxPY4/BUILD/percona-server-5.7.31-34/sql -fPIC -Wall -Wextra -Wformat-security -Wvla -Woverloaded-virtual -Wno-unused-parameter -O3 -D_FORTIFY_SOURCE=2 -g -fno-omit-frame-pointer -fno-strict-aliasing -DDBUG_OFF -DNDEBUG -Wno-class-memaccess -std=gnu++11 -o CMakeFiles/lz4_decompress.dir/lz4_decompress.cc.o -c /tmp/B.bSxPY4/BUILD/percona-server-5.7.31-34/extra/lz4_decompress.cc make[2]: Leaving directory '/tmp/B.bSxPY4/BUILD/percona-server-5.7.31-34/build' make[1]: Entering directory '/tmp/B.bSxPY4/BUILD/percona-server-5.7.31-34/build' [ 3%] Built target mysqlservices make[1]: Leaving directory '/tmp/B.bSxPY4/BUILD/percona-server-5.7.31-34/build' make[2]: Entering directory '/tmp/B.bSxPY4/BUILD/percona-server-5.7.31-34/build' [ 3%] Building C object scripts/CMakeFiles/comp_sql.dir/comp_sql.c.o cd /tmp/B.bSxPY4/BUILD/percona-server-5.7.31-34/build/scripts && /usr/bin/x86_64-pld-linux-gnux32-gcc -DBOOST_GEOMETRY_SQRT_CHECK_FINITENESS -DHAVE_CONFIG_H -DHAVE_TLSv13 -DLZ4_DISABLE_DEPRECATE_WARNINGS -D_FILE_OFFSET_BITS=64 -D_GNU_SOURCE -D__STDC_WANT_LIB_EXT1__=1 -I/tmp/B.bSxPY4/BUILD/percona-server-5.7.31-34/build/include -I/tmp/B.bSxPY4/BUILD/percona-server-5.7.31-34/extra/rapidjson/include -I/tmp/B.bSxPY4/BUILD/percona-server-5.7.31-34/build/libbinlogevents/include -I/tmp/B.bSxPY4/BUILD/percona-server-5.7.31-34/libbinlogevents/export -fPIC -Wall -Wextra -Wformat-security -Wvla -Wwrite-strings -Wdeclaration-after-statement -O3 -D_FORTIFY_SOURCE=2 -O2 -fwrapv -pipe -Wformat -Werror=format-security -gdwarf-4 -fno-debug-types-section -fvar-tracking-assignments -g2 -Wp,-D_FORTIFY_SOURCE=2 -fstack-protector-strong --param=ssp-buffer-size=4 -Werror=trampolines -fPIC -mtune=generic -march=x86-64 -gdwarf-4 -fno-debug-types-section -fvar-tracking-assignments -g2 -DNDEBUG -fno-omit-frame-pointer -fno-strict-aliasing -Wno-shadow -g -fno-omit-frame-pointer -fno-strict-aliasing -DDBUG_OFF -DNDEBUG -o CMakeFiles/comp_sql.dir/comp_sql.c.o -c /tmp/B.bSxPY4/BUILD/percona-server-5.7.31-34/scripts/comp_sql.c make[2]: Leaving directory '/tmp/B.bSxPY4/BUILD/percona-server-5.7.31-34/build' make[2]: Entering directory '/tmp/B.bSxPY4/BUILD/percona-server-5.7.31-34/build' [ 3%] Linking CXX executable lz4_decompress cd /tmp/B.bSxPY4/BUILD/percona-server-5.7.31-34/build/extra && /usr/bin/cmake -E cmake_link_script CMakeFiles/lz4_decompress.dir/link.txt --verbose=1 /usr/bin/x86_64-pld-linux-gnux32-g++ -fPIC -Wall -Wextra -Wformat-security -Wvla -Woverloaded-virtual -Wno-unused-parameter -O3 -D_FORTIFY_SOURCE=2 -g -fno-omit-frame-pointer -fno-strict-aliasing -DDBUG_OFF -DNDEBUG -Wno-class-memaccess CMakeFiles/lz4_decompress.dir/lz4_decompress.cc.o -o lz4_decompress -lpthread -llz4 make[2]: Leaving directory '/tmp/B.bSxPY4/BUILD/percona-server-5.7.31-34/build' make[2]: Entering directory '/tmp/B.bSxPY4/BUILD/percona-server-5.7.31-34/build' [ 3%] Linking C executable comp_sql cd /tmp/B.bSxPY4/BUILD/percona-server-5.7.31-34/build/scripts && /usr/bin/cmake -E cmake_link_script CMakeFiles/comp_sql.dir/link.txt --verbose=1 /usr/bin/x86_64-pld-linux-gnux32-gcc -fPIC -Wall -Wextra -Wformat-security -Wvla -Wwrite-strings -Wdeclaration-after-statement -O3 -D_FORTIFY_SOURCE=2 -O2 -fwrapv -pipe -Wformat -Werror=format-security -gdwarf-4 -fno-debug-types-section -fvar-tracking-assignments -g2 -Wp,-D_FORTIFY_SOURCE=2 -fstack-protector-strong --param=ssp-buffer-size=4 -Werror=trampolines -fPIC -mtune=generic -march=x86-64 -gdwarf-4 -fno-debug-types-section -fvar-tracking-assignments -g2 -DNDEBUG -fno-omit-frame-pointer -fno-strict-aliasing -Wno-shadow -g -fno-omit-frame-pointer -fno-strict-aliasing -DDBUG_OFF -DNDEBUG CMakeFiles/comp_sql.dir/comp_sql.c.o -o comp_sql -lpthread make[2]: Leaving directory '/tmp/B.bSxPY4/BUILD/percona-server-5.7.31-34/build' make[1]: Entering directory '/tmp/B.bSxPY4/BUILD/percona-server-5.7.31-34/build' [ 3%] Built target lz4_decompress make[1]: Leaving directory '/tmp/B.bSxPY4/BUILD/percona-server-5.7.31-34/build' /usr/bin/make -f client/dump/CMakeFiles/boost_lib.dir/build.make client/dump/CMakeFiles/boost_lib.dir/depend make[1]: Entering directory '/tmp/B.bSxPY4/BUILD/percona-server-5.7.31-34/build' [ 3%] Built target comp_sql make[1]: Leaving directory '/tmp/B.bSxPY4/BUILD/percona-server-5.7.31-34/build' make[2]: Entering directory '/tmp/B.bSxPY4/BUILD/percona-server-5.7.31-34/build' [ 3%] Building C object vio/CMakeFiles/vio.dir/viosslfactories.c.o cd /tmp/B.bSxPY4/BUILD/percona-server-5.7.31-34/build/vio && /usr/bin/x86_64-pld-linux-gnux32-gcc -DBOOST_GEOMETRY_SQRT_CHECK_FINITENESS -DHAVE_CONFIG_H -DHAVE_TLSv13 -DLZ4_DISABLE_DEPRECATE_WARNINGS -D_FILE_OFFSET_BITS=64 -D_GNU_SOURCE -D__STDC_WANT_LIB_EXT1__=1 -I/tmp/B.bSxPY4/BUILD/percona-server-5.7.31-34/build/include -I/tmp/B.bSxPY4/BUILD/percona-server-5.7.31-34/extra/rapidjson/include -I/tmp/B.bSxPY4/BUILD/percona-server-5.7.31-34/build/libbinlogevents/include -I/tmp/B.bSxPY4/BUILD/percona-server-5.7.31-34/libbinlogevents/export -I/tmp/B.bSxPY4/BUILD/percona-server-5.7.31-34/include -fPIC -Wall -Wextra -Wformat-security -Wvla -Wwrite-strings -Wdeclaration-after-statement -O3 -D_FORTIFY_SOURCE=2 -O2 -fwrapv -pipe -Wformat -Werror=format-security -gdwarf-4 -fno-debug-types-section -fvar-tracking-assignments -g2 -Wp,-D_FORTIFY_SOURCE=2 -fstack-protector-strong --param=ssp-buffer-size=4 -Werror=trampolines -fPIC -mtune=generic -march=x86-64 -gdwarf-4 -fno-debug-types-section -fvar-tracking-assignments -g2 -DNDEBUG -fno-omit-frame-pointer -fno-strict-aliasing -Wno-shadow -g -fno-omit-frame-pointer -fno-strict-aliasing -DDBUG_OFF -DNDEBUG -DHAVE_OPENSSL -o CMakeFiles/vio.dir/viosslfactories.c.o -c /tmp/B.bSxPY4/BUILD/percona-server-5.7.31-34/vio/viosslfactories.c make[2]: Leaving directory '/tmp/B.bSxPY4/BUILD/percona-server-5.7.31-34/build' make[2]: Entering directory '/tmp/B.bSxPY4/BUILD/percona-server-5.7.31-34/build' cd /tmp/B.bSxPY4/BUILD/percona-server-5.7.31-34/build && /usr/bin/cmake -E cmake_depends "Unix Makefiles" /tmp/B.bSxPY4/BUILD/percona-server-5.7.31-34 /tmp/B.bSxPY4/BUILD/percona-server-5.7.31-34/client/dump /tmp/B.bSxPY4/BUILD/percona-server-5.7.31-34/build /tmp/B.bSxPY4/BUILD/percona-server-5.7.31-34/build/client/dump /tmp/B.bSxPY4/BUILD/percona-server-5.7.31-34/build/client/dump/CMakeFiles/boost_lib.dir/DependInfo.cmake --color= Scanning dependencies of target boost_lib make[2]: Leaving directory '/tmp/B.bSxPY4/BUILD/percona-server-5.7.31-34/build' /usr/bin/make -f client/dump/CMakeFiles/boost_lib.dir/build.make client/dump/CMakeFiles/boost_lib.dir/build make[2]: Entering directory '/tmp/B.bSxPY4/BUILD/percona-server-5.7.31-34/build' [ 3%] Linking C static library ../archive_output_directory/libvio.a cd /tmp/B.bSxPY4/BUILD/percona-server-5.7.31-34/build/vio && /usr/bin/cmake -P CMakeFiles/vio.dir/cmake_clean_target.cmake cd /tmp/B.bSxPY4/BUILD/percona-server-5.7.31-34/build/vio && /usr/bin/cmake -E cmake_link_script CMakeFiles/vio.dir/link.txt --verbose=1 /usr/bin/ar qc ../archive_output_directory/libvio.a CMakeFiles/vio.dir/vio.c.o CMakeFiles/vio.dir/viosocket.c.o CMakeFiles/vio.dir/viossl.c.o CMakeFiles/vio.dir/viosslfactories.c.o /usr/bin/ranlib ../archive_output_directory/libvio.a cd /tmp/B.bSxPY4/BUILD/percona-server-5.7.31-34/build/vio && /usr/bin/cmake -DTARGET_NAME=vio -DTARGET_LOC=/tmp/B.bSxPY4/BUILD/percona-server-5.7.31-34/build/archive_output_directory/libvio.a -DCFG_INTDIR=. -P /tmp/B.bSxPY4/BUILD/percona-server-5.7.31-34/build/archive_output_directory/lib_location_vio.cmake make[2]: Leaving directory '/tmp/B.bSxPY4/BUILD/percona-server-5.7.31-34/build' make[1]: Entering directory '/tmp/B.bSxPY4/BUILD/percona-server-5.7.31-34/build' [ 3%] Built target vio make[1]: Leaving directory '/tmp/B.bSxPY4/BUILD/percona-server-5.7.31-34/build' /usr/bin/make -f sql/CMakeFiles/gen_lex_hash.dir/build.make sql/CMakeFiles/gen_lex_hash.dir/depend make[2]: Entering directory '/tmp/B.bSxPY4/BUILD/percona-server-5.7.31-34/build' [ 3%] Building C object regex/CMakeFiles/regex.dir/regfree.c.o cd /tmp/B.bSxPY4/BUILD/percona-server-5.7.31-34/build/regex && /usr/bin/x86_64-pld-linux-gnux32-gcc -DBOOST_GEOMETRY_SQRT_CHECK_FINITENESS -DHAVE_CONFIG_H -DHAVE_TLSv13 -DLZ4_DISABLE_DEPRECATE_WARNINGS -D_FILE_OFFSET_BITS=64 -D_GNU_SOURCE -D__STDC_WANT_LIB_EXT1__=1 -I/tmp/B.bSxPY4/BUILD/percona-server-5.7.31-34/build/include -I/tmp/B.bSxPY4/BUILD/percona-server-5.7.31-34/extra/rapidjson/include -I/tmp/B.bSxPY4/BUILD/percona-server-5.7.31-34/build/libbinlogevents/include -I/tmp/B.bSxPY4/BUILD/percona-server-5.7.31-34/libbinlogevents/export -I/tmp/B.bSxPY4/BUILD/percona-server-5.7.31-34/include -fPIC -Wall -Wextra -Wformat-security -Wvla -Wwrite-strings -Wdeclaration-after-statement -O3 -D_FORTIFY_SOURCE=2 -O2 -fwrapv -pipe -Wformat -Werror=format-security -gdwarf-4 -fno-debug-types-section -fvar-tracking-assignments -g2 -Wp,-D_FORTIFY_SOURCE=2 -fstack-protector-strong --param=ssp-buffer-size=4 -Werror=trampolines -fPIC -mtune=generic -march=x86-64 -gdwarf-4 -fno-debug-types-section -fvar-tracking-assignments -g2 -DNDEBUG -fno-omit-frame-pointer -fno-strict-aliasing -Wno-shadow -g -fno-omit-frame-pointer -fno-strict-aliasing -DDBUG_OFF -DNDEBUG -o CMakeFiles/regex.dir/regfree.c.o -c /tmp/B.bSxPY4/BUILD/percona-server-5.7.31-34/regex/regfree.c make[2]: Leaving directory '/tmp/B.bSxPY4/BUILD/percona-server-5.7.31-34/build' make[2]: Entering directory '/tmp/B.bSxPY4/BUILD/percona-server-5.7.31-34/build' cd /tmp/B.bSxPY4/BUILD/percona-server-5.7.31-34/build && /usr/bin/cmake -E cmake_depends "Unix Makefiles" /tmp/B.bSxPY4/BUILD/percona-server-5.7.31-34 /tmp/B.bSxPY4/BUILD/percona-server-5.7.31-34/sql /tmp/B.bSxPY4/BUILD/percona-server-5.7.31-34/build /tmp/B.bSxPY4/BUILD/percona-server-5.7.31-34/build/sql /tmp/B.bSxPY4/BUILD/percona-server-5.7.31-34/build/sql/CMakeFiles/gen_lex_hash.dir/DependInfo.cmake --color= Scanning dependencies of target gen_lex_hash make[2]: Leaving directory '/tmp/B.bSxPY4/BUILD/percona-server-5.7.31-34/build' /usr/bin/make -f sql/CMakeFiles/gen_lex_hash.dir/build.make sql/CMakeFiles/gen_lex_hash.dir/build make[2]: Entering directory '/tmp/B.bSxPY4/BUILD/percona-server-5.7.31-34/build' [ 3%] Building C object strings/CMakeFiles/strings.dir/ctype-cp932.c.o cd /tmp/B.bSxPY4/BUILD/percona-server-5.7.31-34/build/strings && /usr/bin/x86_64-pld-linux-gnux32-gcc -DBOOST_GEOMETRY_SQRT_CHECK_FINITENESS -DDISABLE_MYSQL_THREAD_H -DHAVE_CONFIG_H -DHAVE_TLSv13 -DLZ4_DISABLE_DEPRECATE_WARNINGS -D_FILE_OFFSET_BITS=64 -D_GNU_SOURCE -D__STDC_WANT_LIB_EXT1__=1 -I/tmp/B.bSxPY4/BUILD/percona-server-5.7.31-34/build/include -I/tmp/B.bSxPY4/BUILD/percona-server-5.7.31-34/extra/rapidjson/include -I/tmp/B.bSxPY4/BUILD/percona-server-5.7.31-34/build/libbinlogevents/include -I/tmp/B.bSxPY4/BUILD/percona-server-5.7.31-34/libbinlogevents/export -I/tmp/B.bSxPY4/BUILD/percona-server-5.7.31-34/include -fPIC -Wall -Wextra -Wformat-security -Wvla -Wwrite-strings -Wdeclaration-after-statement -O3 -D_FORTIFY_SOURCE=2 -O2 -fwrapv -pipe -Wformat -Werror=format-security -gdwarf-4 -fno-debug-types-section -fvar-tracking-assignments -g2 -Wp,-D_FORTIFY_SOURCE=2 -fstack-protector-strong --param=ssp-buffer-size=4 -Werror=trampolines -fPIC -mtune=generic -march=x86-64 -gdwarf-4 -fno-debug-types-section -fvar-tracking-assignments -g2 -DNDEBUG -fno-omit-frame-pointer -fno-strict-aliasing -Wno-shadow -g -fno-omit-frame-pointer -fno-strict-aliasing -DDBUG_OFF -DNDEBUG -o CMakeFiles/strings.dir/ctype-cp932.c.o -c /tmp/B.bSxPY4/BUILD/percona-server-5.7.31-34/strings/ctype-cp932.c make[2]: Leaving directory '/tmp/B.bSxPY4/BUILD/percona-server-5.7.31-34/build' make[2]: Entering directory '/tmp/B.bSxPY4/BUILD/percona-server-5.7.31-34/build' [ 3%] Building CXX object libbinlogstandalone/src/CMakeFiles/binlogstandalone_static.dir/__/__/libbinlogevents/src/binlog_event.cpp.o cd /tmp/B.bSxPY4/BUILD/percona-server-5.7.31-34/build/libbinlogstandalone/src && /usr/bin/x86_64-pld-linux-gnux32-g++ -DBOOST_GEOMETRY_SQRT_CHECK_FINITENESS -DHAVE_CONFIG_H -DHAVE_TLSv13 -DLZ4_DISABLE_DEPRECATE_WARNINGS -DSTANDALONE_BINLOG -D_FILE_OFFSET_BITS=64 -D_GNU_SOURCE -D__STDC_WANT_LIB_EXT1__=1 -I/tmp/B.bSxPY4/BUILD/percona-server-5.7.31-34/build/include -I/tmp/B.bSxPY4/BUILD/percona-server-5.7.31-34/extra/rapidjson/include -I/tmp/B.bSxPY4/BUILD/percona-server-5.7.31-34/build/libbinlogevents/include -I/tmp/B.bSxPY4/BUILD/percona-server-5.7.31-34/libbinlogevents/export -I/tmp/B.bSxPY4/BUILD/percona-server-5.7.31-34/include -I/tmp/B.bSxPY4/BUILD/percona-server-5.7.31-34/libbinlogevents/include -I/tmp/B.bSxPY4/BUILD/percona-server-5.7.31-34/build/libbinlogstandalone/../libbinlogevents/include -I/tmp/B.bSxPY4/BUILD/percona-server-5.7.31-34/build/libbinlogstandalone/libbinlogevents/export -fPIC -Wall -Wextra -Wformat-security -Wvla -Woverloaded-virtual -Wno-unused-parameter -O3 -D_FORTIFY_SOURCE=2 -g -fno-omit-frame-pointer -fno-strict-aliasing -DDBUG_OFF -DNDEBUG -std=gnu++11 -o CMakeFiles/binlogstandalone_static.dir/__/__/libbinlogevents/src/binlog_event.cpp.o -c /tmp/B.bSxPY4/BUILD/percona-server-5.7.31-34/libbinlogevents/src/binlog_event.cpp make[2]: Leaving directory '/tmp/B.bSxPY4/BUILD/percona-server-5.7.31-34/build' make[2]: Entering directory '/tmp/B.bSxPY4/BUILD/percona-server-5.7.31-34/build' [ 3%] Building C object strings/CMakeFiles/strings.dir/ctype-czech.c.o cd /tmp/B.bSxPY4/BUILD/percona-server-5.7.31-34/build/strings && /usr/bin/x86_64-pld-linux-gnux32-gcc -DBOOST_GEOMETRY_SQRT_CHECK_FINITENESS -DDISABLE_MYSQL_THREAD_H -DHAVE_CONFIG_H -DHAVE_TLSv13 -DLZ4_DISABLE_DEPRECATE_WARNINGS -D_FILE_OFFSET_BITS=64 -D_GNU_SOURCE -D__STDC_WANT_LIB_EXT1__=1 -I/tmp/B.bSxPY4/BUILD/percona-server-5.7.31-34/build/include -I/tmp/B.bSxPY4/BUILD/percona-server-5.7.31-34/extra/rapidjson/include -I/tmp/B.bSxPY4/BUILD/percona-server-5.7.31-34/build/libbinlogevents/include -I/tmp/B.bSxPY4/BUILD/percona-server-5.7.31-34/libbinlogevents/export -I/tmp/B.bSxPY4/BUILD/percona-server-5.7.31-34/include -fPIC -Wall -Wextra -Wformat-security -Wvla -Wwrite-strings -Wdeclaration-after-statement -O3 -D_FORTIFY_SOURCE=2 -O2 -fwrapv -pipe -Wformat -Werror=format-security -gdwarf-4 -fno-debug-types-section -fvar-tracking-assignments -g2 -Wp,-D_FORTIFY_SOURCE=2 -fstack-protector-strong --param=ssp-buffer-size=4 -Werror=trampolines -fPIC -mtune=generic -march=x86-64 -gdwarf-4 -fno-debug-types-section -fvar-tracking-assignments -g2 -DNDEBUG -fno-omit-frame-pointer -fno-strict-aliasing -Wno-shadow -g -fno-omit-frame-pointer -fno-strict-aliasing -DDBUG_OFF -DNDEBUG -o CMakeFiles/strings.dir/ctype-czech.c.o -c /tmp/B.bSxPY4/BUILD/percona-server-5.7.31-34/strings/ctype-czech.c make[2]: Leaving directory '/tmp/B.bSxPY4/BUILD/percona-server-5.7.31-34/build' make[2]: Entering directory '/tmp/B.bSxPY4/BUILD/percona-server-5.7.31-34/build' [ 3%] Building C object regex/CMakeFiles/regex.dir/regexec.c.o cd /tmp/B.bSxPY4/BUILD/percona-server-5.7.31-34/build/regex && /usr/bin/x86_64-pld-linux-gnux32-gcc -DBOOST_GEOMETRY_SQRT_CHECK_FINITENESS -DHAVE_CONFIG_H -DHAVE_TLSv13 -DLZ4_DISABLE_DEPRECATE_WARNINGS -D_FILE_OFFSET_BITS=64 -D_GNU_SOURCE -D__STDC_WANT_LIB_EXT1__=1 -I/tmp/B.bSxPY4/BUILD/percona-server-5.7.31-34/build/include -I/tmp/B.bSxPY4/BUILD/percona-server-5.7.31-34/extra/rapidjson/include -I/tmp/B.bSxPY4/BUILD/percona-server-5.7.31-34/build/libbinlogevents/include -I/tmp/B.bSxPY4/BUILD/percona-server-5.7.31-34/libbinlogevents/export -I/tmp/B.bSxPY4/BUILD/percona-server-5.7.31-34/include -fPIC -Wall -Wextra -Wformat-security -Wvla -Wwrite-strings -Wdeclaration-after-statement -O3 -D_FORTIFY_SOURCE=2 -O2 -fwrapv -pipe -Wformat -Werror=format-security -gdwarf-4 -fno-debug-types-section -fvar-tracking-assignments -g2 -Wp,-D_FORTIFY_SOURCE=2 -fstack-protector-strong --param=ssp-buffer-size=4 -Werror=trampolines -fPIC -mtune=generic -march=x86-64 -gdwarf-4 -fno-debug-types-section -fvar-tracking-assignments -g2 -DNDEBUG -fno-omit-frame-pointer -fno-strict-aliasing -Wno-shadow -g -fno-omit-frame-pointer -fno-strict-aliasing -DDBUG_OFF -DNDEBUG -o CMakeFiles/regex.dir/regexec.c.o -c /tmp/B.bSxPY4/BUILD/percona-server-5.7.31-34/regex/regexec.c make[2]: Leaving directory '/tmp/B.bSxPY4/BUILD/percona-server-5.7.31-34/build' make[2]: Entering directory '/tmp/B.bSxPY4/BUILD/percona-server-5.7.31-34/build' [ 1%] Building CXX object extra/coredumper/src/CMakeFiles/coredumper.dir/elfcore.cc.o cd /tmp/B.bSxPY4/BUILD/percona-server-5.7.31-34/build/extra/coredumper/src && /usr/bin/x86_64-pld-linux-gnux32-g++ -DBOOST_GEOMETRY_SQRT_CHECK_FINITENESS -DHAVE_CONFIG_H -DHAVE_TLSv13 -DLZ4_DISABLE_DEPRECATE_WARNINGS -D_FILE_OFFSET_BITS=64 -D_GNU_SOURCE -D__STDC_WANT_LIB_EXT1__=1 -I/tmp/B.bSxPY4/BUILD/percona-server-5.7.31-34/build/include -I/tmp/B.bSxPY4/BUILD/percona-server-5.7.31-34/extra/rapidjson/include -I/tmp/B.bSxPY4/BUILD/percona-server-5.7.31-34/build/libbinlogevents/include -I/tmp/B.bSxPY4/BUILD/percona-server-5.7.31-34/libbinlogevents/export -I/tmp/B.bSxPY4/BUILD/percona-server-5.7.31-34/extra/coredumper/include -fPIC -O3 -D_FORTIFY_SOURCE=2 -g -fno-omit-frame-pointer -fno-strict-aliasing -DDBUG_OFF -DNDEBUG -fno-strict-aliasing -std=gnu++11 -o CMakeFiles/coredumper.dir/elfcore.cc.o -c /tmp/B.bSxPY4/BUILD/percona-server-5.7.31-34/extra/coredumper/src/elfcore.cc /tmp/B.bSxPY4/BUILD/percona-server-5.7.31-34/extra/coredumper/src/linux_syscall_support.h: Assembler messages: /tmp/B.bSxPY4/BUILD/percona-server-5.7.31-34/extra/coredumper/src/linux_syscall_support.h:1416: Error: incorrect register `%r15d' used with `q' suffix /tmp/B.bSxPY4/BUILD/percona-server-5.7.31-34/extra/coredumper/src/linux_syscall_support.h:1418: Error: incorrect register `%esi' used with `q' suffix /tmp/B.bSxPY4/BUILD/percona-server-5.7.31-34/extra/coredumper/src/linux_syscall_support.h:1421: Error: incorrect register `%esi' used with `q' suffix /tmp/B.bSxPY4/BUILD/percona-server-5.7.31-34/extra/coredumper/src/linux_syscall_support.h:1422: Error: operand size mismatch for `movq' /tmp/B.bSxPY4/BUILD/percona-server-5.7.31-34/extra/coredumper/src/linux_syscall_support.h:1423: Error: operand size mismatch for `movq' /tmp/B.bSxPY4/BUILD/percona-server-5.7.31-34/extra/coredumper/src/linux_syscall_support.h:2040: Error: operand type mismatch for `movq' /tmp/B.bSxPY4/BUILD/percona-server-5.7.31-34/extra/coredumper/src/linux_syscall_support.h:2040: Error: operand type mismatch for `movq' /tmp/B.bSxPY4/BUILD/percona-server-5.7.31-34/extra/coredumper/src/linux_syscall_support.h:2040: Error: operand type mismatch for `movq' /tmp/B.bSxPY4/BUILD/percona-server-5.7.31-34/extra/coredumper/src/linux_syscall_support.h:2067: Error: operand type mismatch for `movq' make[2]: *** [extra/coredumper/src/CMakeFiles/coredumper.dir/build.make:112: extra/coredumper/src/CMakeFiles/coredumper.dir/elfcore.cc.o] Error 1 make[2]: Leaving directory '/tmp/B.bSxPY4/BUILD/percona-server-5.7.31-34/build' make[1]: *** [CMakeFiles/Makefile2:2117: extra/coredumper/src/CMakeFiles/coredumper.dir/all] Error 2 make[1]: *** Waiting for unfinished jobs.... make[2]: Entering directory '/tmp/B.bSxPY4/BUILD/percona-server-5.7.31-34/build' [ 3%] Building CXX object client/dump/CMakeFiles/boost_lib.dir/__/__/include/boost_1_59_0/libs/chrono/src/chrono.cpp.o cd /tmp/B.bSxPY4/BUILD/percona-server-5.7.31-34/build/client/dump && /usr/bin/x86_64-pld-linux-gnux32-g++ -DBOOST_ALL_NO_LIB -DBOOST_GEOMETRY_SQRT_CHECK_FINITENESS -DBOOST_SYSTEM_NO_DEPRECATED -DHAVE_CONFIG_H -DHAVE_TLSv13 -DLZ4_DISABLE_DEPRECATE_WARNINGS -D_FILE_OFFSET_BITS=64 -D_GNU_SOURCE -D__STDC_WANT_LIB_EXT1__=1 -I/tmp/B.bSxPY4/BUILD/percona-server-5.7.31-34/build/include -I/tmp/B.bSxPY4/BUILD/percona-server-5.7.31-34/extra/rapidjson/include -I/tmp/B.bSxPY4/BUILD/percona-server-5.7.31-34/build/libbinlogevents/include -I/tmp/B.bSxPY4/BUILD/percona-server-5.7.31-34/libbinlogevents/export -I/tmp/B.bSxPY4/BUILD/percona-server-5.7.31-34/client -I/tmp/B.bSxPY4/BUILD/percona-server-5.7.31-34/include -I/tmp/B.bSxPY4/BUILD/percona-server-5.7.31-34/mysys_ssl -I/tmp/B.bSxPY4/BUILD/percona-server-5.7.31-34/libmysql -I/tmp/B.bSxPY4/BUILD/percona-server-5.7.31-34/libbinlogevents/include -I/tmp/B.bSxPY4/BUILD/percona-server-5.7.31-34/regex -I/tmp/B.bSxPY4/BUILD/percona-server-5.7.31-34/strings -I/usr/include/readline -I/tmp/B.bSxPY4/BUILD/percona-server-5.7.31-34/build/client -I/tmp/B.bSxPY4/BUILD/percona-server-5.7.31-34/dump -isystem /tmp/B.bSxPY4/BUILD/percona-server-5.7.31-34/include/boost_1_59_0/patches -isystem /tmp/B.bSxPY4/BUILD/percona-server-5.7.31-34/boost_1_59_0 -fPIC -Wall -Wextra -Wformat-security -Wvla -Woverloaded-virtual -Wno-unused-parameter -O3 -D_FORTIFY_SOURCE=2 -g -fno-omit-frame-pointer -fno-strict-aliasing -DDBUG_OFF -DNDEBUG -Wno-class-memaccess -std=gnu++11 -o CMakeFiles/boost_lib.dir/__/__/include/boost_1_59_0/libs/chrono/src/chrono.cpp.o -c /tmp/B.bSxPY4/BUILD/percona-server-5.7.31-34/include/boost_1_59_0/libs/chrono/src/chrono.cpp make[2]: Leaving directory '/tmp/B.bSxPY4/BUILD/percona-server-5.7.31-34/build' make[2]: Entering directory '/tmp/B.bSxPY4/BUILD/percona-server-5.7.31-34/build' [ 3%] Building CXX object libbinlogstandalone/src/CMakeFiles/binlogstandalone_shared.dir/__/__/libbinlogevents/src/rows_event.cpp.o cd /tmp/B.bSxPY4/BUILD/percona-server-5.7.31-34/build/libbinlogstandalone/src && /usr/bin/x86_64-pld-linux-gnux32-g++ -DBOOST_GEOMETRY_SQRT_CHECK_FINITENESS -DHAVE_CONFIG_H -DHAVE_TLSv13 -DLZ4_DISABLE_DEPRECATE_WARNINGS -DSTANDALONE_BINLOG -D_FILE_OFFSET_BITS=64 -D_GNU_SOURCE -D__STDC_WANT_LIB_EXT1__=1 -Dbinlogstandalone_shared_EXPORTS -I/tmp/B.bSxPY4/BUILD/percona-server-5.7.31-34/build/include -I/tmp/B.bSxPY4/BUILD/percona-server-5.7.31-34/extra/rapidjson/include -I/tmp/B.bSxPY4/BUILD/percona-server-5.7.31-34/build/libbinlogevents/include -I/tmp/B.bSxPY4/BUILD/percona-server-5.7.31-34/libbinlogevents/export -I/tmp/B.bSxPY4/BUILD/percona-server-5.7.31-34/include -I/tmp/B.bSxPY4/BUILD/percona-server-5.7.31-34/libbinlogevents/include -I/tmp/B.bSxPY4/BUILD/percona-server-5.7.31-34/build/libbinlogstandalone/../libbinlogevents/include -I/tmp/B.bSxPY4/BUILD/percona-server-5.7.31-34/build/libbinlogstandalone/libbinlogevents/export -fPIC -Wall -Wextra -Wformat-security -Wvla -Woverloaded-virtual -Wno-unused-parameter -O3 -D_FORTIFY_SOURCE=2 -g -fno-omit-frame-pointer -fno-strict-aliasing -DDBUG_OFF -DNDEBUG -fPIC -std=gnu++11 -o CMakeFiles/binlogstandalone_shared.dir/__/__/libbinlogevents/src/rows_event.cpp.o -c /tmp/B.bSxPY4/BUILD/percona-server-5.7.31-34/libbinlogevents/src/rows_event.cpp make[2]: Leaving directory '/tmp/B.bSxPY4/BUILD/percona-server-5.7.31-34/build' make[2]: Entering directory '/tmp/B.bSxPY4/BUILD/percona-server-5.7.31-34/build' [ 3%] Building C object regex/CMakeFiles/regex.dir/reginit.c.o cd /tmp/B.bSxPY4/BUILD/percona-server-5.7.31-34/build/regex && /usr/bin/x86_64-pld-linux-gnux32-gcc -DBOOST_GEOMETRY_SQRT_CHECK_FINITENESS -DHAVE_CONFIG_H -DHAVE_TLSv13 -DLZ4_DISABLE_DEPRECATE_WARNINGS -D_FILE_OFFSET_BITS=64 -D_GNU_SOURCE -D__STDC_WANT_LIB_EXT1__=1 -I/tmp/B.bSxPY4/BUILD/percona-server-5.7.31-34/build/include -I/tmp/B.bSxPY4/BUILD/percona-server-5.7.31-34/extra/rapidjson/include -I/tmp/B.bSxPY4/BUILD/percona-server-5.7.31-34/build/libbinlogevents/include -I/tmp/B.bSxPY4/BUILD/percona-server-5.7.31-34/libbinlogevents/export -I/tmp/B.bSxPY4/BUILD/percona-server-5.7.31-34/include -fPIC -Wall -Wextra -Wformat-security -Wvla -Wwrite-strings -Wdeclaration-after-statement -O3 -D_FORTIFY_SOURCE=2 -O2 -fwrapv -pipe -Wformat -Werror=format-security -gdwarf-4 -fno-debug-types-section -fvar-tracking-assignments -g2 -Wp,-D_FORTIFY_SOURCE=2 -fstack-protector-strong --param=ssp-buffer-size=4 -Werror=trampolines -fPIC -mtune=generic -march=x86-64 -gdwarf-4 -fno-debug-types-section -fvar-tracking-assignments -g2 -DNDEBUG -fno-omit-frame-pointer -fno-strict-aliasing -Wno-shadow -g -fno-omit-frame-pointer -fno-strict-aliasing -DDBUG_OFF -DNDEBUG -o CMakeFiles/regex.dir/reginit.c.o -c /tmp/B.bSxPY4/BUILD/percona-server-5.7.31-34/regex/reginit.c make[2]: Leaving directory '/tmp/B.bSxPY4/BUILD/percona-server-5.7.31-34/build' make[2]: Entering directory '/tmp/B.bSxPY4/BUILD/percona-server-5.7.31-34/build' [ 3%] Building CXX object libbinlogstandalone/src/CMakeFiles/binlogstandalone_shared.dir/__/__/libbinlogevents/src/binlog_event.cpp.o cd /tmp/B.bSxPY4/BUILD/percona-server-5.7.31-34/build/libbinlogstandalone/src && /usr/bin/x86_64-pld-linux-gnux32-g++ -DBOOST_GEOMETRY_SQRT_CHECK_FINITENESS -DHAVE_CONFIG_H -DHAVE_TLSv13 -DLZ4_DISABLE_DEPRECATE_WARNINGS -DSTANDALONE_BINLOG -D_FILE_OFFSET_BITS=64 -D_GNU_SOURCE -D__STDC_WANT_LIB_EXT1__=1 -Dbinlogstandalone_shared_EXPORTS -I/tmp/B.bSxPY4/BUILD/percona-server-5.7.31-34/build/include -I/tmp/B.bSxPY4/BUILD/percona-server-5.7.31-34/extra/rapidjson/include -I/tmp/B.bSxPY4/BUILD/percona-server-5.7.31-34/build/libbinlogevents/include -I/tmp/B.bSxPY4/BUILD/percona-server-5.7.31-34/libbinlogevents/export -I/tmp/B.bSxPY4/BUILD/percona-server-5.7.31-34/include -I/tmp/B.bSxPY4/BUILD/percona-server-5.7.31-34/libbinlogevents/include -I/tmp/B.bSxPY4/BUILD/percona-server-5.7.31-34/build/libbinlogstandalone/../libbinlogevents/include -I/tmp/B.bSxPY4/BUILD/percona-server-5.7.31-34/build/libbinlogstandalone/libbinlogevents/export -fPIC -Wall -Wextra -Wformat-security -Wvla -Woverloaded-virtual -Wno-unused-parameter -O3 -D_FORTIFY_SOURCE=2 -g -fno-omit-frame-pointer -fno-strict-aliasing -DDBUG_OFF -DNDEBUG -fPIC -std=gnu++11 -o CMakeFiles/binlogstandalone_shared.dir/__/__/libbinlogevents/src/binlog_event.cpp.o -c /tmp/B.bSxPY4/BUILD/percona-server-5.7.31-34/libbinlogevents/src/binlog_event.cpp make[2]: Leaving directory '/tmp/B.bSxPY4/BUILD/percona-server-5.7.31-34/build' make[2]: Entering directory '/tmp/B.bSxPY4/BUILD/percona-server-5.7.31-34/build' [ 4%] Linking C static library ../archive_output_directory/libregex.a cd /tmp/B.bSxPY4/BUILD/percona-server-5.7.31-34/build/regex && /usr/bin/cmake -P CMakeFiles/regex.dir/cmake_clean_target.cmake cd /tmp/B.bSxPY4/BUILD/percona-server-5.7.31-34/build/regex && /usr/bin/cmake -E cmake_link_script CMakeFiles/regex.dir/link.txt --verbose=1 /usr/bin/ar qc ../archive_output_directory/libregex.a CMakeFiles/regex.dir/regcomp.c.o CMakeFiles/regex.dir/regerror.c.o CMakeFiles/regex.dir/regexec.c.o CMakeFiles/regex.dir/regfree.c.o CMakeFiles/regex.dir/reginit.c.o /usr/bin/ranlib ../archive_output_directory/libregex.a cd /tmp/B.bSxPY4/BUILD/percona-server-5.7.31-34/build/regex && /usr/bin/cmake -DTARGET_NAME=regex -DTARGET_LOC=/tmp/B.bSxPY4/BUILD/percona-server-5.7.31-34/build/archive_output_directory/libregex.a -DCFG_INTDIR=. -P /tmp/B.bSxPY4/BUILD/percona-server-5.7.31-34/build/archive_output_directory/lib_location_regex.cmake make[2]: Leaving directory '/tmp/B.bSxPY4/BUILD/percona-server-5.7.31-34/build' make[1]: Entering directory '/tmp/B.bSxPY4/BUILD/percona-server-5.7.31-34/build' [ 4%] Built target regex make[1]: Leaving directory '/tmp/B.bSxPY4/BUILD/percona-server-5.7.31-34/build' make[2]: Entering directory '/tmp/B.bSxPY4/BUILD/percona-server-5.7.31-34/build' [ 3%] Building CXX object libbinlogstandalone/src/CMakeFiles/binlogstandalone_static.dir/__/__/libbinlogevents/src/rows_event.cpp.o cd /tmp/B.bSxPY4/BUILD/percona-server-5.7.31-34/build/libbinlogstandalone/src && /usr/bin/x86_64-pld-linux-gnux32-g++ -DBOOST_GEOMETRY_SQRT_CHECK_FINITENESS -DHAVE_CONFIG_H -DHAVE_TLSv13 -DLZ4_DISABLE_DEPRECATE_WARNINGS -DSTANDALONE_BINLOG -D_FILE_OFFSET_BITS=64 -D_GNU_SOURCE -D__STDC_WANT_LIB_EXT1__=1 -I/tmp/B.bSxPY4/BUILD/percona-server-5.7.31-34/build/include -I/tmp/B.bSxPY4/BUILD/percona-server-5.7.31-34/extra/rapidjson/include -I/tmp/B.bSxPY4/BUILD/percona-server-5.7.31-34/build/libbinlogevents/include -I/tmp/B.bSxPY4/BUILD/percona-server-5.7.31-34/libbinlogevents/export -I/tmp/B.bSxPY4/BUILD/percona-server-5.7.31-34/include -I/tmp/B.bSxPY4/BUILD/percona-server-5.7.31-34/libbinlogevents/include -I/tmp/B.bSxPY4/BUILD/percona-server-5.7.31-34/build/libbinlogstandalone/../libbinlogevents/include -I/tmp/B.bSxPY4/BUILD/percona-server-5.7.31-34/build/libbinlogstandalone/libbinlogevents/export -fPIC -Wall -Wextra -Wformat-security -Wvla -Woverloaded-virtual -Wno-unused-parameter -O3 -D_FORTIFY_SOURCE=2 -g -fno-omit-frame-pointer -fno-strict-aliasing -DDBUG_OFF -DNDEBUG -std=gnu++11 -o CMakeFiles/binlogstandalone_static.dir/__/__/libbinlogevents/src/rows_event.cpp.o -c /tmp/B.bSxPY4/BUILD/percona-server-5.7.31-34/libbinlogevents/src/rows_event.cpp make[2]: Leaving directory '/tmp/B.bSxPY4/BUILD/percona-server-5.7.31-34/build' make[2]: Entering directory '/tmp/B.bSxPY4/BUILD/percona-server-5.7.31-34/build' [ 3%] Building C object strings/CMakeFiles/strings.dir/ctype-euc_kr.c.o cd /tmp/B.bSxPY4/BUILD/percona-server-5.7.31-34/build/strings && /usr/bin/x86_64-pld-linux-gnux32-gcc -DBOOST_GEOMETRY_SQRT_CHECK_FINITENESS -DDISABLE_MYSQL_THREAD_H -DHAVE_CONFIG_H -DHAVE_TLSv13 -DLZ4_DISABLE_DEPRECATE_WARNINGS -D_FILE_OFFSET_BITS=64 -D_GNU_SOURCE -D__STDC_WANT_LIB_EXT1__=1 -I/tmp/B.bSxPY4/BUILD/percona-server-5.7.31-34/build/include -I/tmp/B.bSxPY4/BUILD/percona-server-5.7.31-34/extra/rapidjson/include -I/tmp/B.bSxPY4/BUILD/percona-server-5.7.31-34/build/libbinlogevents/include -I/tmp/B.bSxPY4/BUILD/percona-server-5.7.31-34/libbinlogevents/export -I/tmp/B.bSxPY4/BUILD/percona-server-5.7.31-34/include -fPIC -Wall -Wextra -Wformat-security -Wvla -Wwrite-strings -Wdeclaration-after-statement -O3 -D_FORTIFY_SOURCE=2 -O2 -fwrapv -pipe -Wformat -Werror=format-security -gdwarf-4 -fno-debug-types-section -fvar-tracking-assignments -g2 -Wp,-D_FORTIFY_SOURCE=2 -fstack-protector-strong --param=ssp-buffer-size=4 -Werror=trampolines -fPIC -mtune=generic -march=x86-64 -gdwarf-4 -fno-debug-types-section -fvar-tracking-assignments -g2 -DNDEBUG -fno-omit-frame-pointer -fno-strict-aliasing -Wno-shadow -g -fno-omit-frame-pointer -fno-strict-aliasing -DDBUG_OFF -DNDEBUG -o CMakeFiles/strings.dir/ctype-euc_kr.c.o -c /tmp/B.bSxPY4/BUILD/percona-server-5.7.31-34/strings/ctype-euc_kr.c make[2]: Leaving directory '/tmp/B.bSxPY4/BUILD/percona-server-5.7.31-34/build' make[2]: Entering directory '/tmp/B.bSxPY4/BUILD/percona-server-5.7.31-34/build' [ 3%] Building CXX object sql/CMakeFiles/gen_lex_hash.dir/gen_lex_hash.cc.o cd /tmp/B.bSxPY4/BUILD/percona-server-5.7.31-34/build/sql && /usr/bin/x86_64-pld-linux-gnux32-g++ -DBOOST_GEOMETRY_SQRT_CHECK_FINITENESS -DHAVE_CONFIG_H -DHAVE_POOL_OF_THREADS -DHAVE_REPLICATION -DHAVE_TLSv13 -DLZ4_DISABLE_DEPRECATE_WARNINGS -DMYSQL_SERVER -D_FILE_OFFSET_BITS=64 -D_GNU_SOURCE -D__STDC_WANT_LIB_EXT1__=1 -I/tmp/B.bSxPY4/BUILD/percona-server-5.7.31-34/build/include -I/tmp/B.bSxPY4/BUILD/percona-server-5.7.31-34/extra/rapidjson/include -I/tmp/B.bSxPY4/BUILD/percona-server-5.7.31-34/build/libbinlogevents/include -I/tmp/B.bSxPY4/BUILD/percona-server-5.7.31-34/libbinlogevents/export -I/tmp/B.bSxPY4/BUILD/percona-server-5.7.31-34/include -I/tmp/B.bSxPY4/BUILD/percona-server-5.7.31-34/sql/conn_handler -I/tmp/B.bSxPY4/BUILD/percona-server-5.7.31-34/libbinlogevents/include -I/tmp/B.bSxPY4/BUILD/percona-server-5.7.31-34/sql -I/tmp/B.bSxPY4/BUILD/percona-server-5.7.31-34/sql/auth -I/tmp/B.bSxPY4/BUILD/percona-server-5.7.31-34/regex -I/tmp/B.bSxPY4/BUILD/percona-server-5.7.31-34/build/sql -isystem /tmp/B.bSxPY4/BUILD/percona-server-5.7.31-34/include/boost_1_59_0/patches -isystem /tmp/B.bSxPY4/BUILD/percona-server-5.7.31-34/boost_1_59_0 -fPIC -Wall -Wextra -Wformat-security -Wvla -Woverloaded-virtual -Wno-unused-parameter -O3 -D_FORTIFY_SOURCE=2 -g -fno-omit-frame-pointer -fno-strict-aliasing -DDBUG_OFF -DNDEBUG -Wno-class-memaccess -DHAVE_OPENSSL -std=gnu++11 -o CMakeFiles/gen_lex_hash.dir/gen_lex_hash.cc.o -c /tmp/B.bSxPY4/BUILD/percona-server-5.7.31-34/sql/gen_lex_hash.cc make[2]: Leaving directory '/tmp/B.bSxPY4/BUILD/percona-server-5.7.31-34/build' make[2]: Entering directory '/tmp/B.bSxPY4/BUILD/percona-server-5.7.31-34/build' [ 5%] Linking CXX executable gen_lex_hash cd /tmp/B.bSxPY4/BUILD/percona-server-5.7.31-34/build/sql && /usr/bin/cmake -E cmake_link_script CMakeFiles/gen_lex_hash.dir/link.txt --verbose=1 /usr/bin/x86_64-pld-linux-gnux32-g++ -fPIC -Wall -Wextra -Wformat-security -Wvla -Woverloaded-virtual -Wno-unused-parameter -O3 -D_FORTIFY_SOURCE=2 -g -fno-omit-frame-pointer -fno-strict-aliasing -DDBUG_OFF -DNDEBUG -Wno-class-memaccess CMakeFiles/gen_lex_hash.dir/gen_lex_hash.cc.o -o gen_lex_hash -lpthread make[2]: Leaving directory '/tmp/B.bSxPY4/BUILD/percona-server-5.7.31-34/build' make[1]: Entering directory '/tmp/B.bSxPY4/BUILD/percona-server-5.7.31-34/build' [ 5%] Built target gen_lex_hash make[1]: Leaving directory '/tmp/B.bSxPY4/BUILD/percona-server-5.7.31-34/build' make[2]: Entering directory '/tmp/B.bSxPY4/BUILD/percona-server-5.7.31-34/build' [ 4%] Building C object strings/CMakeFiles/strings.dir/ctype-extra.c.o cd /tmp/B.bSxPY4/BUILD/percona-server-5.7.31-34/build/strings && /usr/bin/x86_64-pld-linux-gnux32-gcc -DBOOST_GEOMETRY_SQRT_CHECK_FINITENESS -DDISABLE_MYSQL_THREAD_H -DHAVE_CONFIG_H -DHAVE_TLSv13 -DLZ4_DISABLE_DEPRECATE_WARNINGS -D_FILE_OFFSET_BITS=64 -D_GNU_SOURCE -D__STDC_WANT_LIB_EXT1__=1 -I/tmp/B.bSxPY4/BUILD/percona-server-5.7.31-34/build/include -I/tmp/B.bSxPY4/BUILD/percona-server-5.7.31-34/extra/rapidjson/include -I/tmp/B.bSxPY4/BUILD/percona-server-5.7.31-34/build/libbinlogevents/include -I/tmp/B.bSxPY4/BUILD/percona-server-5.7.31-34/libbinlogevents/export -I/tmp/B.bSxPY4/BUILD/percona-server-5.7.31-34/include -fPIC -Wall -Wextra -Wformat-security -Wvla -Wwrite-strings -Wdeclaration-after-statement -O3 -D_FORTIFY_SOURCE=2 -O2 -fwrapv -pipe -Wformat -Werror=format-security -gdwarf-4 -fno-debug-types-section -fvar-tracking-assignments -g2 -Wp,-D_FORTIFY_SOURCE=2 -fstack-protector-strong --param=ssp-buffer-size=4 -Werror=trampolines -fPIC -mtune=generic -march=x86-64 -gdwarf-4 -fno-debug-types-section -fvar-tracking-assignments -g2 -DNDEBUG -fno-omit-frame-pointer -fno-strict-aliasing -Wno-shadow -g -fno-omit-frame-pointer -fno-strict-aliasing -DDBUG_OFF -DNDEBUG -o CMakeFiles/strings.dir/ctype-extra.c.o -c /tmp/B.bSxPY4/BUILD/percona-server-5.7.31-34/strings/ctype-extra.c make[2]: Leaving directory '/tmp/B.bSxPY4/BUILD/percona-server-5.7.31-34/build' make[2]: Entering directory '/tmp/B.bSxPY4/BUILD/percona-server-5.7.31-34/build' [ 5%] Building C object strings/CMakeFiles/strings.dir/ctype-gb2312.c.o cd /tmp/B.bSxPY4/BUILD/percona-server-5.7.31-34/build/strings && /usr/bin/x86_64-pld-linux-gnux32-gcc -DBOOST_GEOMETRY_SQRT_CHECK_FINITENESS -DDISABLE_MYSQL_THREAD_H -DHAVE_CONFIG_H -DHAVE_TLSv13 -DLZ4_DISABLE_DEPRECATE_WARNINGS -D_FILE_OFFSET_BITS=64 -D_GNU_SOURCE -D__STDC_WANT_LIB_EXT1__=1 -I/tmp/B.bSxPY4/BUILD/percona-server-5.7.31-34/build/include -I/tmp/B.bSxPY4/BUILD/percona-server-5.7.31-34/extra/rapidjson/include -I/tmp/B.bSxPY4/BUILD/percona-server-5.7.31-34/build/libbinlogevents/include -I/tmp/B.bSxPY4/BUILD/percona-server-5.7.31-34/libbinlogevents/export -I/tmp/B.bSxPY4/BUILD/percona-server-5.7.31-34/include -fPIC -Wall -Wextra -Wformat-security -Wvla -Wwrite-strings -Wdeclaration-after-statement -O3 -D_FORTIFY_SOURCE=2 -O2 -fwrapv -pipe -Wformat -Werror=format-security -gdwarf-4 -fno-debug-types-section -fvar-tracking-assignments -g2 -Wp,-D_FORTIFY_SOURCE=2 -fstack-protector-strong --param=ssp-buffer-size=4 -Werror=trampolines -fPIC -mtune=generic -march=x86-64 -gdwarf-4 -fno-debug-types-section -fvar-tracking-assignments -g2 -DNDEBUG -fno-omit-frame-pointer -fno-strict-aliasing -Wno-shadow -g -fno-omit-frame-pointer -fno-strict-aliasing -DDBUG_OFF -DNDEBUG -o CMakeFiles/strings.dir/ctype-gb2312.c.o -c /tmp/B.bSxPY4/BUILD/percona-server-5.7.31-34/strings/ctype-gb2312.c make[2]: Leaving directory '/tmp/B.bSxPY4/BUILD/percona-server-5.7.31-34/build' make[2]: Entering directory '/tmp/B.bSxPY4/BUILD/percona-server-5.7.31-34/build' [ 4%] Building CXX object libbinlogstandalone/src/CMakeFiles/binlogstandalone_static.dir/__/__/libbinlogevents/src/uuid.cpp.o cd /tmp/B.bSxPY4/BUILD/percona-server-5.7.31-34/build/libbinlogstandalone/src && /usr/bin/x86_64-pld-linux-gnux32-g++ -DBOOST_GEOMETRY_SQRT_CHECK_FINITENESS -DHAVE_CONFIG_H -DHAVE_TLSv13 -DLZ4_DISABLE_DEPRECATE_WARNINGS -DSTANDALONE_BINLOG -D_FILE_OFFSET_BITS=64 -D_GNU_SOURCE -D__STDC_WANT_LIB_EXT1__=1 -I/tmp/B.bSxPY4/BUILD/percona-server-5.7.31-34/build/include -I/tmp/B.bSxPY4/BUILD/percona-server-5.7.31-34/extra/rapidjson/include -I/tmp/B.bSxPY4/BUILD/percona-server-5.7.31-34/build/libbinlogevents/include -I/tmp/B.bSxPY4/BUILD/percona-server-5.7.31-34/libbinlogevents/export -I/tmp/B.bSxPY4/BUILD/percona-server-5.7.31-34/include -I/tmp/B.bSxPY4/BUILD/percona-server-5.7.31-34/libbinlogevents/include -I/tmp/B.bSxPY4/BUILD/percona-server-5.7.31-34/build/libbinlogstandalone/../libbinlogevents/include -I/tmp/B.bSxPY4/BUILD/percona-server-5.7.31-34/build/libbinlogstandalone/libbinlogevents/export -fPIC -Wall -Wextra -Wformat-security -Wvla -Woverloaded-virtual -Wno-unused-parameter -O3 -D_FORTIFY_SOURCE=2 -g -fno-omit-frame-pointer -fno-strict-aliasing -DDBUG_OFF -DNDEBUG -std=gnu++11 -o CMakeFiles/binlogstandalone_static.dir/__/__/libbinlogevents/src/uuid.cpp.o -c /tmp/B.bSxPY4/BUILD/percona-server-5.7.31-34/libbinlogevents/src/uuid.cpp make[2]: Leaving directory '/tmp/B.bSxPY4/BUILD/percona-server-5.7.31-34/build' make[2]: Entering directory '/tmp/B.bSxPY4/BUILD/percona-server-5.7.31-34/build' [ 4%] Building CXX object client/dump/CMakeFiles/boost_lib.dir/__/__/include/boost_1_59_0/libs/system/src/error_code.cpp.o cd /tmp/B.bSxPY4/BUILD/percona-server-5.7.31-34/build/client/dump && /usr/bin/x86_64-pld-linux-gnux32-g++ -DBOOST_ALL_NO_LIB -DBOOST_GEOMETRY_SQRT_CHECK_FINITENESS -DBOOST_SYSTEM_NO_DEPRECATED -DHAVE_CONFIG_H -DHAVE_TLSv13 -DLZ4_DISABLE_DEPRECATE_WARNINGS -D_FILE_OFFSET_BITS=64 -D_GNU_SOURCE -D__STDC_WANT_LIB_EXT1__=1 -I/tmp/B.bSxPY4/BUILD/percona-server-5.7.31-34/build/include -I/tmp/B.bSxPY4/BUILD/percona-server-5.7.31-34/extra/rapidjson/include -I/tmp/B.bSxPY4/BUILD/percona-server-5.7.31-34/build/libbinlogevents/include -I/tmp/B.bSxPY4/BUILD/percona-server-5.7.31-34/libbinlogevents/export -I/tmp/B.bSxPY4/BUILD/percona-server-5.7.31-34/client -I/tmp/B.bSxPY4/BUILD/percona-server-5.7.31-34/include -I/tmp/B.bSxPY4/BUILD/percona-server-5.7.31-34/mysys_ssl -I/tmp/B.bSxPY4/BUILD/percona-server-5.7.31-34/libmysql -I/tmp/B.bSxPY4/BUILD/percona-server-5.7.31-34/libbinlogevents/include -I/tmp/B.bSxPY4/BUILD/percona-server-5.7.31-34/regex -I/tmp/B.bSxPY4/BUILD/percona-server-5.7.31-34/strings -I/usr/include/readline -I/tmp/B.bSxPY4/BUILD/percona-server-5.7.31-34/build/client -I/tmp/B.bSxPY4/BUILD/percona-server-5.7.31-34/dump -isystem /tmp/B.bSxPY4/BUILD/percona-server-5.7.31-34/include/boost_1_59_0/patches -isystem /tmp/B.bSxPY4/BUILD/percona-server-5.7.31-34/boost_1_59_0 -fPIC -Wall -Wextra -Wformat-security -Wvla -Woverloaded-virtual -Wno-unused-parameter -O3 -D_FORTIFY_SOURCE=2 -g -fno-omit-frame-pointer -fno-strict-aliasing -DDBUG_OFF -DNDEBUG -Wno-class-memaccess -std=gnu++11 -o CMakeFiles/boost_lib.dir/__/__/include/boost_1_59_0/libs/system/src/error_code.cpp.o -c /tmp/B.bSxPY4/BUILD/percona-server-5.7.31-34/include/boost_1_59_0/libs/system/src/error_code.cpp make[2]: Leaving directory '/tmp/B.bSxPY4/BUILD/percona-server-5.7.31-34/build' make[2]: Entering directory '/tmp/B.bSxPY4/BUILD/percona-server-5.7.31-34/build' [ 4%] Building C object strings/CMakeFiles/strings.dir/ctype-eucjpms.c.o cd /tmp/B.bSxPY4/BUILD/percona-server-5.7.31-34/build/strings && /usr/bin/x86_64-pld-linux-gnux32-gcc -DBOOST_GEOMETRY_SQRT_CHECK_FINITENESS -DDISABLE_MYSQL_THREAD_H -DHAVE_CONFIG_H -DHAVE_TLSv13 -DLZ4_DISABLE_DEPRECATE_WARNINGS -D_FILE_OFFSET_BITS=64 -D_GNU_SOURCE -D__STDC_WANT_LIB_EXT1__=1 -I/tmp/B.bSxPY4/BUILD/percona-server-5.7.31-34/build/include -I/tmp/B.bSxPY4/BUILD/percona-server-5.7.31-34/extra/rapidjson/include -I/tmp/B.bSxPY4/BUILD/percona-server-5.7.31-34/build/libbinlogevents/include -I/tmp/B.bSxPY4/BUILD/percona-server-5.7.31-34/libbinlogevents/export -I/tmp/B.bSxPY4/BUILD/percona-server-5.7.31-34/include -fPIC -Wall -Wextra -Wformat-security -Wvla -Wwrite-strings -Wdeclaration-after-statement -O3 -D_FORTIFY_SOURCE=2 -O2 -fwrapv -pipe -Wformat -Werror=format-security -gdwarf-4 -fno-debug-types-section -fvar-tracking-assignments -g2 -Wp,-D_FORTIFY_SOURCE=2 -fstack-protector-strong --param=ssp-buffer-size=4 -Werror=trampolines -fPIC -mtune=generic -march=x86-64 -gdwarf-4 -fno-debug-types-section -fvar-tracking-assignments -g2 -DNDEBUG -fno-omit-frame-pointer -fno-strict-aliasing -Wno-shadow -g -fno-omit-frame-pointer -fno-strict-aliasing -DDBUG_OFF -DNDEBUG -o CMakeFiles/strings.dir/ctype-eucjpms.c.o -c /tmp/B.bSxPY4/BUILD/percona-server-5.7.31-34/strings/ctype-eucjpms.c make[2]: Leaving directory '/tmp/B.bSxPY4/BUILD/percona-server-5.7.31-34/build' make[2]: Entering directory '/tmp/B.bSxPY4/BUILD/percona-server-5.7.31-34/build' [ 5%] Linking CXX static library ../../archive_output_directory/libboost_lib.a cd /tmp/B.bSxPY4/BUILD/percona-server-5.7.31-34/build/client/dump && /usr/bin/cmake -P CMakeFiles/boost_lib.dir/cmake_clean_target.cmake cd /tmp/B.bSxPY4/BUILD/percona-server-5.7.31-34/build/client/dump && /usr/bin/cmake -E cmake_link_script CMakeFiles/boost_lib.dir/link.txt --verbose=1 /usr/bin/ar qc ../../archive_output_directory/libboost_lib.a CMakeFiles/boost_lib.dir/__/__/include/boost_1_59_0/libs/chrono/src/chrono.cpp.o CMakeFiles/boost_lib.dir/__/__/include/boost_1_59_0/libs/system/src/error_code.cpp.o /usr/bin/ranlib ../../archive_output_directory/libboost_lib.a cd /tmp/B.bSxPY4/BUILD/percona-server-5.7.31-34/build/client/dump && /usr/bin/cmake -DTARGET_NAME=boost_lib -DTARGET_LOC=/tmp/B.bSxPY4/BUILD/percona-server-5.7.31-34/build/archive_output_directory/libboost_lib.a -DCFG_INTDIR=. -P /tmp/B.bSxPY4/BUILD/percona-server-5.7.31-34/build/archive_output_directory/lib_location_boost_lib.cmake make[2]: Leaving directory '/tmp/B.bSxPY4/BUILD/percona-server-5.7.31-34/build' make[1]: Entering directory '/tmp/B.bSxPY4/BUILD/percona-server-5.7.31-34/build' [ 5%] Built target boost_lib make[1]: Leaving directory '/tmp/B.bSxPY4/BUILD/percona-server-5.7.31-34/build' make[2]: Entering directory '/tmp/B.bSxPY4/BUILD/percona-server-5.7.31-34/build' [ 5%] Building C object strings/CMakeFiles/strings.dir/ctype-latin1.c.o cd /tmp/B.bSxPY4/BUILD/percona-server-5.7.31-34/build/strings && /usr/bin/x86_64-pld-linux-gnux32-gcc -DBOOST_GEOMETRY_SQRT_CHECK_FINITENESS -DDISABLE_MYSQL_THREAD_H -DHAVE_CONFIG_H -DHAVE_TLSv13 -DLZ4_DISABLE_DEPRECATE_WARNINGS -D_FILE_OFFSET_BITS=64 -D_GNU_SOURCE -D__STDC_WANT_LIB_EXT1__=1 -I/tmp/B.bSxPY4/BUILD/percona-server-5.7.31-34/build/include -I/tmp/B.bSxPY4/BUILD/percona-server-5.7.31-34/extra/rapidjson/include -I/tmp/B.bSxPY4/BUILD/percona-server-5.7.31-34/build/libbinlogevents/include -I/tmp/B.bSxPY4/BUILD/percona-server-5.7.31-34/libbinlogevents/export -I/tmp/B.bSxPY4/BUILD/percona-server-5.7.31-34/include -fPIC -Wall -Wextra -Wformat-security -Wvla -Wwrite-strings -Wdeclaration-after-statement -O3 -D_FORTIFY_SOURCE=2 -O2 -fwrapv -pipe -Wformat -Werror=format-security -gdwarf-4 -fno-debug-types-section -fvar-tracking-assignments -g2 -Wp,-D_FORTIFY_SOURCE=2 -fstack-protector-strong --param=ssp-buffer-size=4 -Werror=trampolines -fPIC -mtune=generic -march=x86-64 -gdwarf-4 -fno-debug-types-section -fvar-tracking-assignments -g2 -DNDEBUG -fno-omit-frame-pointer -fno-strict-aliasing -Wno-shadow -g -fno-omit-frame-pointer -fno-strict-aliasing -DDBUG_OFF -DNDEBUG -o CMakeFiles/strings.dir/ctype-latin1.c.o -c /tmp/B.bSxPY4/BUILD/percona-server-5.7.31-34/strings/ctype-latin1.c make[2]: Leaving directory '/tmp/B.bSxPY4/BUILD/percona-server-5.7.31-34/build' make[2]: Entering directory '/tmp/B.bSxPY4/BUILD/percona-server-5.7.31-34/build' [ 3%] Building CXX object libbinlogstandalone/src/CMakeFiles/binlogstandalone_static.dir/__/__/libbinlogevents/src/statement_events.cpp.o cd /tmp/B.bSxPY4/BUILD/percona-server-5.7.31-34/build/libbinlogstandalone/src && /usr/bin/x86_64-pld-linux-gnux32-g++ -DBOOST_GEOMETRY_SQRT_CHECK_FINITENESS -DHAVE_CONFIG_H -DHAVE_TLSv13 -DLZ4_DISABLE_DEPRECATE_WARNINGS -DSTANDALONE_BINLOG -D_FILE_OFFSET_BITS=64 -D_GNU_SOURCE -D__STDC_WANT_LIB_EXT1__=1 -I/tmp/B.bSxPY4/BUILD/percona-server-5.7.31-34/build/include -I/tmp/B.bSxPY4/BUILD/percona-server-5.7.31-34/extra/rapidjson/include -I/tmp/B.bSxPY4/BUILD/percona-server-5.7.31-34/build/libbinlogevents/include -I/tmp/B.bSxPY4/BUILD/percona-server-5.7.31-34/libbinlogevents/export -I/tmp/B.bSxPY4/BUILD/percona-server-5.7.31-34/include -I/tmp/B.bSxPY4/BUILD/percona-server-5.7.31-34/libbinlogevents/include -I/tmp/B.bSxPY4/BUILD/percona-server-5.7.31-34/build/libbinlogstandalone/../libbinlogevents/include -I/tmp/B.bSxPY4/BUILD/percona-server-5.7.31-34/build/libbinlogstandalone/libbinlogevents/export -fPIC -Wall -Wextra -Wformat-security -Wvla -Woverloaded-virtual -Wno-unused-parameter -O3 -D_FORTIFY_SOURCE=2 -g -fno-omit-frame-pointer -fno-strict-aliasing -DDBUG_OFF -DNDEBUG -std=gnu++11 -o CMakeFiles/binlogstandalone_static.dir/__/__/libbinlogevents/src/statement_events.cpp.o -c /tmp/B.bSxPY4/BUILD/percona-server-5.7.31-34/libbinlogevents/src/statement_events.cpp make[2]: Leaving directory '/tmp/B.bSxPY4/BUILD/percona-server-5.7.31-34/build' make[2]: Entering directory '/tmp/B.bSxPY4/BUILD/percona-server-5.7.31-34/build' [ 4%] Building CXX object libbinlogstandalone/src/CMakeFiles/binlogstandalone_shared.dir/__/__/libbinlogevents/src/statement_events.cpp.o cd /tmp/B.bSxPY4/BUILD/percona-server-5.7.31-34/build/libbinlogstandalone/src && /usr/bin/x86_64-pld-linux-gnux32-g++ -DBOOST_GEOMETRY_SQRT_CHECK_FINITENESS -DHAVE_CONFIG_H -DHAVE_TLSv13 -DLZ4_DISABLE_DEPRECATE_WARNINGS -DSTANDALONE_BINLOG -D_FILE_OFFSET_BITS=64 -D_GNU_SOURCE -D__STDC_WANT_LIB_EXT1__=1 -Dbinlogstandalone_shared_EXPORTS -I/tmp/B.bSxPY4/BUILD/percona-server-5.7.31-34/build/include -I/tmp/B.bSxPY4/BUILD/percona-server-5.7.31-34/extra/rapidjson/include -I/tmp/B.bSxPY4/BUILD/percona-server-5.7.31-34/build/libbinlogevents/include -I/tmp/B.bSxPY4/BUILD/percona-server-5.7.31-34/libbinlogevents/export -I/tmp/B.bSxPY4/BUILD/percona-server-5.7.31-34/include -I/tmp/B.bSxPY4/BUILD/percona-server-5.7.31-34/libbinlogevents/include -I/tmp/B.bSxPY4/BUILD/percona-server-5.7.31-34/build/libbinlogstandalone/../libbinlogevents/include -I/tmp/B.bSxPY4/BUILD/percona-server-5.7.31-34/build/libbinlogstandalone/libbinlogevents/export -fPIC -Wall -Wextra -Wformat-security -Wvla -Woverloaded-virtual -Wno-unused-parameter -O3 -D_FORTIFY_SOURCE=2 -g -fno-omit-frame-pointer -fno-strict-aliasing -DDBUG_OFF -DNDEBUG -fPIC -std=gnu++11 -o CMakeFiles/binlogstandalone_shared.dir/__/__/libbinlogevents/src/statement_events.cpp.o -c /tmp/B.bSxPY4/BUILD/percona-server-5.7.31-34/libbinlogevents/src/statement_events.cpp make[2]: Leaving directory '/tmp/B.bSxPY4/BUILD/percona-server-5.7.31-34/build' make[2]: Entering directory '/tmp/B.bSxPY4/BUILD/percona-server-5.7.31-34/build' [ 5%] Building C object strings/CMakeFiles/strings.dir/ctype-gbk.c.o cd /tmp/B.bSxPY4/BUILD/percona-server-5.7.31-34/build/strings && /usr/bin/x86_64-pld-linux-gnux32-gcc -DBOOST_GEOMETRY_SQRT_CHECK_FINITENESS -DDISABLE_MYSQL_THREAD_H -DHAVE_CONFIG_H -DHAVE_TLSv13 -DLZ4_DISABLE_DEPRECATE_WARNINGS -D_FILE_OFFSET_BITS=64 -D_GNU_SOURCE -D__STDC_WANT_LIB_EXT1__=1 -I/tmp/B.bSxPY4/BUILD/percona-server-5.7.31-34/build/include -I/tmp/B.bSxPY4/BUILD/percona-server-5.7.31-34/extra/rapidjson/include -I/tmp/B.bSxPY4/BUILD/percona-server-5.7.31-34/build/libbinlogevents/include -I/tmp/B.bSxPY4/BUILD/percona-server-5.7.31-34/libbinlogevents/export -I/tmp/B.bSxPY4/BUILD/percona-server-5.7.31-34/include -fPIC -Wall -Wextra -Wformat-security -Wvla -Wwrite-strings -Wdeclaration-after-statement -O3 -D_FORTIFY_SOURCE=2 -O2 -fwrapv -pipe -Wformat -Werror=format-security -gdwarf-4 -fno-debug-types-section -fvar-tracking-assignments -g2 -Wp,-D_FORTIFY_SOURCE=2 -fstack-protector-strong --param=ssp-buffer-size=4 -Werror=trampolines -fPIC -mtune=generic -march=x86-64 -gdwarf-4 -fno-debug-types-section -fvar-tracking-assignments -g2 -DNDEBUG -fno-omit-frame-pointer -fno-strict-aliasing -Wno-shadow -g -fno-omit-frame-pointer -fno-strict-aliasing -DDBUG_OFF -DNDEBUG -o CMakeFiles/strings.dir/ctype-gbk.c.o -c /tmp/B.bSxPY4/BUILD/percona-server-5.7.31-34/strings/ctype-gbk.c make[2]: Leaving directory '/tmp/B.bSxPY4/BUILD/percona-server-5.7.31-34/build' make[2]: Entering directory '/tmp/B.bSxPY4/BUILD/percona-server-5.7.31-34/build' [ 6%] Building C object strings/CMakeFiles/strings.dir/ctype-tis620.c.o cd /tmp/B.bSxPY4/BUILD/percona-server-5.7.31-34/build/strings && /usr/bin/x86_64-pld-linux-gnux32-gcc -DBOOST_GEOMETRY_SQRT_CHECK_FINITENESS -DDISABLE_MYSQL_THREAD_H -DHAVE_CONFIG_H -DHAVE_TLSv13 -DLZ4_DISABLE_DEPRECATE_WARNINGS -D_FILE_OFFSET_BITS=64 -D_GNU_SOURCE -D__STDC_WANT_LIB_EXT1__=1 -I/tmp/B.bSxPY4/BUILD/percona-server-5.7.31-34/build/include -I/tmp/B.bSxPY4/BUILD/percona-server-5.7.31-34/extra/rapidjson/include -I/tmp/B.bSxPY4/BUILD/percona-server-5.7.31-34/build/libbinlogevents/include -I/tmp/B.bSxPY4/BUILD/percona-server-5.7.31-34/libbinlogevents/export -I/tmp/B.bSxPY4/BUILD/percona-server-5.7.31-34/include -fPIC -Wall -Wextra -Wformat-security -Wvla -Wwrite-strings -Wdeclaration-after-statement -O3 -D_FORTIFY_SOURCE=2 -O2 -fwrapv -pipe -Wformat -Werror=format-security -gdwarf-4 -fno-debug-types-section -fvar-tracking-assignments -g2 -Wp,-D_FORTIFY_SOURCE=2 -fstack-protector-strong --param=ssp-buffer-size=4 -Werror=trampolines -fPIC -mtune=generic -march=x86-64 -gdwarf-4 -fno-debug-types-section -fvar-tracking-assignments -g2 -DNDEBUG -fno-omit-frame-pointer -fno-strict-aliasing -Wno-shadow -g -fno-omit-frame-pointer -fno-strict-aliasing -DDBUG_OFF -DNDEBUG -o CMakeFiles/strings.dir/ctype-tis620.c.o -c /tmp/B.bSxPY4/BUILD/percona-server-5.7.31-34/strings/ctype-tis620.c make[2]: Leaving directory '/tmp/B.bSxPY4/BUILD/percona-server-5.7.31-34/build' make[2]: Entering directory '/tmp/B.bSxPY4/BUILD/percona-server-5.7.31-34/build' [ 6%] Building C object strings/CMakeFiles/strings.dir/ctype-mb.c.o cd /tmp/B.bSxPY4/BUILD/percona-server-5.7.31-34/build/strings && /usr/bin/x86_64-pld-linux-gnux32-gcc -DBOOST_GEOMETRY_SQRT_CHECK_FINITENESS -DDISABLE_MYSQL_THREAD_H -DHAVE_CONFIG_H -DHAVE_TLSv13 -DLZ4_DISABLE_DEPRECATE_WARNINGS -D_FILE_OFFSET_BITS=64 -D_GNU_SOURCE -D__STDC_WANT_LIB_EXT1__=1 -I/tmp/B.bSxPY4/BUILD/percona-server-5.7.31-34/build/include -I/tmp/B.bSxPY4/BUILD/percona-server-5.7.31-34/extra/rapidjson/include -I/tmp/B.bSxPY4/BUILD/percona-server-5.7.31-34/build/libbinlogevents/include -I/tmp/B.bSxPY4/BUILD/percona-server-5.7.31-34/libbinlogevents/export -I/tmp/B.bSxPY4/BUILD/percona-server-5.7.31-34/include -fPIC -Wall -Wextra -Wformat-security -Wvla -Wwrite-strings -Wdeclaration-after-statement -O3 -D_FORTIFY_SOURCE=2 -O2 -fwrapv -pipe -Wformat -Werror=format-security -gdwarf-4 -fno-debug-types-section -fvar-tracking-assignments -g2 -Wp,-D_FORTIFY_SOURCE=2 -fstack-protector-strong --param=ssp-buffer-size=4 -Werror=trampolines -fPIC -mtune=generic -march=x86-64 -gdwarf-4 -fno-debug-types-section -fvar-tracking-assignments -g2 -DNDEBUG -fno-omit-frame-pointer -fno-strict-aliasing -Wno-shadow -g -fno-omit-frame-pointer -fno-strict-aliasing -DDBUG_OFF -DNDEBUG -o CMakeFiles/strings.dir/ctype-mb.c.o -c /tmp/B.bSxPY4/BUILD/percona-server-5.7.31-34/strings/ctype-mb.c make[2]: Leaving directory '/tmp/B.bSxPY4/BUILD/percona-server-5.7.31-34/build' make[2]: Entering directory '/tmp/B.bSxPY4/BUILD/percona-server-5.7.31-34/build' [ 6%] Building C object strings/CMakeFiles/strings.dir/ctype-simple.c.o cd /tmp/B.bSxPY4/BUILD/percona-server-5.7.31-34/build/strings && /usr/bin/x86_64-pld-linux-gnux32-gcc -DBOOST_GEOMETRY_SQRT_CHECK_FINITENESS -DDISABLE_MYSQL_THREAD_H -DHAVE_CONFIG_H -DHAVE_TLSv13 -DLZ4_DISABLE_DEPRECATE_WARNINGS -D_FILE_OFFSET_BITS=64 -D_GNU_SOURCE -D__STDC_WANT_LIB_EXT1__=1 -I/tmp/B.bSxPY4/BUILD/percona-server-5.7.31-34/build/include -I/tmp/B.bSxPY4/BUILD/percona-server-5.7.31-34/extra/rapidjson/include -I/tmp/B.bSxPY4/BUILD/percona-server-5.7.31-34/build/libbinlogevents/include -I/tmp/B.bSxPY4/BUILD/percona-server-5.7.31-34/libbinlogevents/export -I/tmp/B.bSxPY4/BUILD/percona-server-5.7.31-34/include -fPIC -Wall -Wextra -Wformat-security -Wvla -Wwrite-strings -Wdeclaration-after-statement -O3 -D_FORTIFY_SOURCE=2 -O2 -fwrapv -pipe -Wformat -Werror=format-security -gdwarf-4 -fno-debug-types-section -fvar-tracking-assignments -g2 -Wp,-D_FORTIFY_SOURCE=2 -fstack-protector-strong --param=ssp-buffer-size=4 -Werror=trampolines -fPIC -mtune=generic -march=x86-64 -gdwarf-4 -fno-debug-types-section -fvar-tracking-assignments -g2 -DNDEBUG -fno-omit-frame-pointer -fno-strict-aliasing -Wno-shadow -g -fno-omit-frame-pointer -fno-strict-aliasing -DDBUG_OFF -DNDEBUG -o CMakeFiles/strings.dir/ctype-simple.c.o -c /tmp/B.bSxPY4/BUILD/percona-server-5.7.31-34/strings/ctype-simple.c make[2]: Leaving directory '/tmp/B.bSxPY4/BUILD/percona-server-5.7.31-34/build' make[2]: Entering directory '/tmp/B.bSxPY4/BUILD/percona-server-5.7.31-34/build' [ 6%] Building C object strings/CMakeFiles/strings.dir/ctype-sjis.c.o cd /tmp/B.bSxPY4/BUILD/percona-server-5.7.31-34/build/strings && /usr/bin/x86_64-pld-linux-gnux32-gcc -DBOOST_GEOMETRY_SQRT_CHECK_FINITENESS -DDISABLE_MYSQL_THREAD_H -DHAVE_CONFIG_H -DHAVE_TLSv13 -DLZ4_DISABLE_DEPRECATE_WARNINGS -D_FILE_OFFSET_BITS=64 -D_GNU_SOURCE -D__STDC_WANT_LIB_EXT1__=1 -I/tmp/B.bSxPY4/BUILD/percona-server-5.7.31-34/build/include -I/tmp/B.bSxPY4/BUILD/percona-server-5.7.31-34/extra/rapidjson/include -I/tmp/B.bSxPY4/BUILD/percona-server-5.7.31-34/build/libbinlogevents/include -I/tmp/B.bSxPY4/BUILD/percona-server-5.7.31-34/libbinlogevents/export -I/tmp/B.bSxPY4/BUILD/percona-server-5.7.31-34/include -fPIC -Wall -Wextra -Wformat-security -Wvla -Wwrite-strings -Wdeclaration-after-statement -O3 -D_FORTIFY_SOURCE=2 -O2 -fwrapv -pipe -Wformat -Werror=format-security -gdwarf-4 -fno-debug-types-section -fvar-tracking-assignments -g2 -Wp,-D_FORTIFY_SOURCE=2 -fstack-protector-strong --param=ssp-buffer-size=4 -Werror=trampolines -fPIC -mtune=generic -march=x86-64 -gdwarf-4 -fno-debug-types-section -fvar-tracking-assignments -g2 -DNDEBUG -fno-omit-frame-pointer -fno-strict-aliasing -Wno-shadow -g -fno-omit-frame-pointer -fno-strict-aliasing -DDBUG_OFF -DNDEBUG -o CMakeFiles/strings.dir/ctype-sjis.c.o -c /tmp/B.bSxPY4/BUILD/percona-server-5.7.31-34/strings/ctype-sjis.c make[2]: Leaving directory '/tmp/B.bSxPY4/BUILD/percona-server-5.7.31-34/build' make[2]: Entering directory '/tmp/B.bSxPY4/BUILD/percona-server-5.7.31-34/build' [ 6%] Building CXX object libbinlogstandalone/src/CMakeFiles/binlogstandalone_shared.dir/__/__/libbinlogevents/src/uuid.cpp.o cd /tmp/B.bSxPY4/BUILD/percona-server-5.7.31-34/build/libbinlogstandalone/src && /usr/bin/x86_64-pld-linux-gnux32-g++ -DBOOST_GEOMETRY_SQRT_CHECK_FINITENESS -DHAVE_CONFIG_H -DHAVE_TLSv13 -DLZ4_DISABLE_DEPRECATE_WARNINGS -DSTANDALONE_BINLOG -D_FILE_OFFSET_BITS=64 -D_GNU_SOURCE -D__STDC_WANT_LIB_EXT1__=1 -Dbinlogstandalone_shared_EXPORTS -I/tmp/B.bSxPY4/BUILD/percona-server-5.7.31-34/build/include -I/tmp/B.bSxPY4/BUILD/percona-server-5.7.31-34/extra/rapidjson/include -I/tmp/B.bSxPY4/BUILD/percona-server-5.7.31-34/build/libbinlogevents/include -I/tmp/B.bSxPY4/BUILD/percona-server-5.7.31-34/libbinlogevents/export -I/tmp/B.bSxPY4/BUILD/percona-server-5.7.31-34/include -I/tmp/B.bSxPY4/BUILD/percona-server-5.7.31-34/libbinlogevents/include -I/tmp/B.bSxPY4/BUILD/percona-server-5.7.31-34/build/libbinlogstandalone/../libbinlogevents/include -I/tmp/B.bSxPY4/BUILD/percona-server-5.7.31-34/build/libbinlogstandalone/libbinlogevents/export -fPIC -Wall -Wextra -Wformat-security -Wvla -Woverloaded-virtual -Wno-unused-parameter -O3 -D_FORTIFY_SOURCE=2 -g -fno-omit-frame-pointer -fno-strict-aliasing -DDBUG_OFF -DNDEBUG -fPIC -std=gnu++11 -o CMakeFiles/binlogstandalone_shared.dir/__/__/libbinlogevents/src/uuid.cpp.o -c /tmp/B.bSxPY4/BUILD/percona-server-5.7.31-34/libbinlogevents/src/uuid.cpp make[2]: Leaving directory '/tmp/B.bSxPY4/BUILD/percona-server-5.7.31-34/build' make[2]: Entering directory '/tmp/B.bSxPY4/BUILD/percona-server-5.7.31-34/build' [ 3%] Building CXX object libbinlogstandalone/src/CMakeFiles/binlogstandalone_static.dir/__/__/libbinlogevents/src/control_events.cpp.o cd /tmp/B.bSxPY4/BUILD/percona-server-5.7.31-34/build/libbinlogstandalone/src && /usr/bin/x86_64-pld-linux-gnux32-g++ -DBOOST_GEOMETRY_SQRT_CHECK_FINITENESS -DHAVE_CONFIG_H -DHAVE_TLSv13 -DLZ4_DISABLE_DEPRECATE_WARNINGS -DSTANDALONE_BINLOG -D_FILE_OFFSET_BITS=64 -D_GNU_SOURCE -D__STDC_WANT_LIB_EXT1__=1 -I/tmp/B.bSxPY4/BUILD/percona-server-5.7.31-34/build/include -I/tmp/B.bSxPY4/BUILD/percona-server-5.7.31-34/extra/rapidjson/include -I/tmp/B.bSxPY4/BUILD/percona-server-5.7.31-34/build/libbinlogevents/include -I/tmp/B.bSxPY4/BUILD/percona-server-5.7.31-34/libbinlogevents/export -I/tmp/B.bSxPY4/BUILD/percona-server-5.7.31-34/include -I/tmp/B.bSxPY4/BUILD/percona-server-5.7.31-34/libbinlogevents/include -I/tmp/B.bSxPY4/BUILD/percona-server-5.7.31-34/build/libbinlogstandalone/../libbinlogevents/include -I/tmp/B.bSxPY4/BUILD/percona-server-5.7.31-34/build/libbinlogstandalone/libbinlogevents/export -fPIC -Wall -Wextra -Wformat-security -Wvla -Woverloaded-virtual -Wno-unused-parameter -O3 -D_FORTIFY_SOURCE=2 -g -fno-omit-frame-pointer -fno-strict-aliasing -DDBUG_OFF -DNDEBUG -std=gnu++11 -o CMakeFiles/binlogstandalone_static.dir/__/__/libbinlogevents/src/control_events.cpp.o -c /tmp/B.bSxPY4/BUILD/percona-server-5.7.31-34/libbinlogevents/src/control_events.cpp make[2]: Leaving directory '/tmp/B.bSxPY4/BUILD/percona-server-5.7.31-34/build' make[2]: Entering directory '/tmp/B.bSxPY4/BUILD/percona-server-5.7.31-34/build' [ 4%] Building CXX object libbinlogstandalone/src/CMakeFiles/binlogstandalone_shared.dir/__/__/libbinlogevents/src/control_events.cpp.o cd /tmp/B.bSxPY4/BUILD/percona-server-5.7.31-34/build/libbinlogstandalone/src && /usr/bin/x86_64-pld-linux-gnux32-g++ -DBOOST_GEOMETRY_SQRT_CHECK_FINITENESS -DHAVE_CONFIG_H -DHAVE_TLSv13 -DLZ4_DISABLE_DEPRECATE_WARNINGS -DSTANDALONE_BINLOG -D_FILE_OFFSET_BITS=64 -D_GNU_SOURCE -D__STDC_WANT_LIB_EXT1__=1 -Dbinlogstandalone_shared_EXPORTS -I/tmp/B.bSxPY4/BUILD/percona-server-5.7.31-34/build/include -I/tmp/B.bSxPY4/BUILD/percona-server-5.7.31-34/extra/rapidjson/include -I/tmp/B.bSxPY4/BUILD/percona-server-5.7.31-34/build/libbinlogevents/include -I/tmp/B.bSxPY4/BUILD/percona-server-5.7.31-34/libbinlogevents/export -I/tmp/B.bSxPY4/BUILD/percona-server-5.7.31-34/include -I/tmp/B.bSxPY4/BUILD/percona-server-5.7.31-34/libbinlogevents/include -I/tmp/B.bSxPY4/BUILD/percona-server-5.7.31-34/build/libbinlogstandalone/../libbinlogevents/include -I/tmp/B.bSxPY4/BUILD/percona-server-5.7.31-34/build/libbinlogstandalone/libbinlogevents/export -fPIC -Wall -Wextra -Wformat-security -Wvla -Woverloaded-virtual -Wno-unused-parameter -O3 -D_FORTIFY_SOURCE=2 -g -fno-omit-frame-pointer -fno-strict-aliasing -DDBUG_OFF -DNDEBUG -fPIC -std=gnu++11 -o CMakeFiles/binlogstandalone_shared.dir/__/__/libbinlogevents/src/control_events.cpp.o -c /tmp/B.bSxPY4/BUILD/percona-server-5.7.31-34/libbinlogevents/src/control_events.cpp make[2]: Leaving directory '/tmp/B.bSxPY4/BUILD/percona-server-5.7.31-34/build' make[2]: Entering directory '/tmp/B.bSxPY4/BUILD/percona-server-5.7.31-34/build' [ 6%] Linking CXX static library ../lib/libbinlogstandalone.a cd /tmp/B.bSxPY4/BUILD/percona-server-5.7.31-34/build/libbinlogstandalone/src && /usr/bin/cmake -P CMakeFiles/binlogstandalone_static.dir/cmake_clean_target.cmake cd /tmp/B.bSxPY4/BUILD/percona-server-5.7.31-34/build/libbinlogstandalone/src && /usr/bin/cmake -E cmake_link_script CMakeFiles/binlogstandalone_static.dir/link.txt --verbose=1 /usr/bin/ar qc ../lib/libbinlogstandalone.a CMakeFiles/binlogstandalone_static.dir/__/__/libbinlogevents/src/load_data_events.cpp.o CMakeFiles/binlogstandalone_static.dir/__/__/libbinlogevents/src/rows_event.cpp.o CMakeFiles/binlogstandalone_static.dir/__/__/libbinlogevents/src/binlog_event.cpp.o CMakeFiles/binlogstandalone_static.dir/__/__/libbinlogevents/src/control_events.cpp.o CMakeFiles/binlogstandalone_static.dir/__/__/libbinlogevents/src/statement_events.cpp.o CMakeFiles/binlogstandalone_static.dir/__/__/libbinlogevents/src/uuid.cpp.o /usr/bin/ranlib ../lib/libbinlogstandalone.a make[2]: Leaving directory '/tmp/B.bSxPY4/BUILD/percona-server-5.7.31-34/build' make[1]: Entering directory '/tmp/B.bSxPY4/BUILD/percona-server-5.7.31-34/build' [ 6%] Built target binlogstandalone_static make[1]: Leaving directory '/tmp/B.bSxPY4/BUILD/percona-server-5.7.31-34/build' make[2]: Entering directory '/tmp/B.bSxPY4/BUILD/percona-server-5.7.31-34/build' [ 6%] Building C object strings/CMakeFiles/strings.dir/ctype-win1250ch.c.o cd /tmp/B.bSxPY4/BUILD/percona-server-5.7.31-34/build/strings && /usr/bin/x86_64-pld-linux-gnux32-gcc -DBOOST_GEOMETRY_SQRT_CHECK_FINITENESS -DDISABLE_MYSQL_THREAD_H -DHAVE_CONFIG_H -DHAVE_TLSv13 -DLZ4_DISABLE_DEPRECATE_WARNINGS -D_FILE_OFFSET_BITS=64 -D_GNU_SOURCE -D__STDC_WANT_LIB_EXT1__=1 -I/tmp/B.bSxPY4/BUILD/percona-server-5.7.31-34/build/include -I/tmp/B.bSxPY4/BUILD/percona-server-5.7.31-34/extra/rapidjson/include -I/tmp/B.bSxPY4/BUILD/percona-server-5.7.31-34/build/libbinlogevents/include -I/tmp/B.bSxPY4/BUILD/percona-server-5.7.31-34/libbinlogevents/export -I/tmp/B.bSxPY4/BUILD/percona-server-5.7.31-34/include -fPIC -Wall -Wextra -Wformat-security -Wvla -Wwrite-strings -Wdeclaration-after-statement -O3 -D_FORTIFY_SOURCE=2 -O2 -fwrapv -pipe -Wformat -Werror=format-security -gdwarf-4 -fno-debug-types-section -fvar-tracking-assignments -g2 -Wp,-D_FORTIFY_SOURCE=2 -fstack-protector-strong --param=ssp-buffer-size=4 -Werror=trampolines -fPIC -mtune=generic -march=x86-64 -gdwarf-4 -fno-debug-types-section -fvar-tracking-assignments -g2 -DNDEBUG -fno-omit-frame-pointer -fno-strict-aliasing -Wno-shadow -g -fno-omit-frame-pointer -fno-strict-aliasing -DDBUG_OFF -DNDEBUG -o CMakeFiles/strings.dir/ctype-win1250ch.c.o -c /tmp/B.bSxPY4/BUILD/percona-server-5.7.31-34/strings/ctype-win1250ch.c make[2]: Leaving directory '/tmp/B.bSxPY4/BUILD/percona-server-5.7.31-34/build' make[2]: Entering directory '/tmp/B.bSxPY4/BUILD/percona-server-5.7.31-34/build' [ 5%] Building C object strings/CMakeFiles/strings.dir/ctype-gb18030.c.o cd /tmp/B.bSxPY4/BUILD/percona-server-5.7.31-34/build/strings && /usr/bin/x86_64-pld-linux-gnux32-gcc -DBOOST_GEOMETRY_SQRT_CHECK_FINITENESS -DDISABLE_MYSQL_THREAD_H -DHAVE_CONFIG_H -DHAVE_TLSv13 -DLZ4_DISABLE_DEPRECATE_WARNINGS -D_FILE_OFFSET_BITS=64 -D_GNU_SOURCE -D__STDC_WANT_LIB_EXT1__=1 -I/tmp/B.bSxPY4/BUILD/percona-server-5.7.31-34/build/include -I/tmp/B.bSxPY4/BUILD/percona-server-5.7.31-34/extra/rapidjson/include -I/tmp/B.bSxPY4/BUILD/percona-server-5.7.31-34/build/libbinlogevents/include -I/tmp/B.bSxPY4/BUILD/percona-server-5.7.31-34/libbinlogevents/export -I/tmp/B.bSxPY4/BUILD/percona-server-5.7.31-34/include -fPIC -Wall -Wextra -Wformat-security -Wvla -Wwrite-strings -Wdeclaration-after-statement -O3 -D_FORTIFY_SOURCE=2 -O2 -fwrapv -pipe -Wformat -Werror=format-security -gdwarf-4 -fno-debug-types-section -fvar-tracking-assignments -g2 -Wp,-D_FORTIFY_SOURCE=2 -fstack-protector-strong --param=ssp-buffer-size=4 -Werror=trampolines -fPIC -mtune=generic -march=x86-64 -gdwarf-4 -fno-debug-types-section -fvar-tracking-assignments -g2 -DNDEBUG -fno-omit-frame-pointer -fno-strict-aliasing -Wno-shadow -g -fno-omit-frame-pointer -fno-strict-aliasing -DDBUG_OFF -DNDEBUG -o CMakeFiles/strings.dir/ctype-gb18030.c.o -c /tmp/B.bSxPY4/BUILD/percona-server-5.7.31-34/strings/ctype-gb18030.c make[2]: Leaving directory '/tmp/B.bSxPY4/BUILD/percona-server-5.7.31-34/build' make[2]: Entering directory '/tmp/B.bSxPY4/BUILD/percona-server-5.7.31-34/build' [ 6%] Linking CXX shared library ../lib/libbinlogstandalone.so cd /tmp/B.bSxPY4/BUILD/percona-server-5.7.31-34/build/libbinlogstandalone/src && /usr/bin/cmake -E cmake_link_script CMakeFiles/binlogstandalone_shared.dir/link.txt --verbose=1 /usr/bin/x86_64-pld-linux-gnux32-g++ -fPIC -fPIC -Wall -Wextra -Wformat-security -Wvla -Woverloaded-virtual -Wno-unused-parameter -O3 -D_FORTIFY_SOURCE=2 -g -fno-omit-frame-pointer -fno-strict-aliasing -DDBUG_OFF -DNDEBUG -fPIC -shared -Wl,-soname,libbinlogstandalone.so -o ../lib/libbinlogstandalone.so CMakeFiles/binlogstandalone_shared.dir/__/__/libbinlogevents/src/load_data_events.cpp.o CMakeFiles/binlogstandalone_shared.dir/__/__/libbinlogevents/src/rows_event.cpp.o CMakeFiles/binlogstandalone_shared.dir/__/__/libbinlogevents/src/binlog_event.cpp.o CMakeFiles/binlogstandalone_shared.dir/__/__/libbinlogevents/src/control_events.cpp.o CMakeFiles/binlogstandalone_shared.dir/__/__/libbinlogevents/src/statement_events.cpp.o CMakeFiles/binlogstandalone_shared.dir/__/__/libbinlogevents/src/uuid.cpp.o -lpthread -lz make[2]: Leaving directory '/tmp/B.bSxPY4/BUILD/percona-server-5.7.31-34/build' make[1]: Entering directory '/tmp/B.bSxPY4/BUILD/percona-server-5.7.31-34/build' [ 6%] Built target binlogstandalone_shared make[1]: Leaving directory '/tmp/B.bSxPY4/BUILD/percona-server-5.7.31-34/build' make[2]: Entering directory '/tmp/B.bSxPY4/BUILD/percona-server-5.7.31-34/build' [ 6%] Building C object strings/CMakeFiles/strings.dir/ctype.c.o cd /tmp/B.bSxPY4/BUILD/percona-server-5.7.31-34/build/strings && /usr/bin/x86_64-pld-linux-gnux32-gcc -DBOOST_GEOMETRY_SQRT_CHECK_FINITENESS -DDISABLE_MYSQL_THREAD_H -DHAVE_CONFIG_H -DHAVE_TLSv13 -DLZ4_DISABLE_DEPRECATE_WARNINGS -D_FILE_OFFSET_BITS=64 -D_GNU_SOURCE -D__STDC_WANT_LIB_EXT1__=1 -I/tmp/B.bSxPY4/BUILD/percona-server-5.7.31-34/build/include -I/tmp/B.bSxPY4/BUILD/percona-server-5.7.31-34/extra/rapidjson/include -I/tmp/B.bSxPY4/BUILD/percona-server-5.7.31-34/build/libbinlogevents/include -I/tmp/B.bSxPY4/BUILD/percona-server-5.7.31-34/libbinlogevents/export -I/tmp/B.bSxPY4/BUILD/percona-server-5.7.31-34/include -fPIC -Wall -Wextra -Wformat-security -Wvla -Wwrite-strings -Wdeclaration-after-statement -O3 -D_FORTIFY_SOURCE=2 -O2 -fwrapv -pipe -Wformat -Werror=format-security -gdwarf-4 -fno-debug-types-section -fvar-tracking-assignments -g2 -Wp,-D_FORTIFY_SOURCE=2 -fstack-protector-strong --param=ssp-buffer-size=4 -Werror=trampolines -fPIC -mtune=generic -march=x86-64 -gdwarf-4 -fno-debug-types-section -fvar-tracking-assignments -g2 -DNDEBUG -fno-omit-frame-pointer -fno-strict-aliasing -Wno-shadow -g -fno-omit-frame-pointer -fno-strict-aliasing -DDBUG_OFF -DNDEBUG -o CMakeFiles/strings.dir/ctype.c.o -c /tmp/B.bSxPY4/BUILD/percona-server-5.7.31-34/strings/ctype.c make[2]: Leaving directory '/tmp/B.bSxPY4/BUILD/percona-server-5.7.31-34/build' make[2]: Entering directory '/tmp/B.bSxPY4/BUILD/percona-server-5.7.31-34/build' [ 6%] Building C object strings/CMakeFiles/strings.dir/int2str.c.o cd /tmp/B.bSxPY4/BUILD/percona-server-5.7.31-34/build/strings && /usr/bin/x86_64-pld-linux-gnux32-gcc -DBOOST_GEOMETRY_SQRT_CHECK_FINITENESS -DDISABLE_MYSQL_THREAD_H -DHAVE_CONFIG_H -DHAVE_TLSv13 -DLZ4_DISABLE_DEPRECATE_WARNINGS -D_FILE_OFFSET_BITS=64 -D_GNU_SOURCE -D__STDC_WANT_LIB_EXT1__=1 -I/tmp/B.bSxPY4/BUILD/percona-server-5.7.31-34/build/include -I/tmp/B.bSxPY4/BUILD/percona-server-5.7.31-34/extra/rapidjson/include -I/tmp/B.bSxPY4/BUILD/percona-server-5.7.31-34/build/libbinlogevents/include -I/tmp/B.bSxPY4/BUILD/percona-server-5.7.31-34/libbinlogevents/export -I/tmp/B.bSxPY4/BUILD/percona-server-5.7.31-34/include -fPIC -Wall -Wextra -Wformat-security -Wvla -Wwrite-strings -Wdeclaration-after-statement -O3 -D_FORTIFY_SOURCE=2 -O2 -fwrapv -pipe -Wformat -Werror=format-security -gdwarf-4 -fno-debug-types-section -fvar-tracking-assignments -g2 -Wp,-D_FORTIFY_SOURCE=2 -fstack-protector-strong --param=ssp-buffer-size=4 -Werror=trampolines -fPIC -mtune=generic -march=x86-64 -gdwarf-4 -fno-debug-types-section -fvar-tracking-assignments -g2 -DNDEBUG -fno-omit-frame-pointer -fno-strict-aliasing -Wno-shadow -g -fno-omit-frame-pointer -fno-strict-aliasing -DDBUG_OFF -DNDEBUG -o CMakeFiles/strings.dir/int2str.c.o -c /tmp/B.bSxPY4/BUILD/percona-server-5.7.31-34/strings/int2str.c make[2]: Leaving directory '/tmp/B.bSxPY4/BUILD/percona-server-5.7.31-34/build' make[2]: Entering directory '/tmp/B.bSxPY4/BUILD/percona-server-5.7.31-34/build' [ 6%] Building C object strings/CMakeFiles/strings.dir/ctype-uca.c.o cd /tmp/B.bSxPY4/BUILD/percona-server-5.7.31-34/build/strings && /usr/bin/x86_64-pld-linux-gnux32-gcc -DBOOST_GEOMETRY_SQRT_CHECK_FINITENESS -DDISABLE_MYSQL_THREAD_H -DHAVE_CONFIG_H -DHAVE_TLSv13 -DLZ4_DISABLE_DEPRECATE_WARNINGS -D_FILE_OFFSET_BITS=64 -D_GNU_SOURCE -D__STDC_WANT_LIB_EXT1__=1 -I/tmp/B.bSxPY4/BUILD/percona-server-5.7.31-34/build/include -I/tmp/B.bSxPY4/BUILD/percona-server-5.7.31-34/extra/rapidjson/include -I/tmp/B.bSxPY4/BUILD/percona-server-5.7.31-34/build/libbinlogevents/include -I/tmp/B.bSxPY4/BUILD/percona-server-5.7.31-34/libbinlogevents/export -I/tmp/B.bSxPY4/BUILD/percona-server-5.7.31-34/include -fPIC -Wall -Wextra -Wformat-security -Wvla -Wwrite-strings -Wdeclaration-after-statement -O3 -D_FORTIFY_SOURCE=2 -O2 -fwrapv -pipe -Wformat -Werror=format-security -gdwarf-4 -fno-debug-types-section -fvar-tracking-assignments -g2 -Wp,-D_FORTIFY_SOURCE=2 -fstack-protector-strong --param=ssp-buffer-size=4 -Werror=trampolines -fPIC -mtune=generic -march=x86-64 -gdwarf-4 -fno-debug-types-section -fvar-tracking-assignments -g2 -DNDEBUG -fno-omit-frame-pointer -fno-strict-aliasing -Wno-shadow -g -fno-omit-frame-pointer -fno-strict-aliasing -DDBUG_OFF -DNDEBUG -o CMakeFiles/strings.dir/ctype-uca.c.o -c /tmp/B.bSxPY4/BUILD/percona-server-5.7.31-34/strings/ctype-uca.c make[2]: Leaving directory '/tmp/B.bSxPY4/BUILD/percona-server-5.7.31-34/build' make[2]: Entering directory '/tmp/B.bSxPY4/BUILD/percona-server-5.7.31-34/build' [ 6%] Building C object strings/CMakeFiles/strings.dir/is_prefix.c.o cd /tmp/B.bSxPY4/BUILD/percona-server-5.7.31-34/build/strings && /usr/bin/x86_64-pld-linux-gnux32-gcc -DBOOST_GEOMETRY_SQRT_CHECK_FINITENESS -DDISABLE_MYSQL_THREAD_H -DHAVE_CONFIG_H -DHAVE_TLSv13 -DLZ4_DISABLE_DEPRECATE_WARNINGS -D_FILE_OFFSET_BITS=64 -D_GNU_SOURCE -D__STDC_WANT_LIB_EXT1__=1 -I/tmp/B.bSxPY4/BUILD/percona-server-5.7.31-34/build/include -I/tmp/B.bSxPY4/BUILD/percona-server-5.7.31-34/extra/rapidjson/include -I/tmp/B.bSxPY4/BUILD/percona-server-5.7.31-34/build/libbinlogevents/include -I/tmp/B.bSxPY4/BUILD/percona-server-5.7.31-34/libbinlogevents/export -I/tmp/B.bSxPY4/BUILD/percona-server-5.7.31-34/include -fPIC -Wall -Wextra -Wformat-security -Wvla -Wwrite-strings -Wdeclaration-after-statement -O3 -D_FORTIFY_SOURCE=2 -O2 -fwrapv -pipe -Wformat -Werror=format-security -gdwarf-4 -fno-debug-types-section -fvar-tracking-assignments -g2 -Wp,-D_FORTIFY_SOURCE=2 -fstack-protector-strong --param=ssp-buffer-size=4 -Werror=trampolines -fPIC -mtune=generic -march=x86-64 -gdwarf-4 -fno-debug-types-section -fvar-tracking-assignments -g2 -DNDEBUG -fno-omit-frame-pointer -fno-strict-aliasing -Wno-shadow -g -fno-omit-frame-pointer -fno-strict-aliasing -DDBUG_OFF -DNDEBUG -o CMakeFiles/strings.dir/is_prefix.c.o -c /tmp/B.bSxPY4/BUILD/percona-server-5.7.31-34/strings/is_prefix.c make[2]: Leaving directory '/tmp/B.bSxPY4/BUILD/percona-server-5.7.31-34/build' make[2]: Entering directory '/tmp/B.bSxPY4/BUILD/percona-server-5.7.31-34/build' [ 6%] Building C object strings/CMakeFiles/strings.dir/llstr.c.o cd /tmp/B.bSxPY4/BUILD/percona-server-5.7.31-34/build/strings && /usr/bin/x86_64-pld-linux-gnux32-gcc -DBOOST_GEOMETRY_SQRT_CHECK_FINITENESS -DDISABLE_MYSQL_THREAD_H -DHAVE_CONFIG_H -DHAVE_TLSv13 -DLZ4_DISABLE_DEPRECATE_WARNINGS -D_FILE_OFFSET_BITS=64 -D_GNU_SOURCE -D__STDC_WANT_LIB_EXT1__=1 -I/tmp/B.bSxPY4/BUILD/percona-server-5.7.31-34/build/include -I/tmp/B.bSxPY4/BUILD/percona-server-5.7.31-34/extra/rapidjson/include -I/tmp/B.bSxPY4/BUILD/percona-server-5.7.31-34/build/libbinlogevents/include -I/tmp/B.bSxPY4/BUILD/percona-server-5.7.31-34/libbinlogevents/export -I/tmp/B.bSxPY4/BUILD/percona-server-5.7.31-34/include -fPIC -Wall -Wextra -Wformat-security -Wvla -Wwrite-strings -Wdeclaration-after-statement -O3 -D_FORTIFY_SOURCE=2 -O2 -fwrapv -pipe -Wformat -Werror=format-security -gdwarf-4 -fno-debug-types-section -fvar-tracking-assignments -g2 -Wp,-D_FORTIFY_SOURCE=2 -fstack-protector-strong --param=ssp-buffer-size=4 -Werror=trampolines -fPIC -mtune=generic -march=x86-64 -gdwarf-4 -fno-debug-types-section -fvar-tracking-assignments -g2 -DNDEBUG -fno-omit-frame-pointer -fno-strict-aliasing -Wno-shadow -g -fno-omit-frame-pointer -fno-strict-aliasing -DDBUG_OFF -DNDEBUG -o CMakeFiles/strings.dir/llstr.c.o -c /tmp/B.bSxPY4/BUILD/percona-server-5.7.31-34/strings/llstr.c make[2]: Leaving directory '/tmp/B.bSxPY4/BUILD/percona-server-5.7.31-34/build' make[2]: Entering directory '/tmp/B.bSxPY4/BUILD/percona-server-5.7.31-34/build' [ 6%] Building C object strings/CMakeFiles/strings.dir/longlong2str.c.o cd /tmp/B.bSxPY4/BUILD/percona-server-5.7.31-34/build/strings && /usr/bin/x86_64-pld-linux-gnux32-gcc -DBOOST_GEOMETRY_SQRT_CHECK_FINITENESS -DDISABLE_MYSQL_THREAD_H -DHAVE_CONFIG_H -DHAVE_TLSv13 -DLZ4_DISABLE_DEPRECATE_WARNINGS -D_FILE_OFFSET_BITS=64 -D_GNU_SOURCE -D__STDC_WANT_LIB_EXT1__=1 -I/tmp/B.bSxPY4/BUILD/percona-server-5.7.31-34/build/include -I/tmp/B.bSxPY4/BUILD/percona-server-5.7.31-34/extra/rapidjson/include -I/tmp/B.bSxPY4/BUILD/percona-server-5.7.31-34/build/libbinlogevents/include -I/tmp/B.bSxPY4/BUILD/percona-server-5.7.31-34/libbinlogevents/export -I/tmp/B.bSxPY4/BUILD/percona-server-5.7.31-34/include -fPIC -Wall -Wextra -Wformat-security -Wvla -Wwrite-strings -Wdeclaration-after-statement -O3 -D_FORTIFY_SOURCE=2 -O2 -fwrapv -pipe -Wformat -Werror=format-security -gdwarf-4 -fno-debug-types-section -fvar-tracking-assignments -g2 -Wp,-D_FORTIFY_SOURCE=2 -fstack-protector-strong --param=ssp-buffer-size=4 -Werror=trampolines -fPIC -mtune=generic -march=x86-64 -gdwarf-4 -fno-debug-types-section -fvar-tracking-assignments -g2 -DNDEBUG -fno-omit-frame-pointer -fno-strict-aliasing -Wno-shadow -g -fno-omit-frame-pointer -fno-strict-aliasing -DDBUG_OFF -DNDEBUG -o CMakeFiles/strings.dir/longlong2str.c.o -c /tmp/B.bSxPY4/BUILD/percona-server-5.7.31-34/strings/longlong2str.c make[2]: Leaving directory '/tmp/B.bSxPY4/BUILD/percona-server-5.7.31-34/build' make[2]: Entering directory '/tmp/B.bSxPY4/BUILD/percona-server-5.7.31-34/build' [ 6%] Building C object strings/CMakeFiles/strings.dir/my_strtoll10.c.o cd /tmp/B.bSxPY4/BUILD/percona-server-5.7.31-34/build/strings && /usr/bin/x86_64-pld-linux-gnux32-gcc -DBOOST_GEOMETRY_SQRT_CHECK_FINITENESS -DDISABLE_MYSQL_THREAD_H -DHAVE_CONFIG_H -DHAVE_TLSv13 -DLZ4_DISABLE_DEPRECATE_WARNINGS -D_FILE_OFFSET_BITS=64 -D_GNU_SOURCE -D__STDC_WANT_LIB_EXT1__=1 -I/tmp/B.bSxPY4/BUILD/percona-server-5.7.31-34/build/include -I/tmp/B.bSxPY4/BUILD/percona-server-5.7.31-34/extra/rapidjson/include -I/tmp/B.bSxPY4/BUILD/percona-server-5.7.31-34/build/libbinlogevents/include -I/tmp/B.bSxPY4/BUILD/percona-server-5.7.31-34/libbinlogevents/export -I/tmp/B.bSxPY4/BUILD/percona-server-5.7.31-34/include -fPIC -Wall -Wextra -Wformat-security -Wvla -Wwrite-strings -Wdeclaration-after-statement -O3 -D_FORTIFY_SOURCE=2 -O2 -fwrapv -pipe -Wformat -Werror=format-security -gdwarf-4 -fno-debug-types-section -fvar-tracking-assignments -g2 -Wp,-D_FORTIFY_SOURCE=2 -fstack-protector-strong --param=ssp-buffer-size=4 -Werror=trampolines -fPIC -mtune=generic -march=x86-64 -gdwarf-4 -fno-debug-types-section -fvar-tracking-assignments -g2 -DNDEBUG -fno-omit-frame-pointer -fno-strict-aliasing -Wno-shadow -g -fno-omit-frame-pointer -fno-strict-aliasing -DDBUG_OFF -DNDEBUG -o CMakeFiles/strings.dir/my_strtoll10.c.o -c /tmp/B.bSxPY4/BUILD/percona-server-5.7.31-34/strings/my_strtoll10.c make[2]: Leaving directory '/tmp/B.bSxPY4/BUILD/percona-server-5.7.31-34/build' make[2]: Entering directory '/tmp/B.bSxPY4/BUILD/percona-server-5.7.31-34/build' [ 7%] Building C object strings/CMakeFiles/strings.dir/str_alloc.c.o cd /tmp/B.bSxPY4/BUILD/percona-server-5.7.31-34/build/strings && /usr/bin/x86_64-pld-linux-gnux32-gcc -DBOOST_GEOMETRY_SQRT_CHECK_FINITENESS -DDISABLE_MYSQL_THREAD_H -DHAVE_CONFIG_H -DHAVE_TLSv13 -DLZ4_DISABLE_DEPRECATE_WARNINGS -D_FILE_OFFSET_BITS=64 -D_GNU_SOURCE -D__STDC_WANT_LIB_EXT1__=1 -I/tmp/B.bSxPY4/BUILD/percona-server-5.7.31-34/build/include -I/tmp/B.bSxPY4/BUILD/percona-server-5.7.31-34/extra/rapidjson/include -I/tmp/B.bSxPY4/BUILD/percona-server-5.7.31-34/build/libbinlogevents/include -I/tmp/B.bSxPY4/BUILD/percona-server-5.7.31-34/libbinlogevents/export -I/tmp/B.bSxPY4/BUILD/percona-server-5.7.31-34/include -fPIC -Wall -Wextra -Wformat-security -Wvla -Wwrite-strings -Wdeclaration-after-statement -O3 -D_FORTIFY_SOURCE=2 -O2 -fwrapv -pipe -Wformat -Werror=format-security -gdwarf-4 -fno-debug-types-section -fvar-tracking-assignments -g2 -Wp,-D_FORTIFY_SOURCE=2 -fstack-protector-strong --param=ssp-buffer-size=4 -Werror=trampolines -fPIC -mtune=generic -march=x86-64 -gdwarf-4 -fno-debug-types-section -fvar-tracking-assignments -g2 -DNDEBUG -fno-omit-frame-pointer -fno-strict-aliasing -Wno-shadow -g -fno-omit-frame-pointer -fno-strict-aliasing -DDBUG_OFF -DNDEBUG -o CMakeFiles/strings.dir/str_alloc.c.o -c /tmp/B.bSxPY4/BUILD/percona-server-5.7.31-34/strings/str_alloc.c make[2]: Leaving directory '/tmp/B.bSxPY4/BUILD/percona-server-5.7.31-34/build' make[2]: Entering directory '/tmp/B.bSxPY4/BUILD/percona-server-5.7.31-34/build' [ 6%] Building C object strings/CMakeFiles/strings.dir/ctype-ucs2.c.o cd /tmp/B.bSxPY4/BUILD/percona-server-5.7.31-34/build/strings && /usr/bin/x86_64-pld-linux-gnux32-gcc -DBOOST_GEOMETRY_SQRT_CHECK_FINITENESS -DDISABLE_MYSQL_THREAD_H -DHAVE_CONFIG_H -DHAVE_TLSv13 -DLZ4_DISABLE_DEPRECATE_WARNINGS -D_FILE_OFFSET_BITS=64 -D_GNU_SOURCE -D__STDC_WANT_LIB_EXT1__=1 -I/tmp/B.bSxPY4/BUILD/percona-server-5.7.31-34/build/include -I/tmp/B.bSxPY4/BUILD/percona-server-5.7.31-34/extra/rapidjson/include -I/tmp/B.bSxPY4/BUILD/percona-server-5.7.31-34/build/libbinlogevents/include -I/tmp/B.bSxPY4/BUILD/percona-server-5.7.31-34/libbinlogevents/export -I/tmp/B.bSxPY4/BUILD/percona-server-5.7.31-34/include -fPIC -Wall -Wextra -Wformat-security -Wvla -Wwrite-strings -Wdeclaration-after-statement -O3 -D_FORTIFY_SOURCE=2 -O2 -fwrapv -pipe -Wformat -Werror=format-security -gdwarf-4 -fno-debug-types-section -fvar-tracking-assignments -g2 -Wp,-D_FORTIFY_SOURCE=2 -fstack-protector-strong --param=ssp-buffer-size=4 -Werror=trampolines -fPIC -mtune=generic -march=x86-64 -gdwarf-4 -fno-debug-types-section -fvar-tracking-assignments -g2 -DNDEBUG -fno-omit-frame-pointer -fno-strict-aliasing -Wno-shadow -g -fno-omit-frame-pointer -fno-strict-aliasing -DDBUG_OFF -DNDEBUG -o CMakeFiles/strings.dir/ctype-ucs2.c.o -c /tmp/B.bSxPY4/BUILD/percona-server-5.7.31-34/strings/ctype-ucs2.c make[2]: Leaving directory '/tmp/B.bSxPY4/BUILD/percona-server-5.7.31-34/build' make[2]: Entering directory '/tmp/B.bSxPY4/BUILD/percona-server-5.7.31-34/build' [ 7%] Building C object strings/CMakeFiles/strings.dir/str2int.c.o cd /tmp/B.bSxPY4/BUILD/percona-server-5.7.31-34/build/strings && /usr/bin/x86_64-pld-linux-gnux32-gcc -DBOOST_GEOMETRY_SQRT_CHECK_FINITENESS -DDISABLE_MYSQL_THREAD_H -DHAVE_CONFIG_H -DHAVE_TLSv13 -DLZ4_DISABLE_DEPRECATE_WARNINGS -D_FILE_OFFSET_BITS=64 -D_GNU_SOURCE -D__STDC_WANT_LIB_EXT1__=1 -I/tmp/B.bSxPY4/BUILD/percona-server-5.7.31-34/build/include -I/tmp/B.bSxPY4/BUILD/percona-server-5.7.31-34/extra/rapidjson/include -I/tmp/B.bSxPY4/BUILD/percona-server-5.7.31-34/build/libbinlogevents/include -I/tmp/B.bSxPY4/BUILD/percona-server-5.7.31-34/libbinlogevents/export -I/tmp/B.bSxPY4/BUILD/percona-server-5.7.31-34/include -fPIC -Wall -Wextra -Wformat-security -Wvla -Wwrite-strings -Wdeclaration-after-statement -O3 -D_FORTIFY_SOURCE=2 -O2 -fwrapv -pipe -Wformat -Werror=format-security -gdwarf-4 -fno-debug-types-section -fvar-tracking-assignments -g2 -Wp,-D_FORTIFY_SOURCE=2 -fstack-protector-strong --param=ssp-buffer-size=4 -Werror=trampolines -fPIC -mtune=generic -march=x86-64 -gdwarf-4 -fno-debug-types-section -fvar-tracking-assignments -g2 -DNDEBUG -fno-omit-frame-pointer -fno-strict-aliasing -Wno-shadow -g -fno-omit-frame-pointer -fno-strict-aliasing -DDBUG_OFF -DNDEBUG -o CMakeFiles/strings.dir/str2int.c.o -c /tmp/B.bSxPY4/BUILD/percona-server-5.7.31-34/strings/str2int.c make[2]: Leaving directory '/tmp/B.bSxPY4/BUILD/percona-server-5.7.31-34/build' make[2]: Entering directory '/tmp/B.bSxPY4/BUILD/percona-server-5.7.31-34/build' [ 7%] Building C object strings/CMakeFiles/strings.dir/strcend.c.o cd /tmp/B.bSxPY4/BUILD/percona-server-5.7.31-34/build/strings && /usr/bin/x86_64-pld-linux-gnux32-gcc -DBOOST_GEOMETRY_SQRT_CHECK_FINITENESS -DDISABLE_MYSQL_THREAD_H -DHAVE_CONFIG_H -DHAVE_TLSv13 -DLZ4_DISABLE_DEPRECATE_WARNINGS -D_FILE_OFFSET_BITS=64 -D_GNU_SOURCE -D__STDC_WANT_LIB_EXT1__=1 -I/tmp/B.bSxPY4/BUILD/percona-server-5.7.31-34/build/include -I/tmp/B.bSxPY4/BUILD/percona-server-5.7.31-34/extra/rapidjson/include -I/tmp/B.bSxPY4/BUILD/percona-server-5.7.31-34/build/libbinlogevents/include -I/tmp/B.bSxPY4/BUILD/percona-server-5.7.31-34/libbinlogevents/export -I/tmp/B.bSxPY4/BUILD/percona-server-5.7.31-34/include -fPIC -Wall -Wextra -Wformat-security -Wvla -Wwrite-strings -Wdeclaration-after-statement -O3 -D_FORTIFY_SOURCE=2 -O2 -fwrapv -pipe -Wformat -Werror=format-security -gdwarf-4 -fno-debug-types-section -fvar-tracking-assignments -g2 -Wp,-D_FORTIFY_SOURCE=2 -fstack-protector-strong --param=ssp-buffer-size=4 -Werror=trampolines -fPIC -mtune=generic -march=x86-64 -gdwarf-4 -fno-debug-types-section -fvar-tracking-assignments -g2 -DNDEBUG -fno-omit-frame-pointer -fno-strict-aliasing -Wno-shadow -g -fno-omit-frame-pointer -fno-strict-aliasing -DDBUG_OFF -DNDEBUG -o CMakeFiles/strings.dir/strcend.c.o -c /tmp/B.bSxPY4/BUILD/percona-server-5.7.31-34/strings/strcend.c make[2]: Leaving directory '/tmp/B.bSxPY4/BUILD/percona-server-5.7.31-34/build' make[2]: Entering directory '/tmp/B.bSxPY4/BUILD/percona-server-5.7.31-34/build' [ 7%] Building C object strings/CMakeFiles/strings.dir/strend.c.o cd /tmp/B.bSxPY4/BUILD/percona-server-5.7.31-34/build/strings && /usr/bin/x86_64-pld-linux-gnux32-gcc -DBOOST_GEOMETRY_SQRT_CHECK_FINITENESS -DDISABLE_MYSQL_THREAD_H -DHAVE_CONFIG_H -DHAVE_TLSv13 -DLZ4_DISABLE_DEPRECATE_WARNINGS -D_FILE_OFFSET_BITS=64 -D_GNU_SOURCE -D__STDC_WANT_LIB_EXT1__=1 -I/tmp/B.bSxPY4/BUILD/percona-server-5.7.31-34/build/include -I/tmp/B.bSxPY4/BUILD/percona-server-5.7.31-34/extra/rapidjson/include -I/tmp/B.bSxPY4/BUILD/percona-server-5.7.31-34/build/libbinlogevents/include -I/tmp/B.bSxPY4/BUILD/percona-server-5.7.31-34/libbinlogevents/export -I/tmp/B.bSxPY4/BUILD/percona-server-5.7.31-34/include -fPIC -Wall -Wextra -Wformat-security -Wvla -Wwrite-strings -Wdeclaration-after-statement -O3 -D_FORTIFY_SOURCE=2 -O2 -fwrapv -pipe -Wformat -Werror=format-security -gdwarf-4 -fno-debug-types-section -fvar-tracking-assignments -g2 -Wp,-D_FORTIFY_SOURCE=2 -fstack-protector-strong --param=ssp-buffer-size=4 -Werror=trampolines -fPIC -mtune=generic -march=x86-64 -gdwarf-4 -fno-debug-types-section -fvar-tracking-assignments -g2 -DNDEBUG -fno-omit-frame-pointer -fno-strict-aliasing -Wno-shadow -g -fno-omit-frame-pointer -fno-strict-aliasing -DDBUG_OFF -DNDEBUG -o CMakeFiles/strings.dir/strend.c.o -c /tmp/B.bSxPY4/BUILD/percona-server-5.7.31-34/strings/strend.c make[2]: Leaving directory '/tmp/B.bSxPY4/BUILD/percona-server-5.7.31-34/build' make[2]: Entering directory '/tmp/B.bSxPY4/BUILD/percona-server-5.7.31-34/build' [ 6%] Building C object strings/CMakeFiles/strings.dir/ctype-ujis.c.o cd /tmp/B.bSxPY4/BUILD/percona-server-5.7.31-34/build/strings && /usr/bin/x86_64-pld-linux-gnux32-gcc -DBOOST_GEOMETRY_SQRT_CHECK_FINITENESS -DDISABLE_MYSQL_THREAD_H -DHAVE_CONFIG_H -DHAVE_TLSv13 -DLZ4_DISABLE_DEPRECATE_WARNINGS -D_FILE_OFFSET_BITS=64 -D_GNU_SOURCE -D__STDC_WANT_LIB_EXT1__=1 -I/tmp/B.bSxPY4/BUILD/percona-server-5.7.31-34/build/include -I/tmp/B.bSxPY4/BUILD/percona-server-5.7.31-34/extra/rapidjson/include -I/tmp/B.bSxPY4/BUILD/percona-server-5.7.31-34/build/libbinlogevents/include -I/tmp/B.bSxPY4/BUILD/percona-server-5.7.31-34/libbinlogevents/export -I/tmp/B.bSxPY4/BUILD/percona-server-5.7.31-34/include -fPIC -Wall -Wextra -Wformat-security -Wvla -Wwrite-strings -Wdeclaration-after-statement -O3 -D_FORTIFY_SOURCE=2 -O2 -fwrapv -pipe -Wformat -Werror=format-security -gdwarf-4 -fno-debug-types-section -fvar-tracking-assignments -g2 -Wp,-D_FORTIFY_SOURCE=2 -fstack-protector-strong --param=ssp-buffer-size=4 -Werror=trampolines -fPIC -mtune=generic -march=x86-64 -gdwarf-4 -fno-debug-types-section -fvar-tracking-assignments -g2 -DNDEBUG -fno-omit-frame-pointer -fno-strict-aliasing -Wno-shadow -g -fno-omit-frame-pointer -fno-strict-aliasing -DDBUG_OFF -DNDEBUG -o CMakeFiles/strings.dir/ctype-ujis.c.o -c /tmp/B.bSxPY4/BUILD/percona-server-5.7.31-34/strings/ctype-ujis.c make[2]: Leaving directory '/tmp/B.bSxPY4/BUILD/percona-server-5.7.31-34/build' make[2]: Entering directory '/tmp/B.bSxPY4/BUILD/percona-server-5.7.31-34/build' [ 7%] Building C object strings/CMakeFiles/strings.dir/strfill.c.o cd /tmp/B.bSxPY4/BUILD/percona-server-5.7.31-34/build/strings && /usr/bin/x86_64-pld-linux-gnux32-gcc -DBOOST_GEOMETRY_SQRT_CHECK_FINITENESS -DDISABLE_MYSQL_THREAD_H -DHAVE_CONFIG_H -DHAVE_TLSv13 -DLZ4_DISABLE_DEPRECATE_WARNINGS -D_FILE_OFFSET_BITS=64 -D_GNU_SOURCE -D__STDC_WANT_LIB_EXT1__=1 -I/tmp/B.bSxPY4/BUILD/percona-server-5.7.31-34/build/include -I/tmp/B.bSxPY4/BUILD/percona-server-5.7.31-34/extra/rapidjson/include -I/tmp/B.bSxPY4/BUILD/percona-server-5.7.31-34/build/libbinlogevents/include -I/tmp/B.bSxPY4/BUILD/percona-server-5.7.31-34/libbinlogevents/export -I/tmp/B.bSxPY4/BUILD/percona-server-5.7.31-34/include -fPIC -Wall -Wextra -Wformat-security -Wvla -Wwrite-strings -Wdeclaration-after-statement -O3 -D_FORTIFY_SOURCE=2 -O2 -fwrapv -pipe -Wformat -Werror=format-security -gdwarf-4 -fno-debug-types-section -fvar-tracking-assignments -g2 -Wp,-D_FORTIFY_SOURCE=2 -fstack-protector-strong --param=ssp-buffer-size=4 -Werror=trampolines -fPIC -mtune=generic -march=x86-64 -gdwarf-4 -fno-debug-types-section -fvar-tracking-assignments -g2 -DNDEBUG -fno-omit-frame-pointer -fno-strict-aliasing -Wno-shadow -g -fno-omit-frame-pointer -fno-strict-aliasing -DDBUG_OFF -DNDEBUG -o CMakeFiles/strings.dir/strfill.c.o -c /tmp/B.bSxPY4/BUILD/percona-server-5.7.31-34/strings/strfill.c make[2]: Leaving directory '/tmp/B.bSxPY4/BUILD/percona-server-5.7.31-34/build' make[2]: Entering directory '/tmp/B.bSxPY4/BUILD/percona-server-5.7.31-34/build' [ 6%] Building C object strings/CMakeFiles/strings.dir/my_vsnprintf.c.o cd /tmp/B.bSxPY4/BUILD/percona-server-5.7.31-34/build/strings && /usr/bin/x86_64-pld-linux-gnux32-gcc -DBOOST_GEOMETRY_SQRT_CHECK_FINITENESS -DDISABLE_MYSQL_THREAD_H -DHAVE_CONFIG_H -DHAVE_TLSv13 -DLZ4_DISABLE_DEPRECATE_WARNINGS -D_FILE_OFFSET_BITS=64 -D_GNU_SOURCE -D__STDC_WANT_LIB_EXT1__=1 -I/tmp/B.bSxPY4/BUILD/percona-server-5.7.31-34/build/include -I/tmp/B.bSxPY4/BUILD/percona-server-5.7.31-34/extra/rapidjson/include -I/tmp/B.bSxPY4/BUILD/percona-server-5.7.31-34/build/libbinlogevents/include -I/tmp/B.bSxPY4/BUILD/percona-server-5.7.31-34/libbinlogevents/export -I/tmp/B.bSxPY4/BUILD/percona-server-5.7.31-34/include -fPIC -Wall -Wextra -Wformat-security -Wvla -Wwrite-strings -Wdeclaration-after-statement -O3 -D_FORTIFY_SOURCE=2 -O2 -fwrapv -pipe -Wformat -Werror=format-security -gdwarf-4 -fno-debug-types-section -fvar-tracking-assignments -g2 -Wp,-D_FORTIFY_SOURCE=2 -fstack-protector-strong --param=ssp-buffer-size=4 -Werror=trampolines -fPIC -mtune=generic -march=x86-64 -gdwarf-4 -fno-debug-types-section -fvar-tracking-assignments -g2 -DNDEBUG -fno-omit-frame-pointer -fno-strict-aliasing -Wno-shadow -g -fno-omit-frame-pointer -fno-strict-aliasing -DDBUG_OFF -DNDEBUG -o CMakeFiles/strings.dir/my_vsnprintf.c.o -c /tmp/B.bSxPY4/BUILD/percona-server-5.7.31-34/strings/my_vsnprintf.c make[2]: Leaving directory '/tmp/B.bSxPY4/BUILD/percona-server-5.7.31-34/build' make[2]: Entering directory '/tmp/B.bSxPY4/BUILD/percona-server-5.7.31-34/build' [ 7%] Building C object strings/CMakeFiles/strings.dir/my_stpmov.c.o cd /tmp/B.bSxPY4/BUILD/percona-server-5.7.31-34/build/strings && /usr/bin/x86_64-pld-linux-gnux32-gcc -DBOOST_GEOMETRY_SQRT_CHECK_FINITENESS -DDISABLE_MYSQL_THREAD_H -DHAVE_CONFIG_H -DHAVE_TLSv13 -DLZ4_DISABLE_DEPRECATE_WARNINGS -D_FILE_OFFSET_BITS=64 -D_GNU_SOURCE -D__STDC_WANT_LIB_EXT1__=1 -I/tmp/B.bSxPY4/BUILD/percona-server-5.7.31-34/build/include -I/tmp/B.bSxPY4/BUILD/percona-server-5.7.31-34/extra/rapidjson/include -I/tmp/B.bSxPY4/BUILD/percona-server-5.7.31-34/build/libbinlogevents/include -I/tmp/B.bSxPY4/BUILD/percona-server-5.7.31-34/libbinlogevents/export -I/tmp/B.bSxPY4/BUILD/percona-server-5.7.31-34/include -fPIC -Wall -Wextra -Wformat-security -Wvla -Wwrite-strings -Wdeclaration-after-statement -O3 -D_FORTIFY_SOURCE=2 -O2 -fwrapv -pipe -Wformat -Werror=format-security -gdwarf-4 -fno-debug-types-section -fvar-tracking-assignments -g2 -Wp,-D_FORTIFY_SOURCE=2 -fstack-protector-strong --param=ssp-buffer-size=4 -Werror=trampolines -fPIC -mtune=generic -march=x86-64 -gdwarf-4 -fno-debug-types-section -fvar-tracking-assignments -g2 -DNDEBUG -fno-omit-frame-pointer -fno-strict-aliasing -Wno-shadow -g -fno-omit-frame-pointer -fno-strict-aliasing -DDBUG_OFF -DNDEBUG -o CMakeFiles/strings.dir/my_stpmov.c.o -c /tmp/B.bSxPY4/BUILD/percona-server-5.7.31-34/strings/my_stpmov.c make[2]: Leaving directory '/tmp/B.bSxPY4/BUILD/percona-server-5.7.31-34/build' make[2]: Entering directory '/tmp/B.bSxPY4/BUILD/percona-server-5.7.31-34/build' [ 7%] Building C object strings/CMakeFiles/strings.dir/strmake.c.o cd /tmp/B.bSxPY4/BUILD/percona-server-5.7.31-34/build/strings && /usr/bin/x86_64-pld-linux-gnux32-gcc -DBOOST_GEOMETRY_SQRT_CHECK_FINITENESS -DDISABLE_MYSQL_THREAD_H -DHAVE_CONFIG_H -DHAVE_TLSv13 -DLZ4_DISABLE_DEPRECATE_WARNINGS -D_FILE_OFFSET_BITS=64 -D_GNU_SOURCE -D__STDC_WANT_LIB_EXT1__=1 -I/tmp/B.bSxPY4/BUILD/percona-server-5.7.31-34/build/include -I/tmp/B.bSxPY4/BUILD/percona-server-5.7.31-34/extra/rapidjson/include -I/tmp/B.bSxPY4/BUILD/percona-server-5.7.31-34/build/libbinlogevents/include -I/tmp/B.bSxPY4/BUILD/percona-server-5.7.31-34/libbinlogevents/export -I/tmp/B.bSxPY4/BUILD/percona-server-5.7.31-34/include -fPIC -Wall -Wextra -Wformat-security -Wvla -Wwrite-strings -Wdeclaration-after-statement -O3 -D_FORTIFY_SOURCE=2 -O2 -fwrapv -pipe -Wformat -Werror=format-security -gdwarf-4 -fno-debug-types-section -fvar-tracking-assignments -g2 -Wp,-D_FORTIFY_SOURCE=2 -fstack-protector-strong --param=ssp-buffer-size=4 -Werror=trampolines -fPIC -mtune=generic -march=x86-64 -gdwarf-4 -fno-debug-types-section -fvar-tracking-assignments -g2 -DNDEBUG -fno-omit-frame-pointer -fno-strict-aliasing -Wno-shadow -g -fno-omit-frame-pointer -fno-strict-aliasing -DDBUG_OFF -DNDEBUG -o CMakeFiles/strings.dir/strmake.c.o -c /tmp/B.bSxPY4/BUILD/percona-server-5.7.31-34/strings/strmake.c make[2]: Leaving directory '/tmp/B.bSxPY4/BUILD/percona-server-5.7.31-34/build' make[2]: Entering directory '/tmp/B.bSxPY4/BUILD/percona-server-5.7.31-34/build' [ 7%] Building C object strings/CMakeFiles/strings.dir/strxmov.c.o cd /tmp/B.bSxPY4/BUILD/percona-server-5.7.31-34/build/strings && /usr/bin/x86_64-pld-linux-gnux32-gcc -DBOOST_GEOMETRY_SQRT_CHECK_FINITENESS -DDISABLE_MYSQL_THREAD_H -DHAVE_CONFIG_H -DHAVE_TLSv13 -DLZ4_DISABLE_DEPRECATE_WARNINGS -D_FILE_OFFSET_BITS=64 -D_GNU_SOURCE -D__STDC_WANT_LIB_EXT1__=1 -I/tmp/B.bSxPY4/BUILD/percona-server-5.7.31-34/build/include -I/tmp/B.bSxPY4/BUILD/percona-server-5.7.31-34/extra/rapidjson/include -I/tmp/B.bSxPY4/BUILD/percona-server-5.7.31-34/build/libbinlogevents/include -I/tmp/B.bSxPY4/BUILD/percona-server-5.7.31-34/libbinlogevents/export -I/tmp/B.bSxPY4/BUILD/percona-server-5.7.31-34/include -fPIC -Wall -Wextra -Wformat-security -Wvla -Wwrite-strings -Wdeclaration-after-statement -O3 -D_FORTIFY_SOURCE=2 -O2 -fwrapv -pipe -Wformat -Werror=format-security -gdwarf-4 -fno-debug-types-section -fvar-tracking-assignments -g2 -Wp,-D_FORTIFY_SOURCE=2 -fstack-protector-strong --param=ssp-buffer-size=4 -Werror=trampolines -fPIC -mtune=generic -march=x86-64 -gdwarf-4 -fno-debug-types-section -fvar-tracking-assignments -g2 -DNDEBUG -fno-omit-frame-pointer -fno-strict-aliasing -Wno-shadow -g -fno-omit-frame-pointer -fno-strict-aliasing -DDBUG_OFF -DNDEBUG -o CMakeFiles/strings.dir/strxmov.c.o -c /tmp/B.bSxPY4/BUILD/percona-server-5.7.31-34/strings/strxmov.c make[2]: Leaving directory '/tmp/B.bSxPY4/BUILD/percona-server-5.7.31-34/build' make[2]: Entering directory '/tmp/B.bSxPY4/BUILD/percona-server-5.7.31-34/build' [ 7%] Building C object strings/CMakeFiles/strings.dir/my_stpnmov.c.o cd /tmp/B.bSxPY4/BUILD/percona-server-5.7.31-34/build/strings && /usr/bin/x86_64-pld-linux-gnux32-gcc -DBOOST_GEOMETRY_SQRT_CHECK_FINITENESS -DDISABLE_MYSQL_THREAD_H -DHAVE_CONFIG_H -DHAVE_TLSv13 -DLZ4_DISABLE_DEPRECATE_WARNINGS -D_FILE_OFFSET_BITS=64 -D_GNU_SOURCE -D__STDC_WANT_LIB_EXT1__=1 -I/tmp/B.bSxPY4/BUILD/percona-server-5.7.31-34/build/include -I/tmp/B.bSxPY4/BUILD/percona-server-5.7.31-34/extra/rapidjson/include -I/tmp/B.bSxPY4/BUILD/percona-server-5.7.31-34/build/libbinlogevents/include -I/tmp/B.bSxPY4/BUILD/percona-server-5.7.31-34/libbinlogevents/export -I/tmp/B.bSxPY4/BUILD/percona-server-5.7.31-34/include -fPIC -Wall -Wextra -Wformat-security -Wvla -Wwrite-strings -Wdeclaration-after-statement -O3 -D_FORTIFY_SOURCE=2 -O2 -fwrapv -pipe -Wformat -Werror=format-security -gdwarf-4 -fno-debug-types-section -fvar-tracking-assignments -g2 -Wp,-D_FORTIFY_SOURCE=2 -fstack-protector-strong --param=ssp-buffer-size=4 -Werror=trampolines -fPIC -mtune=generic -march=x86-64 -gdwarf-4 -fno-debug-types-section -fvar-tracking-assignments -g2 -DNDEBUG -fno-omit-frame-pointer -fno-strict-aliasing -Wno-shadow -g -fno-omit-frame-pointer -fno-strict-aliasing -DDBUG_OFF -DNDEBUG -o CMakeFiles/strings.dir/my_stpnmov.c.o -c /tmp/B.bSxPY4/BUILD/percona-server-5.7.31-34/strings/my_stpnmov.c make[2]: Leaving directory '/tmp/B.bSxPY4/BUILD/percona-server-5.7.31-34/build' make[2]: Entering directory '/tmp/B.bSxPY4/BUILD/percona-server-5.7.31-34/build' [ 6%] Building C object strings/CMakeFiles/strings.dir/ctype-utf8.c.o cd /tmp/B.bSxPY4/BUILD/percona-server-5.7.31-34/build/strings && /usr/bin/x86_64-pld-linux-gnux32-gcc -DBOOST_GEOMETRY_SQRT_CHECK_FINITENESS -DDISABLE_MYSQL_THREAD_H -DHAVE_CONFIG_H -DHAVE_TLSv13 -DLZ4_DISABLE_DEPRECATE_WARNINGS -D_FILE_OFFSET_BITS=64 -D_GNU_SOURCE -D__STDC_WANT_LIB_EXT1__=1 -I/tmp/B.bSxPY4/BUILD/percona-server-5.7.31-34/build/include -I/tmp/B.bSxPY4/BUILD/percona-server-5.7.31-34/extra/rapidjson/include -I/tmp/B.bSxPY4/BUILD/percona-server-5.7.31-34/build/libbinlogevents/include -I/tmp/B.bSxPY4/BUILD/percona-server-5.7.31-34/libbinlogevents/export -I/tmp/B.bSxPY4/BUILD/percona-server-5.7.31-34/include -fPIC -Wall -Wextra -Wformat-security -Wvla -Wwrite-strings -Wdeclaration-after-statement -O3 -D_FORTIFY_SOURCE=2 -O2 -fwrapv -pipe -Wformat -Werror=format-security -gdwarf-4 -fno-debug-types-section -fvar-tracking-assignments -g2 -Wp,-D_FORTIFY_SOURCE=2 -fstack-protector-strong --param=ssp-buffer-size=4 -Werror=trampolines -fPIC -mtune=generic -march=x86-64 -gdwarf-4 -fno-debug-types-section -fvar-tracking-assignments -g2 -DNDEBUG -fno-omit-frame-pointer -fno-strict-aliasing -Wno-shadow -g -fno-omit-frame-pointer -fno-strict-aliasing -DDBUG_OFF -DNDEBUG -o CMakeFiles/strings.dir/ctype-utf8.c.o -c /tmp/B.bSxPY4/BUILD/percona-server-5.7.31-34/strings/ctype-utf8.c make[2]: Leaving directory '/tmp/B.bSxPY4/BUILD/percona-server-5.7.31-34/build' make[2]: Entering directory '/tmp/B.bSxPY4/BUILD/percona-server-5.7.31-34/build' [ 7%] Building C object strings/CMakeFiles/strings.dir/strxnmov.c.o cd /tmp/B.bSxPY4/BUILD/percona-server-5.7.31-34/build/strings && /usr/bin/x86_64-pld-linux-gnux32-gcc -DBOOST_GEOMETRY_SQRT_CHECK_FINITENESS -DDISABLE_MYSQL_THREAD_H -DHAVE_CONFIG_H -DHAVE_TLSv13 -DLZ4_DISABLE_DEPRECATE_WARNINGS -D_FILE_OFFSET_BITS=64 -D_GNU_SOURCE -D__STDC_WANT_LIB_EXT1__=1 -I/tmp/B.bSxPY4/BUILD/percona-server-5.7.31-34/build/include -I/tmp/B.bSxPY4/BUILD/percona-server-5.7.31-34/extra/rapidjson/include -I/tmp/B.bSxPY4/BUILD/percona-server-5.7.31-34/build/libbinlogevents/include -I/tmp/B.bSxPY4/BUILD/percona-server-5.7.31-34/libbinlogevents/export -I/tmp/B.bSxPY4/BUILD/percona-server-5.7.31-34/include -fPIC -Wall -Wextra -Wformat-security -Wvla -Wwrite-strings -Wdeclaration-after-statement -O3 -D_FORTIFY_SOURCE=2 -O2 -fwrapv -pipe -Wformat -Werror=format-security -gdwarf-4 -fno-debug-types-section -fvar-tracking-assignments -g2 -Wp,-D_FORTIFY_SOURCE=2 -fstack-protector-strong --param=ssp-buffer-size=4 -Werror=trampolines -fPIC -mtune=generic -march=x86-64 -gdwarf-4 -fno-debug-types-section -fvar-tracking-assignments -g2 -DNDEBUG -fno-omit-frame-pointer -fno-strict-aliasing -Wno-shadow -g -fno-omit-frame-pointer -fno-strict-aliasing -DDBUG_OFF -DNDEBUG -o CMakeFiles/strings.dir/strxnmov.c.o -c /tmp/B.bSxPY4/BUILD/percona-server-5.7.31-34/strings/strxnmov.c make[2]: Leaving directory '/tmp/B.bSxPY4/BUILD/percona-server-5.7.31-34/build' make[2]: Entering directory '/tmp/B.bSxPY4/BUILD/percona-server-5.7.31-34/build' [ 7%] Building C object strings/CMakeFiles/strings.dir/strcont.c.o cd /tmp/B.bSxPY4/BUILD/percona-server-5.7.31-34/build/strings && /usr/bin/x86_64-pld-linux-gnux32-gcc -DBOOST_GEOMETRY_SQRT_CHECK_FINITENESS -DDISABLE_MYSQL_THREAD_H -DHAVE_CONFIG_H -DHAVE_TLSv13 -DLZ4_DISABLE_DEPRECATE_WARNINGS -D_FILE_OFFSET_BITS=64 -D_GNU_SOURCE -D__STDC_WANT_LIB_EXT1__=1 -I/tmp/B.bSxPY4/BUILD/percona-server-5.7.31-34/build/include -I/tmp/B.bSxPY4/BUILD/percona-server-5.7.31-34/extra/rapidjson/include -I/tmp/B.bSxPY4/BUILD/percona-server-5.7.31-34/build/libbinlogevents/include -I/tmp/B.bSxPY4/BUILD/percona-server-5.7.31-34/libbinlogevents/export -I/tmp/B.bSxPY4/BUILD/percona-server-5.7.31-34/include -fPIC -Wall -Wextra -Wformat-security -Wvla -Wwrite-strings -Wdeclaration-after-statement -O3 -D_FORTIFY_SOURCE=2 -O2 -fwrapv -pipe -Wformat -Werror=format-security -gdwarf-4 -fno-debug-types-section -fvar-tracking-assignments -g2 -Wp,-D_FORTIFY_SOURCE=2 -fstack-protector-strong --param=ssp-buffer-size=4 -Werror=trampolines -fPIC -mtune=generic -march=x86-64 -gdwarf-4 -fno-debug-types-section -fvar-tracking-assignments -g2 -DNDEBUG -fno-omit-frame-pointer -fno-strict-aliasing -Wno-shadow -g -fno-omit-frame-pointer -fno-strict-aliasing -DDBUG_OFF -DNDEBUG -o CMakeFiles/strings.dir/strcont.c.o -c /tmp/B.bSxPY4/BUILD/percona-server-5.7.31-34/strings/strcont.c make[2]: Leaving directory '/tmp/B.bSxPY4/BUILD/percona-server-5.7.31-34/build' make[2]: Entering directory '/tmp/B.bSxPY4/BUILD/percona-server-5.7.31-34/build' [ 7%] Building C object strings/CMakeFiles/strings.dir/my_strchr.c.o cd /tmp/B.bSxPY4/BUILD/percona-server-5.7.31-34/build/strings && /usr/bin/x86_64-pld-linux-gnux32-gcc -DBOOST_GEOMETRY_SQRT_CHECK_FINITENESS -DDISABLE_MYSQL_THREAD_H -DHAVE_CONFIG_H -DHAVE_TLSv13 -DLZ4_DISABLE_DEPRECATE_WARNINGS -D_FILE_OFFSET_BITS=64 -D_GNU_SOURCE -D__STDC_WANT_LIB_EXT1__=1 -I/tmp/B.bSxPY4/BUILD/percona-server-5.7.31-34/build/include -I/tmp/B.bSxPY4/BUILD/percona-server-5.7.31-34/extra/rapidjson/include -I/tmp/B.bSxPY4/BUILD/percona-server-5.7.31-34/build/libbinlogevents/include -I/tmp/B.bSxPY4/BUILD/percona-server-5.7.31-34/libbinlogevents/export -I/tmp/B.bSxPY4/BUILD/percona-server-5.7.31-34/include -fPIC -Wall -Wextra -Wformat-security -Wvla -Wwrite-strings -Wdeclaration-after-statement -O3 -D_FORTIFY_SOURCE=2 -O2 -fwrapv -pipe -Wformat -Werror=format-security -gdwarf-4 -fno-debug-types-section -fvar-tracking-assignments -g2 -Wp,-D_FORTIFY_SOURCE=2 -fstack-protector-strong --param=ssp-buffer-size=4 -Werror=trampolines -fPIC -mtune=generic -march=x86-64 -gdwarf-4 -fno-debug-types-section -fvar-tracking-assignments -g2 -DNDEBUG -fno-omit-frame-pointer -fno-strict-aliasing -Wno-shadow -g -fno-omit-frame-pointer -fno-strict-aliasing -DDBUG_OFF -DNDEBUG -o CMakeFiles/strings.dir/my_strchr.c.o -c /tmp/B.bSxPY4/BUILD/percona-server-5.7.31-34/strings/my_strchr.c make[2]: Leaving directory '/tmp/B.bSxPY4/BUILD/percona-server-5.7.31-34/build' make[2]: Entering directory '/tmp/B.bSxPY4/BUILD/percona-server-5.7.31-34/build' [ 7%] Building C object strings/CMakeFiles/strings.dir/strappend.c.o cd /tmp/B.bSxPY4/BUILD/percona-server-5.7.31-34/build/strings && /usr/bin/x86_64-pld-linux-gnux32-gcc -DBOOST_GEOMETRY_SQRT_CHECK_FINITENESS -DDISABLE_MYSQL_THREAD_H -DHAVE_CONFIG_H -DHAVE_TLSv13 -DLZ4_DISABLE_DEPRECATE_WARNINGS -D_FILE_OFFSET_BITS=64 -D_GNU_SOURCE -D__STDC_WANT_LIB_EXT1__=1 -I/tmp/B.bSxPY4/BUILD/percona-server-5.7.31-34/build/include -I/tmp/B.bSxPY4/BUILD/percona-server-5.7.31-34/extra/rapidjson/include -I/tmp/B.bSxPY4/BUILD/percona-server-5.7.31-34/build/libbinlogevents/include -I/tmp/B.bSxPY4/BUILD/percona-server-5.7.31-34/libbinlogevents/export -I/tmp/B.bSxPY4/BUILD/percona-server-5.7.31-34/include -fPIC -Wall -Wextra -Wformat-security -Wvla -Wwrite-strings -Wdeclaration-after-statement -O3 -D_FORTIFY_SOURCE=2 -O2 -fwrapv -pipe -Wformat -Werror=format-security -gdwarf-4 -fno-debug-types-section -fvar-tracking-assignments -g2 -Wp,-D_FORTIFY_SOURCE=2 -fstack-protector-strong --param=ssp-buffer-size=4 -Werror=trampolines -fPIC -mtune=generic -march=x86-64 -gdwarf-4 -fno-debug-types-section -fvar-tracking-assignments -g2 -DNDEBUG -fno-omit-frame-pointer -fno-strict-aliasing -Wno-shadow -g -fno-omit-frame-pointer -fno-strict-aliasing -DDBUG_OFF -DNDEBUG -o CMakeFiles/strings.dir/strappend.c.o -c /tmp/B.bSxPY4/BUILD/percona-server-5.7.31-34/strings/strappend.c make[2]: Leaving directory '/tmp/B.bSxPY4/BUILD/percona-server-5.7.31-34/build' make[2]: Entering directory '/tmp/B.bSxPY4/BUILD/percona-server-5.7.31-34/build' [ 7%] Building C object strings/CMakeFiles/strings.dir/xml.c.o cd /tmp/B.bSxPY4/BUILD/percona-server-5.7.31-34/build/strings && /usr/bin/x86_64-pld-linux-gnux32-gcc -DBOOST_GEOMETRY_SQRT_CHECK_FINITENESS -DDISABLE_MYSQL_THREAD_H -DHAVE_CONFIG_H -DHAVE_TLSv13 -DLZ4_DISABLE_DEPRECATE_WARNINGS -D_FILE_OFFSET_BITS=64 -D_GNU_SOURCE -D__STDC_WANT_LIB_EXT1__=1 -I/tmp/B.bSxPY4/BUILD/percona-server-5.7.31-34/build/include -I/tmp/B.bSxPY4/BUILD/percona-server-5.7.31-34/extra/rapidjson/include -I/tmp/B.bSxPY4/BUILD/percona-server-5.7.31-34/build/libbinlogevents/include -I/tmp/B.bSxPY4/BUILD/percona-server-5.7.31-34/libbinlogevents/export -I/tmp/B.bSxPY4/BUILD/percona-server-5.7.31-34/include -fPIC -Wall -Wextra -Wformat-security -Wvla -Wwrite-strings -Wdeclaration-after-statement -O3 -D_FORTIFY_SOURCE=2 -O2 -fwrapv -pipe -Wformat -Werror=format-security -gdwarf-4 -fno-debug-types-section -fvar-tracking-assignments -g2 -Wp,-D_FORTIFY_SOURCE=2 -fstack-protector-strong --param=ssp-buffer-size=4 -Werror=trampolines -fPIC -mtune=generic -march=x86-64 -gdwarf-4 -fno-debug-types-section -fvar-tracking-assignments -g2 -DNDEBUG -fno-omit-frame-pointer -fno-strict-aliasing -Wno-shadow -g -fno-omit-frame-pointer -fno-strict-aliasing -DDBUG_OFF -DNDEBUG -o CMakeFiles/strings.dir/xml.c.o -c /tmp/B.bSxPY4/BUILD/percona-server-5.7.31-34/strings/xml.c make[2]: Leaving directory '/tmp/B.bSxPY4/BUILD/percona-server-5.7.31-34/build' make[2]: Entering directory '/tmp/B.bSxPY4/BUILD/percona-server-5.7.31-34/build' [ 6%] Building C object strings/CMakeFiles/strings.dir/dtoa.c.o cd /tmp/B.bSxPY4/BUILD/percona-server-5.7.31-34/build/strings && /usr/bin/x86_64-pld-linux-gnux32-gcc -DBOOST_GEOMETRY_SQRT_CHECK_FINITENESS -DDISABLE_MYSQL_THREAD_H -DHAVE_CONFIG_H -DHAVE_TLSv13 -DLZ4_DISABLE_DEPRECATE_WARNINGS -D_FILE_OFFSET_BITS=64 -D_GNU_SOURCE -D__STDC_WANT_LIB_EXT1__=1 -I/tmp/B.bSxPY4/BUILD/percona-server-5.7.31-34/build/include -I/tmp/B.bSxPY4/BUILD/percona-server-5.7.31-34/extra/rapidjson/include -I/tmp/B.bSxPY4/BUILD/percona-server-5.7.31-34/build/libbinlogevents/include -I/tmp/B.bSxPY4/BUILD/percona-server-5.7.31-34/libbinlogevents/export -I/tmp/B.bSxPY4/BUILD/percona-server-5.7.31-34/include -fPIC -Wall -Wextra -Wformat-security -Wvla -Wwrite-strings -Wdeclaration-after-statement -O3 -D_FORTIFY_SOURCE=2 -O2 -fwrapv -pipe -Wformat -Werror=format-security -gdwarf-4 -fno-debug-types-section -fvar-tracking-assignments -g2 -Wp,-D_FORTIFY_SOURCE=2 -fstack-protector-strong --param=ssp-buffer-size=4 -Werror=trampolines -fPIC -mtune=generic -march=x86-64 -gdwarf-4 -fno-debug-types-section -fvar-tracking-assignments -g2 -DNDEBUG -fno-omit-frame-pointer -fno-strict-aliasing -Wno-shadow -g -fno-omit-frame-pointer -fno-strict-aliasing -DDBUG_OFF -DNDEBUG -o CMakeFiles/strings.dir/dtoa.c.o -c /tmp/B.bSxPY4/BUILD/percona-server-5.7.31-34/strings/dtoa.c make[2]: Leaving directory '/tmp/B.bSxPY4/BUILD/percona-server-5.7.31-34/build' make[2]: Entering directory '/tmp/B.bSxPY4/BUILD/percona-server-5.7.31-34/build' [ 6%] Building C object strings/CMakeFiles/strings.dir/decimal.c.o cd /tmp/B.bSxPY4/BUILD/percona-server-5.7.31-34/build/strings && /usr/bin/x86_64-pld-linux-gnux32-gcc -DBOOST_GEOMETRY_SQRT_CHECK_FINITENESS -DDISABLE_MYSQL_THREAD_H -DHAVE_CONFIG_H -DHAVE_TLSv13 -DLZ4_DISABLE_DEPRECATE_WARNINGS -D_FILE_OFFSET_BITS=64 -D_GNU_SOURCE -D__STDC_WANT_LIB_EXT1__=1 -I/tmp/B.bSxPY4/BUILD/percona-server-5.7.31-34/build/include -I/tmp/B.bSxPY4/BUILD/percona-server-5.7.31-34/extra/rapidjson/include -I/tmp/B.bSxPY4/BUILD/percona-server-5.7.31-34/build/libbinlogevents/include -I/tmp/B.bSxPY4/BUILD/percona-server-5.7.31-34/libbinlogevents/export -I/tmp/B.bSxPY4/BUILD/percona-server-5.7.31-34/include -fPIC -Wall -Wextra -Wformat-security -Wvla -Wwrite-strings -Wdeclaration-after-statement -O3 -D_FORTIFY_SOURCE=2 -O2 -fwrapv -pipe -Wformat -Werror=format-security -gdwarf-4 -fno-debug-types-section -fvar-tracking-assignments -g2 -Wp,-D_FORTIFY_SOURCE=2 -fstack-protector-strong --param=ssp-buffer-size=4 -Werror=trampolines -fPIC -mtune=generic -march=x86-64 -gdwarf-4 -fno-debug-types-section -fvar-tracking-assignments -g2 -DNDEBUG -fno-omit-frame-pointer -fno-strict-aliasing -Wno-shadow -g -fno-omit-frame-pointer -fno-strict-aliasing -DDBUG_OFF -DNDEBUG -o CMakeFiles/strings.dir/decimal.c.o -c /tmp/B.bSxPY4/BUILD/percona-server-5.7.31-34/strings/decimal.c make[2]: Leaving directory '/tmp/B.bSxPY4/BUILD/percona-server-5.7.31-34/build' make[2]: Entering directory '/tmp/B.bSxPY4/BUILD/percona-server-5.7.31-34/build' [ 7%] Linking C static library ../archive_output_directory/libstrings.a cd /tmp/B.bSxPY4/BUILD/percona-server-5.7.31-34/build/strings && /usr/bin/cmake -P CMakeFiles/strings.dir/cmake_clean_target.cmake cd /tmp/B.bSxPY4/BUILD/percona-server-5.7.31-34/build/strings && /usr/bin/cmake -E cmake_link_script CMakeFiles/strings.dir/link.txt --verbose=1 /usr/bin/ar qc ../archive_output_directory/libstrings.a CMakeFiles/strings.dir/bchange.c.o CMakeFiles/strings.dir/ctype-big5.c.o CMakeFiles/strings.dir/ctype-bin.c.o CMakeFiles/strings.dir/ctype-cp932.c.o CMakeFiles/strings.dir/ctype-czech.c.o CMakeFiles/strings.dir/ctype-euc_kr.c.o CMakeFiles/strings.dir/ctype-eucjpms.c.o CMakeFiles/strings.dir/ctype-extra.c.o CMakeFiles/strings.dir/ctype-gb2312.c.o CMakeFiles/strings.dir/ctype-gbk.c.o CMakeFiles/strings.dir/ctype-gb18030.c.o CMakeFiles/strings.dir/ctype-latin1.c.o CMakeFiles/strings.dir/ctype-mb.c.o CMakeFiles/strings.dir/ctype-simple.c.o CMakeFiles/strings.dir/ctype-sjis.c.o CMakeFiles/strings.dir/ctype-tis620.c.o CMakeFiles/strings.dir/ctype-uca.c.o CMakeFiles/strings.dir/ctype-ucs2.c.o CMakeFiles/strings.dir/ctype-ujis.c.o CMakeFiles/strings.dir/ctype-utf8.c.o CMakeFiles/strings.dir/ctype-win1250ch.c.o CMakeFiles/strings.dir/ctype.c.o CMakeFiles/strings.dir/decimal.c.o CMakeFiles/strings.dir/dtoa.c.o CMakeFiles/strings.dir/int2str.c.o CMakeFiles/strings.dir/is_prefix.c.o CMakeFiles/strings.dir/llstr.c.o CMakeFiles/strings.dir/longlong2str.c.o CMakeFiles/strings.dir/my_strtoll10.c.o CMakeFiles/strings.dir/my_vsnprintf.c.o CMakeFiles/strings.dir/str2int.c.o CMakeFiles/strings.dir/str_alloc.c.o CMakeFiles/strings.dir/strcend.c.o CMakeFiles/strings.dir/strend.c.o CMakeFiles/strings.dir/strfill.c.o CMakeFiles/strings.dir/strmake.c.o CMakeFiles/strings.dir/my_stpmov.c.o CMakeFiles/strings.dir/my_stpnmov.c.o CMakeFiles/strings.dir/strxmov.c.o CMakeFiles/strings.dir/strxnmov.c.o CMakeFiles/strings.dir/xml.c.o CMakeFiles/strings.dir/my_strchr.c.o CMakeFiles/strings.dir/strcont.c.o CMakeFiles/strings.dir/strappend.c.o /usr/bin/ranlib ../archive_output_directory/libstrings.a cd /tmp/B.bSxPY4/BUILD/percona-server-5.7.31-34/build/strings && /usr/bin/cmake -DTARGET_NAME=strings -DTARGET_LOC=/tmp/B.bSxPY4/BUILD/percona-server-5.7.31-34/build/archive_output_directory/libstrings.a -DCFG_INTDIR=. -P /tmp/B.bSxPY4/BUILD/percona-server-5.7.31-34/build/archive_output_directory/lib_location_strings.cmake make[2]: Leaving directory '/tmp/B.bSxPY4/BUILD/percona-server-5.7.31-34/build' make[1]: Entering directory '/tmp/B.bSxPY4/BUILD/percona-server-5.7.31-34/build' [ 7%] Built target strings make[1]: Leaving directory '/tmp/B.bSxPY4/BUILD/percona-server-5.7.31-34/build' make: *** [Makefile:175: all] Error 2 error: Bad exit status from /tmp/B.bSxPY4/BUILD/tmp/rpm-tmp.1106 (%build) RPM build errors: Bad exit status from /tmp/B.bSxPY4/BUILD/tmp/rpm-tmp.1106 (%build) ended at: Tue Oct 13 10:52:57 2020, done in 0:01:07.983169 error: No files produced. + chmod -R u+rwX /tmp/B.bSxPY4/BUILD + rm -rf /tmp/B.bSxPY4/tmp /tmp/B.bSxPY4/BUILD + rm -rf /tmp/B.bSxPY4 Begin-PLD-Builder-Info Build-Time: user:80.56s sys:22.41s real:108.26s (faults io:2 non-io:2720439) End-PLD-Builder-Info
[Back to list of logs] [View rpm -qa of builder]