FailedOk

th/SRPMS[OK]
th/x32[OK]
th/i686[OK]
th/x86_64[OK]

ac/SRPMS[OK]
ac/i386[OK]
ac/i586[OK]
ac/i686[OK]
ac/alpha[OK]
ac/amd64[OK]
ac/athlon[OK]
ac/ppc[OK]
ac/sparc[OK]
ac/sparc64[OK]

Advanced Search
main()
Powered by PLD Linux
(c) 2002-2020 PLD Team
$Revision: 1.37 $
Powered by vim.
Your IP: 3.238.8.102

percona-server 3C02B43A-2CF2-4F6F-A5D1-516A4B1D008F

Status:Failed
Source URL:https://buildlogs.pld-linux.org/pld/th/x32/FAIL/percona-server,3C02B43A-2CF2-4F6F-A5D1-516A4B1D008F.bz2
text/plain URL:View!
full text:View!
rpm -qa of builder:View!
Date:2020/10/13 10:53:05
Runtime:0:01:07.983169

Toc:

  • error 1
  • /tmp/B.bSxPY4/BUILD/percona-server-5.7.31-34/extra/coredumper/src/linux_syscall_support.h:1416: Error: incorrect register `%r15d' used with `q' suffix
  • error 2
  • /tmp/B.bSxPY4/BUILD/percona-server-5.7.31-34/extra/coredumper/src/linux_syscall_support.h:1418: Error: incorrect register `%esi' used with `q' suffix
  • error 3
  • /tmp/B.bSxPY4/BUILD/percona-server-5.7.31-34/extra/coredumper/src/linux_syscall_support.h:1421: Error: incorrect register `%esi' used with `q' suffix
  • error 4
  • /tmp/B.bSxPY4/BUILD/percona-server-5.7.31-34/extra/coredumper/src/linux_syscall_support.h:1422: Error: operand size mismatch for `movq'
  • error 5
  • /tmp/B.bSxPY4/BUILD/percona-server-5.7.31-34/extra/coredumper/src/linux_syscall_support.h:1423: Error: operand size mismatch for `movq'
  • error 6
  • /tmp/B.bSxPY4/BUILD/percona-server-5.7.31-34/extra/coredumper/src/linux_syscall_support.h:2040: Error: operand type mismatch for `movq'
  • error 7
  • /tmp/B.bSxPY4/BUILD/percona-server-5.7.31-34/extra/coredumper/src/linux_syscall_support.h:2040: Error: operand type mismatch for `movq'
  • error 8
  • /tmp/B.bSxPY4/BUILD/percona-server-5.7.31-34/extra/coredumper/src/linux_syscall_support.h:2040: Error: operand type mismatch for `movq'
  • error 9
  • /tmp/B.bSxPY4/BUILD/percona-server-5.7.31-34/extra/coredumper/src/linux_syscall_support.h:2067: Error: operand type mismatch for `movq'
  • error 10
  • make[2]: *** [extra/coredumper/src/CMakeFiles/coredumper.dir/build.make:112: extra/coredumper/src/CMakeFiles/coredumper.dir/elfcore.cc.o] Error 1
  • error 11
  • make[1]: *** [CMakeFiles/Makefile2:2117: extra/coredumper/src/CMakeFiles/coredumper.dir/all] Error 2
  • error 12
  • error: Bad exit status from /tmp/B.bSxPY4/BUILD/tmp/rpm-tmp.1106 (%build)
  • error 13
  • RPM build errors:
  • error 14
  • error: No files produced.

Content:

make[2]: Leaving directory '/tmp/B.bSxPY4/BUILD/percona-server-5.7.31-34/build'
make[2]: Entering directory '/tmp/B.bSxPY4/BUILD/percona-server-5.7.31-34/build'
[  1%] Building C object vio/CMakeFiles/vio.dir/viosocket.c.o
cd /tmp/B.bSxPY4/BUILD/percona-server-5.7.31-34/build/vio && /usr/bin/x86_64-pld-linux-gnux32-gcc -DBOOST_GEOMETRY_SQRT_CHECK_FINITENESS -DHAVE_CONFIG_H -DHAVE_TLSv13 -DLZ4_DISABLE_DEPRECATE_WARNINGS -D_FILE_OFFSET_BITS=64 -D_GNU_SOURCE -D__STDC_WANT_LIB_EXT1__=1 -I/tmp/B.bSxPY4/BUILD/percona-server-5.7.31-34/build/include -I/tmp/B.bSxPY4/BUILD/percona-server-5.7.31-34/extra/rapidjson/include -I/tmp/B.bSxPY4/BUILD/percona-server-5.7.31-34/build/libbinlogevents/include -I/tmp/B.bSxPY4/BUILD/percona-server-5.7.31-34/libbinlogevents/export -I/tmp/B.bSxPY4/BUILD/percona-server-5.7.31-34/include  -fPIC -Wall -Wextra -Wformat-security -Wvla -Wwrite-strings -Wdeclaration-after-statement -O3 -D_FORTIFY_SOURCE=2 -O2 -fwrapv -pipe -Wformat -Werror=format-security -gdwarf-4 -fno-debug-types-section -fvar-tracking-assignments -g2 -Wp,-D_FORTIFY_SOURCE=2 -fstack-protector-strong --param=ssp-buffer-size=4 -Werror=trampolines -fPIC -mtune=generic -march=x86-64 -gdwarf-4 -fno-debug-types-section -fvar-tracking-assignments -g2  -DNDEBUG -fno-omit-frame-pointer -fno-strict-aliasing  -Wno-shadow -g -fno-omit-frame-pointer -fno-strict-aliasing -DDBUG_OFF -DNDEBUG    -DHAVE_OPENSSL -o CMakeFiles/vio.dir/viosocket.c.o   -c /tmp/B.bSxPY4/BUILD/percona-server-5.7.31-34/vio/viosocket.c
make[2]: Leaving directory '/tmp/B.bSxPY4/BUILD/percona-server-5.7.31-34/build'
make[2]: Entering directory '/tmp/B.bSxPY4/BUILD/percona-server-5.7.31-34/build'
[  3%] Linking C static library ../archive_output_directory/libmysqlservices.a
cd /tmp/B.bSxPY4/BUILD/percona-server-5.7.31-34/build/libservices && /usr/bin/cmake -P CMakeFiles/mysqlservices.dir/cmake_clean_target.cmake
cd /tmp/B.bSxPY4/BUILD/percona-server-5.7.31-34/build/libservices && /usr/bin/cmake -E cmake_link_script CMakeFiles/mysqlservices.dir/link.txt --verbose=1
/usr/bin/ar qc ../archive_output_directory/libmysqlservices.a  CMakeFiles/mysqlservices.dir/service_command.c.o CMakeFiles/mysqlservices.dir/locking_service.c.o CMakeFiles/mysqlservices.dir/srv_session_service.c.o CMakeFiles/mysqlservices.dir/my_snprintf_service.c.o CMakeFiles/mysqlservices.dir/thd_alloc_service.c.o CMakeFiles/mysqlservices.dir/thd_wait_service.c.o CMakeFiles/mysqlservices.dir/my_plugin_log_service.c.o CMakeFiles/mysqlservices.dir/my_thread_scheduler_service.c.o CMakeFiles/mysqlservices.dir/mysql_string_service.c.o CMakeFiles/mysqlservices.dir/mysql_malloc_service.c.o CMakeFiles/mysqlservices.dir/mysql_password_policy_service.c.o CMakeFiles/mysqlservices.dir/parser_service.c.o CMakeFiles/mysqlservices.dir/srv_session_info_service.c.o CMakeFiles/mysqlservices.dir/rpl_transaction_ctx_service.c.o CMakeFiles/mysqlservices.dir/rpl_transaction_write_set_service.c.o CMakeFiles/mysqlservices.dir/security_context_service.c.o CMakeFiles/mysqlservices.dir/mysql_keyring_service.c.o
/usr/bin/ranlib ../archive_output_directory/libmysqlservices.a
cd /tmp/B.bSxPY4/BUILD/percona-server-5.7.31-34/build/libservices && /usr/bin/cmake -DTARGET_NAME=mysqlservices -DTARGET_LOC=/tmp/B.bSxPY4/BUILD/percona-server-5.7.31-34/build/archive_output_directory/libmysqlservices.a -DCFG_INTDIR=. -P /tmp/B.bSxPY4/BUILD/percona-server-5.7.31-34/build/archive_output_directory/lib_location_mysqlservices.cmake
make[2]: Leaving directory '/tmp/B.bSxPY4/BUILD/percona-server-5.7.31-34/build'
make[2]: Entering directory '/tmp/B.bSxPY4/BUILD/percona-server-5.7.31-34/build'
[  0%] Building CXX object libbinlogstandalone/src/CMakeFiles/binlogstandalone_static.dir/__/__/libbinlogevents/src/load_data_events.cpp.o
cd /tmp/B.bSxPY4/BUILD/percona-server-5.7.31-34/build/libbinlogstandalone/src && /usr/bin/x86_64-pld-linux-gnux32-g++  -DBOOST_GEOMETRY_SQRT_CHECK_FINITENESS -DHAVE_CONFIG_H -DHAVE_TLSv13 -DLZ4_DISABLE_DEPRECATE_WARNINGS -DSTANDALONE_BINLOG -D_FILE_OFFSET_BITS=64 -D_GNU_SOURCE -D__STDC_WANT_LIB_EXT1__=1 -I/tmp/B.bSxPY4/BUILD/percona-server-5.7.31-34/build/include -I/tmp/B.bSxPY4/BUILD/percona-server-5.7.31-34/extra/rapidjson/include -I/tmp/B.bSxPY4/BUILD/percona-server-5.7.31-34/build/libbinlogevents/include -I/tmp/B.bSxPY4/BUILD/percona-server-5.7.31-34/libbinlogevents/export -I/tmp/B.bSxPY4/BUILD/percona-server-5.7.31-34/include -I/tmp/B.bSxPY4/BUILD/percona-server-5.7.31-34/libbinlogevents/include -I/tmp/B.bSxPY4/BUILD/percona-server-5.7.31-34/build/libbinlogstandalone/../libbinlogevents/include -I/tmp/B.bSxPY4/BUILD/percona-server-5.7.31-34/build/libbinlogstandalone/libbinlogevents/export  -fPIC -Wall -Wextra -Wformat-security -Wvla -Woverloaded-virtual -Wno-unused-parameter -O3 -D_FORTIFY_SOURCE=2 -g -fno-omit-frame-pointer -fno-strict-aliasing -DDBUG_OFF -DNDEBUG   -std=gnu++11 -o CMakeFiles/binlogstandalone_static.dir/__/__/libbinlogevents/src/load_data_events.cpp.o -c /tmp/B.bSxPY4/BUILD/percona-server-5.7.31-34/libbinlogevents/src/load_data_events.cpp
make[2]: Leaving directory '/tmp/B.bSxPY4/BUILD/percona-server-5.7.31-34/build'
make[2]: Entering directory '/tmp/B.bSxPY4/BUILD/percona-server-5.7.31-34/build'
[  3%] Building C object regex/CMakeFiles/regex.dir/regerror.c.o
cd /tmp/B.bSxPY4/BUILD/percona-server-5.7.31-34/build/regex && /usr/bin/x86_64-pld-linux-gnux32-gcc -DBOOST_GEOMETRY_SQRT_CHECK_FINITENESS -DHAVE_CONFIG_H -DHAVE_TLSv13 -DLZ4_DISABLE_DEPRECATE_WARNINGS -D_FILE_OFFSET_BITS=64 -D_GNU_SOURCE -D__STDC_WANT_LIB_EXT1__=1 -I/tmp/B.bSxPY4/BUILD/percona-server-5.7.31-34/build/include -I/tmp/B.bSxPY4/BUILD/percona-server-5.7.31-34/extra/rapidjson/include -I/tmp/B.bSxPY4/BUILD/percona-server-5.7.31-34/build/libbinlogevents/include -I/tmp/B.bSxPY4/BUILD/percona-server-5.7.31-34/libbinlogevents/export -I/tmp/B.bSxPY4/BUILD/percona-server-5.7.31-34/include  -fPIC -Wall -Wextra -Wformat-security -Wvla -Wwrite-strings -Wdeclaration-after-statement -O3 -D_FORTIFY_SOURCE=2 -O2 -fwrapv -pipe -Wformat -Werror=format-security -gdwarf-4 -fno-debug-types-section -fvar-tracking-assignments -g2 -Wp,-D_FORTIFY_SOURCE=2 -fstack-protector-strong --param=ssp-buffer-size=4 -Werror=trampolines -fPIC -mtune=generic -march=x86-64 -gdwarf-4 -fno-debug-types-section -fvar-tracking-assignments -g2  -DNDEBUG -fno-omit-frame-pointer -fno-strict-aliasing  -Wno-shadow -g -fno-omit-frame-pointer -fno-strict-aliasing -DDBUG_OFF -DNDEBUG   -o CMakeFiles/regex.dir/regerror.c.o   -c /tmp/B.bSxPY4/BUILD/percona-server-5.7.31-34/regex/regerror.c
make[2]: Leaving directory '/tmp/B.bSxPY4/BUILD/percona-server-5.7.31-34/build'
make[2]: Entering directory '/tmp/B.bSxPY4/BUILD/percona-server-5.7.31-34/build'
[  3%] Building CXX object extra/CMakeFiles/lz4_decompress.dir/lz4_decompress.cc.o
cd /tmp/B.bSxPY4/BUILD/percona-server-5.7.31-34/build/extra && /usr/bin/x86_64-pld-linux-gnux32-g++  -DBOOST_GEOMETRY_SQRT_CHECK_FINITENESS -DHAVE_CONFIG_H -DHAVE_LZ4=1 -DHAVE_TLSv13 -DLZ4_DISABLE_DEPRECATE_WARNINGS -DMUTEX_EVENT -DUNIV_INNOCHECKSUM -D_FILE_OFFSET_BITS=64 -D_GNU_SOURCE -D__STDC_WANT_LIB_EXT1__=1 -I/tmp/B.bSxPY4/BUILD/percona-server-5.7.31-34/build/include -I/tmp/B.bSxPY4/BUILD/percona-server-5.7.31-34/extra/rapidjson/include -I/tmp/B.bSxPY4/BUILD/percona-server-5.7.31-34/build/libbinlogevents/include -I/tmp/B.bSxPY4/BUILD/percona-server-5.7.31-34/libbinlogevents/export -I/tmp/B.bSxPY4/BUILD/percona-server-5.7.31-34/include -I/tmp/B.bSxPY4/BUILD/percona-server-5.7.31-34/storage/ndb/include -I/tmp/B.bSxPY4/BUILD/percona-server-5.7.31-34/build/storage/ndb/include -I/tmp/B.bSxPY4/BUILD/percona-server-5.7.31-34/storage/ndb/include/ndbapi -I/tmp/B.bSxPY4/BUILD/percona-server-5.7.31-34/storage/ndb/include/mgmapi -I/tmp/B.bSxPY4/BUILD/percona-server-5.7.31-34/storage/innobase/include -I/tmp/B.bSxPY4/BUILD/percona-server-5.7.31-34/sql  -fPIC -Wall -Wextra -Wformat-security -Wvla -Woverloaded-virtual -Wno-unused-parameter -O3 -D_FORTIFY_SOURCE=2 -g -fno-omit-frame-pointer -fno-strict-aliasing -DDBUG_OFF -DNDEBUG -Wno-class-memaccess   -std=gnu++11 -o CMakeFiles/lz4_decompress.dir/lz4_decompress.cc.o -c /tmp/B.bSxPY4/BUILD/percona-server-5.7.31-34/extra/lz4_decompress.cc
make[2]: Leaving directory '/tmp/B.bSxPY4/BUILD/percona-server-5.7.31-34/build'
make[1]: Entering directory '/tmp/B.bSxPY4/BUILD/percona-server-5.7.31-34/build'
[  3%] Built target mysqlservices
make[1]: Leaving directory '/tmp/B.bSxPY4/BUILD/percona-server-5.7.31-34/build'
make[2]: Entering directory '/tmp/B.bSxPY4/BUILD/percona-server-5.7.31-34/build'
[  3%] Building C object scripts/CMakeFiles/comp_sql.dir/comp_sql.c.o
cd /tmp/B.bSxPY4/BUILD/percona-server-5.7.31-34/build/scripts && /usr/bin/x86_64-pld-linux-gnux32-gcc -DBOOST_GEOMETRY_SQRT_CHECK_FINITENESS -DHAVE_CONFIG_H -DHAVE_TLSv13 -DLZ4_DISABLE_DEPRECATE_WARNINGS -D_FILE_OFFSET_BITS=64 -D_GNU_SOURCE -D__STDC_WANT_LIB_EXT1__=1 -I/tmp/B.bSxPY4/BUILD/percona-server-5.7.31-34/build/include -I/tmp/B.bSxPY4/BUILD/percona-server-5.7.31-34/extra/rapidjson/include -I/tmp/B.bSxPY4/BUILD/percona-server-5.7.31-34/build/libbinlogevents/include -I/tmp/B.bSxPY4/BUILD/percona-server-5.7.31-34/libbinlogevents/export  -fPIC -Wall -Wextra -Wformat-security -Wvla -Wwrite-strings -Wdeclaration-after-statement -O3 -D_FORTIFY_SOURCE=2 -O2 -fwrapv -pipe -Wformat -Werror=format-security -gdwarf-4 -fno-debug-types-section -fvar-tracking-assignments -g2 -Wp,-D_FORTIFY_SOURCE=2 -fstack-protector-strong --param=ssp-buffer-size=4 -Werror=trampolines -fPIC -mtune=generic -march=x86-64 -gdwarf-4 -fno-debug-types-section -fvar-tracking-assignments -g2  -DNDEBUG -fno-omit-frame-pointer -fno-strict-aliasing  -Wno-shadow -g -fno-omit-frame-pointer -fno-strict-aliasing -DDBUG_OFF -DNDEBUG   -o CMakeFiles/comp_sql.dir/comp_sql.c.o   -c /tmp/B.bSxPY4/BUILD/percona-server-5.7.31-34/scripts/comp_sql.c
make[2]: Leaving directory '/tmp/B.bSxPY4/BUILD/percona-server-5.7.31-34/build'
make[2]: Entering directory '/tmp/B.bSxPY4/BUILD/percona-server-5.7.31-34/build'
[  3%] Linking CXX executable lz4_decompress
cd /tmp/B.bSxPY4/BUILD/percona-server-5.7.31-34/build/extra && /usr/bin/cmake -E cmake_link_script CMakeFiles/lz4_decompress.dir/link.txt --verbose=1
/usr/bin/x86_64-pld-linux-gnux32-g++   -fPIC -Wall -Wextra -Wformat-security -Wvla -Woverloaded-virtual -Wno-unused-parameter -O3 -D_FORTIFY_SOURCE=2 -g -fno-omit-frame-pointer -fno-strict-aliasing -DDBUG_OFF -DNDEBUG -Wno-class-memaccess   CMakeFiles/lz4_decompress.dir/lz4_decompress.cc.o  -o lz4_decompress  -lpthread -llz4 
make[2]: Leaving directory '/tmp/B.bSxPY4/BUILD/percona-server-5.7.31-34/build'
make[2]: Entering directory '/tmp/B.bSxPY4/BUILD/percona-server-5.7.31-34/build'
[  3%] Linking C executable comp_sql
cd /tmp/B.bSxPY4/BUILD/percona-server-5.7.31-34/build/scripts && /usr/bin/cmake -E cmake_link_script CMakeFiles/comp_sql.dir/link.txt --verbose=1
/usr/bin/x86_64-pld-linux-gnux32-gcc  -fPIC -Wall -Wextra -Wformat-security -Wvla -Wwrite-strings -Wdeclaration-after-statement -O3 -D_FORTIFY_SOURCE=2 -O2 -fwrapv -pipe -Wformat -Werror=format-security -gdwarf-4 -fno-debug-types-section -fvar-tracking-assignments -g2 -Wp,-D_FORTIFY_SOURCE=2 -fstack-protector-strong --param=ssp-buffer-size=4 -Werror=trampolines -fPIC -mtune=generic -march=x86-64 -gdwarf-4 -fno-debug-types-section -fvar-tracking-assignments -g2  -DNDEBUG -fno-omit-frame-pointer -fno-strict-aliasing  -Wno-shadow -g -fno-omit-frame-pointer -fno-strict-aliasing -DDBUG_OFF -DNDEBUG   CMakeFiles/comp_sql.dir/comp_sql.c.o  -o comp_sql  -lpthread 
make[2]: Leaving directory '/tmp/B.bSxPY4/BUILD/percona-server-5.7.31-34/build'
make[1]: Entering directory '/tmp/B.bSxPY4/BUILD/percona-server-5.7.31-34/build'
[  3%] Built target lz4_decompress
make[1]: Leaving directory '/tmp/B.bSxPY4/BUILD/percona-server-5.7.31-34/build'
/usr/bin/make  -f client/dump/CMakeFiles/boost_lib.dir/build.make client/dump/CMakeFiles/boost_lib.dir/depend
make[1]: Entering directory '/tmp/B.bSxPY4/BUILD/percona-server-5.7.31-34/build'
[  3%] Built target comp_sql
make[1]: Leaving directory '/tmp/B.bSxPY4/BUILD/percona-server-5.7.31-34/build'
make[2]: Entering directory '/tmp/B.bSxPY4/BUILD/percona-server-5.7.31-34/build'
[  3%] Building C object vio/CMakeFiles/vio.dir/viosslfactories.c.o
cd /tmp/B.bSxPY4/BUILD/percona-server-5.7.31-34/build/vio && /usr/bin/x86_64-pld-linux-gnux32-gcc -DBOOST_GEOMETRY_SQRT_CHECK_FINITENESS -DHAVE_CONFIG_H -DHAVE_TLSv13 -DLZ4_DISABLE_DEPRECATE_WARNINGS -D_FILE_OFFSET_BITS=64 -D_GNU_SOURCE -D__STDC_WANT_LIB_EXT1__=1 -I/tmp/B.bSxPY4/BUILD/percona-server-5.7.31-34/build/include -I/tmp/B.bSxPY4/BUILD/percona-server-5.7.31-34/extra/rapidjson/include -I/tmp/B.bSxPY4/BUILD/percona-server-5.7.31-34/build/libbinlogevents/include -I/tmp/B.bSxPY4/BUILD/percona-server-5.7.31-34/libbinlogevents/export -I/tmp/B.bSxPY4/BUILD/percona-server-5.7.31-34/include  -fPIC -Wall -Wextra -Wformat-security -Wvla -Wwrite-strings -Wdeclaration-after-statement -O3 -D_FORTIFY_SOURCE=2 -O2 -fwrapv -pipe -Wformat -Werror=format-security -gdwarf-4 -fno-debug-types-section -fvar-tracking-assignments -g2 -Wp,-D_FORTIFY_SOURCE=2 -fstack-protector-strong --param=ssp-buffer-size=4 -Werror=trampolines -fPIC -mtune=generic -march=x86-64 -gdwarf-4 -fno-debug-types-section -fvar-tracking-assignments -g2  -DNDEBUG -fno-omit-frame-pointer -fno-strict-aliasing  -Wno-shadow -g -fno-omit-frame-pointer -fno-strict-aliasing -DDBUG_OFF -DNDEBUG    -DHAVE_OPENSSL -o CMakeFiles/vio.dir/viosslfactories.c.o   -c /tmp/B.bSxPY4/BUILD/percona-server-5.7.31-34/vio/viosslfactories.c
make[2]: Leaving directory '/tmp/B.bSxPY4/BUILD/percona-server-5.7.31-34/build'
make[2]: Entering directory '/tmp/B.bSxPY4/BUILD/percona-server-5.7.31-34/build'
cd /tmp/B.bSxPY4/BUILD/percona-server-5.7.31-34/build && /usr/bin/cmake -E cmake_depends "Unix Makefiles" /tmp/B.bSxPY4/BUILD/percona-server-5.7.31-34 /tmp/B.bSxPY4/BUILD/percona-server-5.7.31-34/client/dump /tmp/B.bSxPY4/BUILD/percona-server-5.7.31-34/build /tmp/B.bSxPY4/BUILD/percona-server-5.7.31-34/build/client/dump /tmp/B.bSxPY4/BUILD/percona-server-5.7.31-34/build/client/dump/CMakeFiles/boost_lib.dir/DependInfo.cmake --color=
Scanning dependencies of target boost_lib
make[2]: Leaving directory '/tmp/B.bSxPY4/BUILD/percona-server-5.7.31-34/build'
/usr/bin/make  -f client/dump/CMakeFiles/boost_lib.dir/build.make client/dump/CMakeFiles/boost_lib.dir/build
make[2]: Entering directory '/tmp/B.bSxPY4/BUILD/percona-server-5.7.31-34/build'
[  3%] Linking C static library ../archive_output_directory/libvio.a
cd /tmp/B.bSxPY4/BUILD/percona-server-5.7.31-34/build/vio && /usr/bin/cmake -P CMakeFiles/vio.dir/cmake_clean_target.cmake
cd /tmp/B.bSxPY4/BUILD/percona-server-5.7.31-34/build/vio && /usr/bin/cmake -E cmake_link_script CMakeFiles/vio.dir/link.txt --verbose=1
/usr/bin/ar qc ../archive_output_directory/libvio.a  CMakeFiles/vio.dir/vio.c.o CMakeFiles/vio.dir/viosocket.c.o CMakeFiles/vio.dir/viossl.c.o CMakeFiles/vio.dir/viosslfactories.c.o
/usr/bin/ranlib ../archive_output_directory/libvio.a
cd /tmp/B.bSxPY4/BUILD/percona-server-5.7.31-34/build/vio && /usr/bin/cmake -DTARGET_NAME=vio -DTARGET_LOC=/tmp/B.bSxPY4/BUILD/percona-server-5.7.31-34/build/archive_output_directory/libvio.a -DCFG_INTDIR=. -P /tmp/B.bSxPY4/BUILD/percona-server-5.7.31-34/build/archive_output_directory/lib_location_vio.cmake
make[2]: Leaving directory '/tmp/B.bSxPY4/BUILD/percona-server-5.7.31-34/build'
make[1]: Entering directory '/tmp/B.bSxPY4/BUILD/percona-server-5.7.31-34/build'
[  3%] Built target vio
make[1]: Leaving directory '/tmp/B.bSxPY4/BUILD/percona-server-5.7.31-34/build'
/usr/bin/make  -f sql/CMakeFiles/gen_lex_hash.dir/build.make sql/CMakeFiles/gen_lex_hash.dir/depend
make[2]: Entering directory '/tmp/B.bSxPY4/BUILD/percona-server-5.7.31-34/build'
[  3%] Building C object regex/CMakeFiles/regex.dir/regfree.c.o
cd /tmp/B.bSxPY4/BUILD/percona-server-5.7.31-34/build/regex && /usr/bin/x86_64-pld-linux-gnux32-gcc -DBOOST_GEOMETRY_SQRT_CHECK_FINITENESS -DHAVE_CONFIG_H -DHAVE_TLSv13 -DLZ4_DISABLE_DEPRECATE_WARNINGS -D_FILE_OFFSET_BITS=64 -D_GNU_SOURCE -D__STDC_WANT_LIB_EXT1__=1 -I/tmp/B.bSxPY4/BUILD/percona-server-5.7.31-34/build/include -I/tmp/B.bSxPY4/BUILD/percona-server-5.7.31-34/extra/rapidjson/include -I/tmp/B.bSxPY4/BUILD/percona-server-5.7.31-34/build/libbinlogevents/include -I/tmp/B.bSxPY4/BUILD/percona-server-5.7.31-34/libbinlogevents/export -I/tmp/B.bSxPY4/BUILD/percona-server-5.7.31-34/include  -fPIC -Wall -Wextra -Wformat-security -Wvla -Wwrite-strings -Wdeclaration-after-statement -O3 -D_FORTIFY_SOURCE=2 -O2 -fwrapv -pipe -Wformat -Werror=format-security -gdwarf-4 -fno-debug-types-section -fvar-tracking-assignments -g2 -Wp,-D_FORTIFY_SOURCE=2 -fstack-protector-strong --param=ssp-buffer-size=4 -Werror=trampolines -fPIC -mtune=generic -march=x86-64 -gdwarf-4 -fno-debug-types-section -fvar-tracking-assignments -g2  -DNDEBUG -fno-omit-frame-pointer -fno-strict-aliasing  -Wno-shadow -g -fno-omit-frame-pointer -fno-strict-aliasing -DDBUG_OFF -DNDEBUG   -o CMakeFiles/regex.dir/regfree.c.o   -c /tmp/B.bSxPY4/BUILD/percona-server-5.7.31-34/regex/regfree.c
make[2]: Leaving directory '/tmp/B.bSxPY4/BUILD/percona-server-5.7.31-34/build'
make[2]: Entering directory '/tmp/B.bSxPY4/BUILD/percona-server-5.7.31-34/build'
cd /tmp/B.bSxPY4/BUILD/percona-server-5.7.31-34/build && /usr/bin/cmake -E cmake_depends "Unix Makefiles" /tmp/B.bSxPY4/BUILD/percona-server-5.7.31-34 /tmp/B.bSxPY4/BUILD/percona-server-5.7.31-34/sql /tmp/B.bSxPY4/BUILD/percona-server-5.7.31-34/build /tmp/B.bSxPY4/BUILD/percona-server-5.7.31-34/build/sql /tmp/B.bSxPY4/BUILD/percona-server-5.7.31-34/build/sql/CMakeFiles/gen_lex_hash.dir/DependInfo.cmake --color=
Scanning dependencies of target gen_lex_hash
make[2]: Leaving directory '/tmp/B.bSxPY4/BUILD/percona-server-5.7.31-34/build'
/usr/bin/make  -f sql/CMakeFiles/gen_lex_hash.dir/build.make sql/CMakeFiles/gen_lex_hash.dir/build
make[2]: Entering directory '/tmp/B.bSxPY4/BUILD/percona-server-5.7.31-34/build'
[  3%] Building C object strings/CMakeFiles/strings.dir/ctype-cp932.c.o
cd /tmp/B.bSxPY4/BUILD/percona-server-5.7.31-34/build/strings && /usr/bin/x86_64-pld-linux-gnux32-gcc -DBOOST_GEOMETRY_SQRT_CHECK_FINITENESS -DDISABLE_MYSQL_THREAD_H -DHAVE_CONFIG_H -DHAVE_TLSv13 -DLZ4_DISABLE_DEPRECATE_WARNINGS -D_FILE_OFFSET_BITS=64 -D_GNU_SOURCE -D__STDC_WANT_LIB_EXT1__=1 -I/tmp/B.bSxPY4/BUILD/percona-server-5.7.31-34/build/include -I/tmp/B.bSxPY4/BUILD/percona-server-5.7.31-34/extra/rapidjson/include -I/tmp/B.bSxPY4/BUILD/percona-server-5.7.31-34/build/libbinlogevents/include -I/tmp/B.bSxPY4/BUILD/percona-server-5.7.31-34/libbinlogevents/export -I/tmp/B.bSxPY4/BUILD/percona-server-5.7.31-34/include  -fPIC -Wall -Wextra -Wformat-security -Wvla -Wwrite-strings -Wdeclaration-after-statement -O3 -D_FORTIFY_SOURCE=2 -O2 -fwrapv -pipe -Wformat -Werror=format-security -gdwarf-4 -fno-debug-types-section -fvar-tracking-assignments -g2 -Wp,-D_FORTIFY_SOURCE=2 -fstack-protector-strong --param=ssp-buffer-size=4 -Werror=trampolines -fPIC -mtune=generic -march=x86-64 -gdwarf-4 -fno-debug-types-section -fvar-tracking-assignments -g2  -DNDEBUG -fno-omit-frame-pointer -fno-strict-aliasing  -Wno-shadow -g -fno-omit-frame-pointer -fno-strict-aliasing -DDBUG_OFF -DNDEBUG   -o CMakeFiles/strings.dir/ctype-cp932.c.o   -c /tmp/B.bSxPY4/BUILD/percona-server-5.7.31-34/strings/ctype-cp932.c
make[2]: Leaving directory '/tmp/B.bSxPY4/BUILD/percona-server-5.7.31-34/build'
make[2]: Entering directory '/tmp/B.bSxPY4/BUILD/percona-server-5.7.31-34/build'
[  3%] Building CXX object libbinlogstandalone/src/CMakeFiles/binlogstandalone_static.dir/__/__/libbinlogevents/src/binlog_event.cpp.o
cd /tmp/B.bSxPY4/BUILD/percona-server-5.7.31-34/build/libbinlogstandalone/src && /usr/bin/x86_64-pld-linux-gnux32-g++  -DBOOST_GEOMETRY_SQRT_CHECK_FINITENESS -DHAVE_CONFIG_H -DHAVE_TLSv13 -DLZ4_DISABLE_DEPRECATE_WARNINGS -DSTANDALONE_BINLOG -D_FILE_OFFSET_BITS=64 -D_GNU_SOURCE -D__STDC_WANT_LIB_EXT1__=1 -I/tmp/B.bSxPY4/BUILD/percona-server-5.7.31-34/build/include -I/tmp/B.bSxPY4/BUILD/percona-server-5.7.31-34/extra/rapidjson/include -I/tmp/B.bSxPY4/BUILD/percona-server-5.7.31-34/build/libbinlogevents/include -I/tmp/B.bSxPY4/BUILD/percona-server-5.7.31-34/libbinlogevents/export -I/tmp/B.bSxPY4/BUILD/percona-server-5.7.31-34/include -I/tmp/B.bSxPY4/BUILD/percona-server-5.7.31-34/libbinlogevents/include -I/tmp/B.bSxPY4/BUILD/percona-server-5.7.31-34/build/libbinlogstandalone/../libbinlogevents/include -I/tmp/B.bSxPY4/BUILD/percona-server-5.7.31-34/build/libbinlogstandalone/libbinlogevents/export  -fPIC -Wall -Wextra -Wformat-security -Wvla -Woverloaded-virtual -Wno-unused-parameter -O3 -D_FORTIFY_SOURCE=2 -g -fno-omit-frame-pointer -fno-strict-aliasing -DDBUG_OFF -DNDEBUG   -std=gnu++11 -o CMakeFiles/binlogstandalone_static.dir/__/__/libbinlogevents/src/binlog_event.cpp.o -c /tmp/B.bSxPY4/BUILD/percona-server-5.7.31-34/libbinlogevents/src/binlog_event.cpp
make[2]: Leaving directory '/tmp/B.bSxPY4/BUILD/percona-server-5.7.31-34/build'
make[2]: Entering directory '/tmp/B.bSxPY4/BUILD/percona-server-5.7.31-34/build'
[  3%] Building C object strings/CMakeFiles/strings.dir/ctype-czech.c.o
cd /tmp/B.bSxPY4/BUILD/percona-server-5.7.31-34/build/strings && /usr/bin/x86_64-pld-linux-gnux32-gcc -DBOOST_GEOMETRY_SQRT_CHECK_FINITENESS -DDISABLE_MYSQL_THREAD_H -DHAVE_CONFIG_H -DHAVE_TLSv13 -DLZ4_DISABLE_DEPRECATE_WARNINGS -D_FILE_OFFSET_BITS=64 -D_GNU_SOURCE -D__STDC_WANT_LIB_EXT1__=1 -I/tmp/B.bSxPY4/BUILD/percona-server-5.7.31-34/build/include -I/tmp/B.bSxPY4/BUILD/percona-server-5.7.31-34/extra/rapidjson/include -I/tmp/B.bSxPY4/BUILD/percona-server-5.7.31-34/build/libbinlogevents/include -I/tmp/B.bSxPY4/BUILD/percona-server-5.7.31-34/libbinlogevents/export -I/tmp/B.bSxPY4/BUILD/percona-server-5.7.31-34/include  -fPIC -Wall -Wextra -Wformat-security -Wvla -Wwrite-strings -Wdeclaration-after-statement -O3 -D_FORTIFY_SOURCE=2 -O2 -fwrapv -pipe -Wformat -Werror=format-security -gdwarf-4 -fno-debug-types-section -fvar-tracking-assignments -g2 -Wp,-D_FORTIFY_SOURCE=2 -fstack-protector-strong --param=ssp-buffer-size=4 -Werror=trampolines -fPIC -mtune=generic -march=x86-64 -gdwarf-4 -fno-debug-types-section -fvar-tracking-assignments -g2  -DNDEBUG -fno-omit-frame-pointer -fno-strict-aliasing  -Wno-shadow -g -fno-omit-frame-pointer -fno-strict-aliasing -DDBUG_OFF -DNDEBUG   -o CMakeFiles/strings.dir/ctype-czech.c.o   -c /tmp/B.bSxPY4/BUILD/percona-server-5.7.31-34/strings/ctype-czech.c
make[2]: Leaving directory '/tmp/B.bSxPY4/BUILD/percona-server-5.7.31-34/build'
make[2]: Entering directory '/tmp/B.bSxPY4/BUILD/percona-server-5.7.31-34/build'
[  3%] Building C object regex/CMakeFiles/regex.dir/regexec.c.o
cd /tmp/B.bSxPY4/BUILD/percona-server-5.7.31-34/build/regex && /usr/bin/x86_64-pld-linux-gnux32-gcc -DBOOST_GEOMETRY_SQRT_CHECK_FINITENESS -DHAVE_CONFIG_H -DHAVE_TLSv13 -DLZ4_DISABLE_DEPRECATE_WARNINGS -D_FILE_OFFSET_BITS=64 -D_GNU_SOURCE -D__STDC_WANT_LIB_EXT1__=1 -I/tmp/B.bSxPY4/BUILD/percona-server-5.7.31-34/build/include -I/tmp/B.bSxPY4/BUILD/percona-server-5.7.31-34/extra/rapidjson/include -I/tmp/B.bSxPY4/BUILD/percona-server-5.7.31-34/build/libbinlogevents/include -I/tmp/B.bSxPY4/BUILD/percona-server-5.7.31-34/libbinlogevents/export -I/tmp/B.bSxPY4/BUILD/percona-server-5.7.31-34/include  -fPIC -Wall -Wextra -Wformat-security -Wvla -Wwrite-strings -Wdeclaration-after-statement -O3 -D_FORTIFY_SOURCE=2 -O2 -fwrapv -pipe -Wformat -Werror=format-security -gdwarf-4 -fno-debug-types-section -fvar-tracking-assignments -g2 -Wp,-D_FORTIFY_SOURCE=2 -fstack-protector-strong --param=ssp-buffer-size=4 -Werror=trampolines -fPIC -mtune=generic -march=x86-64 -gdwarf-4 -fno-debug-types-section -fvar-tracking-assignments -g2  -DNDEBUG -fno-omit-frame-pointer -fno-strict-aliasing  -Wno-shadow -g -fno-omit-frame-pointer -fno-strict-aliasing -DDBUG_OFF -DNDEBUG   -o CMakeFiles/regex.dir/regexec.c.o   -c /tmp/B.bSxPY4/BUILD/percona-server-5.7.31-34/regex/regexec.c
make[2]: Leaving directory '/tmp/B.bSxPY4/BUILD/percona-server-5.7.31-34/build'
make[2]: Entering directory '/tmp/B.bSxPY4/BUILD/percona-server-5.7.31-34/build'
[  1%] Building CXX object extra/coredumper/src/CMakeFiles/coredumper.dir/elfcore.cc.o
cd /tmp/B.bSxPY4/BUILD/percona-server-5.7.31-34/build/extra/coredumper/src && /usr/bin/x86_64-pld-linux-gnux32-g++  -DBOOST_GEOMETRY_SQRT_CHECK_FINITENESS -DHAVE_CONFIG_H -DHAVE_TLSv13 -DLZ4_DISABLE_DEPRECATE_WARNINGS -D_FILE_OFFSET_BITS=64 -D_GNU_SOURCE -D__STDC_WANT_LIB_EXT1__=1 -I/tmp/B.bSxPY4/BUILD/percona-server-5.7.31-34/build/include -I/tmp/B.bSxPY4/BUILD/percona-server-5.7.31-34/extra/rapidjson/include -I/tmp/B.bSxPY4/BUILD/percona-server-5.7.31-34/build/libbinlogevents/include -I/tmp/B.bSxPY4/BUILD/percona-server-5.7.31-34/libbinlogevents/export -I/tmp/B.bSxPY4/BUILD/percona-server-5.7.31-34/extra/coredumper/include  -fPIC -O3 -D_FORTIFY_SOURCE=2 -g -fno-omit-frame-pointer -fno-strict-aliasing -DDBUG_OFF -DNDEBUG   -fno-strict-aliasing -std=gnu++11 -o CMakeFiles/coredumper.dir/elfcore.cc.o -c /tmp/B.bSxPY4/BUILD/percona-server-5.7.31-34/extra/coredumper/src/elfcore.cc
/tmp/B.bSxPY4/BUILD/percona-server-5.7.31-34/extra/coredumper/src/linux_syscall_support.h: Assembler messages:
/tmp/B.bSxPY4/BUILD/percona-server-5.7.31-34/extra/coredumper/src/linux_syscall_support.h:1416: Error: incorrect register `%r15d' used with `q' suffix
/tmp/B.bSxPY4/BUILD/percona-server-5.7.31-34/extra/coredumper/src/linux_syscall_support.h:1418: Error: incorrect register `%esi' used with `q' suffix
/tmp/B.bSxPY4/BUILD/percona-server-5.7.31-34/extra/coredumper/src/linux_syscall_support.h:1421: Error: incorrect register `%esi' used with `q' suffix
/tmp/B.bSxPY4/BUILD/percona-server-5.7.31-34/extra/coredumper/src/linux_syscall_support.h:1422: Error: operand size mismatch for `movq'
/tmp/B.bSxPY4/BUILD/percona-server-5.7.31-34/extra/coredumper/src/linux_syscall_support.h:1423: Error: operand size mismatch for `movq'
/tmp/B.bSxPY4/BUILD/percona-server-5.7.31-34/extra/coredumper/src/linux_syscall_support.h:2040: Error: operand type mismatch for `movq'
/tmp/B.bSxPY4/BUILD/percona-server-5.7.31-34/extra/coredumper/src/linux_syscall_support.h:2040: Error: operand type mismatch for `movq'
/tmp/B.bSxPY4/BUILD/percona-server-5.7.31-34/extra/coredumper/src/linux_syscall_support.h:2040: Error: operand type mismatch for `movq'
/tmp/B.bSxPY4/BUILD/percona-server-5.7.31-34/extra/coredumper/src/linux_syscall_support.h:2067: Error: operand type mismatch for `movq'
make[2]: *** [extra/coredumper/src/CMakeFiles/coredumper.dir/build.make:112: extra/coredumper/src/CMakeFiles/coredumper.dir/elfcore.cc.o] Error 1
make[2]: Leaving directory '/tmp/B.bSxPY4/BUILD/percona-server-5.7.31-34/build'
make[1]: *** [CMakeFiles/Makefile2:2117: extra/coredumper/src/CMakeFiles/coredumper.dir/all] Error 2
make[1]: *** Waiting for unfinished jobs....
make[2]: Entering directory '/tmp/B.bSxPY4/BUILD/percona-server-5.7.31-34/build'
[  3%] Building CXX object client/dump/CMakeFiles/boost_lib.dir/__/__/include/boost_1_59_0/libs/chrono/src/chrono.cpp.o
cd /tmp/B.bSxPY4/BUILD/percona-server-5.7.31-34/build/client/dump && /usr/bin/x86_64-pld-linux-gnux32-g++  -DBOOST_ALL_NO_LIB -DBOOST_GEOMETRY_SQRT_CHECK_FINITENESS -DBOOST_SYSTEM_NO_DEPRECATED -DHAVE_CONFIG_H -DHAVE_TLSv13 -DLZ4_DISABLE_DEPRECATE_WARNINGS -D_FILE_OFFSET_BITS=64 -D_GNU_SOURCE -D__STDC_WANT_LIB_EXT1__=1 -I/tmp/B.bSxPY4/BUILD/percona-server-5.7.31-34/build/include -I/tmp/B.bSxPY4/BUILD/percona-server-5.7.31-34/extra/rapidjson/include -I/tmp/B.bSxPY4/BUILD/percona-server-5.7.31-34/build/libbinlogevents/include -I/tmp/B.bSxPY4/BUILD/percona-server-5.7.31-34/libbinlogevents/export -I/tmp/B.bSxPY4/BUILD/percona-server-5.7.31-34/client -I/tmp/B.bSxPY4/BUILD/percona-server-5.7.31-34/include -I/tmp/B.bSxPY4/BUILD/percona-server-5.7.31-34/mysys_ssl -I/tmp/B.bSxPY4/BUILD/percona-server-5.7.31-34/libmysql -I/tmp/B.bSxPY4/BUILD/percona-server-5.7.31-34/libbinlogevents/include -I/tmp/B.bSxPY4/BUILD/percona-server-5.7.31-34/regex -I/tmp/B.bSxPY4/BUILD/percona-server-5.7.31-34/strings -I/usr/include/readline -I/tmp/B.bSxPY4/BUILD/percona-server-5.7.31-34/build/client -I/tmp/B.bSxPY4/BUILD/percona-server-5.7.31-34/dump -isystem /tmp/B.bSxPY4/BUILD/percona-server-5.7.31-34/include/boost_1_59_0/patches -isystem /tmp/B.bSxPY4/BUILD/percona-server-5.7.31-34/boost_1_59_0  -fPIC -Wall -Wextra -Wformat-security -Wvla -Woverloaded-virtual -Wno-unused-parameter -O3 -D_FORTIFY_SOURCE=2 -g -fno-omit-frame-pointer -fno-strict-aliasing -DDBUG_OFF -DNDEBUG -Wno-class-memaccess   -std=gnu++11 -o CMakeFiles/boost_lib.dir/__/__/include/boost_1_59_0/libs/chrono/src/chrono.cpp.o -c /tmp/B.bSxPY4/BUILD/percona-server-5.7.31-34/include/boost_1_59_0/libs/chrono/src/chrono.cpp
make[2]: Leaving directory '/tmp/B.bSxPY4/BUILD/percona-server-5.7.31-34/build'
make[2]: Entering directory '/tmp/B.bSxPY4/BUILD/percona-server-5.7.31-34/build'
[  3%] Building CXX object libbinlogstandalone/src/CMakeFiles/binlogstandalone_shared.dir/__/__/libbinlogevents/src/rows_event.cpp.o
cd /tmp/B.bSxPY4/BUILD/percona-server-5.7.31-34/build/libbinlogstandalone/src && /usr/bin/x86_64-pld-linux-gnux32-g++  -DBOOST_GEOMETRY_SQRT_CHECK_FINITENESS -DHAVE_CONFIG_H -DHAVE_TLSv13 -DLZ4_DISABLE_DEPRECATE_WARNINGS -DSTANDALONE_BINLOG -D_FILE_OFFSET_BITS=64 -D_GNU_SOURCE -D__STDC_WANT_LIB_EXT1__=1 -Dbinlogstandalone_shared_EXPORTS -I/tmp/B.bSxPY4/BUILD/percona-server-5.7.31-34/build/include -I/tmp/B.bSxPY4/BUILD/percona-server-5.7.31-34/extra/rapidjson/include -I/tmp/B.bSxPY4/BUILD/percona-server-5.7.31-34/build/libbinlogevents/include -I/tmp/B.bSxPY4/BUILD/percona-server-5.7.31-34/libbinlogevents/export -I/tmp/B.bSxPY4/BUILD/percona-server-5.7.31-34/include -I/tmp/B.bSxPY4/BUILD/percona-server-5.7.31-34/libbinlogevents/include -I/tmp/B.bSxPY4/BUILD/percona-server-5.7.31-34/build/libbinlogstandalone/../libbinlogevents/include -I/tmp/B.bSxPY4/BUILD/percona-server-5.7.31-34/build/libbinlogstandalone/libbinlogevents/export  -fPIC -Wall -Wextra -Wformat-security -Wvla -Woverloaded-virtual -Wno-unused-parameter -O3 -D_FORTIFY_SOURCE=2 -g -fno-omit-frame-pointer -fno-strict-aliasing -DDBUG_OFF -DNDEBUG -fPIC   -std=gnu++11 -o CMakeFiles/binlogstandalone_shared.dir/__/__/libbinlogevents/src/rows_event.cpp.o -c /tmp/B.bSxPY4/BUILD/percona-server-5.7.31-34/libbinlogevents/src/rows_event.cpp
make[2]: Leaving directory '/tmp/B.bSxPY4/BUILD/percona-server-5.7.31-34/build'
make[2]: Entering directory '/tmp/B.bSxPY4/BUILD/percona-server-5.7.31-34/build'
[  3%] Building C object regex/CMakeFiles/regex.dir/reginit.c.o
cd /tmp/B.bSxPY4/BUILD/percona-server-5.7.31-34/build/regex && /usr/bin/x86_64-pld-linux-gnux32-gcc -DBOOST_GEOMETRY_SQRT_CHECK_FINITENESS -DHAVE_CONFIG_H -DHAVE_TLSv13 -DLZ4_DISABLE_DEPRECATE_WARNINGS -D_FILE_OFFSET_BITS=64 -D_GNU_SOURCE -D__STDC_WANT_LIB_EXT1__=1 -I/tmp/B.bSxPY4/BUILD/percona-server-5.7.31-34/build/include -I/tmp/B.bSxPY4/BUILD/percona-server-5.7.31-34/extra/rapidjson/include -I/tmp/B.bSxPY4/BUILD/percona-server-5.7.31-34/build/libbinlogevents/include -I/tmp/B.bSxPY4/BUILD/percona-server-5.7.31-34/libbinlogevents/export -I/tmp/B.bSxPY4/BUILD/percona-server-5.7.31-34/include  -fPIC -Wall -Wextra -Wformat-security -Wvla -Wwrite-strings -Wdeclaration-after-statement -O3 -D_FORTIFY_SOURCE=2 -O2 -fwrapv -pipe -Wformat -Werror=format-security -gdwarf-4 -fno-debug-types-section -fvar-tracking-assignments -g2 -Wp,-D_FORTIFY_SOURCE=2 -fstack-protector-strong --param=ssp-buffer-size=4 -Werror=trampolines -fPIC -mtune=generic -march=x86-64 -gdwarf-4 -fno-debug-types-section -fvar-tracking-assignments -g2  -DNDEBUG -fno-omit-frame-pointer -fno-strict-aliasing  -Wno-shadow -g -fno-omit-frame-pointer -fno-strict-aliasing -DDBUG_OFF -DNDEBUG   -o CMakeFiles/regex.dir/reginit.c.o   -c /tmp/B.bSxPY4/BUILD/percona-server-5.7.31-34/regex/reginit.c
make[2]: Leaving directory '/tmp/B.bSxPY4/BUILD/percona-server-5.7.31-34/build'
make[2]: Entering directory '/tmp/B.bSxPY4/BUILD/percona-server-5.7.31-34/build'
[  3%] Building CXX object libbinlogstandalone/src/CMakeFiles/binlogstandalone_shared.dir/__/__/libbinlogevents/src/binlog_event.cpp.o
cd /tmp/B.bSxPY4/BUILD/percona-server-5.7.31-34/build/libbinlogstandalone/src && /usr/bin/x86_64-pld-linux-gnux32-g++  -DBOOST_GEOMETRY_SQRT_CHECK_FINITENESS -DHAVE_CONFIG_H -DHAVE_TLSv13 -DLZ4_DISABLE_DEPRECATE_WARNINGS -DSTANDALONE_BINLOG -D_FILE_OFFSET_BITS=64 -D_GNU_SOURCE -D__STDC_WANT_LIB_EXT1__=1 -Dbinlogstandalone_shared_EXPORTS -I/tmp/B.bSxPY4/BUILD/percona-server-5.7.31-34/build/include -I/tmp/B.bSxPY4/BUILD/percona-server-5.7.31-34/extra/rapidjson/include -I/tmp/B.bSxPY4/BUILD/percona-server-5.7.31-34/build/libbinlogevents/include -I/tmp/B.bSxPY4/BUILD/percona-server-5.7.31-34/libbinlogevents/export -I/tmp/B.bSxPY4/BUILD/percona-server-5.7.31-34/include -I/tmp/B.bSxPY4/BUILD/percona-server-5.7.31-34/libbinlogevents/include -I/tmp/B.bSxPY4/BUILD/percona-server-5.7.31-34/build/libbinlogstandalone/../libbinlogevents/include -I/tmp/B.bSxPY4/BUILD/percona-server-5.7.31-34/build/libbinlogstandalone/libbinlogevents/export  -fPIC -Wall -Wextra -Wformat-security -Wvla -Woverloaded-virtual -Wno-unused-parameter -O3 -D_FORTIFY_SOURCE=2 -g -fno-omit-frame-pointer -fno-strict-aliasing -DDBUG_OFF -DNDEBUG -fPIC   -std=gnu++11 -o CMakeFiles/binlogstandalone_shared.dir/__/__/libbinlogevents/src/binlog_event.cpp.o -c /tmp/B.bSxPY4/BUILD/percona-server-5.7.31-34/libbinlogevents/src/binlog_event.cpp
make[2]: Leaving directory '/tmp/B.bSxPY4/BUILD/percona-server-5.7.31-34/build'
make[2]: Entering directory '/tmp/B.bSxPY4/BUILD/percona-server-5.7.31-34/build'
[  4%] Linking C static library ../archive_output_directory/libregex.a
cd /tmp/B.bSxPY4/BUILD/percona-server-5.7.31-34/build/regex && /usr/bin/cmake -P CMakeFiles/regex.dir/cmake_clean_target.cmake
cd /tmp/B.bSxPY4/BUILD/percona-server-5.7.31-34/build/regex && /usr/bin/cmake -E cmake_link_script CMakeFiles/regex.dir/link.txt --verbose=1
/usr/bin/ar qc ../archive_output_directory/libregex.a  CMakeFiles/regex.dir/regcomp.c.o CMakeFiles/regex.dir/regerror.c.o CMakeFiles/regex.dir/regexec.c.o CMakeFiles/regex.dir/regfree.c.o CMakeFiles/regex.dir/reginit.c.o
/usr/bin/ranlib ../archive_output_directory/libregex.a
cd /tmp/B.bSxPY4/BUILD/percona-server-5.7.31-34/build/regex && /usr/bin/cmake -DTARGET_NAME=regex -DTARGET_LOC=/tmp/B.bSxPY4/BUILD/percona-server-5.7.31-34/build/archive_output_directory/libregex.a -DCFG_INTDIR=. -P /tmp/B.bSxPY4/BUILD/percona-server-5.7.31-34/build/archive_output_directory/lib_location_regex.cmake
make[2]: Leaving directory '/tmp/B.bSxPY4/BUILD/percona-server-5.7.31-34/build'
make[1]: Entering directory '/tmp/B.bSxPY4/BUILD/percona-server-5.7.31-34/build'
[  4%] Built target regex
make[1]: Leaving directory '/tmp/B.bSxPY4/BUILD/percona-server-5.7.31-34/build'
make[2]: Entering directory '/tmp/B.bSxPY4/BUILD/percona-server-5.7.31-34/build'
[  3%] Building CXX object libbinlogstandalone/src/CMakeFiles/binlogstandalone_static.dir/__/__/libbinlogevents/src/rows_event.cpp.o
cd /tmp/B.bSxPY4/BUILD/percona-server-5.7.31-34/build/libbinlogstandalone/src && /usr/bin/x86_64-pld-linux-gnux32-g++  -DBOOST_GEOMETRY_SQRT_CHECK_FINITENESS -DHAVE_CONFIG_H -DHAVE_TLSv13 -DLZ4_DISABLE_DEPRECATE_WARNINGS -DSTANDALONE_BINLOG -D_FILE_OFFSET_BITS=64 -D_GNU_SOURCE -D__STDC_WANT_LIB_EXT1__=1 -I/tmp/B.bSxPY4/BUILD/percona-server-5.7.31-34/build/include -I/tmp/B.bSxPY4/BUILD/percona-server-5.7.31-34/extra/rapidjson/include -I/tmp/B.bSxPY4/BUILD/percona-server-5.7.31-34/build/libbinlogevents/include -I/tmp/B.bSxPY4/BUILD/percona-server-5.7.31-34/libbinlogevents/export -I/tmp/B.bSxPY4/BUILD/percona-server-5.7.31-34/include -I/tmp/B.bSxPY4/BUILD/percona-server-5.7.31-34/libbinlogevents/include -I/tmp/B.bSxPY4/BUILD/percona-server-5.7.31-34/build/libbinlogstandalone/../libbinlogevents/include -I/tmp/B.bSxPY4/BUILD/percona-server-5.7.31-34/build/libbinlogstandalone/libbinlogevents/export  -fPIC -Wall -Wextra -Wformat-security -Wvla -Woverloaded-virtual -Wno-unused-parameter -O3 -D_FORTIFY_SOURCE=2 -g -fno-omit-frame-pointer -fno-strict-aliasing -DDBUG_OFF -DNDEBUG   -std=gnu++11 -o CMakeFiles/binlogstandalone_static.dir/__/__/libbinlogevents/src/rows_event.cpp.o -c /tmp/B.bSxPY4/BUILD/percona-server-5.7.31-34/libbinlogevents/src/rows_event.cpp
make[2]: Leaving directory '/tmp/B.bSxPY4/BUILD/percona-server-5.7.31-34/build'
make[2]: Entering directory '/tmp/B.bSxPY4/BUILD/percona-server-5.7.31-34/build'
[  3%] Building C object strings/CMakeFiles/strings.dir/ctype-euc_kr.c.o
cd /tmp/B.bSxPY4/BUILD/percona-server-5.7.31-34/build/strings && /usr/bin/x86_64-pld-linux-gnux32-gcc -DBOOST_GEOMETRY_SQRT_CHECK_FINITENESS -DDISABLE_MYSQL_THREAD_H -DHAVE_CONFIG_H -DHAVE_TLSv13 -DLZ4_DISABLE_DEPRECATE_WARNINGS -D_FILE_OFFSET_BITS=64 -D_GNU_SOURCE -D__STDC_WANT_LIB_EXT1__=1 -I/tmp/B.bSxPY4/BUILD/percona-server-5.7.31-34/build/include -I/tmp/B.bSxPY4/BUILD/percona-server-5.7.31-34/extra/rapidjson/include -I/tmp/B.bSxPY4/BUILD/percona-server-5.7.31-34/build/libbinlogevents/include -I/tmp/B.bSxPY4/BUILD/percona-server-5.7.31-34/libbinlogevents/export -I/tmp/B.bSxPY4/BUILD/percona-server-5.7.31-34/include  -fPIC -Wall -Wextra -Wformat-security -Wvla -Wwrite-strings -Wdeclaration-after-statement -O3 -D_FORTIFY_SOURCE=2 -O2 -fwrapv -pipe -Wformat -Werror=format-security -gdwarf-4 -fno-debug-types-section -fvar-tracking-assignments -g2 -Wp,-D_FORTIFY_SOURCE=2 -fstack-protector-strong --param=ssp-buffer-size=4 -Werror=trampolines -fPIC -mtune=generic -march=x86-64 -gdwarf-4 -fno-debug-types-section -fvar-tracking-assignments -g2  -DNDEBUG -fno-omit-frame-pointer -fno-strict-aliasing  -Wno-shadow -g -fno-omit-frame-pointer -fno-strict-aliasing -DDBUG_OFF -DNDEBUG   -o CMakeFiles/strings.dir/ctype-euc_kr.c.o   -c /tmp/B.bSxPY4/BUILD/percona-server-5.7.31-34/strings/ctype-euc_kr.c
make[2]: Leaving directory '/tmp/B.bSxPY4/BUILD/percona-server-5.7.31-34/build'
make[2]: Entering directory '/tmp/B.bSxPY4/BUILD/percona-server-5.7.31-34/build'
[  3%] Building CXX object sql/CMakeFiles/gen_lex_hash.dir/gen_lex_hash.cc.o
cd /tmp/B.bSxPY4/BUILD/percona-server-5.7.31-34/build/sql && /usr/bin/x86_64-pld-linux-gnux32-g++  -DBOOST_GEOMETRY_SQRT_CHECK_FINITENESS -DHAVE_CONFIG_H -DHAVE_POOL_OF_THREADS -DHAVE_REPLICATION -DHAVE_TLSv13 -DLZ4_DISABLE_DEPRECATE_WARNINGS -DMYSQL_SERVER -D_FILE_OFFSET_BITS=64 -D_GNU_SOURCE -D__STDC_WANT_LIB_EXT1__=1 -I/tmp/B.bSxPY4/BUILD/percona-server-5.7.31-34/build/include -I/tmp/B.bSxPY4/BUILD/percona-server-5.7.31-34/extra/rapidjson/include -I/tmp/B.bSxPY4/BUILD/percona-server-5.7.31-34/build/libbinlogevents/include -I/tmp/B.bSxPY4/BUILD/percona-server-5.7.31-34/libbinlogevents/export -I/tmp/B.bSxPY4/BUILD/percona-server-5.7.31-34/include -I/tmp/B.bSxPY4/BUILD/percona-server-5.7.31-34/sql/conn_handler -I/tmp/B.bSxPY4/BUILD/percona-server-5.7.31-34/libbinlogevents/include -I/tmp/B.bSxPY4/BUILD/percona-server-5.7.31-34/sql -I/tmp/B.bSxPY4/BUILD/percona-server-5.7.31-34/sql/auth -I/tmp/B.bSxPY4/BUILD/percona-server-5.7.31-34/regex -I/tmp/B.bSxPY4/BUILD/percona-server-5.7.31-34/build/sql -isystem /tmp/B.bSxPY4/BUILD/percona-server-5.7.31-34/include/boost_1_59_0/patches -isystem /tmp/B.bSxPY4/BUILD/percona-server-5.7.31-34/boost_1_59_0  -fPIC -Wall -Wextra -Wformat-security -Wvla -Woverloaded-virtual -Wno-unused-parameter -O3 -D_FORTIFY_SOURCE=2 -g -fno-omit-frame-pointer -fno-strict-aliasing -DDBUG_OFF -DNDEBUG -Wno-class-memaccess    -DHAVE_OPENSSL -std=gnu++11 -o CMakeFiles/gen_lex_hash.dir/gen_lex_hash.cc.o -c /tmp/B.bSxPY4/BUILD/percona-server-5.7.31-34/sql/gen_lex_hash.cc
make[2]: Leaving directory '/tmp/B.bSxPY4/BUILD/percona-server-5.7.31-34/build'
make[2]: Entering directory '/tmp/B.bSxPY4/BUILD/percona-server-5.7.31-34/build'
[  5%] Linking CXX executable gen_lex_hash
cd /tmp/B.bSxPY4/BUILD/percona-server-5.7.31-34/build/sql && /usr/bin/cmake -E cmake_link_script CMakeFiles/gen_lex_hash.dir/link.txt --verbose=1
/usr/bin/x86_64-pld-linux-gnux32-g++   -fPIC -Wall -Wextra -Wformat-security -Wvla -Woverloaded-virtual -Wno-unused-parameter -O3 -D_FORTIFY_SOURCE=2 -g -fno-omit-frame-pointer -fno-strict-aliasing -DDBUG_OFF -DNDEBUG -Wno-class-memaccess   CMakeFiles/gen_lex_hash.dir/gen_lex_hash.cc.o  -o gen_lex_hash  -lpthread 
make[2]: Leaving directory '/tmp/B.bSxPY4/BUILD/percona-server-5.7.31-34/build'
make[1]: Entering directory '/tmp/B.bSxPY4/BUILD/percona-server-5.7.31-34/build'
[  5%] Built target gen_lex_hash
make[1]: Leaving directory '/tmp/B.bSxPY4/BUILD/percona-server-5.7.31-34/build'
make[2]: Entering directory '/tmp/B.bSxPY4/BUILD/percona-server-5.7.31-34/build'
[  4%] Building C object strings/CMakeFiles/strings.dir/ctype-extra.c.o
cd /tmp/B.bSxPY4/BUILD/percona-server-5.7.31-34/build/strings && /usr/bin/x86_64-pld-linux-gnux32-gcc -DBOOST_GEOMETRY_SQRT_CHECK_FINITENESS -DDISABLE_MYSQL_THREAD_H -DHAVE_CONFIG_H -DHAVE_TLSv13 -DLZ4_DISABLE_DEPRECATE_WARNINGS -D_FILE_OFFSET_BITS=64 -D_GNU_SOURCE -D__STDC_WANT_LIB_EXT1__=1 -I/tmp/B.bSxPY4/BUILD/percona-server-5.7.31-34/build/include -I/tmp/B.bSxPY4/BUILD/percona-server-5.7.31-34/extra/rapidjson/include -I/tmp/B.bSxPY4/BUILD/percona-server-5.7.31-34/build/libbinlogevents/include -I/tmp/B.bSxPY4/BUILD/percona-server-5.7.31-34/libbinlogevents/export -I/tmp/B.bSxPY4/BUILD/percona-server-5.7.31-34/include  -fPIC -Wall -Wextra -Wformat-security -Wvla -Wwrite-strings -Wdeclaration-after-statement -O3 -D_FORTIFY_SOURCE=2 -O2 -fwrapv -pipe -Wformat -Werror=format-security -gdwarf-4 -fno-debug-types-section -fvar-tracking-assignments -g2 -Wp,-D_FORTIFY_SOURCE=2 -fstack-protector-strong --param=ssp-buffer-size=4 -Werror=trampolines -fPIC -mtune=generic -march=x86-64 -gdwarf-4 -fno-debug-types-section -fvar-tracking-assignments -g2  -DNDEBUG -fno-omit-frame-pointer -fno-strict-aliasing  -Wno-shadow -g -fno-omit-frame-pointer -fno-strict-aliasing -DDBUG_OFF -DNDEBUG   -o CMakeFiles/strings.dir/ctype-extra.c.o   -c /tmp/B.bSxPY4/BUILD/percona-server-5.7.31-34/strings/ctype-extra.c
make[2]: Leaving directory '/tmp/B.bSxPY4/BUILD/percona-server-5.7.31-34/build'
make[2]: Entering directory '/tmp/B.bSxPY4/BUILD/percona-server-5.7.31-34/build'
[  5%] Building C object strings/CMakeFiles/strings.dir/ctype-gb2312.c.o
cd /tmp/B.bSxPY4/BUILD/percona-server-5.7.31-34/build/strings && /usr/bin/x86_64-pld-linux-gnux32-gcc -DBOOST_GEOMETRY_SQRT_CHECK_FINITENESS -DDISABLE_MYSQL_THREAD_H -DHAVE_CONFIG_H -DHAVE_TLSv13 -DLZ4_DISABLE_DEPRECATE_WARNINGS -D_FILE_OFFSET_BITS=64 -D_GNU_SOURCE -D__STDC_WANT_LIB_EXT1__=1 -I/tmp/B.bSxPY4/BUILD/percona-server-5.7.31-34/build/include -I/tmp/B.bSxPY4/BUILD/percona-server-5.7.31-34/extra/rapidjson/include -I/tmp/B.bSxPY4/BUILD/percona-server-5.7.31-34/build/libbinlogevents/include -I/tmp/B.bSxPY4/BUILD/percona-server-5.7.31-34/libbinlogevents/export -I/tmp/B.bSxPY4/BUILD/percona-server-5.7.31-34/include  -fPIC -Wall -Wextra -Wformat-security -Wvla -Wwrite-strings -Wdeclaration-after-statement -O3 -D_FORTIFY_SOURCE=2 -O2 -fwrapv -pipe -Wformat -Werror=format-security -gdwarf-4 -fno-debug-types-section -fvar-tracking-assignments -g2 -Wp,-D_FORTIFY_SOURCE=2 -fstack-protector-strong --param=ssp-buffer-size=4 -Werror=trampolines -fPIC -mtune=generic -march=x86-64 -gdwarf-4 -fno-debug-types-section -fvar-tracking-assignments -g2  -DNDEBUG -fno-omit-frame-pointer -fno-strict-aliasing  -Wno-shadow -g -fno-omit-frame-pointer -fno-strict-aliasing -DDBUG_OFF -DNDEBUG   -o CMakeFiles/strings.dir/ctype-gb2312.c.o   -c /tmp/B.bSxPY4/BUILD/percona-server-5.7.31-34/strings/ctype-gb2312.c
make[2]: Leaving directory '/tmp/B.bSxPY4/BUILD/percona-server-5.7.31-34/build'
make[2]: Entering directory '/tmp/B.bSxPY4/BUILD/percona-server-5.7.31-34/build'
[  4%] Building CXX object libbinlogstandalone/src/CMakeFiles/binlogstandalone_static.dir/__/__/libbinlogevents/src/uuid.cpp.o
cd /tmp/B.bSxPY4/BUILD/percona-server-5.7.31-34/build/libbinlogstandalone/src && /usr/bin/x86_64-pld-linux-gnux32-g++  -DBOOST_GEOMETRY_SQRT_CHECK_FINITENESS -DHAVE_CONFIG_H -DHAVE_TLSv13 -DLZ4_DISABLE_DEPRECATE_WARNINGS -DSTANDALONE_BINLOG -D_FILE_OFFSET_BITS=64 -D_GNU_SOURCE -D__STDC_WANT_LIB_EXT1__=1 -I/tmp/B.bSxPY4/BUILD/percona-server-5.7.31-34/build/include -I/tmp/B.bSxPY4/BUILD/percona-server-5.7.31-34/extra/rapidjson/include -I/tmp/B.bSxPY4/BUILD/percona-server-5.7.31-34/build/libbinlogevents/include -I/tmp/B.bSxPY4/BUILD/percona-server-5.7.31-34/libbinlogevents/export -I/tmp/B.bSxPY4/BUILD/percona-server-5.7.31-34/include -I/tmp/B.bSxPY4/BUILD/percona-server-5.7.31-34/libbinlogevents/include -I/tmp/B.bSxPY4/BUILD/percona-server-5.7.31-34/build/libbinlogstandalone/../libbinlogevents/include -I/tmp/B.bSxPY4/BUILD/percona-server-5.7.31-34/build/libbinlogstandalone/libbinlogevents/export  -fPIC -Wall -Wextra -Wformat-security -Wvla -Woverloaded-virtual -Wno-unused-parameter -O3 -D_FORTIFY_SOURCE=2 -g -fno-omit-frame-pointer -fno-strict-aliasing -DDBUG_OFF -DNDEBUG   -std=gnu++11 -o CMakeFiles/binlogstandalone_static.dir/__/__/libbinlogevents/src/uuid.cpp.o -c /tmp/B.bSxPY4/BUILD/percona-server-5.7.31-34/libbinlogevents/src/uuid.cpp
make[2]: Leaving directory '/tmp/B.bSxPY4/BUILD/percona-server-5.7.31-34/build'
make[2]: Entering directory '/tmp/B.bSxPY4/BUILD/percona-server-5.7.31-34/build'
[  4%] Building CXX object client/dump/CMakeFiles/boost_lib.dir/__/__/include/boost_1_59_0/libs/system/src/error_code.cpp.o
cd /tmp/B.bSxPY4/BUILD/percona-server-5.7.31-34/build/client/dump && /usr/bin/x86_64-pld-linux-gnux32-g++  -DBOOST_ALL_NO_LIB -DBOOST_GEOMETRY_SQRT_CHECK_FINITENESS -DBOOST_SYSTEM_NO_DEPRECATED -DHAVE_CONFIG_H -DHAVE_TLSv13 -DLZ4_DISABLE_DEPRECATE_WARNINGS -D_FILE_OFFSET_BITS=64 -D_GNU_SOURCE -D__STDC_WANT_LIB_EXT1__=1 -I/tmp/B.bSxPY4/BUILD/percona-server-5.7.31-34/build/include -I/tmp/B.bSxPY4/BUILD/percona-server-5.7.31-34/extra/rapidjson/include -I/tmp/B.bSxPY4/BUILD/percona-server-5.7.31-34/build/libbinlogevents/include -I/tmp/B.bSxPY4/BUILD/percona-server-5.7.31-34/libbinlogevents/export -I/tmp/B.bSxPY4/BUILD/percona-server-5.7.31-34/client -I/tmp/B.bSxPY4/BUILD/percona-server-5.7.31-34/include -I/tmp/B.bSxPY4/BUILD/percona-server-5.7.31-34/mysys_ssl -I/tmp/B.bSxPY4/BUILD/percona-server-5.7.31-34/libmysql -I/tmp/B.bSxPY4/BUILD/percona-server-5.7.31-34/libbinlogevents/include -I/tmp/B.bSxPY4/BUILD/percona-server-5.7.31-34/regex -I/tmp/B.bSxPY4/BUILD/percona-server-5.7.31-34/strings -I/usr/include/readline -I/tmp/B.bSxPY4/BUILD/percona-server-5.7.31-34/build/client -I/tmp/B.bSxPY4/BUILD/percona-server-5.7.31-34/dump -isystem /tmp/B.bSxPY4/BUILD/percona-server-5.7.31-34/include/boost_1_59_0/patches -isystem /tmp/B.bSxPY4/BUILD/percona-server-5.7.31-34/boost_1_59_0  -fPIC -Wall -Wextra -Wformat-security -Wvla -Woverloaded-virtual -Wno-unused-parameter -O3 -D_FORTIFY_SOURCE=2 -g -fno-omit-frame-pointer -fno-strict-aliasing -DDBUG_OFF -DNDEBUG -Wno-class-memaccess   -std=gnu++11 -o CMakeFiles/boost_lib.dir/__/__/include/boost_1_59_0/libs/system/src/error_code.cpp.o -c /tmp/B.bSxPY4/BUILD/percona-server-5.7.31-34/include/boost_1_59_0/libs/system/src/error_code.cpp
make[2]: Leaving directory '/tmp/B.bSxPY4/BUILD/percona-server-5.7.31-34/build'
make[2]: Entering directory '/tmp/B.bSxPY4/BUILD/percona-server-5.7.31-34/build'
[  4%] Building C object strings/CMakeFiles/strings.dir/ctype-eucjpms.c.o
cd /tmp/B.bSxPY4/BUILD/percona-server-5.7.31-34/build/strings && /usr/bin/x86_64-pld-linux-gnux32-gcc -DBOOST_GEOMETRY_SQRT_CHECK_FINITENESS -DDISABLE_MYSQL_THREAD_H -DHAVE_CONFIG_H -DHAVE_TLSv13 -DLZ4_DISABLE_DEPRECATE_WARNINGS -D_FILE_OFFSET_BITS=64 -D_GNU_SOURCE -D__STDC_WANT_LIB_EXT1__=1 -I/tmp/B.bSxPY4/BUILD/percona-server-5.7.31-34/build/include -I/tmp/B.bSxPY4/BUILD/percona-server-5.7.31-34/extra/rapidjson/include -I/tmp/B.bSxPY4/BUILD/percona-server-5.7.31-34/build/libbinlogevents/include -I/tmp/B.bSxPY4/BUILD/percona-server-5.7.31-34/libbinlogevents/export -I/tmp/B.bSxPY4/BUILD/percona-server-5.7.31-34/include  -fPIC -Wall -Wextra -Wformat-security -Wvla -Wwrite-strings -Wdeclaration-after-statement -O3 -D_FORTIFY_SOURCE=2 -O2 -fwrapv -pipe -Wformat -Werror=format-security -gdwarf-4 -fno-debug-types-section -fvar-tracking-assignments -g2 -Wp,-D_FORTIFY_SOURCE=2 -fstack-protector-strong --param=ssp-buffer-size=4 -Werror=trampolines -fPIC -mtune=generic -march=x86-64 -gdwarf-4 -fno-debug-types-section -fvar-tracking-assignments -g2  -DNDEBUG -fno-omit-frame-pointer -fno-strict-aliasing  -Wno-shadow -g -fno-omit-frame-pointer -fno-strict-aliasing -DDBUG_OFF -DNDEBUG   -o CMakeFiles/strings.dir/ctype-eucjpms.c.o   -c /tmp/B.bSxPY4/BUILD/percona-server-5.7.31-34/strings/ctype-eucjpms.c
make[2]: Leaving directory '/tmp/B.bSxPY4/BUILD/percona-server-5.7.31-34/build'
make[2]: Entering directory '/tmp/B.bSxPY4/BUILD/percona-server-5.7.31-34/build'
[  5%] Linking CXX static library ../../archive_output_directory/libboost_lib.a
cd /tmp/B.bSxPY4/BUILD/percona-server-5.7.31-34/build/client/dump && /usr/bin/cmake -P CMakeFiles/boost_lib.dir/cmake_clean_target.cmake
cd /tmp/B.bSxPY4/BUILD/percona-server-5.7.31-34/build/client/dump && /usr/bin/cmake -E cmake_link_script CMakeFiles/boost_lib.dir/link.txt --verbose=1
/usr/bin/ar qc ../../archive_output_directory/libboost_lib.a  CMakeFiles/boost_lib.dir/__/__/include/boost_1_59_0/libs/chrono/src/chrono.cpp.o CMakeFiles/boost_lib.dir/__/__/include/boost_1_59_0/libs/system/src/error_code.cpp.o
/usr/bin/ranlib ../../archive_output_directory/libboost_lib.a
cd /tmp/B.bSxPY4/BUILD/percona-server-5.7.31-34/build/client/dump && /usr/bin/cmake -DTARGET_NAME=boost_lib -DTARGET_LOC=/tmp/B.bSxPY4/BUILD/percona-server-5.7.31-34/build/archive_output_directory/libboost_lib.a -DCFG_INTDIR=. -P /tmp/B.bSxPY4/BUILD/percona-server-5.7.31-34/build/archive_output_directory/lib_location_boost_lib.cmake
make[2]: Leaving directory '/tmp/B.bSxPY4/BUILD/percona-server-5.7.31-34/build'
make[1]: Entering directory '/tmp/B.bSxPY4/BUILD/percona-server-5.7.31-34/build'
[  5%] Built target boost_lib
make[1]: Leaving directory '/tmp/B.bSxPY4/BUILD/percona-server-5.7.31-34/build'
make[2]: Entering directory '/tmp/B.bSxPY4/BUILD/percona-server-5.7.31-34/build'
[  5%] Building C object strings/CMakeFiles/strings.dir/ctype-latin1.c.o
cd /tmp/B.bSxPY4/BUILD/percona-server-5.7.31-34/build/strings && /usr/bin/x86_64-pld-linux-gnux32-gcc -DBOOST_GEOMETRY_SQRT_CHECK_FINITENESS -DDISABLE_MYSQL_THREAD_H -DHAVE_CONFIG_H -DHAVE_TLSv13 -DLZ4_DISABLE_DEPRECATE_WARNINGS -D_FILE_OFFSET_BITS=64 -D_GNU_SOURCE -D__STDC_WANT_LIB_EXT1__=1 -I/tmp/B.bSxPY4/BUILD/percona-server-5.7.31-34/build/include -I/tmp/B.bSxPY4/BUILD/percona-server-5.7.31-34/extra/rapidjson/include -I/tmp/B.bSxPY4/BUILD/percona-server-5.7.31-34/build/libbinlogevents/include -I/tmp/B.bSxPY4/BUILD/percona-server-5.7.31-34/libbinlogevents/export -I/tmp/B.bSxPY4/BUILD/percona-server-5.7.31-34/include  -fPIC -Wall -Wextra -Wformat-security -Wvla -Wwrite-strings -Wdeclaration-after-statement -O3 -D_FORTIFY_SOURCE=2 -O2 -fwrapv -pipe -Wformat -Werror=format-security -gdwarf-4 -fno-debug-types-section -fvar-tracking-assignments -g2 -Wp,-D_FORTIFY_SOURCE=2 -fstack-protector-strong --param=ssp-buffer-size=4 -Werror=trampolines -fPIC -mtune=generic -march=x86-64 -gdwarf-4 -fno-debug-types-section -fvar-tracking-assignments -g2  -DNDEBUG -fno-omit-frame-pointer -fno-strict-aliasing  -Wno-shadow -g -fno-omit-frame-pointer -fno-strict-aliasing -DDBUG_OFF -DNDEBUG   -o CMakeFiles/strings.dir/ctype-latin1.c.o   -c /tmp/B.bSxPY4/BUILD/percona-server-5.7.31-34/strings/ctype-latin1.c
make[2]: Leaving directory '/tmp/B.bSxPY4/BUILD/percona-server-5.7.31-34/build'
make[2]: Entering directory '/tmp/B.bSxPY4/BUILD/percona-server-5.7.31-34/build'
[  3%] Building CXX object libbinlogstandalone/src/CMakeFiles/binlogstandalone_static.dir/__/__/libbinlogevents/src/statement_events.cpp.o
cd /tmp/B.bSxPY4/BUILD/percona-server-5.7.31-34/build/libbinlogstandalone/src && /usr/bin/x86_64-pld-linux-gnux32-g++  -DBOOST_GEOMETRY_SQRT_CHECK_FINITENESS -DHAVE_CONFIG_H -DHAVE_TLSv13 -DLZ4_DISABLE_DEPRECATE_WARNINGS -DSTANDALONE_BINLOG -D_FILE_OFFSET_BITS=64 -D_GNU_SOURCE -D__STDC_WANT_LIB_EXT1__=1 -I/tmp/B.bSxPY4/BUILD/percona-server-5.7.31-34/build/include -I/tmp/B.bSxPY4/BUILD/percona-server-5.7.31-34/extra/rapidjson/include -I/tmp/B.bSxPY4/BUILD/percona-server-5.7.31-34/build/libbinlogevents/include -I/tmp/B.bSxPY4/BUILD/percona-server-5.7.31-34/libbinlogevents/export -I/tmp/B.bSxPY4/BUILD/percona-server-5.7.31-34/include -I/tmp/B.bSxPY4/BUILD/percona-server-5.7.31-34/libbinlogevents/include -I/tmp/B.bSxPY4/BUILD/percona-server-5.7.31-34/build/libbinlogstandalone/../libbinlogevents/include -I/tmp/B.bSxPY4/BUILD/percona-server-5.7.31-34/build/libbinlogstandalone/libbinlogevents/export  -fPIC -Wall -Wextra -Wformat-security -Wvla -Woverloaded-virtual -Wno-unused-parameter -O3 -D_FORTIFY_SOURCE=2 -g -fno-omit-frame-pointer -fno-strict-aliasing -DDBUG_OFF -DNDEBUG   -std=gnu++11 -o CMakeFiles/binlogstandalone_static.dir/__/__/libbinlogevents/src/statement_events.cpp.o -c /tmp/B.bSxPY4/BUILD/percona-server-5.7.31-34/libbinlogevents/src/statement_events.cpp
make[2]: Leaving directory '/tmp/B.bSxPY4/BUILD/percona-server-5.7.31-34/build'
make[2]: Entering directory '/tmp/B.bSxPY4/BUILD/percona-server-5.7.31-34/build'
[  4%] Building CXX object libbinlogstandalone/src/CMakeFiles/binlogstandalone_shared.dir/__/__/libbinlogevents/src/statement_events.cpp.o
cd /tmp/B.bSxPY4/BUILD/percona-server-5.7.31-34/build/libbinlogstandalone/src && /usr/bin/x86_64-pld-linux-gnux32-g++  -DBOOST_GEOMETRY_SQRT_CHECK_FINITENESS -DHAVE_CONFIG_H -DHAVE_TLSv13 -DLZ4_DISABLE_DEPRECATE_WARNINGS -DSTANDALONE_BINLOG -D_FILE_OFFSET_BITS=64 -D_GNU_SOURCE -D__STDC_WANT_LIB_EXT1__=1 -Dbinlogstandalone_shared_EXPORTS -I/tmp/B.bSxPY4/BUILD/percona-server-5.7.31-34/build/include -I/tmp/B.bSxPY4/BUILD/percona-server-5.7.31-34/extra/rapidjson/include -I/tmp/B.bSxPY4/BUILD/percona-server-5.7.31-34/build/libbinlogevents/include -I/tmp/B.bSxPY4/BUILD/percona-server-5.7.31-34/libbinlogevents/export -I/tmp/B.bSxPY4/BUILD/percona-server-5.7.31-34/include -I/tmp/B.bSxPY4/BUILD/percona-server-5.7.31-34/libbinlogevents/include -I/tmp/B.bSxPY4/BUILD/percona-server-5.7.31-34/build/libbinlogstandalone/../libbinlogevents/include -I/tmp/B.bSxPY4/BUILD/percona-server-5.7.31-34/build/libbinlogstandalone/libbinlogevents/export  -fPIC -Wall -Wextra -Wformat-security -Wvla -Woverloaded-virtual -Wno-unused-parameter -O3 -D_FORTIFY_SOURCE=2 -g -fno-omit-frame-pointer -fno-strict-aliasing -DDBUG_OFF -DNDEBUG -fPIC   -std=gnu++11 -o CMakeFiles/binlogstandalone_shared.dir/__/__/libbinlogevents/src/statement_events.cpp.o -c /tmp/B.bSxPY4/BUILD/percona-server-5.7.31-34/libbinlogevents/src/statement_events.cpp
make[2]: Leaving directory '/tmp/B.bSxPY4/BUILD/percona-server-5.7.31-34/build'
make[2]: Entering directory '/tmp/B.bSxPY4/BUILD/percona-server-5.7.31-34/build'
[  5%] Building C object strings/CMakeFiles/strings.dir/ctype-gbk.c.o
cd /tmp/B.bSxPY4/BUILD/percona-server-5.7.31-34/build/strings && /usr/bin/x86_64-pld-linux-gnux32-gcc -DBOOST_GEOMETRY_SQRT_CHECK_FINITENESS -DDISABLE_MYSQL_THREAD_H -DHAVE_CONFIG_H -DHAVE_TLSv13 -DLZ4_DISABLE_DEPRECATE_WARNINGS -D_FILE_OFFSET_BITS=64 -D_GNU_SOURCE -D__STDC_WANT_LIB_EXT1__=1 -I/tmp/B.bSxPY4/BUILD/percona-server-5.7.31-34/build/include -I/tmp/B.bSxPY4/BUILD/percona-server-5.7.31-34/extra/rapidjson/include -I/tmp/B.bSxPY4/BUILD/percona-server-5.7.31-34/build/libbinlogevents/include -I/tmp/B.bSxPY4/BUILD/percona-server-5.7.31-34/libbinlogevents/export -I/tmp/B.bSxPY4/BUILD/percona-server-5.7.31-34/include  -fPIC -Wall -Wextra -Wformat-security -Wvla -Wwrite-strings -Wdeclaration-after-statement -O3 -D_FORTIFY_SOURCE=2 -O2 -fwrapv -pipe -Wformat -Werror=format-security -gdwarf-4 -fno-debug-types-section -fvar-tracking-assignments -g2 -Wp,-D_FORTIFY_SOURCE=2 -fstack-protector-strong --param=ssp-buffer-size=4 -Werror=trampolines -fPIC -mtune=generic -march=x86-64 -gdwarf-4 -fno-debug-types-section -fvar-tracking-assignments -g2  -DNDEBUG -fno-omit-frame-pointer -fno-strict-aliasing  -Wno-shadow -g -fno-omit-frame-pointer -fno-strict-aliasing -DDBUG_OFF -DNDEBUG   -o CMakeFiles/strings.dir/ctype-gbk.c.o   -c /tmp/B.bSxPY4/BUILD/percona-server-5.7.31-34/strings/ctype-gbk.c
make[2]: Leaving directory '/tmp/B.bSxPY4/BUILD/percona-server-5.7.31-34/build'
make[2]: Entering directory '/tmp/B.bSxPY4/BUILD/percona-server-5.7.31-34/build'
[  6%] Building C object strings/CMakeFiles/strings.dir/ctype-tis620.c.o
cd /tmp/B.bSxPY4/BUILD/percona-server-5.7.31-34/build/strings && /usr/bin/x86_64-pld-linux-gnux32-gcc -DBOOST_GEOMETRY_SQRT_CHECK_FINITENESS -DDISABLE_MYSQL_THREAD_H -DHAVE_CONFIG_H -DHAVE_TLSv13 -DLZ4_DISABLE_DEPRECATE_WARNINGS -D_FILE_OFFSET_BITS=64 -D_GNU_SOURCE -D__STDC_WANT_LIB_EXT1__=1 -I/tmp/B.bSxPY4/BUILD/percona-server-5.7.31-34/build/include -I/tmp/B.bSxPY4/BUILD/percona-server-5.7.31-34/extra/rapidjson/include -I/tmp/B.bSxPY4/BUILD/percona-server-5.7.31-34/build/libbinlogevents/include -I/tmp/B.bSxPY4/BUILD/percona-server-5.7.31-34/libbinlogevents/export -I/tmp/B.bSxPY4/BUILD/percona-server-5.7.31-34/include  -fPIC -Wall -Wextra -Wformat-security -Wvla -Wwrite-strings -Wdeclaration-after-statement -O3 -D_FORTIFY_SOURCE=2 -O2 -fwrapv -pipe -Wformat -Werror=format-security -gdwarf-4 -fno-debug-types-section -fvar-tracking-assignments -g2 -Wp,-D_FORTIFY_SOURCE=2 -fstack-protector-strong --param=ssp-buffer-size=4 -Werror=trampolines -fPIC -mtune=generic -march=x86-64 -gdwarf-4 -fno-debug-types-section -fvar-tracking-assignments -g2  -DNDEBUG -fno-omit-frame-pointer -fno-strict-aliasing  -Wno-shadow -g -fno-omit-frame-pointer -fno-strict-aliasing -DDBUG_OFF -DNDEBUG   -o CMakeFiles/strings.dir/ctype-tis620.c.o   -c /tmp/B.bSxPY4/BUILD/percona-server-5.7.31-34/strings/ctype-tis620.c
make[2]: Leaving directory '/tmp/B.bSxPY4/BUILD/percona-server-5.7.31-34/build'
make[2]: Entering directory '/tmp/B.bSxPY4/BUILD/percona-server-5.7.31-34/build'
[  6%] Building C object strings/CMakeFiles/strings.dir/ctype-mb.c.o
cd /tmp/B.bSxPY4/BUILD/percona-server-5.7.31-34/build/strings && /usr/bin/x86_64-pld-linux-gnux32-gcc -DBOOST_GEOMETRY_SQRT_CHECK_FINITENESS -DDISABLE_MYSQL_THREAD_H -DHAVE_CONFIG_H -DHAVE_TLSv13 -DLZ4_DISABLE_DEPRECATE_WARNINGS -D_FILE_OFFSET_BITS=64 -D_GNU_SOURCE -D__STDC_WANT_LIB_EXT1__=1 -I/tmp/B.bSxPY4/BUILD/percona-server-5.7.31-34/build/include -I/tmp/B.bSxPY4/BUILD/percona-server-5.7.31-34/extra/rapidjson/include -I/tmp/B.bSxPY4/BUILD/percona-server-5.7.31-34/build/libbinlogevents/include -I/tmp/B.bSxPY4/BUILD/percona-server-5.7.31-34/libbinlogevents/export -I/tmp/B.bSxPY4/BUILD/percona-server-5.7.31-34/include  -fPIC -Wall -Wextra -Wformat-security -Wvla -Wwrite-strings -Wdeclaration-after-statement -O3 -D_FORTIFY_SOURCE=2 -O2 -fwrapv -pipe -Wformat -Werror=format-security -gdwarf-4 -fno-debug-types-section -fvar-tracking-assignments -g2 -Wp,-D_FORTIFY_SOURCE=2 -fstack-protector-strong --param=ssp-buffer-size=4 -Werror=trampolines -fPIC -mtune=generic -march=x86-64 -gdwarf-4 -fno-debug-types-section -fvar-tracking-assignments -g2  -DNDEBUG -fno-omit-frame-pointer -fno-strict-aliasing  -Wno-shadow -g -fno-omit-frame-pointer -fno-strict-aliasing -DDBUG_OFF -DNDEBUG   -o CMakeFiles/strings.dir/ctype-mb.c.o   -c /tmp/B.bSxPY4/BUILD/percona-server-5.7.31-34/strings/ctype-mb.c
make[2]: Leaving directory '/tmp/B.bSxPY4/BUILD/percona-server-5.7.31-34/build'
make[2]: Entering directory '/tmp/B.bSxPY4/BUILD/percona-server-5.7.31-34/build'
[  6%] Building C object strings/CMakeFiles/strings.dir/ctype-simple.c.o
cd /tmp/B.bSxPY4/BUILD/percona-server-5.7.31-34/build/strings && /usr/bin/x86_64-pld-linux-gnux32-gcc -DBOOST_GEOMETRY_SQRT_CHECK_FINITENESS -DDISABLE_MYSQL_THREAD_H -DHAVE_CONFIG_H -DHAVE_TLSv13 -DLZ4_DISABLE_DEPRECATE_WARNINGS -D_FILE_OFFSET_BITS=64 -D_GNU_SOURCE -D__STDC_WANT_LIB_EXT1__=1 -I/tmp/B.bSxPY4/BUILD/percona-server-5.7.31-34/build/include -I/tmp/B.bSxPY4/BUILD/percona-server-5.7.31-34/extra/rapidjson/include -I/tmp/B.bSxPY4/BUILD/percona-server-5.7.31-34/build/libbinlogevents/include -I/tmp/B.bSxPY4/BUILD/percona-server-5.7.31-34/libbinlogevents/export -I/tmp/B.bSxPY4/BUILD/percona-server-5.7.31-34/include  -fPIC -Wall -Wextra -Wformat-security -Wvla -Wwrite-strings -Wdeclaration-after-statement -O3 -D_FORTIFY_SOURCE=2 -O2 -fwrapv -pipe -Wformat -Werror=format-security -gdwarf-4 -fno-debug-types-section -fvar-tracking-assignments -g2 -Wp,-D_FORTIFY_SOURCE=2 -fstack-protector-strong --param=ssp-buffer-size=4 -Werror=trampolines -fPIC -mtune=generic -march=x86-64 -gdwarf-4 -fno-debug-types-section -fvar-tracking-assignments -g2  -DNDEBUG -fno-omit-frame-pointer -fno-strict-aliasing  -Wno-shadow -g -fno-omit-frame-pointer -fno-strict-aliasing -DDBUG_OFF -DNDEBUG   -o CMakeFiles/strings.dir/ctype-simple.c.o   -c /tmp/B.bSxPY4/BUILD/percona-server-5.7.31-34/strings/ctype-simple.c
make[2]: Leaving directory '/tmp/B.bSxPY4/BUILD/percona-server-5.7.31-34/build'
make[2]: Entering directory '/tmp/B.bSxPY4/BUILD/percona-server-5.7.31-34/build'
[  6%] Building C object strings/CMakeFiles/strings.dir/ctype-sjis.c.o
cd /tmp/B.bSxPY4/BUILD/percona-server-5.7.31-34/build/strings && /usr/bin/x86_64-pld-linux-gnux32-gcc -DBOOST_GEOMETRY_SQRT_CHECK_FINITENESS -DDISABLE_MYSQL_THREAD_H -DHAVE_CONFIG_H -DHAVE_TLSv13 -DLZ4_DISABLE_DEPRECATE_WARNINGS -D_FILE_OFFSET_BITS=64 -D_GNU_SOURCE -D__STDC_WANT_LIB_EXT1__=1 -I/tmp/B.bSxPY4/BUILD/percona-server-5.7.31-34/build/include -I/tmp/B.bSxPY4/BUILD/percona-server-5.7.31-34/extra/rapidjson/include -I/tmp/B.bSxPY4/BUILD/percona-server-5.7.31-34/build/libbinlogevents/include -I/tmp/B.bSxPY4/BUILD/percona-server-5.7.31-34/libbinlogevents/export -I/tmp/B.bSxPY4/BUILD/percona-server-5.7.31-34/include  -fPIC -Wall -Wextra -Wformat-security -Wvla -Wwrite-strings -Wdeclaration-after-statement -O3 -D_FORTIFY_SOURCE=2 -O2 -fwrapv -pipe -Wformat -Werror=format-security -gdwarf-4 -fno-debug-types-section -fvar-tracking-assignments -g2 -Wp,-D_FORTIFY_SOURCE=2 -fstack-protector-strong --param=ssp-buffer-size=4 -Werror=trampolines -fPIC -mtune=generic -march=x86-64 -gdwarf-4 -fno-debug-types-section -fvar-tracking-assignments -g2  -DNDEBUG -fno-omit-frame-pointer -fno-strict-aliasing  -Wno-shadow -g -fno-omit-frame-pointer -fno-strict-aliasing -DDBUG_OFF -DNDEBUG   -o CMakeFiles/strings.dir/ctype-sjis.c.o   -c /tmp/B.bSxPY4/BUILD/percona-server-5.7.31-34/strings/ctype-sjis.c
make[2]: Leaving directory '/tmp/B.bSxPY4/BUILD/percona-server-5.7.31-34/build'
make[2]: Entering directory '/tmp/B.bSxPY4/BUILD/percona-server-5.7.31-34/build'
[  6%] Building CXX object libbinlogstandalone/src/CMakeFiles/binlogstandalone_shared.dir/__/__/libbinlogevents/src/uuid.cpp.o
cd /tmp/B.bSxPY4/BUILD/percona-server-5.7.31-34/build/libbinlogstandalone/src && /usr/bin/x86_64-pld-linux-gnux32-g++  -DBOOST_GEOMETRY_SQRT_CHECK_FINITENESS -DHAVE_CONFIG_H -DHAVE_TLSv13 -DLZ4_DISABLE_DEPRECATE_WARNINGS -DSTANDALONE_BINLOG -D_FILE_OFFSET_BITS=64 -D_GNU_SOURCE -D__STDC_WANT_LIB_EXT1__=1 -Dbinlogstandalone_shared_EXPORTS -I/tmp/B.bSxPY4/BUILD/percona-server-5.7.31-34/build/include -I/tmp/B.bSxPY4/BUILD/percona-server-5.7.31-34/extra/rapidjson/include -I/tmp/B.bSxPY4/BUILD/percona-server-5.7.31-34/build/libbinlogevents/include -I/tmp/B.bSxPY4/BUILD/percona-server-5.7.31-34/libbinlogevents/export -I/tmp/B.bSxPY4/BUILD/percona-server-5.7.31-34/include -I/tmp/B.bSxPY4/BUILD/percona-server-5.7.31-34/libbinlogevents/include -I/tmp/B.bSxPY4/BUILD/percona-server-5.7.31-34/build/libbinlogstandalone/../libbinlogevents/include -I/tmp/B.bSxPY4/BUILD/percona-server-5.7.31-34/build/libbinlogstandalone/libbinlogevents/export  -fPIC -Wall -Wextra -Wformat-security -Wvla -Woverloaded-virtual -Wno-unused-parameter -O3 -D_FORTIFY_SOURCE=2 -g -fno-omit-frame-pointer -fno-strict-aliasing -DDBUG_OFF -DNDEBUG -fPIC   -std=gnu++11 -o CMakeFiles/binlogstandalone_shared.dir/__/__/libbinlogevents/src/uuid.cpp.o -c /tmp/B.bSxPY4/BUILD/percona-server-5.7.31-34/libbinlogevents/src/uuid.cpp
make[2]: Leaving directory '/tmp/B.bSxPY4/BUILD/percona-server-5.7.31-34/build'
make[2]: Entering directory '/tmp/B.bSxPY4/BUILD/percona-server-5.7.31-34/build'
[  3%] Building CXX object libbinlogstandalone/src/CMakeFiles/binlogstandalone_static.dir/__/__/libbinlogevents/src/control_events.cpp.o
cd /tmp/B.bSxPY4/BUILD/percona-server-5.7.31-34/build/libbinlogstandalone/src && /usr/bin/x86_64-pld-linux-gnux32-g++  -DBOOST_GEOMETRY_SQRT_CHECK_FINITENESS -DHAVE_CONFIG_H -DHAVE_TLSv13 -DLZ4_DISABLE_DEPRECATE_WARNINGS -DSTANDALONE_BINLOG -D_FILE_OFFSET_BITS=64 -D_GNU_SOURCE -D__STDC_WANT_LIB_EXT1__=1 -I/tmp/B.bSxPY4/BUILD/percona-server-5.7.31-34/build/include -I/tmp/B.bSxPY4/BUILD/percona-server-5.7.31-34/extra/rapidjson/include -I/tmp/B.bSxPY4/BUILD/percona-server-5.7.31-34/build/libbinlogevents/include -I/tmp/B.bSxPY4/BUILD/percona-server-5.7.31-34/libbinlogevents/export -I/tmp/B.bSxPY4/BUILD/percona-server-5.7.31-34/include -I/tmp/B.bSxPY4/BUILD/percona-server-5.7.31-34/libbinlogevents/include -I/tmp/B.bSxPY4/BUILD/percona-server-5.7.31-34/build/libbinlogstandalone/../libbinlogevents/include -I/tmp/B.bSxPY4/BUILD/percona-server-5.7.31-34/build/libbinlogstandalone/libbinlogevents/export  -fPIC -Wall -Wextra -Wformat-security -Wvla -Woverloaded-virtual -Wno-unused-parameter -O3 -D_FORTIFY_SOURCE=2 -g -fno-omit-frame-pointer -fno-strict-aliasing -DDBUG_OFF -DNDEBUG   -std=gnu++11 -o CMakeFiles/binlogstandalone_static.dir/__/__/libbinlogevents/src/control_events.cpp.o -c /tmp/B.bSxPY4/BUILD/percona-server-5.7.31-34/libbinlogevents/src/control_events.cpp
make[2]: Leaving directory '/tmp/B.bSxPY4/BUILD/percona-server-5.7.31-34/build'
make[2]: Entering directory '/tmp/B.bSxPY4/BUILD/percona-server-5.7.31-34/build'
[  4%] Building CXX object libbinlogstandalone/src/CMakeFiles/binlogstandalone_shared.dir/__/__/libbinlogevents/src/control_events.cpp.o
cd /tmp/B.bSxPY4/BUILD/percona-server-5.7.31-34/build/libbinlogstandalone/src && /usr/bin/x86_64-pld-linux-gnux32-g++  -DBOOST_GEOMETRY_SQRT_CHECK_FINITENESS -DHAVE_CONFIG_H -DHAVE_TLSv13 -DLZ4_DISABLE_DEPRECATE_WARNINGS -DSTANDALONE_BINLOG -D_FILE_OFFSET_BITS=64 -D_GNU_SOURCE -D__STDC_WANT_LIB_EXT1__=1 -Dbinlogstandalone_shared_EXPORTS -I/tmp/B.bSxPY4/BUILD/percona-server-5.7.31-34/build/include -I/tmp/B.bSxPY4/BUILD/percona-server-5.7.31-34/extra/rapidjson/include -I/tmp/B.bSxPY4/BUILD/percona-server-5.7.31-34/build/libbinlogevents/include -I/tmp/B.bSxPY4/BUILD/percona-server-5.7.31-34/libbinlogevents/export -I/tmp/B.bSxPY4/BUILD/percona-server-5.7.31-34/include -I/tmp/B.bSxPY4/BUILD/percona-server-5.7.31-34/libbinlogevents/include -I/tmp/B.bSxPY4/BUILD/percona-server-5.7.31-34/build/libbinlogstandalone/../libbinlogevents/include -I/tmp/B.bSxPY4/BUILD/percona-server-5.7.31-34/build/libbinlogstandalone/libbinlogevents/export  -fPIC -Wall -Wextra -Wformat-security -Wvla -Woverloaded-virtual -Wno-unused-parameter -O3 -D_FORTIFY_SOURCE=2 -g -fno-omit-frame-pointer -fno-strict-aliasing -DDBUG_OFF -DNDEBUG -fPIC   -std=gnu++11 -o CMakeFiles/binlogstandalone_shared.dir/__/__/libbinlogevents/src/control_events.cpp.o -c /tmp/B.bSxPY4/BUILD/percona-server-5.7.31-34/libbinlogevents/src/control_events.cpp
make[2]: Leaving directory '/tmp/B.bSxPY4/BUILD/percona-server-5.7.31-34/build'
make[2]: Entering directory '/tmp/B.bSxPY4/BUILD/percona-server-5.7.31-34/build'
[  6%] Linking CXX static library ../lib/libbinlogstandalone.a
cd /tmp/B.bSxPY4/BUILD/percona-server-5.7.31-34/build/libbinlogstandalone/src && /usr/bin/cmake -P CMakeFiles/binlogstandalone_static.dir/cmake_clean_target.cmake
cd /tmp/B.bSxPY4/BUILD/percona-server-5.7.31-34/build/libbinlogstandalone/src && /usr/bin/cmake -E cmake_link_script CMakeFiles/binlogstandalone_static.dir/link.txt --verbose=1
/usr/bin/ar qc ../lib/libbinlogstandalone.a  CMakeFiles/binlogstandalone_static.dir/__/__/libbinlogevents/src/load_data_events.cpp.o CMakeFiles/binlogstandalone_static.dir/__/__/libbinlogevents/src/rows_event.cpp.o CMakeFiles/binlogstandalone_static.dir/__/__/libbinlogevents/src/binlog_event.cpp.o CMakeFiles/binlogstandalone_static.dir/__/__/libbinlogevents/src/control_events.cpp.o CMakeFiles/binlogstandalone_static.dir/__/__/libbinlogevents/src/statement_events.cpp.o CMakeFiles/binlogstandalone_static.dir/__/__/libbinlogevents/src/uuid.cpp.o
/usr/bin/ranlib ../lib/libbinlogstandalone.a
make[2]: Leaving directory '/tmp/B.bSxPY4/BUILD/percona-server-5.7.31-34/build'
make[1]: Entering directory '/tmp/B.bSxPY4/BUILD/percona-server-5.7.31-34/build'
[  6%] Built target binlogstandalone_static
make[1]: Leaving directory '/tmp/B.bSxPY4/BUILD/percona-server-5.7.31-34/build'
make[2]: Entering directory '/tmp/B.bSxPY4/BUILD/percona-server-5.7.31-34/build'
[  6%] Building C object strings/CMakeFiles/strings.dir/ctype-win1250ch.c.o
cd /tmp/B.bSxPY4/BUILD/percona-server-5.7.31-34/build/strings && /usr/bin/x86_64-pld-linux-gnux32-gcc -DBOOST_GEOMETRY_SQRT_CHECK_FINITENESS -DDISABLE_MYSQL_THREAD_H -DHAVE_CONFIG_H -DHAVE_TLSv13 -DLZ4_DISABLE_DEPRECATE_WARNINGS -D_FILE_OFFSET_BITS=64 -D_GNU_SOURCE -D__STDC_WANT_LIB_EXT1__=1 -I/tmp/B.bSxPY4/BUILD/percona-server-5.7.31-34/build/include -I/tmp/B.bSxPY4/BUILD/percona-server-5.7.31-34/extra/rapidjson/include -I/tmp/B.bSxPY4/BUILD/percona-server-5.7.31-34/build/libbinlogevents/include -I/tmp/B.bSxPY4/BUILD/percona-server-5.7.31-34/libbinlogevents/export -I/tmp/B.bSxPY4/BUILD/percona-server-5.7.31-34/include  -fPIC -Wall -Wextra -Wformat-security -Wvla -Wwrite-strings -Wdeclaration-after-statement -O3 -D_FORTIFY_SOURCE=2 -O2 -fwrapv -pipe -Wformat -Werror=format-security -gdwarf-4 -fno-debug-types-section -fvar-tracking-assignments -g2 -Wp,-D_FORTIFY_SOURCE=2 -fstack-protector-strong --param=ssp-buffer-size=4 -Werror=trampolines -fPIC -mtune=generic -march=x86-64 -gdwarf-4 -fno-debug-types-section -fvar-tracking-assignments -g2  -DNDEBUG -fno-omit-frame-pointer -fno-strict-aliasing  -Wno-shadow -g -fno-omit-frame-pointer -fno-strict-aliasing -DDBUG_OFF -DNDEBUG   -o CMakeFiles/strings.dir/ctype-win1250ch.c.o   -c /tmp/B.bSxPY4/BUILD/percona-server-5.7.31-34/strings/ctype-win1250ch.c
make[2]: Leaving directory '/tmp/B.bSxPY4/BUILD/percona-server-5.7.31-34/build'
make[2]: Entering directory '/tmp/B.bSxPY4/BUILD/percona-server-5.7.31-34/build'
[  5%] Building C object strings/CMakeFiles/strings.dir/ctype-gb18030.c.o
cd /tmp/B.bSxPY4/BUILD/percona-server-5.7.31-34/build/strings && /usr/bin/x86_64-pld-linux-gnux32-gcc -DBOOST_GEOMETRY_SQRT_CHECK_FINITENESS -DDISABLE_MYSQL_THREAD_H -DHAVE_CONFIG_H -DHAVE_TLSv13 -DLZ4_DISABLE_DEPRECATE_WARNINGS -D_FILE_OFFSET_BITS=64 -D_GNU_SOURCE -D__STDC_WANT_LIB_EXT1__=1 -I/tmp/B.bSxPY4/BUILD/percona-server-5.7.31-34/build/include -I/tmp/B.bSxPY4/BUILD/percona-server-5.7.31-34/extra/rapidjson/include -I/tmp/B.bSxPY4/BUILD/percona-server-5.7.31-34/build/libbinlogevents/include -I/tmp/B.bSxPY4/BUILD/percona-server-5.7.31-34/libbinlogevents/export -I/tmp/B.bSxPY4/BUILD/percona-server-5.7.31-34/include  -fPIC -Wall -Wextra -Wformat-security -Wvla -Wwrite-strings -Wdeclaration-after-statement -O3 -D_FORTIFY_SOURCE=2 -O2 -fwrapv -pipe -Wformat -Werror=format-security -gdwarf-4 -fno-debug-types-section -fvar-tracking-assignments -g2 -Wp,-D_FORTIFY_SOURCE=2 -fstack-protector-strong --param=ssp-buffer-size=4 -Werror=trampolines -fPIC -mtune=generic -march=x86-64 -gdwarf-4 -fno-debug-types-section -fvar-tracking-assignments -g2  -DNDEBUG -fno-omit-frame-pointer -fno-strict-aliasing  -Wno-shadow -g -fno-omit-frame-pointer -fno-strict-aliasing -DDBUG_OFF -DNDEBUG   -o CMakeFiles/strings.dir/ctype-gb18030.c.o   -c /tmp/B.bSxPY4/BUILD/percona-server-5.7.31-34/strings/ctype-gb18030.c
make[2]: Leaving directory '/tmp/B.bSxPY4/BUILD/percona-server-5.7.31-34/build'
make[2]: Entering directory '/tmp/B.bSxPY4/BUILD/percona-server-5.7.31-34/build'
[  6%] Linking CXX shared library ../lib/libbinlogstandalone.so
cd /tmp/B.bSxPY4/BUILD/percona-server-5.7.31-34/build/libbinlogstandalone/src && /usr/bin/cmake -E cmake_link_script CMakeFiles/binlogstandalone_shared.dir/link.txt --verbose=1
/usr/bin/x86_64-pld-linux-gnux32-g++ -fPIC  -fPIC -Wall -Wextra -Wformat-security -Wvla -Woverloaded-virtual -Wno-unused-parameter -O3 -D_FORTIFY_SOURCE=2 -g -fno-omit-frame-pointer -fno-strict-aliasing -DDBUG_OFF -DNDEBUG -fPIC  -shared -Wl,-soname,libbinlogstandalone.so -o ../lib/libbinlogstandalone.so CMakeFiles/binlogstandalone_shared.dir/__/__/libbinlogevents/src/load_data_events.cpp.o CMakeFiles/binlogstandalone_shared.dir/__/__/libbinlogevents/src/rows_event.cpp.o CMakeFiles/binlogstandalone_shared.dir/__/__/libbinlogevents/src/binlog_event.cpp.o CMakeFiles/binlogstandalone_shared.dir/__/__/libbinlogevents/src/control_events.cpp.o CMakeFiles/binlogstandalone_shared.dir/__/__/libbinlogevents/src/statement_events.cpp.o CMakeFiles/binlogstandalone_shared.dir/__/__/libbinlogevents/src/uuid.cpp.o  -lpthread -lz 
make[2]: Leaving directory '/tmp/B.bSxPY4/BUILD/percona-server-5.7.31-34/build'
make[1]: Entering directory '/tmp/B.bSxPY4/BUILD/percona-server-5.7.31-34/build'
[  6%] Built target binlogstandalone_shared
make[1]: Leaving directory '/tmp/B.bSxPY4/BUILD/percona-server-5.7.31-34/build'
make[2]: Entering directory '/tmp/B.bSxPY4/BUILD/percona-server-5.7.31-34/build'
[  6%] Building C object strings/CMakeFiles/strings.dir/ctype.c.o
cd /tmp/B.bSxPY4/BUILD/percona-server-5.7.31-34/build/strings && /usr/bin/x86_64-pld-linux-gnux32-gcc -DBOOST_GEOMETRY_SQRT_CHECK_FINITENESS -DDISABLE_MYSQL_THREAD_H -DHAVE_CONFIG_H -DHAVE_TLSv13 -DLZ4_DISABLE_DEPRECATE_WARNINGS -D_FILE_OFFSET_BITS=64 -D_GNU_SOURCE -D__STDC_WANT_LIB_EXT1__=1 -I/tmp/B.bSxPY4/BUILD/percona-server-5.7.31-34/build/include -I/tmp/B.bSxPY4/BUILD/percona-server-5.7.31-34/extra/rapidjson/include -I/tmp/B.bSxPY4/BUILD/percona-server-5.7.31-34/build/libbinlogevents/include -I/tmp/B.bSxPY4/BUILD/percona-server-5.7.31-34/libbinlogevents/export -I/tmp/B.bSxPY4/BUILD/percona-server-5.7.31-34/include  -fPIC -Wall -Wextra -Wformat-security -Wvla -Wwrite-strings -Wdeclaration-after-statement -O3 -D_FORTIFY_SOURCE=2 -O2 -fwrapv -pipe -Wformat -Werror=format-security -gdwarf-4 -fno-debug-types-section -fvar-tracking-assignments -g2 -Wp,-D_FORTIFY_SOURCE=2 -fstack-protector-strong --param=ssp-buffer-size=4 -Werror=trampolines -fPIC -mtune=generic -march=x86-64 -gdwarf-4 -fno-debug-types-section -fvar-tracking-assignments -g2  -DNDEBUG -fno-omit-frame-pointer -fno-strict-aliasing  -Wno-shadow -g -fno-omit-frame-pointer -fno-strict-aliasing -DDBUG_OFF -DNDEBUG   -o CMakeFiles/strings.dir/ctype.c.o   -c /tmp/B.bSxPY4/BUILD/percona-server-5.7.31-34/strings/ctype.c
make[2]: Leaving directory '/tmp/B.bSxPY4/BUILD/percona-server-5.7.31-34/build'
make[2]: Entering directory '/tmp/B.bSxPY4/BUILD/percona-server-5.7.31-34/build'
[  6%] Building C object strings/CMakeFiles/strings.dir/int2str.c.o
cd /tmp/B.bSxPY4/BUILD/percona-server-5.7.31-34/build/strings && /usr/bin/x86_64-pld-linux-gnux32-gcc -DBOOST_GEOMETRY_SQRT_CHECK_FINITENESS -DDISABLE_MYSQL_THREAD_H -DHAVE_CONFIG_H -DHAVE_TLSv13 -DLZ4_DISABLE_DEPRECATE_WARNINGS -D_FILE_OFFSET_BITS=64 -D_GNU_SOURCE -D__STDC_WANT_LIB_EXT1__=1 -I/tmp/B.bSxPY4/BUILD/percona-server-5.7.31-34/build/include -I/tmp/B.bSxPY4/BUILD/percona-server-5.7.31-34/extra/rapidjson/include -I/tmp/B.bSxPY4/BUILD/percona-server-5.7.31-34/build/libbinlogevents/include -I/tmp/B.bSxPY4/BUILD/percona-server-5.7.31-34/libbinlogevents/export -I/tmp/B.bSxPY4/BUILD/percona-server-5.7.31-34/include  -fPIC -Wall -Wextra -Wformat-security -Wvla -Wwrite-strings -Wdeclaration-after-statement -O3 -D_FORTIFY_SOURCE=2 -O2 -fwrapv -pipe -Wformat -Werror=format-security -gdwarf-4 -fno-debug-types-section -fvar-tracking-assignments -g2 -Wp,-D_FORTIFY_SOURCE=2 -fstack-protector-strong --param=ssp-buffer-size=4 -Werror=trampolines -fPIC -mtune=generic -march=x86-64 -gdwarf-4 -fno-debug-types-section -fvar-tracking-assignments -g2  -DNDEBUG -fno-omit-frame-pointer -fno-strict-aliasing  -Wno-shadow -g -fno-omit-frame-pointer -fno-strict-aliasing -DDBUG_OFF -DNDEBUG   -o CMakeFiles/strings.dir/int2str.c.o   -c /tmp/B.bSxPY4/BUILD/percona-server-5.7.31-34/strings/int2str.c
make[2]: Leaving directory '/tmp/B.bSxPY4/BUILD/percona-server-5.7.31-34/build'
make[2]: Entering directory '/tmp/B.bSxPY4/BUILD/percona-server-5.7.31-34/build'
[  6%] Building C object strings/CMakeFiles/strings.dir/ctype-uca.c.o
cd /tmp/B.bSxPY4/BUILD/percona-server-5.7.31-34/build/strings && /usr/bin/x86_64-pld-linux-gnux32-gcc -DBOOST_GEOMETRY_SQRT_CHECK_FINITENESS -DDISABLE_MYSQL_THREAD_H -DHAVE_CONFIG_H -DHAVE_TLSv13 -DLZ4_DISABLE_DEPRECATE_WARNINGS -D_FILE_OFFSET_BITS=64 -D_GNU_SOURCE -D__STDC_WANT_LIB_EXT1__=1 -I/tmp/B.bSxPY4/BUILD/percona-server-5.7.31-34/build/include -I/tmp/B.bSxPY4/BUILD/percona-server-5.7.31-34/extra/rapidjson/include -I/tmp/B.bSxPY4/BUILD/percona-server-5.7.31-34/build/libbinlogevents/include -I/tmp/B.bSxPY4/BUILD/percona-server-5.7.31-34/libbinlogevents/export -I/tmp/B.bSxPY4/BUILD/percona-server-5.7.31-34/include  -fPIC -Wall -Wextra -Wformat-security -Wvla -Wwrite-strings -Wdeclaration-after-statement -O3 -D_FORTIFY_SOURCE=2 -O2 -fwrapv -pipe -Wformat -Werror=format-security -gdwarf-4 -fno-debug-types-section -fvar-tracking-assignments -g2 -Wp,-D_FORTIFY_SOURCE=2 -fstack-protector-strong --param=ssp-buffer-size=4 -Werror=trampolines -fPIC -mtune=generic -march=x86-64 -gdwarf-4 -fno-debug-types-section -fvar-tracking-assignments -g2  -DNDEBUG -fno-omit-frame-pointer -fno-strict-aliasing  -Wno-shadow -g -fno-omit-frame-pointer -fno-strict-aliasing -DDBUG_OFF -DNDEBUG   -o CMakeFiles/strings.dir/ctype-uca.c.o   -c /tmp/B.bSxPY4/BUILD/percona-server-5.7.31-34/strings/ctype-uca.c
make[2]: Leaving directory '/tmp/B.bSxPY4/BUILD/percona-server-5.7.31-34/build'
make[2]: Entering directory '/tmp/B.bSxPY4/BUILD/percona-server-5.7.31-34/build'
[  6%] Building C object strings/CMakeFiles/strings.dir/is_prefix.c.o
cd /tmp/B.bSxPY4/BUILD/percona-server-5.7.31-34/build/strings && /usr/bin/x86_64-pld-linux-gnux32-gcc -DBOOST_GEOMETRY_SQRT_CHECK_FINITENESS -DDISABLE_MYSQL_THREAD_H -DHAVE_CONFIG_H -DHAVE_TLSv13 -DLZ4_DISABLE_DEPRECATE_WARNINGS -D_FILE_OFFSET_BITS=64 -D_GNU_SOURCE -D__STDC_WANT_LIB_EXT1__=1 -I/tmp/B.bSxPY4/BUILD/percona-server-5.7.31-34/build/include -I/tmp/B.bSxPY4/BUILD/percona-server-5.7.31-34/extra/rapidjson/include -I/tmp/B.bSxPY4/BUILD/percona-server-5.7.31-34/build/libbinlogevents/include -I/tmp/B.bSxPY4/BUILD/percona-server-5.7.31-34/libbinlogevents/export -I/tmp/B.bSxPY4/BUILD/percona-server-5.7.31-34/include  -fPIC -Wall -Wextra -Wformat-security -Wvla -Wwrite-strings -Wdeclaration-after-statement -O3 -D_FORTIFY_SOURCE=2 -O2 -fwrapv -pipe -Wformat -Werror=format-security -gdwarf-4 -fno-debug-types-section -fvar-tracking-assignments -g2 -Wp,-D_FORTIFY_SOURCE=2 -fstack-protector-strong --param=ssp-buffer-size=4 -Werror=trampolines -fPIC -mtune=generic -march=x86-64 -gdwarf-4 -fno-debug-types-section -fvar-tracking-assignments -g2  -DNDEBUG -fno-omit-frame-pointer -fno-strict-aliasing  -Wno-shadow -g -fno-omit-frame-pointer -fno-strict-aliasing -DDBUG_OFF -DNDEBUG   -o CMakeFiles/strings.dir/is_prefix.c.o   -c /tmp/B.bSxPY4/BUILD/percona-server-5.7.31-34/strings/is_prefix.c
make[2]: Leaving directory '/tmp/B.bSxPY4/BUILD/percona-server-5.7.31-34/build'
make[2]: Entering directory '/tmp/B.bSxPY4/BUILD/percona-server-5.7.31-34/build'
[  6%] Building C object strings/CMakeFiles/strings.dir/llstr.c.o
cd /tmp/B.bSxPY4/BUILD/percona-server-5.7.31-34/build/strings && /usr/bin/x86_64-pld-linux-gnux32-gcc -DBOOST_GEOMETRY_SQRT_CHECK_FINITENESS -DDISABLE_MYSQL_THREAD_H -DHAVE_CONFIG_H -DHAVE_TLSv13 -DLZ4_DISABLE_DEPRECATE_WARNINGS -D_FILE_OFFSET_BITS=64 -D_GNU_SOURCE -D__STDC_WANT_LIB_EXT1__=1 -I/tmp/B.bSxPY4/BUILD/percona-server-5.7.31-34/build/include -I/tmp/B.bSxPY4/BUILD/percona-server-5.7.31-34/extra/rapidjson/include -I/tmp/B.bSxPY4/BUILD/percona-server-5.7.31-34/build/libbinlogevents/include -I/tmp/B.bSxPY4/BUILD/percona-server-5.7.31-34/libbinlogevents/export -I/tmp/B.bSxPY4/BUILD/percona-server-5.7.31-34/include  -fPIC -Wall -Wextra -Wformat-security -Wvla -Wwrite-strings -Wdeclaration-after-statement -O3 -D_FORTIFY_SOURCE=2 -O2 -fwrapv -pipe -Wformat -Werror=format-security -gdwarf-4 -fno-debug-types-section -fvar-tracking-assignments -g2 -Wp,-D_FORTIFY_SOURCE=2 -fstack-protector-strong --param=ssp-buffer-size=4 -Werror=trampolines -fPIC -mtune=generic -march=x86-64 -gdwarf-4 -fno-debug-types-section -fvar-tracking-assignments -g2  -DNDEBUG -fno-omit-frame-pointer -fno-strict-aliasing  -Wno-shadow -g -fno-omit-frame-pointer -fno-strict-aliasing -DDBUG_OFF -DNDEBUG   -o CMakeFiles/strings.dir/llstr.c.o   -c /tmp/B.bSxPY4/BUILD/percona-server-5.7.31-34/strings/llstr.c
make[2]: Leaving directory '/tmp/B.bSxPY4/BUILD/percona-server-5.7.31-34/build'
make[2]: Entering directory '/tmp/B.bSxPY4/BUILD/percona-server-5.7.31-34/build'
[  6%] Building C object strings/CMakeFiles/strings.dir/longlong2str.c.o
cd /tmp/B.bSxPY4/BUILD/percona-server-5.7.31-34/build/strings && /usr/bin/x86_64-pld-linux-gnux32-gcc -DBOOST_GEOMETRY_SQRT_CHECK_FINITENESS -DDISABLE_MYSQL_THREAD_H -DHAVE_CONFIG_H -DHAVE_TLSv13 -DLZ4_DISABLE_DEPRECATE_WARNINGS -D_FILE_OFFSET_BITS=64 -D_GNU_SOURCE -D__STDC_WANT_LIB_EXT1__=1 -I/tmp/B.bSxPY4/BUILD/percona-server-5.7.31-34/build/include -I/tmp/B.bSxPY4/BUILD/percona-server-5.7.31-34/extra/rapidjson/include -I/tmp/B.bSxPY4/BUILD/percona-server-5.7.31-34/build/libbinlogevents/include -I/tmp/B.bSxPY4/BUILD/percona-server-5.7.31-34/libbinlogevents/export -I/tmp/B.bSxPY4/BUILD/percona-server-5.7.31-34/include  -fPIC -Wall -Wextra -Wformat-security -Wvla -Wwrite-strings -Wdeclaration-after-statement -O3 -D_FORTIFY_SOURCE=2 -O2 -fwrapv -pipe -Wformat -Werror=format-security -gdwarf-4 -fno-debug-types-section -fvar-tracking-assignments -g2 -Wp,-D_FORTIFY_SOURCE=2 -fstack-protector-strong --param=ssp-buffer-size=4 -Werror=trampolines -fPIC -mtune=generic -march=x86-64 -gdwarf-4 -fno-debug-types-section -fvar-tracking-assignments -g2  -DNDEBUG -fno-omit-frame-pointer -fno-strict-aliasing  -Wno-shadow -g -fno-omit-frame-pointer -fno-strict-aliasing -DDBUG_OFF -DNDEBUG   -o CMakeFiles/strings.dir/longlong2str.c.o   -c /tmp/B.bSxPY4/BUILD/percona-server-5.7.31-34/strings/longlong2str.c
make[2]: Leaving directory '/tmp/B.bSxPY4/BUILD/percona-server-5.7.31-34/build'
make[2]: Entering directory '/tmp/B.bSxPY4/BUILD/percona-server-5.7.31-34/build'
[  6%] Building C object strings/CMakeFiles/strings.dir/my_strtoll10.c.o
cd /tmp/B.bSxPY4/BUILD/percona-server-5.7.31-34/build/strings && /usr/bin/x86_64-pld-linux-gnux32-gcc -DBOOST_GEOMETRY_SQRT_CHECK_FINITENESS -DDISABLE_MYSQL_THREAD_H -DHAVE_CONFIG_H -DHAVE_TLSv13 -DLZ4_DISABLE_DEPRECATE_WARNINGS -D_FILE_OFFSET_BITS=64 -D_GNU_SOURCE -D__STDC_WANT_LIB_EXT1__=1 -I/tmp/B.bSxPY4/BUILD/percona-server-5.7.31-34/build/include -I/tmp/B.bSxPY4/BUILD/percona-server-5.7.31-34/extra/rapidjson/include -I/tmp/B.bSxPY4/BUILD/percona-server-5.7.31-34/build/libbinlogevents/include -I/tmp/B.bSxPY4/BUILD/percona-server-5.7.31-34/libbinlogevents/export -I/tmp/B.bSxPY4/BUILD/percona-server-5.7.31-34/include  -fPIC -Wall -Wextra -Wformat-security -Wvla -Wwrite-strings -Wdeclaration-after-statement -O3 -D_FORTIFY_SOURCE=2 -O2 -fwrapv -pipe -Wformat -Werror=format-security -gdwarf-4 -fno-debug-types-section -fvar-tracking-assignments -g2 -Wp,-D_FORTIFY_SOURCE=2 -fstack-protector-strong --param=ssp-buffer-size=4 -Werror=trampolines -fPIC -mtune=generic -march=x86-64 -gdwarf-4 -fno-debug-types-section -fvar-tracking-assignments -g2  -DNDEBUG -fno-omit-frame-pointer -fno-strict-aliasing  -Wno-shadow -g -fno-omit-frame-pointer -fno-strict-aliasing -DDBUG_OFF -DNDEBUG   -o CMakeFiles/strings.dir/my_strtoll10.c.o   -c /tmp/B.bSxPY4/BUILD/percona-server-5.7.31-34/strings/my_strtoll10.c
make[2]: Leaving directory '/tmp/B.bSxPY4/BUILD/percona-server-5.7.31-34/build'
make[2]: Entering directory '/tmp/B.bSxPY4/BUILD/percona-server-5.7.31-34/build'
[  7%] Building C object strings/CMakeFiles/strings.dir/str_alloc.c.o
cd /tmp/B.bSxPY4/BUILD/percona-server-5.7.31-34/build/strings && /usr/bin/x86_64-pld-linux-gnux32-gcc -DBOOST_GEOMETRY_SQRT_CHECK_FINITENESS -DDISABLE_MYSQL_THREAD_H -DHAVE_CONFIG_H -DHAVE_TLSv13 -DLZ4_DISABLE_DEPRECATE_WARNINGS -D_FILE_OFFSET_BITS=64 -D_GNU_SOURCE -D__STDC_WANT_LIB_EXT1__=1 -I/tmp/B.bSxPY4/BUILD/percona-server-5.7.31-34/build/include -I/tmp/B.bSxPY4/BUILD/percona-server-5.7.31-34/extra/rapidjson/include -I/tmp/B.bSxPY4/BUILD/percona-server-5.7.31-34/build/libbinlogevents/include -I/tmp/B.bSxPY4/BUILD/percona-server-5.7.31-34/libbinlogevents/export -I/tmp/B.bSxPY4/BUILD/percona-server-5.7.31-34/include  -fPIC -Wall -Wextra -Wformat-security -Wvla -Wwrite-strings -Wdeclaration-after-statement -O3 -D_FORTIFY_SOURCE=2 -O2 -fwrapv -pipe -Wformat -Werror=format-security -gdwarf-4 -fno-debug-types-section -fvar-tracking-assignments -g2 -Wp,-D_FORTIFY_SOURCE=2 -fstack-protector-strong --param=ssp-buffer-size=4 -Werror=trampolines -fPIC -mtune=generic -march=x86-64 -gdwarf-4 -fno-debug-types-section -fvar-tracking-assignments -g2  -DNDEBUG -fno-omit-frame-pointer -fno-strict-aliasing  -Wno-shadow -g -fno-omit-frame-pointer -fno-strict-aliasing -DDBUG_OFF -DNDEBUG   -o CMakeFiles/strings.dir/str_alloc.c.o   -c /tmp/B.bSxPY4/BUILD/percona-server-5.7.31-34/strings/str_alloc.c
make[2]: Leaving directory '/tmp/B.bSxPY4/BUILD/percona-server-5.7.31-34/build'
make[2]: Entering directory '/tmp/B.bSxPY4/BUILD/percona-server-5.7.31-34/build'
[  6%] Building C object strings/CMakeFiles/strings.dir/ctype-ucs2.c.o
cd /tmp/B.bSxPY4/BUILD/percona-server-5.7.31-34/build/strings && /usr/bin/x86_64-pld-linux-gnux32-gcc -DBOOST_GEOMETRY_SQRT_CHECK_FINITENESS -DDISABLE_MYSQL_THREAD_H -DHAVE_CONFIG_H -DHAVE_TLSv13 -DLZ4_DISABLE_DEPRECATE_WARNINGS -D_FILE_OFFSET_BITS=64 -D_GNU_SOURCE -D__STDC_WANT_LIB_EXT1__=1 -I/tmp/B.bSxPY4/BUILD/percona-server-5.7.31-34/build/include -I/tmp/B.bSxPY4/BUILD/percona-server-5.7.31-34/extra/rapidjson/include -I/tmp/B.bSxPY4/BUILD/percona-server-5.7.31-34/build/libbinlogevents/include -I/tmp/B.bSxPY4/BUILD/percona-server-5.7.31-34/libbinlogevents/export -I/tmp/B.bSxPY4/BUILD/percona-server-5.7.31-34/include  -fPIC -Wall -Wextra -Wformat-security -Wvla -Wwrite-strings -Wdeclaration-after-statement -O3 -D_FORTIFY_SOURCE=2 -O2 -fwrapv -pipe -Wformat -Werror=format-security -gdwarf-4 -fno-debug-types-section -fvar-tracking-assignments -g2 -Wp,-D_FORTIFY_SOURCE=2 -fstack-protector-strong --param=ssp-buffer-size=4 -Werror=trampolines -fPIC -mtune=generic -march=x86-64 -gdwarf-4 -fno-debug-types-section -fvar-tracking-assignments -g2  -DNDEBUG -fno-omit-frame-pointer -fno-strict-aliasing  -Wno-shadow -g -fno-omit-frame-pointer -fno-strict-aliasing -DDBUG_OFF -DNDEBUG   -o CMakeFiles/strings.dir/ctype-ucs2.c.o   -c /tmp/B.bSxPY4/BUILD/percona-server-5.7.31-34/strings/ctype-ucs2.c
make[2]: Leaving directory '/tmp/B.bSxPY4/BUILD/percona-server-5.7.31-34/build'
make[2]: Entering directory '/tmp/B.bSxPY4/BUILD/percona-server-5.7.31-34/build'
[  7%] Building C object strings/CMakeFiles/strings.dir/str2int.c.o
cd /tmp/B.bSxPY4/BUILD/percona-server-5.7.31-34/build/strings && /usr/bin/x86_64-pld-linux-gnux32-gcc -DBOOST_GEOMETRY_SQRT_CHECK_FINITENESS -DDISABLE_MYSQL_THREAD_H -DHAVE_CONFIG_H -DHAVE_TLSv13 -DLZ4_DISABLE_DEPRECATE_WARNINGS -D_FILE_OFFSET_BITS=64 -D_GNU_SOURCE -D__STDC_WANT_LIB_EXT1__=1 -I/tmp/B.bSxPY4/BUILD/percona-server-5.7.31-34/build/include -I/tmp/B.bSxPY4/BUILD/percona-server-5.7.31-34/extra/rapidjson/include -I/tmp/B.bSxPY4/BUILD/percona-server-5.7.31-34/build/libbinlogevents/include -I/tmp/B.bSxPY4/BUILD/percona-server-5.7.31-34/libbinlogevents/export -I/tmp/B.bSxPY4/BUILD/percona-server-5.7.31-34/include  -fPIC -Wall -Wextra -Wformat-security -Wvla -Wwrite-strings -Wdeclaration-after-statement -O3 -D_FORTIFY_SOURCE=2 -O2 -fwrapv -pipe -Wformat -Werror=format-security -gdwarf-4 -fno-debug-types-section -fvar-tracking-assignments -g2 -Wp,-D_FORTIFY_SOURCE=2 -fstack-protector-strong --param=ssp-buffer-size=4 -Werror=trampolines -fPIC -mtune=generic -march=x86-64 -gdwarf-4 -fno-debug-types-section -fvar-tracking-assignments -g2  -DNDEBUG -fno-omit-frame-pointer -fno-strict-aliasing  -Wno-shadow -g -fno-omit-frame-pointer -fno-strict-aliasing -DDBUG_OFF -DNDEBUG   -o CMakeFiles/strings.dir/str2int.c.o   -c /tmp/B.bSxPY4/BUILD/percona-server-5.7.31-34/strings/str2int.c
make[2]: Leaving directory '/tmp/B.bSxPY4/BUILD/percona-server-5.7.31-34/build'
make[2]: Entering directory '/tmp/B.bSxPY4/BUILD/percona-server-5.7.31-34/build'
[  7%] Building C object strings/CMakeFiles/strings.dir/strcend.c.o
cd /tmp/B.bSxPY4/BUILD/percona-server-5.7.31-34/build/strings && /usr/bin/x86_64-pld-linux-gnux32-gcc -DBOOST_GEOMETRY_SQRT_CHECK_FINITENESS -DDISABLE_MYSQL_THREAD_H -DHAVE_CONFIG_H -DHAVE_TLSv13 -DLZ4_DISABLE_DEPRECATE_WARNINGS -D_FILE_OFFSET_BITS=64 -D_GNU_SOURCE -D__STDC_WANT_LIB_EXT1__=1 -I/tmp/B.bSxPY4/BUILD/percona-server-5.7.31-34/build/include -I/tmp/B.bSxPY4/BUILD/percona-server-5.7.31-34/extra/rapidjson/include -I/tmp/B.bSxPY4/BUILD/percona-server-5.7.31-34/build/libbinlogevents/include -I/tmp/B.bSxPY4/BUILD/percona-server-5.7.31-34/libbinlogevents/export -I/tmp/B.bSxPY4/BUILD/percona-server-5.7.31-34/include  -fPIC -Wall -Wextra -Wformat-security -Wvla -Wwrite-strings -Wdeclaration-after-statement -O3 -D_FORTIFY_SOURCE=2 -O2 -fwrapv -pipe -Wformat -Werror=format-security -gdwarf-4 -fno-debug-types-section -fvar-tracking-assignments -g2 -Wp,-D_FORTIFY_SOURCE=2 -fstack-protector-strong --param=ssp-buffer-size=4 -Werror=trampolines -fPIC -mtune=generic -march=x86-64 -gdwarf-4 -fno-debug-types-section -fvar-tracking-assignments -g2  -DNDEBUG -fno-omit-frame-pointer -fno-strict-aliasing  -Wno-shadow -g -fno-omit-frame-pointer -fno-strict-aliasing -DDBUG_OFF -DNDEBUG   -o CMakeFiles/strings.dir/strcend.c.o   -c /tmp/B.bSxPY4/BUILD/percona-server-5.7.31-34/strings/strcend.c
make[2]: Leaving directory '/tmp/B.bSxPY4/BUILD/percona-server-5.7.31-34/build'
make[2]: Entering directory '/tmp/B.bSxPY4/BUILD/percona-server-5.7.31-34/build'
[  7%] Building C object strings/CMakeFiles/strings.dir/strend.c.o
cd /tmp/B.bSxPY4/BUILD/percona-server-5.7.31-34/build/strings && /usr/bin/x86_64-pld-linux-gnux32-gcc -DBOOST_GEOMETRY_SQRT_CHECK_FINITENESS -DDISABLE_MYSQL_THREAD_H -DHAVE_CONFIG_H -DHAVE_TLSv13 -DLZ4_DISABLE_DEPRECATE_WARNINGS -D_FILE_OFFSET_BITS=64 -D_GNU_SOURCE -D__STDC_WANT_LIB_EXT1__=1 -I/tmp/B.bSxPY4/BUILD/percona-server-5.7.31-34/build/include -I/tmp/B.bSxPY4/BUILD/percona-server-5.7.31-34/extra/rapidjson/include -I/tmp/B.bSxPY4/BUILD/percona-server-5.7.31-34/build/libbinlogevents/include -I/tmp/B.bSxPY4/BUILD/percona-server-5.7.31-34/libbinlogevents/export -I/tmp/B.bSxPY4/BUILD/percona-server-5.7.31-34/include  -fPIC -Wall -Wextra -Wformat-security -Wvla -Wwrite-strings -Wdeclaration-after-statement -O3 -D_FORTIFY_SOURCE=2 -O2 -fwrapv -pipe -Wformat -Werror=format-security -gdwarf-4 -fno-debug-types-section -fvar-tracking-assignments -g2 -Wp,-D_FORTIFY_SOURCE=2 -fstack-protector-strong --param=ssp-buffer-size=4 -Werror=trampolines -fPIC -mtune=generic -march=x86-64 -gdwarf-4 -fno-debug-types-section -fvar-tracking-assignments -g2  -DNDEBUG -fno-omit-frame-pointer -fno-strict-aliasing  -Wno-shadow -g -fno-omit-frame-pointer -fno-strict-aliasing -DDBUG_OFF -DNDEBUG   -o CMakeFiles/strings.dir/strend.c.o   -c /tmp/B.bSxPY4/BUILD/percona-server-5.7.31-34/strings/strend.c
make[2]: Leaving directory '/tmp/B.bSxPY4/BUILD/percona-server-5.7.31-34/build'
make[2]: Entering directory '/tmp/B.bSxPY4/BUILD/percona-server-5.7.31-34/build'
[  6%] Building C object strings/CMakeFiles/strings.dir/ctype-ujis.c.o
cd /tmp/B.bSxPY4/BUILD/percona-server-5.7.31-34/build/strings && /usr/bin/x86_64-pld-linux-gnux32-gcc -DBOOST_GEOMETRY_SQRT_CHECK_FINITENESS -DDISABLE_MYSQL_THREAD_H -DHAVE_CONFIG_H -DHAVE_TLSv13 -DLZ4_DISABLE_DEPRECATE_WARNINGS -D_FILE_OFFSET_BITS=64 -D_GNU_SOURCE -D__STDC_WANT_LIB_EXT1__=1 -I/tmp/B.bSxPY4/BUILD/percona-server-5.7.31-34/build/include -I/tmp/B.bSxPY4/BUILD/percona-server-5.7.31-34/extra/rapidjson/include -I/tmp/B.bSxPY4/BUILD/percona-server-5.7.31-34/build/libbinlogevents/include -I/tmp/B.bSxPY4/BUILD/percona-server-5.7.31-34/libbinlogevents/export -I/tmp/B.bSxPY4/BUILD/percona-server-5.7.31-34/include  -fPIC -Wall -Wextra -Wformat-security -Wvla -Wwrite-strings -Wdeclaration-after-statement -O3 -D_FORTIFY_SOURCE=2 -O2 -fwrapv -pipe -Wformat -Werror=format-security -gdwarf-4 -fno-debug-types-section -fvar-tracking-assignments -g2 -Wp,-D_FORTIFY_SOURCE=2 -fstack-protector-strong --param=ssp-buffer-size=4 -Werror=trampolines -fPIC -mtune=generic -march=x86-64 -gdwarf-4 -fno-debug-types-section -fvar-tracking-assignments -g2  -DNDEBUG -fno-omit-frame-pointer -fno-strict-aliasing  -Wno-shadow -g -fno-omit-frame-pointer -fno-strict-aliasing -DDBUG_OFF -DNDEBUG   -o CMakeFiles/strings.dir/ctype-ujis.c.o   -c /tmp/B.bSxPY4/BUILD/percona-server-5.7.31-34/strings/ctype-ujis.c
make[2]: Leaving directory '/tmp/B.bSxPY4/BUILD/percona-server-5.7.31-34/build'
make[2]: Entering directory '/tmp/B.bSxPY4/BUILD/percona-server-5.7.31-34/build'
[  7%] Building C object strings/CMakeFiles/strings.dir/strfill.c.o
cd /tmp/B.bSxPY4/BUILD/percona-server-5.7.31-34/build/strings && /usr/bin/x86_64-pld-linux-gnux32-gcc -DBOOST_GEOMETRY_SQRT_CHECK_FINITENESS -DDISABLE_MYSQL_THREAD_H -DHAVE_CONFIG_H -DHAVE_TLSv13 -DLZ4_DISABLE_DEPRECATE_WARNINGS -D_FILE_OFFSET_BITS=64 -D_GNU_SOURCE -D__STDC_WANT_LIB_EXT1__=1 -I/tmp/B.bSxPY4/BUILD/percona-server-5.7.31-34/build/include -I/tmp/B.bSxPY4/BUILD/percona-server-5.7.31-34/extra/rapidjson/include -I/tmp/B.bSxPY4/BUILD/percona-server-5.7.31-34/build/libbinlogevents/include -I/tmp/B.bSxPY4/BUILD/percona-server-5.7.31-34/libbinlogevents/export -I/tmp/B.bSxPY4/BUILD/percona-server-5.7.31-34/include  -fPIC -Wall -Wextra -Wformat-security -Wvla -Wwrite-strings -Wdeclaration-after-statement -O3 -D_FORTIFY_SOURCE=2 -O2 -fwrapv -pipe -Wformat -Werror=format-security -gdwarf-4 -fno-debug-types-section -fvar-tracking-assignments -g2 -Wp,-D_FORTIFY_SOURCE=2 -fstack-protector-strong --param=ssp-buffer-size=4 -Werror=trampolines -fPIC -mtune=generic -march=x86-64 -gdwarf-4 -fno-debug-types-section -fvar-tracking-assignments -g2  -DNDEBUG -fno-omit-frame-pointer -fno-strict-aliasing  -Wno-shadow -g -fno-omit-frame-pointer -fno-strict-aliasing -DDBUG_OFF -DNDEBUG   -o CMakeFiles/strings.dir/strfill.c.o   -c /tmp/B.bSxPY4/BUILD/percona-server-5.7.31-34/strings/strfill.c
make[2]: Leaving directory '/tmp/B.bSxPY4/BUILD/percona-server-5.7.31-34/build'
make[2]: Entering directory '/tmp/B.bSxPY4/BUILD/percona-server-5.7.31-34/build'
[  6%] Building C object strings/CMakeFiles/strings.dir/my_vsnprintf.c.o
cd /tmp/B.bSxPY4/BUILD/percona-server-5.7.31-34/build/strings && /usr/bin/x86_64-pld-linux-gnux32-gcc -DBOOST_GEOMETRY_SQRT_CHECK_FINITENESS -DDISABLE_MYSQL_THREAD_H -DHAVE_CONFIG_H -DHAVE_TLSv13 -DLZ4_DISABLE_DEPRECATE_WARNINGS -D_FILE_OFFSET_BITS=64 -D_GNU_SOURCE -D__STDC_WANT_LIB_EXT1__=1 -I/tmp/B.bSxPY4/BUILD/percona-server-5.7.31-34/build/include -I/tmp/B.bSxPY4/BUILD/percona-server-5.7.31-34/extra/rapidjson/include -I/tmp/B.bSxPY4/BUILD/percona-server-5.7.31-34/build/libbinlogevents/include -I/tmp/B.bSxPY4/BUILD/percona-server-5.7.31-34/libbinlogevents/export -I/tmp/B.bSxPY4/BUILD/percona-server-5.7.31-34/include  -fPIC -Wall -Wextra -Wformat-security -Wvla -Wwrite-strings -Wdeclaration-after-statement -O3 -D_FORTIFY_SOURCE=2 -O2 -fwrapv -pipe -Wformat -Werror=format-security -gdwarf-4 -fno-debug-types-section -fvar-tracking-assignments -g2 -Wp,-D_FORTIFY_SOURCE=2 -fstack-protector-strong --param=ssp-buffer-size=4 -Werror=trampolines -fPIC -mtune=generic -march=x86-64 -gdwarf-4 -fno-debug-types-section -fvar-tracking-assignments -g2  -DNDEBUG -fno-omit-frame-pointer -fno-strict-aliasing  -Wno-shadow -g -fno-omit-frame-pointer -fno-strict-aliasing -DDBUG_OFF -DNDEBUG   -o CMakeFiles/strings.dir/my_vsnprintf.c.o   -c /tmp/B.bSxPY4/BUILD/percona-server-5.7.31-34/strings/my_vsnprintf.c
make[2]: Leaving directory '/tmp/B.bSxPY4/BUILD/percona-server-5.7.31-34/build'
make[2]: Entering directory '/tmp/B.bSxPY4/BUILD/percona-server-5.7.31-34/build'
[  7%] Building C object strings/CMakeFiles/strings.dir/my_stpmov.c.o
cd /tmp/B.bSxPY4/BUILD/percona-server-5.7.31-34/build/strings && /usr/bin/x86_64-pld-linux-gnux32-gcc -DBOOST_GEOMETRY_SQRT_CHECK_FINITENESS -DDISABLE_MYSQL_THREAD_H -DHAVE_CONFIG_H -DHAVE_TLSv13 -DLZ4_DISABLE_DEPRECATE_WARNINGS -D_FILE_OFFSET_BITS=64 -D_GNU_SOURCE -D__STDC_WANT_LIB_EXT1__=1 -I/tmp/B.bSxPY4/BUILD/percona-server-5.7.31-34/build/include -I/tmp/B.bSxPY4/BUILD/percona-server-5.7.31-34/extra/rapidjson/include -I/tmp/B.bSxPY4/BUILD/percona-server-5.7.31-34/build/libbinlogevents/include -I/tmp/B.bSxPY4/BUILD/percona-server-5.7.31-34/libbinlogevents/export -I/tmp/B.bSxPY4/BUILD/percona-server-5.7.31-34/include  -fPIC -Wall -Wextra -Wformat-security -Wvla -Wwrite-strings -Wdeclaration-after-statement -O3 -D_FORTIFY_SOURCE=2 -O2 -fwrapv -pipe -Wformat -Werror=format-security -gdwarf-4 -fno-debug-types-section -fvar-tracking-assignments -g2 -Wp,-D_FORTIFY_SOURCE=2 -fstack-protector-strong --param=ssp-buffer-size=4 -Werror=trampolines -fPIC -mtune=generic -march=x86-64 -gdwarf-4 -fno-debug-types-section -fvar-tracking-assignments -g2  -DNDEBUG -fno-omit-frame-pointer -fno-strict-aliasing  -Wno-shadow -g -fno-omit-frame-pointer -fno-strict-aliasing -DDBUG_OFF -DNDEBUG   -o CMakeFiles/strings.dir/my_stpmov.c.o   -c /tmp/B.bSxPY4/BUILD/percona-server-5.7.31-34/strings/my_stpmov.c
make[2]: Leaving directory '/tmp/B.bSxPY4/BUILD/percona-server-5.7.31-34/build'
make[2]: Entering directory '/tmp/B.bSxPY4/BUILD/percona-server-5.7.31-34/build'
[  7%] Building C object strings/CMakeFiles/strings.dir/strmake.c.o
cd /tmp/B.bSxPY4/BUILD/percona-server-5.7.31-34/build/strings && /usr/bin/x86_64-pld-linux-gnux32-gcc -DBOOST_GEOMETRY_SQRT_CHECK_FINITENESS -DDISABLE_MYSQL_THREAD_H -DHAVE_CONFIG_H -DHAVE_TLSv13 -DLZ4_DISABLE_DEPRECATE_WARNINGS -D_FILE_OFFSET_BITS=64 -D_GNU_SOURCE -D__STDC_WANT_LIB_EXT1__=1 -I/tmp/B.bSxPY4/BUILD/percona-server-5.7.31-34/build/include -I/tmp/B.bSxPY4/BUILD/percona-server-5.7.31-34/extra/rapidjson/include -I/tmp/B.bSxPY4/BUILD/percona-server-5.7.31-34/build/libbinlogevents/include -I/tmp/B.bSxPY4/BUILD/percona-server-5.7.31-34/libbinlogevents/export -I/tmp/B.bSxPY4/BUILD/percona-server-5.7.31-34/include  -fPIC -Wall -Wextra -Wformat-security -Wvla -Wwrite-strings -Wdeclaration-after-statement -O3 -D_FORTIFY_SOURCE=2 -O2 -fwrapv -pipe -Wformat -Werror=format-security -gdwarf-4 -fno-debug-types-section -fvar-tracking-assignments -g2 -Wp,-D_FORTIFY_SOURCE=2 -fstack-protector-strong --param=ssp-buffer-size=4 -Werror=trampolines -fPIC -mtune=generic -march=x86-64 -gdwarf-4 -fno-debug-types-section -fvar-tracking-assignments -g2  -DNDEBUG -fno-omit-frame-pointer -fno-strict-aliasing  -Wno-shadow -g -fno-omit-frame-pointer -fno-strict-aliasing -DDBUG_OFF -DNDEBUG   -o CMakeFiles/strings.dir/strmake.c.o   -c /tmp/B.bSxPY4/BUILD/percona-server-5.7.31-34/strings/strmake.c
make[2]: Leaving directory '/tmp/B.bSxPY4/BUILD/percona-server-5.7.31-34/build'
make[2]: Entering directory '/tmp/B.bSxPY4/BUILD/percona-server-5.7.31-34/build'
[  7%] Building C object strings/CMakeFiles/strings.dir/strxmov.c.o
cd /tmp/B.bSxPY4/BUILD/percona-server-5.7.31-34/build/strings && /usr/bin/x86_64-pld-linux-gnux32-gcc -DBOOST_GEOMETRY_SQRT_CHECK_FINITENESS -DDISABLE_MYSQL_THREAD_H -DHAVE_CONFIG_H -DHAVE_TLSv13 -DLZ4_DISABLE_DEPRECATE_WARNINGS -D_FILE_OFFSET_BITS=64 -D_GNU_SOURCE -D__STDC_WANT_LIB_EXT1__=1 -I/tmp/B.bSxPY4/BUILD/percona-server-5.7.31-34/build/include -I/tmp/B.bSxPY4/BUILD/percona-server-5.7.31-34/extra/rapidjson/include -I/tmp/B.bSxPY4/BUILD/percona-server-5.7.31-34/build/libbinlogevents/include -I/tmp/B.bSxPY4/BUILD/percona-server-5.7.31-34/libbinlogevents/export -I/tmp/B.bSxPY4/BUILD/percona-server-5.7.31-34/include  -fPIC -Wall -Wextra -Wformat-security -Wvla -Wwrite-strings -Wdeclaration-after-statement -O3 -D_FORTIFY_SOURCE=2 -O2 -fwrapv -pipe -Wformat -Werror=format-security -gdwarf-4 -fno-debug-types-section -fvar-tracking-assignments -g2 -Wp,-D_FORTIFY_SOURCE=2 -fstack-protector-strong --param=ssp-buffer-size=4 -Werror=trampolines -fPIC -mtune=generic -march=x86-64 -gdwarf-4 -fno-debug-types-section -fvar-tracking-assignments -g2  -DNDEBUG -fno-omit-frame-pointer -fno-strict-aliasing  -Wno-shadow -g -fno-omit-frame-pointer -fno-strict-aliasing -DDBUG_OFF -DNDEBUG   -o CMakeFiles/strings.dir/strxmov.c.o   -c /tmp/B.bSxPY4/BUILD/percona-server-5.7.31-34/strings/strxmov.c
make[2]: Leaving directory '/tmp/B.bSxPY4/BUILD/percona-server-5.7.31-34/build'
make[2]: Entering directory '/tmp/B.bSxPY4/BUILD/percona-server-5.7.31-34/build'
[  7%] Building C object strings/CMakeFiles/strings.dir/my_stpnmov.c.o
cd /tmp/B.bSxPY4/BUILD/percona-server-5.7.31-34/build/strings && /usr/bin/x86_64-pld-linux-gnux32-gcc -DBOOST_GEOMETRY_SQRT_CHECK_FINITENESS -DDISABLE_MYSQL_THREAD_H -DHAVE_CONFIG_H -DHAVE_TLSv13 -DLZ4_DISABLE_DEPRECATE_WARNINGS -D_FILE_OFFSET_BITS=64 -D_GNU_SOURCE -D__STDC_WANT_LIB_EXT1__=1 -I/tmp/B.bSxPY4/BUILD/percona-server-5.7.31-34/build/include -I/tmp/B.bSxPY4/BUILD/percona-server-5.7.31-34/extra/rapidjson/include -I/tmp/B.bSxPY4/BUILD/percona-server-5.7.31-34/build/libbinlogevents/include -I/tmp/B.bSxPY4/BUILD/percona-server-5.7.31-34/libbinlogevents/export -I/tmp/B.bSxPY4/BUILD/percona-server-5.7.31-34/include  -fPIC -Wall -Wextra -Wformat-security -Wvla -Wwrite-strings -Wdeclaration-after-statement -O3 -D_FORTIFY_SOURCE=2 -O2 -fwrapv -pipe -Wformat -Werror=format-security -gdwarf-4 -fno-debug-types-section -fvar-tracking-assignments -g2 -Wp,-D_FORTIFY_SOURCE=2 -fstack-protector-strong --param=ssp-buffer-size=4 -Werror=trampolines -fPIC -mtune=generic -march=x86-64 -gdwarf-4 -fno-debug-types-section -fvar-tracking-assignments -g2  -DNDEBUG -fno-omit-frame-pointer -fno-strict-aliasing  -Wno-shadow -g -fno-omit-frame-pointer -fno-strict-aliasing -DDBUG_OFF -DNDEBUG   -o CMakeFiles/strings.dir/my_stpnmov.c.o   -c /tmp/B.bSxPY4/BUILD/percona-server-5.7.31-34/strings/my_stpnmov.c
make[2]: Leaving directory '/tmp/B.bSxPY4/BUILD/percona-server-5.7.31-34/build'
make[2]: Entering directory '/tmp/B.bSxPY4/BUILD/percona-server-5.7.31-34/build'
[  6%] Building C object strings/CMakeFiles/strings.dir/ctype-utf8.c.o
cd /tmp/B.bSxPY4/BUILD/percona-server-5.7.31-34/build/strings && /usr/bin/x86_64-pld-linux-gnux32-gcc -DBOOST_GEOMETRY_SQRT_CHECK_FINITENESS -DDISABLE_MYSQL_THREAD_H -DHAVE_CONFIG_H -DHAVE_TLSv13 -DLZ4_DISABLE_DEPRECATE_WARNINGS -D_FILE_OFFSET_BITS=64 -D_GNU_SOURCE -D__STDC_WANT_LIB_EXT1__=1 -I/tmp/B.bSxPY4/BUILD/percona-server-5.7.31-34/build/include -I/tmp/B.bSxPY4/BUILD/percona-server-5.7.31-34/extra/rapidjson/include -I/tmp/B.bSxPY4/BUILD/percona-server-5.7.31-34/build/libbinlogevents/include -I/tmp/B.bSxPY4/BUILD/percona-server-5.7.31-34/libbinlogevents/export -I/tmp/B.bSxPY4/BUILD/percona-server-5.7.31-34/include  -fPIC -Wall -Wextra -Wformat-security -Wvla -Wwrite-strings -Wdeclaration-after-statement -O3 -D_FORTIFY_SOURCE=2 -O2 -fwrapv -pipe -Wformat -Werror=format-security -gdwarf-4 -fno-debug-types-section -fvar-tracking-assignments -g2 -Wp,-D_FORTIFY_SOURCE=2 -fstack-protector-strong --param=ssp-buffer-size=4 -Werror=trampolines -fPIC -mtune=generic -march=x86-64 -gdwarf-4 -fno-debug-types-section -fvar-tracking-assignments -g2  -DNDEBUG -fno-omit-frame-pointer -fno-strict-aliasing  -Wno-shadow -g -fno-omit-frame-pointer -fno-strict-aliasing -DDBUG_OFF -DNDEBUG   -o CMakeFiles/strings.dir/ctype-utf8.c.o   -c /tmp/B.bSxPY4/BUILD/percona-server-5.7.31-34/strings/ctype-utf8.c
make[2]: Leaving directory '/tmp/B.bSxPY4/BUILD/percona-server-5.7.31-34/build'
make[2]: Entering directory '/tmp/B.bSxPY4/BUILD/percona-server-5.7.31-34/build'
[  7%] Building C object strings/CMakeFiles/strings.dir/strxnmov.c.o
cd /tmp/B.bSxPY4/BUILD/percona-server-5.7.31-34/build/strings && /usr/bin/x86_64-pld-linux-gnux32-gcc -DBOOST_GEOMETRY_SQRT_CHECK_FINITENESS -DDISABLE_MYSQL_THREAD_H -DHAVE_CONFIG_H -DHAVE_TLSv13 -DLZ4_DISABLE_DEPRECATE_WARNINGS -D_FILE_OFFSET_BITS=64 -D_GNU_SOURCE -D__STDC_WANT_LIB_EXT1__=1 -I/tmp/B.bSxPY4/BUILD/percona-server-5.7.31-34/build/include -I/tmp/B.bSxPY4/BUILD/percona-server-5.7.31-34/extra/rapidjson/include -I/tmp/B.bSxPY4/BUILD/percona-server-5.7.31-34/build/libbinlogevents/include -I/tmp/B.bSxPY4/BUILD/percona-server-5.7.31-34/libbinlogevents/export -I/tmp/B.bSxPY4/BUILD/percona-server-5.7.31-34/include  -fPIC -Wall -Wextra -Wformat-security -Wvla -Wwrite-strings -Wdeclaration-after-statement -O3 -D_FORTIFY_SOURCE=2 -O2 -fwrapv -pipe -Wformat -Werror=format-security -gdwarf-4 -fno-debug-types-section -fvar-tracking-assignments -g2 -Wp,-D_FORTIFY_SOURCE=2 -fstack-protector-strong --param=ssp-buffer-size=4 -Werror=trampolines -fPIC -mtune=generic -march=x86-64 -gdwarf-4 -fno-debug-types-section -fvar-tracking-assignments -g2  -DNDEBUG -fno-omit-frame-pointer -fno-strict-aliasing  -Wno-shadow -g -fno-omit-frame-pointer -fno-strict-aliasing -DDBUG_OFF -DNDEBUG   -o CMakeFiles/strings.dir/strxnmov.c.o   -c /tmp/B.bSxPY4/BUILD/percona-server-5.7.31-34/strings/strxnmov.c
make[2]: Leaving directory '/tmp/B.bSxPY4/BUILD/percona-server-5.7.31-34/build'
make[2]: Entering directory '/tmp/B.bSxPY4/BUILD/percona-server-5.7.31-34/build'
[  7%] Building C object strings/CMakeFiles/strings.dir/strcont.c.o
cd /tmp/B.bSxPY4/BUILD/percona-server-5.7.31-34/build/strings && /usr/bin/x86_64-pld-linux-gnux32-gcc -DBOOST_GEOMETRY_SQRT_CHECK_FINITENESS -DDISABLE_MYSQL_THREAD_H -DHAVE_CONFIG_H -DHAVE_TLSv13 -DLZ4_DISABLE_DEPRECATE_WARNINGS -D_FILE_OFFSET_BITS=64 -D_GNU_SOURCE -D__STDC_WANT_LIB_EXT1__=1 -I/tmp/B.bSxPY4/BUILD/percona-server-5.7.31-34/build/include -I/tmp/B.bSxPY4/BUILD/percona-server-5.7.31-34/extra/rapidjson/include -I/tmp/B.bSxPY4/BUILD/percona-server-5.7.31-34/build/libbinlogevents/include -I/tmp/B.bSxPY4/BUILD/percona-server-5.7.31-34/libbinlogevents/export -I/tmp/B.bSxPY4/BUILD/percona-server-5.7.31-34/include  -fPIC -Wall -Wextra -Wformat-security -Wvla -Wwrite-strings -Wdeclaration-after-statement -O3 -D_FORTIFY_SOURCE=2 -O2 -fwrapv -pipe -Wformat -Werror=format-security -gdwarf-4 -fno-debug-types-section -fvar-tracking-assignments -g2 -Wp,-D_FORTIFY_SOURCE=2 -fstack-protector-strong --param=ssp-buffer-size=4 -Werror=trampolines -fPIC -mtune=generic -march=x86-64 -gdwarf-4 -fno-debug-types-section -fvar-tracking-assignments -g2  -DNDEBUG -fno-omit-frame-pointer -fno-strict-aliasing  -Wno-shadow -g -fno-omit-frame-pointer -fno-strict-aliasing -DDBUG_OFF -DNDEBUG   -o CMakeFiles/strings.dir/strcont.c.o   -c /tmp/B.bSxPY4/BUILD/percona-server-5.7.31-34/strings/strcont.c
make[2]: Leaving directory '/tmp/B.bSxPY4/BUILD/percona-server-5.7.31-34/build'
make[2]: Entering directory '/tmp/B.bSxPY4/BUILD/percona-server-5.7.31-34/build'
[  7%] Building C object strings/CMakeFiles/strings.dir/my_strchr.c.o
cd /tmp/B.bSxPY4/BUILD/percona-server-5.7.31-34/build/strings && /usr/bin/x86_64-pld-linux-gnux32-gcc -DBOOST_GEOMETRY_SQRT_CHECK_FINITENESS -DDISABLE_MYSQL_THREAD_H -DHAVE_CONFIG_H -DHAVE_TLSv13 -DLZ4_DISABLE_DEPRECATE_WARNINGS -D_FILE_OFFSET_BITS=64 -D_GNU_SOURCE -D__STDC_WANT_LIB_EXT1__=1 -I/tmp/B.bSxPY4/BUILD/percona-server-5.7.31-34/build/include -I/tmp/B.bSxPY4/BUILD/percona-server-5.7.31-34/extra/rapidjson/include -I/tmp/B.bSxPY4/BUILD/percona-server-5.7.31-34/build/libbinlogevents/include -I/tmp/B.bSxPY4/BUILD/percona-server-5.7.31-34/libbinlogevents/export -I/tmp/B.bSxPY4/BUILD/percona-server-5.7.31-34/include  -fPIC -Wall -Wextra -Wformat-security -Wvla -Wwrite-strings -Wdeclaration-after-statement -O3 -D_FORTIFY_SOURCE=2 -O2 -fwrapv -pipe -Wformat -Werror=format-security -gdwarf-4 -fno-debug-types-section -fvar-tracking-assignments -g2 -Wp,-D_FORTIFY_SOURCE=2 -fstack-protector-strong --param=ssp-buffer-size=4 -Werror=trampolines -fPIC -mtune=generic -march=x86-64 -gdwarf-4 -fno-debug-types-section -fvar-tracking-assignments -g2  -DNDEBUG -fno-omit-frame-pointer -fno-strict-aliasing  -Wno-shadow -g -fno-omit-frame-pointer -fno-strict-aliasing -DDBUG_OFF -DNDEBUG   -o CMakeFiles/strings.dir/my_strchr.c.o   -c /tmp/B.bSxPY4/BUILD/percona-server-5.7.31-34/strings/my_strchr.c
make[2]: Leaving directory '/tmp/B.bSxPY4/BUILD/percona-server-5.7.31-34/build'
make[2]: Entering directory '/tmp/B.bSxPY4/BUILD/percona-server-5.7.31-34/build'
[  7%] Building C object strings/CMakeFiles/strings.dir/strappend.c.o
cd /tmp/B.bSxPY4/BUILD/percona-server-5.7.31-34/build/strings && /usr/bin/x86_64-pld-linux-gnux32-gcc -DBOOST_GEOMETRY_SQRT_CHECK_FINITENESS -DDISABLE_MYSQL_THREAD_H -DHAVE_CONFIG_H -DHAVE_TLSv13 -DLZ4_DISABLE_DEPRECATE_WARNINGS -D_FILE_OFFSET_BITS=64 -D_GNU_SOURCE -D__STDC_WANT_LIB_EXT1__=1 -I/tmp/B.bSxPY4/BUILD/percona-server-5.7.31-34/build/include -I/tmp/B.bSxPY4/BUILD/percona-server-5.7.31-34/extra/rapidjson/include -I/tmp/B.bSxPY4/BUILD/percona-server-5.7.31-34/build/libbinlogevents/include -I/tmp/B.bSxPY4/BUILD/percona-server-5.7.31-34/libbinlogevents/export -I/tmp/B.bSxPY4/BUILD/percona-server-5.7.31-34/include  -fPIC -Wall -Wextra -Wformat-security -Wvla -Wwrite-strings -Wdeclaration-after-statement -O3 -D_FORTIFY_SOURCE=2 -O2 -fwrapv -pipe -Wformat -Werror=format-security -gdwarf-4 -fno-debug-types-section -fvar-tracking-assignments -g2 -Wp,-D_FORTIFY_SOURCE=2 -fstack-protector-strong --param=ssp-buffer-size=4 -Werror=trampolines -fPIC -mtune=generic -march=x86-64 -gdwarf-4 -fno-debug-types-section -fvar-tracking-assignments -g2  -DNDEBUG -fno-omit-frame-pointer -fno-strict-aliasing  -Wno-shadow -g -fno-omit-frame-pointer -fno-strict-aliasing -DDBUG_OFF -DNDEBUG   -o CMakeFiles/strings.dir/strappend.c.o   -c /tmp/B.bSxPY4/BUILD/percona-server-5.7.31-34/strings/strappend.c
make[2]: Leaving directory '/tmp/B.bSxPY4/BUILD/percona-server-5.7.31-34/build'
make[2]: Entering directory '/tmp/B.bSxPY4/BUILD/percona-server-5.7.31-34/build'
[  7%] Building C object strings/CMakeFiles/strings.dir/xml.c.o
cd /tmp/B.bSxPY4/BUILD/percona-server-5.7.31-34/build/strings && /usr/bin/x86_64-pld-linux-gnux32-gcc -DBOOST_GEOMETRY_SQRT_CHECK_FINITENESS -DDISABLE_MYSQL_THREAD_H -DHAVE_CONFIG_H -DHAVE_TLSv13 -DLZ4_DISABLE_DEPRECATE_WARNINGS -D_FILE_OFFSET_BITS=64 -D_GNU_SOURCE -D__STDC_WANT_LIB_EXT1__=1 -I/tmp/B.bSxPY4/BUILD/percona-server-5.7.31-34/build/include -I/tmp/B.bSxPY4/BUILD/percona-server-5.7.31-34/extra/rapidjson/include -I/tmp/B.bSxPY4/BUILD/percona-server-5.7.31-34/build/libbinlogevents/include -I/tmp/B.bSxPY4/BUILD/percona-server-5.7.31-34/libbinlogevents/export -I/tmp/B.bSxPY4/BUILD/percona-server-5.7.31-34/include  -fPIC -Wall -Wextra -Wformat-security -Wvla -Wwrite-strings -Wdeclaration-after-statement -O3 -D_FORTIFY_SOURCE=2 -O2 -fwrapv -pipe -Wformat -Werror=format-security -gdwarf-4 -fno-debug-types-section -fvar-tracking-assignments -g2 -Wp,-D_FORTIFY_SOURCE=2 -fstack-protector-strong --param=ssp-buffer-size=4 -Werror=trampolines -fPIC -mtune=generic -march=x86-64 -gdwarf-4 -fno-debug-types-section -fvar-tracking-assignments -g2  -DNDEBUG -fno-omit-frame-pointer -fno-strict-aliasing  -Wno-shadow -g -fno-omit-frame-pointer -fno-strict-aliasing -DDBUG_OFF -DNDEBUG   -o CMakeFiles/strings.dir/xml.c.o   -c /tmp/B.bSxPY4/BUILD/percona-server-5.7.31-34/strings/xml.c
make[2]: Leaving directory '/tmp/B.bSxPY4/BUILD/percona-server-5.7.31-34/build'
make[2]: Entering directory '/tmp/B.bSxPY4/BUILD/percona-server-5.7.31-34/build'
[  6%] Building C object strings/CMakeFiles/strings.dir/dtoa.c.o
cd /tmp/B.bSxPY4/BUILD/percona-server-5.7.31-34/build/strings && /usr/bin/x86_64-pld-linux-gnux32-gcc -DBOOST_GEOMETRY_SQRT_CHECK_FINITENESS -DDISABLE_MYSQL_THREAD_H -DHAVE_CONFIG_H -DHAVE_TLSv13 -DLZ4_DISABLE_DEPRECATE_WARNINGS -D_FILE_OFFSET_BITS=64 -D_GNU_SOURCE -D__STDC_WANT_LIB_EXT1__=1 -I/tmp/B.bSxPY4/BUILD/percona-server-5.7.31-34/build/include -I/tmp/B.bSxPY4/BUILD/percona-server-5.7.31-34/extra/rapidjson/include -I/tmp/B.bSxPY4/BUILD/percona-server-5.7.31-34/build/libbinlogevents/include -I/tmp/B.bSxPY4/BUILD/percona-server-5.7.31-34/libbinlogevents/export -I/tmp/B.bSxPY4/BUILD/percona-server-5.7.31-34/include  -fPIC -Wall -Wextra -Wformat-security -Wvla -Wwrite-strings -Wdeclaration-after-statement -O3 -D_FORTIFY_SOURCE=2 -O2 -fwrapv -pipe -Wformat -Werror=format-security -gdwarf-4 -fno-debug-types-section -fvar-tracking-assignments -g2 -Wp,-D_FORTIFY_SOURCE=2 -fstack-protector-strong --param=ssp-buffer-size=4 -Werror=trampolines -fPIC -mtune=generic -march=x86-64 -gdwarf-4 -fno-debug-types-section -fvar-tracking-assignments -g2  -DNDEBUG -fno-omit-frame-pointer -fno-strict-aliasing  -Wno-shadow -g -fno-omit-frame-pointer -fno-strict-aliasing -DDBUG_OFF -DNDEBUG   -o CMakeFiles/strings.dir/dtoa.c.o   -c /tmp/B.bSxPY4/BUILD/percona-server-5.7.31-34/strings/dtoa.c
make[2]: Leaving directory '/tmp/B.bSxPY4/BUILD/percona-server-5.7.31-34/build'
make[2]: Entering directory '/tmp/B.bSxPY4/BUILD/percona-server-5.7.31-34/build'
[  6%] Building C object strings/CMakeFiles/strings.dir/decimal.c.o
cd /tmp/B.bSxPY4/BUILD/percona-server-5.7.31-34/build/strings && /usr/bin/x86_64-pld-linux-gnux32-gcc -DBOOST_GEOMETRY_SQRT_CHECK_FINITENESS -DDISABLE_MYSQL_THREAD_H -DHAVE_CONFIG_H -DHAVE_TLSv13 -DLZ4_DISABLE_DEPRECATE_WARNINGS -D_FILE_OFFSET_BITS=64 -D_GNU_SOURCE -D__STDC_WANT_LIB_EXT1__=1 -I/tmp/B.bSxPY4/BUILD/percona-server-5.7.31-34/build/include -I/tmp/B.bSxPY4/BUILD/percona-server-5.7.31-34/extra/rapidjson/include -I/tmp/B.bSxPY4/BUILD/percona-server-5.7.31-34/build/libbinlogevents/include -I/tmp/B.bSxPY4/BUILD/percona-server-5.7.31-34/libbinlogevents/export -I/tmp/B.bSxPY4/BUILD/percona-server-5.7.31-34/include  -fPIC -Wall -Wextra -Wformat-security -Wvla -Wwrite-strings -Wdeclaration-after-statement -O3 -D_FORTIFY_SOURCE=2 -O2 -fwrapv -pipe -Wformat -Werror=format-security -gdwarf-4 -fno-debug-types-section -fvar-tracking-assignments -g2 -Wp,-D_FORTIFY_SOURCE=2 -fstack-protector-strong --param=ssp-buffer-size=4 -Werror=trampolines -fPIC -mtune=generic -march=x86-64 -gdwarf-4 -fno-debug-types-section -fvar-tracking-assignments -g2  -DNDEBUG -fno-omit-frame-pointer -fno-strict-aliasing  -Wno-shadow -g -fno-omit-frame-pointer -fno-strict-aliasing -DDBUG_OFF -DNDEBUG   -o CMakeFiles/strings.dir/decimal.c.o   -c /tmp/B.bSxPY4/BUILD/percona-server-5.7.31-34/strings/decimal.c
make[2]: Leaving directory '/tmp/B.bSxPY4/BUILD/percona-server-5.7.31-34/build'
make[2]: Entering directory '/tmp/B.bSxPY4/BUILD/percona-server-5.7.31-34/build'
[  7%] Linking C static library ../archive_output_directory/libstrings.a
cd /tmp/B.bSxPY4/BUILD/percona-server-5.7.31-34/build/strings && /usr/bin/cmake -P CMakeFiles/strings.dir/cmake_clean_target.cmake
cd /tmp/B.bSxPY4/BUILD/percona-server-5.7.31-34/build/strings && /usr/bin/cmake -E cmake_link_script CMakeFiles/strings.dir/link.txt --verbose=1
/usr/bin/ar qc ../archive_output_directory/libstrings.a  CMakeFiles/strings.dir/bchange.c.o CMakeFiles/strings.dir/ctype-big5.c.o CMakeFiles/strings.dir/ctype-bin.c.o CMakeFiles/strings.dir/ctype-cp932.c.o CMakeFiles/strings.dir/ctype-czech.c.o CMakeFiles/strings.dir/ctype-euc_kr.c.o CMakeFiles/strings.dir/ctype-eucjpms.c.o CMakeFiles/strings.dir/ctype-extra.c.o CMakeFiles/strings.dir/ctype-gb2312.c.o CMakeFiles/strings.dir/ctype-gbk.c.o CMakeFiles/strings.dir/ctype-gb18030.c.o CMakeFiles/strings.dir/ctype-latin1.c.o CMakeFiles/strings.dir/ctype-mb.c.o CMakeFiles/strings.dir/ctype-simple.c.o CMakeFiles/strings.dir/ctype-sjis.c.o CMakeFiles/strings.dir/ctype-tis620.c.o CMakeFiles/strings.dir/ctype-uca.c.o CMakeFiles/strings.dir/ctype-ucs2.c.o CMakeFiles/strings.dir/ctype-ujis.c.o CMakeFiles/strings.dir/ctype-utf8.c.o CMakeFiles/strings.dir/ctype-win1250ch.c.o CMakeFiles/strings.dir/ctype.c.o CMakeFiles/strings.dir/decimal.c.o CMakeFiles/strings.dir/dtoa.c.o CMakeFiles/strings.dir/int2str.c.o CMakeFiles/strings.dir/is_prefix.c.o CMakeFiles/strings.dir/llstr.c.o CMakeFiles/strings.dir/longlong2str.c.o CMakeFiles/strings.dir/my_strtoll10.c.o CMakeFiles/strings.dir/my_vsnprintf.c.o CMakeFiles/strings.dir/str2int.c.o CMakeFiles/strings.dir/str_alloc.c.o CMakeFiles/strings.dir/strcend.c.o CMakeFiles/strings.dir/strend.c.o CMakeFiles/strings.dir/strfill.c.o CMakeFiles/strings.dir/strmake.c.o CMakeFiles/strings.dir/my_stpmov.c.o CMakeFiles/strings.dir/my_stpnmov.c.o CMakeFiles/strings.dir/strxmov.c.o CMakeFiles/strings.dir/strxnmov.c.o CMakeFiles/strings.dir/xml.c.o CMakeFiles/strings.dir/my_strchr.c.o CMakeFiles/strings.dir/strcont.c.o CMakeFiles/strings.dir/strappend.c.o
/usr/bin/ranlib ../archive_output_directory/libstrings.a
cd /tmp/B.bSxPY4/BUILD/percona-server-5.7.31-34/build/strings && /usr/bin/cmake -DTARGET_NAME=strings -DTARGET_LOC=/tmp/B.bSxPY4/BUILD/percona-server-5.7.31-34/build/archive_output_directory/libstrings.a -DCFG_INTDIR=. -P /tmp/B.bSxPY4/BUILD/percona-server-5.7.31-34/build/archive_output_directory/lib_location_strings.cmake
make[2]: Leaving directory '/tmp/B.bSxPY4/BUILD/percona-server-5.7.31-34/build'
make[1]: Entering directory '/tmp/B.bSxPY4/BUILD/percona-server-5.7.31-34/build'
[  7%] Built target strings
make[1]: Leaving directory '/tmp/B.bSxPY4/BUILD/percona-server-5.7.31-34/build'
make: *** [Makefile:175: all] Error 2
error: Bad exit status from /tmp/B.bSxPY4/BUILD/tmp/rpm-tmp.1106 (%build)


RPM build errors:
    Bad exit status from /tmp/B.bSxPY4/BUILD/tmp/rpm-tmp.1106 (%build)
ended at: Tue Oct 13 10:52:57 2020, done in 0:01:07.983169
error: No files produced.
+ chmod -R u+rwX /tmp/B.bSxPY4/BUILD
+ rm -rf /tmp/B.bSxPY4/tmp /tmp/B.bSxPY4/BUILD
+ rm -rf /tmp/B.bSxPY4
Begin-PLD-Builder-Info
Build-Time: user:80.56s sys:22.41s real:108.26s (faults io:2 non-io:2720439)

End-PLD-Builder-Info
[Back to list of logs] [View rpm -qa of builder]