FailedOk

th/SRPMS[OK]
th/x32[OK]
th/i686[OK]
th/x86_64[OK]

ac/SRPMS[OK]
ac/i386[OK]
ac/i586[OK]
ac/i686[OK]
ac/alpha[OK]
ac/amd64[OK]
ac/athlon[OK]
ac/ppc[OK]
ac/sparc[OK]
ac/sparc64[OK]

Advanced Search
main()
Powered by PLD Linux
(c) 2002-2018 PLD Team
$Revision: 1.37 $
Powered by Real Operating System.
Your IP: 54.92.211.239

perl-PAR-Packer 89734f1a-997d-48df-be6a-29cebb4b6c47

Status:Failed
Source URL:ftp://buildlogs.pld-linux.org/th/x32/FAIL/perl-PAR-Packer,89734f1a-997d-48df-be6a-29cebb4b6c47.bz2
text/plain URL:View!
rpm -qa of builder:View!
Date:2018/07/10 09:59:23
Runtime:0:00:08.541847

Toc:

  • prep
  • Executing(%prep): /bin/sh -e /tmp/B.YPFH4s/BUILD/tmp/rpm-tmp.26225
  • build
  • Executing(%build): /bin/sh -e /tmp/B.YPFH4s/BUILD/tmp/rpm-tmp.26225
  • error 1
  • make[1]: *** [Makefile:880: parl] Error 2
  • error 2
  • error: Bad exit status from /tmp/B.YPFH4s/BUILD/tmp/rpm-tmp.26225 (%build)
  • error 3
  • RPM build errors:
  • error 4
  • error: No files produced.

Content:

request from: arekm
checking if we should skip the build
started at: Tue Jul 10 09:59:11 2018
killing old processes on a builder
sending signal 9 to pid -1
Killed
cleaning up /tmp
fetching https://srcbuilder.pld-linux.org/th//srpms/89734f1a-997d-48df-be6a-29cebb4b6c47/perl-PAR-Packer-1.045-1.src.rpm
fetched 209397 bytes, 479.4 K/s
installing srpm: perl-PAR-Packer-1.045-1.src.rpm
+ install -d /tmp/B.YPFH4s/BUILD /tmp/B.YPFH4s/RPMS
+ LC_ALL=en_US.UTF-8
+ rpm -qp --changelog perl-PAR-Packer-1.045-1.src.rpm
* Tue Jul 10 2018 PLD Linux Team <feedback@pld-linux.org>
- For complete changelog see: http://git.pld-linux.org/?p=packages/perl-PAR-Packer.git;a=log;h=auto/th/perl-PAR-Packer-1.045-1
* Tue Jul 10 2018 Arkadiusz Miśkiewicz <arekm@maven.pl> 05adfeb
- avoid file conflict with nss-tools (pp binary) * Tue Jul 10 2018 Arkadiusz Miśkiewicz <arekm@maven.pl> 55d1dfe
- up to 1.045 + rpm -Uhv --nodeps --define '_topdir /tmp/B.YPFH4s' --define '_specdir %{_topdir}' --define '_sourcedir %{_specdir}' --define '_rpmdir %{_topdir}/RPMS' --define '_builddir %{_topdir}/BUILD' --without tests --define '__make make -j1' perl-PAR-Packer-1.045-1.src.rpm Preparing... ################################################## perl-PAR-Packer ################################################## + rm -f perl-PAR-Packer-1.045-1.src.rpm + install -m 700 -d /tmp/B.YPFH4s/BUILD/tmp + TMPDIR=/tmp/B.YPFH4s/BUILD/tmp + exec nice -n 0 rpmbuild -bp --short-circuit --nodeps --define '_topdir /tmp/B.YPFH4s' --define '_specdir %{_topdir}' --define '_sourcedir %{_specdir}' --define '_rpmdir %{_topdir}/RPMS' --define '_builddir %{_topdir}/BUILD' --without tests --target x32-pld-linux --define '__make make -j1' --define 'prep exit 0' /tmp/B.YPFH4s/perl-PAR-Packer.spec Building target platforms: x32-pld-linux checking BuildConflict-ing packages no BuildConflicts found checking BR rpm: Building target platforms: x32-pld-linux no BR needed building RPM using: set -ex; : build-id: 89734f1a-997d-48df-be6a-29cebb4b6c47; TMPDIR=/tmp/B.YPFH4s/BUILD/tmp exec nice -n 0 rpmbuild -bb --define '_smp_mflags -j9' --define '_make_opts -Otarget' --define '_pld_builder 1' --define '_topdir /tmp/B.YPFH4s' --define '_specdir %{_topdir}' --define '_sourcedir %{_specdir}' --define '_rpmdir %{_topdir}/RPMS' --define '_builddir %{_topdir}/BUILD' --without tests --target x32-pld-linux --define '__make make -j1' /tmp/B.YPFH4s/perl-PAR-Packer.spec + : build-id: 89734f1a-997d-48df-be6a-29cebb4b6c47 + TMPDIR=/tmp/B.YPFH4s/BUILD/tmp + exec nice -n 0 rpmbuild -bb --define '_smp_mflags -j9' --define '_make_opts -Otarget' --define '_pld_builder 1' --define '_topdir /tmp/B.YPFH4s' --define '_specdir %{_topdir}' --define '_sourcedir %{_specdir}' --define '_rpmdir %{_topdir}/RPMS' --define '_builddir %{_topdir}/BUILD' --without tests --target x32-pld-linux --define '__make make -j1' /tmp/B.YPFH4s/perl-PAR-Packer.spec Building target platforms: x32-pld-linux Executing(%prep): /bin/sh -e /tmp/B.YPFH4s/BUILD/tmp/rpm-tmp.26225 + umask 022 + cd /tmp/B.YPFH4s/BUILD + cd /tmp/B.YPFH4s/BUILD + rm -rf PAR-Packer-1.045 + /usr/bin/gzip -dc /tmp/B.YPFH4s/PAR-Packer-1.045.tar.gz + /bin/tar -xf - + STATUS=0 + '[' 0 -ne 0 ']' + cd PAR-Packer-1.045 + /bin/id -u + '[' 1000 '=' 0 ']' + /bin/id -u + '[' 1000 '=' 0 ']' + /bin/chmod -Rf a+rX,u+w,g-w,o-w . + exit 0 Executing(%build): /bin/sh -e /tmp/B.YPFH4s/BUILD/tmp/rpm-tmp.26225 HOME=/home/users/builder PATH=/home/users/builder/GNUstep/Tools:/usr/local/bin:/usr/bin:/bin TMPDIR=/tmp/B.YPFH4s/BUILD/tmp + umask 022 + cd /tmp/B.YPFH4s/BUILD + cd PAR-Packer-1.045 + /usr/bin/perl Makefile.PL 'INSTALLDIRS=vendor' Warning: prerequisite Getopt::ArgvFile 1.07 not found. Warning: prerequisite PAR 1.014 not found. Checking if your kit is complete... Looks good Subroutine MY::postamble redefined at ./Makefile.PL line 225. Generating a Unix-style Makefile Writing Makefile for PAR::Packer Writing MYMETA.yml and MYMETA.json # using "ldd" to find shared libraries needed by ./par + make -j1 -j1 'CC=x86_64-pld-linux-gnux32-gcc' 'OPTIMIZE=-O2 -fwrapv -pipe -Wformat -Werror=format-security -gdwarf-4 -fno-debug-types-section -fvar-tracking-assignments -g2 -Wp,-D_FORTIFY_SOURCE=2 -fstack-protector-strong --param=ssp-buffer-size=4 -fPIC -mtune=generic -march=x86-64 -gdwarf-4 -fno-debug-types-section -fvar-tracking-assignments -g2 ' cp lib/App/Packer/PAR.pm blib/lib/App/Packer/PAR.pm cp lib/PAR/StrippedPARL/Base.pm blib/lib/PAR/StrippedPARL/Base.pm cp lib/PAR/Filter/PatchContent.pm blib/lib/PAR/Filter/PatchContent.pm cp lib/PAR/Filter/Bleach.pm blib/lib/PAR/Filter/Bleach.pm cp lib/PAR/Filter/PodStrip.pm blib/lib/PAR/Filter/PodStrip.pm cp lib/PAR/Filter/Bytecode.pm blib/lib/PAR/Filter/Bytecode.pm cp lib/pp.pm blib/lib/pp.pm cp lib/PAR/Packer.pm blib/lib/PAR/Packer.pm cp lib/PAR/Filter.pm blib/lib/PAR/Filter.pm cp lib/PAR/Filter/Obfuscate.pm blib/lib/PAR/Filter/Obfuscate.pm make[1]: Entering directory '/tmp/B.YPFH4s/BUILD/PAR-Packer-1.045/myldr' Makefile:853: warning: overriding recipe for target '.c.o' Makefile:335: warning: ignoring old recipe for target '.c.o' "/usr/bin/perl5.26.2" par_pl2c.pl my_par_pl < ../script/par.pl > my_par_pl.c "/usr/bin/perl5.26.2" sha1.c.PL x86_64-pld-linux-gnux32-gcc -c -D_REENTRANT -D_GNU_SOURCE -fwrapv -fno-strict-aliasing -pipe -fstack-protector-strong -I/usr/local/include -D_LARGEFILE_SOURCE -D_FILE_OFFSET_BITS=64 -I/usr/libx32/perl5/5.26.2/x86_64-pld-linux-gnux32-thread-multi/CORE -DLDLIBPTHNAME=\"\" -DPARL_EXE=\"parl\" -DPAR_PACKER_VERSION=\"1.045\" -O2 -fwrapv -pipe -Wformat -Werror=format-security -gdwarf-4 -fno-debug-types-section -fvar-tracking-assignments -g2 -Wp,-D_FORTIFY_SOURCE=2 -fstack-protector-strong --param=ssp-buffer-size=4 -fPIC -mtune=generic -march=x86-64 -gdwarf-4 -fno-debug-types-section -fvar-tracking-assignments -g2 main.c In file included from main.c:52:0: mktmpdir.c: In function 'par_mktmpdir': mktmpdir.c:226:9: warning: ignoring return value of 'read', declared with attribute warn_unused_result [-Wunused-result] read(f, buf, 6); ^~~~~~~~~~~~~~~ mktmpdir.c:231:13: warning: ignoring return value of 'read', declared with attribute warn_unused_result [-Wunused-result] read(f, buf, 41); ^~~~~~~~~~~~~~~~ x86_64-pld-linux-gnux32-gcc main.o -s -rdynamic -Wl,-rpath,/usr/libx32/perl5/5.26.2/x86_64-pld-linux-gnux32-thread-multi/CORE -Wl,--no-copy-dt-needed-entries -Wl,-z,relro -Wl,-z,combreloc -fstack-protector-strong -L/usr/local/lib -L/usr/libx32/perl5/5.26.2/x86_64-pld-linux-gnux32-thread-multi/CORE -lperl -ldl -lm -lpthread -lc -lcrypt -o ./par true "/usr/bin/perl5.26.2" encode_append.pl Dynamic.in ./par Dynamic.pm "/usr/bin/perl5.26.2" embed_files.pl -c 32768 ./par ldd "/usr/libx32/libperl.so.5.26.0" > boot_embedded_files.c # using method ldd to find files to embed # embedding "./par" as "par" # embedding "/usr/libx32/perl5/5.26.2/x86_64-pld-linux-gnux32-thread-multi/CORE/libperl.so.5.26.0" as "libperl.so.5.26.0" # embedding "/libx32/libpthread.so.0" as "libpthread.so.0" # embedding "/libx32/libm.so.6" as "libm.so.6" # embedding "/libx32/libdl.so.2" as "libdl.so.2" # embedding "/libx32/libcrypt.so.1" as "libcrypt.so.1" # embedding "/libx32/libc.so.6" as "libc.so.6" # embedding "/usr/libx32/libfreebl3.so" as "libfreebl3.so" x86_64-pld-linux-gnux32-gcc -c -D_REENTRANT -D_GNU_SOURCE -fwrapv -fno-strict-aliasing -pipe -fstack-protector-strong -I/usr/local/include -D_LARGEFILE_SOURCE -D_FILE_OFFSET_BITS=64 -I/usr/libx32/perl5/5.26.2/x86_64-pld-linux-gnux32-thread-multi/CORE -DLDLIBPTHNAME=\"\" -DPARL_EXE=\"parl\" -DPAR_PACKER_VERSION=\"1.045\" -O2 -fwrapv -pipe -Wformat -Werror=format-security -gdwarf-4 -fno-debug-types-section -fvar-tracking-assignments -g2 -Wp,-D_FORTIFY_SOURCE=2 -fstack-protector-strong --param=ssp-buffer-size=4 -fPIC -mtune=generic -march=x86-64 -gdwarf-4 -fno-debug-types-section -fvar-tracking-assignments -g2 boot.c In file included from boot.c:10:0: mktmpdir.c: In function 'par_mktmpdir': mktmpdir.c:226:9: warning: ignoring return value of 'read', declared with attribute warn_unused_result [-Wunused-result] read(f, buf, 6); ^~~~~~~~~~~~~~~ mktmpdir.c:231:13: warning: ignoring return value of 'read', declared with attribute warn_unused_result [-Wunused-result] read(f, buf, 41); ^~~~~~~~~~~~~~~~ x86_64-pld-linux-gnux32-gcc boot.o -s -rdynamic -Wl,-rpath,/usr/libx32/perl5/5.26.2/x86_64-pld-linux-gnux32-thread-multi/CORE -Wl,--no-copy-dt-needed-entries -Wl,-z,relro -Wl,-z,combreloc -fstack-protector-strong -L/usr/local/lib -L/usr/libx32/perl5/5.26.2/x86_64-pld-linux-gnux32-thread-multi/CORE -ldl -lm -lpthread -lc -lcrypt -o ./boot true "/usr/bin/perl5.26.2" encode_append.pl Static.in ./boot Static.pm cp Dynamic.pm ../blib/lib/PAR/StrippedPARL/Dynamic.pm cp Static.pm ../blib/lib/PAR/StrippedPARL/Static.pm "/usr/bin/perl5.26.2" -Mblib=.. run_with_inc.pl ./boot -q -B -Oparl Can't locate PAR/Heavy.pm in @INC (you may need to install the PAR::Heavy module) (@INC contains: ../blib/arch ../blib/lib /usr/local/lib/perl5/5.26.0/x86_64-pld-linux-gnux32-thread-multi /usr/local/share/perl5 /usr/libx32/perl5/vendor_perl/5.26.0/x86_64-pld-linux-gnux32-thread-multi /usr/share/perl5/vendor_perl /usr/libx32/perl5/5.26.2/x86_64-pld-linux-gnux32-thread-multi /usr/share/perl5/5.26.2 /usr/local/lib/perl5/5.26.0/x86_64-pld-linux-gnux32-thread-multi /usr/local/share/perl5 /usr/libx32/perl5/vendor_perl/5.26.0/x86_64-pld-linux-gnux32-thread-multi /usr/share/perl5/vendor_perl /usr/libx32/perl5/5.26.2/x86_64-pld-linux-gnux32-thread-multi /usr/share/perl5/5.26.2) at -e line 268, <_FH> chunk 1. system(./boot -I../blib/arch -I../blib/lib -I/usr/local/lib/perl5/5.26.0/x86_64-pld-linux-gnux32-thread-multi -I/usr/local/share/perl5 -I/usr/libx32/perl5/vendor_perl/5.26.0/x86_64-pld-linux-gnux32-thread-multi -I/usr/share/perl5/vendor_perl -I/usr/libx32/perl5/5.26.2/x86_64-pld-linux-gnux32-thread-multi -I/usr/share/perl5/5.26.2 -q -B -Oparl) failed: make[1]: *** [Makefile:880: parl] Error 2 make[1]: Leaving directory '/tmp/B.YPFH4s/BUILD/PAR-Packer-1.045/myldr' make: *** [Makefile:572: subdirs] Error 2 error: Bad exit status from /tmp/B.YPFH4s/BUILD/tmp/rpm-tmp.26225 (%build) RPM build errors: Bad exit status from /tmp/B.YPFH4s/BUILD/tmp/rpm-tmp.26225 (%build) ended at: Tue Jul 10 09:59:23 2018, done in 0:00:08.541847 error: No files produced. + chmod -R u+rwX /tmp/B.YPFH4s/BUILD + rm -rf /tmp/B.YPFH4s/tmp /tmp/B.YPFH4s/BUILD + rm -rf /tmp/B.YPFH4s Begin-PLD-Builder-Info Build-Time: user:9.60s sys:0.79s real:11.77s (faults io:0 non-io:173873) End-PLD-Builder-Info
[Back to list of logs] [View rpm -qa of builder]