FailedOk

th/SRPMS[OK]
th/x32[OK]
th/i686[OK]
th/x86_64[OK]

ac/SRPMS[OK]
ac/i386[OK]
ac/i586[OK]
ac/i686[OK]
ac/alpha[OK]
ac/amd64[OK]
ac/athlon[OK]
ac/ppc[OK]
ac/sparc[OK]
ac/sparc64[OK]

Advanced Search
main()
Powered by PLD Linux
(c) 2002-2018 PLD Team
$Revision: 1.37 $
Powered by Linux.
Your IP: 35.175.190.77

php-pecl-libsodium 2104b5f3-4420-4a85-bea1-ea3041d5715d

Status:Failed
Source URL:ftp://buildlogs.pld-linux.org/th/x32/FAIL/php-pecl-libsodium,2104b5f3-4420-4a85-bea1-ea3041d5715d.bz2
text/plain URL:View!
rpm -qa of builder:View!
Date:2017/12/26 22:44:34
Runtime:0:00:06.967779

Toc:

  • error 1
  • rpm: error: Failed build dependencies:
  • error 2
  • rpm: error: Failed build dependencies:
  • prep
  • Executing(%prep): /bin/sh -e /tmp/B.cSvp5U/BUILD/tmp/rpm-tmp.63176
  • build
  • Executing(%build): /bin/sh -e /tmp/B.cSvp5U/BUILD/tmp/rpm-tmp.63176
  • error 3
  • error: Bad exit status from /tmp/B.cSvp5U/BUILD/tmp/rpm-tmp.63176 (%build)
  • error 4
  • RPM build errors:
  • error 5
  • error: No files produced.

Content:

request from: baggins
checking if we should skip the build
started at: Tue Dec 26 22:44:12 2017
fetching https://srcbuilder.pld-linux.org/th//srpms/2104b5f3-4420-4a85-bea1-ea3041d5715d/php71-pecl-libsodium-1.0.7-1.src.rpm
fetched 182443 bytes, 223.8 K/s
installing srpm: php71-pecl-libsodium-1.0.7-1.src.rpm
+ install -d /tmp/B.cSvp5U/BUILD /tmp/B.cSvp5U/RPMS
+ LC_ALL=en_US.UTF-8
+ rpm -qp --changelog php71-pecl-libsodium-1.0.7-1.src.rpm
* Tue Dec 26 2017 PLD Linux Team <feedback@pld-linux.org>
- For complete changelog see: http://git.pld-linux.org/?p=packages/php-pecl-libsodium.git;a=log;h=master
* Tue Dec 26 2017 Jakub Bogusz <qboosh@pld-linux.org> abeee5f
- updated to 1.0.7, pl + rpm -Uhv --nodeps --define '_topdir /tmp/B.cSvp5U' --define '_specdir %{_topdir}' --define '_sourcedir %{_specdir}' --define '_rpmdir %{_topdir}/RPMS' --define '_builddir %{_topdir}/BUILD' --define 'php_suffix 71' php71-pecl-libsodium-1.0.7-1.src.rpm Preparing... ################################################## php71-pecl-libsodium ################################################## + rm -f php71-pecl-libsodium-1.0.7-1.src.rpm + install -m 700 -d /tmp/B.cSvp5U/BUILD/tmp + TMPDIR=/tmp/B.cSvp5U/BUILD/tmp + exec nice -n 0 rpmbuild -bp --short-circuit --nodeps --define '_topdir /tmp/B.cSvp5U' --define '_specdir %{_topdir}' --define '_sourcedir %{_specdir}' --define '_rpmdir %{_topdir}/RPMS' --define '_builddir %{_topdir}/BUILD' --target x32-pld-linux --define 'php_suffix 71' --define 'prep exit 0' /tmp/B.cSvp5U/php-pecl-libsodium.spec Building target platforms: x32-pld-linux checking BuildConflict-ing packages no BuildConflicts found checking BR rpm: error: Failed build dependencies: rpm: php71-devel >= 4:5.3 is needed by php71-pecl-libsodium-1.0.7-1.src rpm: php71-json is needed by php71-pecl-libsodium-1.0.7-1.src rpm: Building target platforms: x32-pld-linux updating poldek cache... ready is up to date Retrieving th::packages.ndir.md... th is up to date Retrieving th::packages.ndir.md... th is up to date Retrieving th-ready::packages.ndir.md... th-ready is up to date Retrieving th-ready::packages.ndir.md... th-ready is up to date Retrieving th-test::packages.ndir.md... th-test is up to date Retrieving th-test::packages.ndir.md... th-test is up to date checking conflicting packages in BRed packages poldek: Loading [pndir]ready... poldek: Loading [pndir]th-test... poldek: Loading [pndir]th-test... poldek: Loading [pndir]th-ready... poldek: Loading [pndir]th-ready... poldek: Loading [pndir]th... poldek: Loading [pndir]th... poldek: 26836 packages read poldek: Removed 3931 duplicate packages from available set poldek: Processing dependencies... poldek: php70-devel-7.0.26-3.x32 obsoleted by php71-devel-7.1.12-3.x32 poldek: There are 2 packages to install, 1 to remove: poldek: I php71-devel-7.1.12-3.x32 php71-json-7.1.12-3.x32 poldek: R php70-devel-7.0.26-3.x32 poldek: This operation will use 478.6KB of disk space. poldek: Need to get 507.3KB of archives (507.3KB to download). poldek: poldek: Retrieving [1/2] th-test::php71-devel-7.1.12-3.x32.rpm... poldek: ..............................done poldek: Retrieving [2/2] th-test::php71-json-7.1.12-3.x32.rpm... poldek: ..............................done poldek: Executing pm-command.sh --upgrade -vh --test --root / --define _check_dirname_deps 1... poldek: Preparing... ################################################## no conflicts found checking BR rpm: error: Failed build dependencies: rpm: php71-devel >= 4:5.3 is needed by php71-pecl-libsodium-1.0.7-1.src rpm: php71-json is needed by php71-pecl-libsodium-1.0.7-1.src rpm: Building target platforms: x32-pld-linux installing BR: php71\-json php71\-devel + poldek --noask --caplookup -Q -v '--ignore=hhvm-*' '--ignore=php4-*' '--ignore=php52-*' '--ignore=php53-*' '--ignore=php54-*' '--ignore=php55-*' '--ignore=php56-*' '--ignore=php70-*' --upgrade php71-json php71-devel Loading [pndir]ready... Loading [pndir]th-test... Loading [pndir]th-test... Loading [pndir]th-ready... Loading [pndir]th-ready... Loading [pndir]th... Loading [pndir]th... 26836 packages read Removed 3931 duplicate packages from available set Processing dependencies... php70-devel-7.0.26-3.x32 obsoleted by php71-devel-7.1.12-3.x32 There are 2 packages to install, 1 to remove: I php71-devel-7.1.12-3.x32 php71-json-7.1.12-3.x32 R php70-devel-7.0.26-3.x32 This operation will use 478.6KB of disk space. Need to get 507.3KB of archives. Executing pm-command.sh --upgrade -vh --root / --define _check_dirname_deps 1... Preparing... ################################################## php71-devel ################################################## php71-json ################################################## building RPM using: set -ex; : build-id: 2104b5f3-4420-4a85-bea1-ea3041d5715d; TMPDIR=/tmp/B.cSvp5U/BUILD/tmp exec nice -n 0 rpmbuild -bb --define '_smp_mflags -j9' --define '_make_opts -Otarget' --define '_pld_builder 1' --define '_topdir /tmp/B.cSvp5U' --define '_specdir %{_topdir}' --define '_sourcedir %{_specdir}' --define '_rpmdir %{_topdir}/RPMS' --define '_builddir %{_topdir}/BUILD' --target x32-pld-linux --define 'php_suffix 71' /tmp/B.cSvp5U/php-pecl-libsodium.spec + : build-id: 2104b5f3-4420-4a85-bea1-ea3041d5715d + TMPDIR=/tmp/B.cSvp5U/BUILD/tmp + exec nice -n 0 rpmbuild -bb --define '_smp_mflags -j9' --define '_make_opts -Otarget' --define '_pld_builder 1' --define '_topdir /tmp/B.cSvp5U' --define '_specdir %{_topdir}' --define '_sourcedir %{_specdir}' --define '_rpmdir %{_topdir}/RPMS' --define '_builddir %{_topdir}/BUILD' --target x32-pld-linux --define 'php_suffix 71' /tmp/B.cSvp5U/php-pecl-libsodium.spec Building target platforms: x32-pld-linux Executing(%prep): /bin/sh -e /tmp/B.cSvp5U/BUILD/tmp/rpm-tmp.63176 + umask 022 + cd /tmp/B.cSvp5U/BUILD + cd /tmp/B.cSvp5U/BUILD + rm -rf php71-pecl-libsodium-1.0.7 + /bin/mkdir -p php71-pecl-libsodium-1.0.7 + cd php71-pecl-libsodium-1.0.7 + /usr/bin/gzip -dc /tmp/B.cSvp5U/libsodium-1.0.7.tgz + /bin/tar -xf - + STATUS=0 + '[' 0 -ne 0 ']' + /bin/id -u + '[' 1000 '=' 0 ']' + /bin/id -u + '[' 1000 '=' 0 ']' + /bin/chmod -Rf a+rX,u+w,g-w,o-w . + /bin/mv libsodium-1.0.7/LICENSE libsodium-1.0.7/README.md libsodium-1.0.7/acinclude.m4 libsodium-1.0.7/aclocal.m4 libsodium-1.0.7/build libsodium-1.0.7/compat.h libsodium-1.0.7/config.h libsodium-1.0.7/config.m4 libsodium-1.0.7/config.w32 libsodium-1.0.7/libsodium.c libsodium-1.0.7/php_libsodium.h libsodium-1.0.7/tests . + exit 0 Executing(%build): /bin/sh -e /tmp/B.cSvp5U/BUILD/tmp/rpm-tmp.63176 HOME=/home/users/builder PATH=/home/users/builder/GNUstep/Tools:/usr/local/bin:/usr/bin:/bin TMPDIR=/tmp/B.cSvp5U/BUILD/tmp + umask 022 + cd /tmp/B.cSvp5U/BUILD + cd php71-pecl-libsodium-1.0.7 + sed -n '/#define PHP_LIBSODIUM_VERSION/{s/.* "//;s/".*$//;p}' php_libsodium.h + extver=1.0.7 + test x1.0.7 '!=' x1.0.7 + phpize Configuring for: PHP Api Version: 20160303 Zend Module Api No: 20160303 Zend Extension Api No: 320160303 + ./configure 'LDFLAGS=-Wl,--as-needed -Wl,--no-copy-dt-needed-entries -Wl,-z,relro -Wl,-z,combreloc ' 'CFLAGS=-O2 -fwrapv -pipe -Wformat -Werror=format-security -gdwarf-4 -fno-debug-types-section -fvar-tracking-assignments -g2 -Wp,-D_FORTIFY_SOURCE=2 -fstack-protector-strong --param=ssp-buffer-size=4 -fPIC -mtune=generic -march=x86-64 -gdwarf-4 -fno-debug-types-section -fvar-tracking-assignments -g2 ' 'CXXFLAGS=-O2 -fwrapv -pipe -Wformat -Werror=format-security -gdwarf-4 -fno-debug-types-section -fvar-tracking-assignments -g2 -Wp,-D_FORTIFY_SOURCE=2 -fstack-protector-strong --param=ssp-buffer-size=4 -fPIC -mtune=generic -march=x86-64 -gdwarf-4 -fno-debug-types-section -fvar-tracking-assignments -g2 ' 'FFLAGS=-O2 -fwrapv -pipe -Wformat -Werror=format-security -gdwarf-4 -fno-debug-types-section -fvar-tracking-assignments -g2 -Wp,-D_FORTIFY_SOURCE=2 -fstack-protector-strong --param=ssp-buffer-size=4 -fPIC -mtune=generic -march=x86-64 -gdwarf-4 -fno-debug-types-section -fvar-tracking-assignments -g2 ' 'FCFLAGS=-O2 -fwrapv -pipe -Wformat -Werror=format-security -gdwarf-4 -fno-debug-types-section -fvar-tracking-assignments -g2 -Wp,-D_FORTIFY_SOURCE=2 -fstack-protector-strong --param=ssp-buffer-size=4 -fPIC -mtune=generic -march=x86-64 -gdwarf-4 -fno-debug-types-section -fvar-tracking-assignments -g2 ' 'CPPFLAGS=' 'CC=x86_64-pld-linux-gnux32-gcc' 'CXX=x86_64-pld-linux-gnux32-g++' '--host=x86_64-pld-linux-gnux32' '--build=x86_64-pld-linux-gnux32' '--prefix=/usr' '--exec-prefix=/usr' '--bindir=/usr/bin' '--sbindir=/usr/sbin' '--sysconfdir=/etc' '--datadir=/usr/share' '--includedir=/usr/include' '--libdir=/usr/libx32' '--libexecdir=/usr/libexec' '--localstatedir=/var' '--sharedstatedir=/var/lib' '--mandir=/usr/share/man' '--infodir=/usr/share/info' '--x-libraries=/usr/libx32' checking for grep that handles long lines and -e... /bin/grep checking for egrep... /bin/grep -E checking for a sed that does not truncate output... /bin/sed checking for x86_64-pld-linux-gnux32-cc... x86_64-pld-linux-gnux32-gcc checking whether the C compiler works... yes checking for C compiler default output file name... a.out checking for suffix of executables... checking whether we are cross compiling... no checking for suffix of object files... o checking whether we are using the GNU C compiler... yes checking whether x86_64-pld-linux-gnux32-gcc accepts -g... yes checking for x86_64-pld-linux-gnux32-gcc option to accept ISO C89... none needed checking how to run the C preprocessor... x86_64-pld-linux-gnux32-gcc -E checking for icc... no checking for suncc... no checking whether x86_64-pld-linux-gnux32-gcc and cc understand -c and -o together... yes checking for system library directory... lib checking if compiler supports -R... no checking if compiler supports -Wl,-rpath,... yes checking build system type... x86_64-pld-linux-gnux32 checking host system type... x86_64-pld-linux-gnux32 checking target system type... x86_64-pld-linux-gnux32 checking for PHP prefix... /usr checking for PHP includes... -I/usr/include/php -I/usr/include/php/main -I/usr/include/php/TSRM -I/usr/include/php/Zend -I/usr/include/php/ext -I/usr/include/php/ext/date/lib checking for PHP extension directory... /usr/libx32/php71 checking for PHP installed headers prefix... /usr/include/php checking if debug is enabled... no checking if zts is enabled... no checking for re2c... re2c checking for re2c version... 0.13.5 (ok) checking for gawk... gawk checking for libsodium support... yes, shared checking for libsodium files in default path... found in /usr checking for sodium_add in -lsodium... yes checking for crypto_aead_aes256gcm_encrypt in -lsodium... yes checking how to print strings... print -r checking for a sed that does not truncate output... (cached) /bin/sed checking for fgrep... /bin/grep -F checking for ld used by x86_64-pld-linux-gnux32-gcc... /usr/bin/ld checking if the linker (/usr/bin/ld) is GNU ld... yes checking for BSD- or MS-compatible name lister (nm)... /usr/bin/nm -B checking the name lister (/usr/bin/nm -B) interface... BSD nm checking whether ln -s works... yes checking the maximum length of command line arguments... 1572864 checking how to convert x86_64-pld-linux-gnux32 file names to x86_64-pld-linux-gnux32 format... func_convert_file_noop checking how to convert x86_64-pld-linux-gnux32 file names to toolchain format... func_convert_file_noop checking for /usr/bin/ld option to reload object files... -r checking for x86_64-pld-linux-gnux32-objdump... no checking for objdump... objdump checking how to recognize dependent libraries... pass_all checking for x86_64-pld-linux-gnux32-dlltool... no checking for dlltool... no checking how to associate runtime and link libraries... print -r -- checking for x86_64-pld-linux-gnux32-ar... no checking for ar... ar checking for archiver @FILE support... @ checking for x86_64-pld-linux-gnux32-strip... no checking for strip... strip checking for x86_64-pld-linux-gnux32-ranlib... no checking for ranlib... ranlib checking for mawk... (cached) gawk checking command to parse /usr/bin/nm -B output from x86_64-pld-linux-gnux32-gcc object... ok checking for sysroot... no checking for a working dd... /bin/dd checking how to truncate binary pipes... /bin/dd bs=4096 count=1 checking for x86_64-pld-linux-gnux32-mt... no checking for mt... no checking if : is a manifest tool... no checking for ANSI C header files... yes checking for sys/types.h... yes checking for sys/stat.h... yes checking for stdlib.h... yes checking for string.h... yes checking for memory.h... yes checking for strings.h... yes checking for inttypes.h... yes checking for stdint.h... yes checking for unistd.h... yes checking for dlfcn.h... yes checking for objdir... .libs checking if x86_64-pld-linux-gnux32-gcc supports -fno-rtti -fno-exceptions... no checking for x86_64-pld-linux-gnux32-gcc option to produce PIC... -fPIC -DPIC checking if x86_64-pld-linux-gnux32-gcc PIC flag -fPIC -DPIC works... yes checking if x86_64-pld-linux-gnux32-gcc static flag -static works... yes checking if x86_64-pld-linux-gnux32-gcc supports -c -o file.o... yes checking if x86_64-pld-linux-gnux32-gcc supports -c -o file.o... (cached) yes checking whether the x86_64-pld-linux-gnux32-gcc linker (/usr/bin/ld -m elf32_x86_64) supports shared libraries... yes checking whether -lc should be explicitly linked in... no checking dynamic linker characteristics... GNU/Linux ld.so checking how to hardcode library paths into programs... immediate checking whether stripping libraries is possible... yes checking if libtool supports shared libraries... yes checking whether to build shared libraries... yes checking whether to build static libraries... no configure: creating ./config.status config.status: creating config.h config.status: executing libtool commands + /usr/bin/make -Otarget -j9 /bin/sh /tmp/B.cSvp5U/BUILD/php71-pecl-libsodium-1.0.7/libtool --mode=compile x86_64-pld-linux-gnux32-gcc -I. -I/tmp/B.cSvp5U/BUILD/php71-pecl-libsodium-1.0.7 -DPHP_ATOM_INC -I/tmp/B.cSvp5U/BUILD/php71-pecl-libsodium-1.0.7/include -I/tmp/B.cSvp5U/BUILD/php71-pecl-libsodium-1.0.7/main -I/tmp/B.cSvp5U/BUILD/php71-pecl-libsodium-1.0.7 -I/usr/include/php -I/usr/include/php/main -I/usr/include/php/TSRM -I/usr/include/php/Zend -I/usr/include/php/ext -I/usr/include/php/ext/date/lib -DHAVE_CONFIG_H -O2 -fwrapv -pipe -Wformat -Werror=format-security -gdwarf-4 -fno-debug-types-section -fvar-tracking-assignments -g2 -Wp,-D_FORTIFY_SOURCE=2 -fstack-protector-strong --param=ssp-buffer-size=4 -fPIC -mtune=generic -march=x86-64 -gdwarf-4 -fno-debug-types-section -fvar-tracking-assignments -g2 -c /tmp/B.cSvp5U/BUILD/php71-pecl-libsodium-1.0.7/libsodium.c -o libsodium.lo libtool: compile: x86_64-pld-linux-gnux32-gcc -I. -I/tmp/B.cSvp5U/BUILD/php71-pecl-libsodium-1.0.7 -DPHP_ATOM_INC -I/tmp/B.cSvp5U/BUILD/php71-pecl-libsodium-1.0.7/include -I/tmp/B.cSvp5U/BUILD/php71-pecl-libsodium-1.0.7/main -I/tmp/B.cSvp5U/BUILD/php71-pecl-libsodium-1.0.7 -I/usr/include/php -I/usr/include/php/main -I/usr/include/php/TSRM -I/usr/include/php/Zend -I/usr/include/php/ext -I/usr/include/php/ext/date/lib -DHAVE_CONFIG_H -O2 -fwrapv -pipe -Wformat -Werror=format-security -gdwarf-4 -fno-debug-types-section -fvar-tracking-assignments -g2 -Wp,-D_FORTIFY_SOURCE=2 -fstack-protector-strong --param=ssp-buffer-size=4 -fPIC -mtune=generic -march=x86-64 -gdwarf-4 -fno-debug-types-section -fvar-tracking-assignments -g2 -c /tmp/B.cSvp5U/BUILD/php71-pecl-libsodium-1.0.7/libsodium.c -fPIC -DPIC -o .libs/libsodium.o /bin/sh /tmp/B.cSvp5U/BUILD/php71-pecl-libsodium-1.0.7/libtool --mode=link x86_64-pld-linux-gnux32-gcc -DPHP_ATOM_INC -I/tmp/B.cSvp5U/BUILD/php71-pecl-libsodium-1.0.7/include -I/tmp/B.cSvp5U/BUILD/php71-pecl-libsodium-1.0.7/main -I/tmp/B.cSvp5U/BUILD/php71-pecl-libsodium-1.0.7 -I/usr/include/php -I/usr/include/php/main -I/usr/include/php/TSRM -I/usr/include/php/Zend -I/usr/include/php/ext -I/usr/include/php/ext/date/lib -DHAVE_CONFIG_H -O2 -fwrapv -pipe -Wformat -Werror=format-security -gdwarf-4 -fno-debug-types-section -fvar-tracking-assignments -g2 -Wp,-D_FORTIFY_SOURCE=2 -fstack-protector-strong --param=ssp-buffer-size=4 -fPIC -mtune=generic -march=x86-64 -gdwarf-4 -fno-debug-types-section -fvar-tracking-assignments -g2 -Wl,--as-needed -Wl,--no-copy-dt-needed-entries -Wl,-z,relro -Wl,-z,combreloc -o libsodium.la -export-dynamic -avoid-version -prefer-pic -module -rpath /tmp/B.cSvp5U/BUILD/php71-pecl-libsodium-1.0.7/modules libsodium.lo -lsodium libtool: link: x86_64-pld-linux-gnux32-gcc -shared -fPIC -DPIC -O2 -gdwarf-4 -g2 -fstack-protector-strong -mtune=generic -march=x86-64 -gdwarf-4 -g2 -Wl,--as-needed -Wl,--no-copy-dt-needed-entries -Wl,-z -Wl,relro -Wl,-z -Wl,combreloc .libs/libsodium.o -lsodium -Wl,-soname -Wl,libsodium.so -o .libs/libsodium.so libtool: link: ( cd ".libs" && rm -f "libsodium.la" && ln -s "../libsodium.la" "libsodium.la" ) /bin/sh /tmp/B.cSvp5U/BUILD/php71-pecl-libsodium-1.0.7/libtool --mode=install cp ./libsodium.la /tmp/B.cSvp5U/BUILD/php71-pecl-libsodium-1.0.7/modules libtool: install: cp ./.libs/libsodium.so /tmp/B.cSvp5U/BUILD/php71-pecl-libsodium-1.0.7/modules/libsodium.so libtool: install: cp ./.libs/libsodium.lai /tmp/B.cSvp5U/BUILD/php71-pecl-libsodium-1.0.7/modules/libsodium.la libtool: finish: PATH="/home/users/builder/GNUstep/Tools:/usr/local/bin:/usr/bin:/bin:/sbin" ldconfig -n /tmp/B.cSvp5U/BUILD/php71-pecl-libsodium-1.0.7/modules ---------------------------------------------------------------------- Libraries have been installed in: /tmp/B.cSvp5U/BUILD/php71-pecl-libsodium-1.0.7/modules If you ever happen to want to link against installed libraries in a given directory, LIBDIR, you must either use libtool, and specify the full pathname of the library, or use the '-LLIBDIR' flag during linking and do at least one of the following: - add LIBDIR to the 'LD_LIBRARY_PATH' environment variable during execution - add LIBDIR to the 'LD_RUN_PATH' environment variable during linking - use the '-Wl,-rpath -Wl,LIBDIR' linker flag - have your system administrator add LIBDIR to '/etc/ld.so.conf' See any operating system documentation about shared libraries for more information, such as the ld(1) and ld.so(8) manual pages. ---------------------------------------------------------------------- Build complete. Don't forget to run 'make test'. + : Minimal load test + >modules.log + /usr/bin/php71 -n -d 'extension_dir=modules' -d 'extension=libsodium.so' -m + grep libsodium modules.log libsodium + : Upstream test suite + export 'NO_INTERACTION=1' 'REPORT_EXIT_STATUS=1' 'MALLOC_CHECK_=2' + /usr/bin/make -Otarget -j9 test 'PHP_EXECUTABLE=/usr/bin/php71' 'PHP_TEST_SHARED_SYSTEM_EXTENSIONS=json' Build complete. Don't forget to run 'make test'. ===================================================================== PHP : /usr/bin/php71 PHP_SAPI : cli PHP_VERSION : 7.1.12 ZEND_VERSION: 3.1.0 PHP_OS : Linux - Linux naiad-pld 4.1.47-1 #1 SMP Sat Dec 9 17:56:06 CET 2017 x86_64 INI actual : /tmp/B.cSvp5U/BUILD/php71-pecl-libsodium-1.0.7/tmp-php.ini More .INIs : CWD : /tmp/B.cSvp5U/BUILD/php71-pecl-libsodium-1.0.7 Extra dirs : VALGRIND : Not used ===================================================================== TIME START 2017-12-26 22:44:33 ===================================================================== TEST 1/17 [tests/crypto_aead.phpt] PASS Check for libsodium AEAD [tests/crypto_aead.phpt] TEST 2/17 [tests/crypto_auth.phpt] FAIL Check for libsodium auth [tests/crypto_auth.phpt] TEST 3/17 [tests/crypto_box.phpt] PASS Check for libsodium box [tests/crypto_box.phpt] TEST 4/17 [tests/crypto_generichash.phpt] PASS Check for libsodium generichash [tests/crypto_generichash.phpt] TEST 5/17 [tests/crypto_hex.phpt] PASS Check for libsodium bin2hex [tests/crypto_hex.phpt] TEST 6/17 [tests/crypto_kx.phpt] PASS Check for libsodium-based key exchange [tests/crypto_kx.phpt] TEST 7/17 [tests/crypto_scalarmult.phpt] PASS Check for libsodium scalarmult [tests/crypto_scalarmult.phpt] TEST 8/17 [tests/crypto_secretbox.phpt] PASS Check for libsodium secretbox [tests/crypto_secretbox.phpt] TEST 9/17 [tests/crypto_shorthash.phpt] PASS Check for libsodium shorthash [tests/crypto_shorthash.phpt] TEST 10/17 [tests/crypto_sign.phpt] PASS Check for libsodium ed25519 signatures [tests/crypto_sign.phpt] TEST 11/17 [tests/crypto_stream.phpt] PASS Check for libsodium stream [tests/crypto_stream.phpt] TEST 12/17 [tests/installed.phpt] PASS Check for libsodium presence [tests/installed.phpt] TEST 13/17 [tests/pwhash_argon2i.phpt] PASS Check for libsodium utils [tests/pwhash_argon2i.phpt] TEST 14/17 [tests/pwhash_scrypt.phpt] PASS Check for libsodium utils [tests/pwhash_scrypt.phpt] TEST 15/17 [tests/randombytes.phpt] PASS Check for libsodium randombytes [tests/randombytes.phpt] TEST 16/17 [tests/utils.phpt] PASS Check for libsodium utils [tests/utils.phpt] TEST 17/17 [tests/version.phpt] PASS Check for libsodium version [tests/version.phpt] ===================================================================== TIME END 2017-12-26 22:44:34 ===================================================================== TEST RESULT SUMMARY --------------------------------------------------------------------- Exts skipped : 0 Exts tested : 7 --------------------------------------------------------------------- Number of tests : 17 17 Tests skipped : 0 ( 0.0%) -------- Tests warned : 0 ( 0.0%) ( 0.0%) Tests failed : 1 ( 5.9%) ( 5.9%) Expected fail : 0 ( 0.0%) ( 0.0%) Tests passed : 16 ( 94.1%) ( 94.1%) --------------------------------------------------------------------- Time taken : 1 seconds ===================================================================== ===================================================================== FAILED TEST SUMMARY --------------------------------------------------------------------- Check for libsodium auth [tests/crypto_auth.phpt] ===================================================================== make: *** [Makefile:151: test] Error 1 error: Bad exit status from /tmp/B.cSvp5U/BUILD/tmp/rpm-tmp.63176 (%build) RPM build errors: Bad exit status from /tmp/B.cSvp5U/BUILD/tmp/rpm-tmp.63176 (%build) ended at: Tue Dec 26 22:44:34 2017, done in 0:00:06.967779 error: No files produced. + chmod -R u+rwX /tmp/B.cSvp5U/BUILD + rm -rf /tmp/B.cSvp5U/tmp /tmp/B.cSvp5U/BUILD + rm -rf /tmp/B.cSvp5U Begin-PLD-Builder-Info Build-Time: user:12.52s sys:1.81s real:22.83s (faults io:0 non-io:689403) End-PLD-Builder-Info
[Back to list of logs] [View rpm -qa of builder]