FailedOk

th/SRPMS[OK]
th/x32[OK]
th/i686[OK]
th/x86_64[OK]

ac/SRPMS[OK]
ac/i386[OK]
ac/i586[OK]
ac/i686[OK]
ac/alpha[OK]
ac/amd64[OK]
ac/athlon[OK]
ac/ppc[OK]
ac/sparc[OK]
ac/sparc64[OK]

Advanced Search
main()
Powered by PLD Linux
(c) 2002-2020 PLD Team
$Revision: 1.37 $
Powered by X.
Your IP: 18.234.255.5

php-pecl-memcache 8cdb0722-e62f-4233-9bf6-614e96be8e37

Status:Failed
Source URL:https://buildlogs.pld-linux.org/pld/th/x32/FAIL/php-pecl-memcache,8cdb0722-e62f-4233-9bf6-614e96be8e37.bz2
text/plain URL:View!
full text:View!
rpm -qa of builder:View!
Date:2020/11/19 15:17:48
Runtime:0:00:05.505368

Toc:

  • error 1
  • rpm: error: Failed build dependencies:
  • error 2
  • rpm: error: Failed build dependencies:
  • prep
  • Executing(%prep): /bin/sh -e /tmp/B.98HJ_h/BUILD/tmp/rpm-tmp.14514
  • error 3
  • XFAIL: memcache->addServer() [tests/019.phpt]
  • error 4
  • XFAIL: memcache->set()/memcache->get() with multiple keys and load balancing [tests/020.phpt]
  • error 5
  • XFAIL: memcache->getExtendedStats() [tests/022.phpt]
  • error 6
  • XFAIL: memcache_get_extended_stats() [tests/022a.phpt]
  • error 7
  • XFAIL: memcache->delete() with load balancing [tests/023.phpt]
  • error 8
  • XFAIL: memcache->increment() with load balancing [tests/025.phpt]
  • error 9
  • XFAIL: memcache->delete() with load balancing [tests/026.phpt]
  • error 10
  • XFAIL: memcache->addServer() adding server in failed mode [tests/031.phpt]
  • error 11
  • XFAIL: memcache->getServerStatus(), memcache->setServerParams() [tests/032.phpt]
  • error 12
  • XFAIL: memcache::connect() with unix domain socket [tests/035.phpt]
  • error 13
  • XFAIL: ini_set('session.save_handler') [tests/036.phpt]
  • error 14
  • XFAIL: ini_set('session.save_path') [tests/036b.phpt]
  • error 15
  • XFAIL: memcache->increment()/decrement() with multiple keys [tests/040.phpt]
  • error 16
  • XFAIL: memcache->delete() with multiple keys [tests/041.phpt]
  • error 17
  • XFAIL: memcache->set() with multiple values [tests/042.phpt]
  • error 18
  • XFAIL: ini_set('memcache.redundancy') [tests/043.phpt]
  • error 19
  • XFAIL: ini_set('memcache.session_redundancy') [tests/044.phpt]
  • error 20
  • XFAIL: hash strategies and functions [tests/046.phpt]
  • error 21
  • XFAIL: ini_set('session.save_handler') with unix domain socket [tests/053.phpt]
  • error 22
  • XFAIL: memcache multi host save path function [tests/bug73539.phpt]
  • error 23
  • XFAIL: session_regenerate_id() should not cause fatal error [tests/githubbug13.phpt]
  • build
  • Executing(%build): /bin/sh -e /tmp/B.98HJ_h/BUILD/tmp/rpm-tmp.14514
  • error 24
  • /tmp/B.98HJ_h/BUILD/php80-pecl-memcache-4.0.5.1/php7/memcache.c:42:2: error: initializer element is not constant
  • error 25
  • /tmp/B.98HJ_h/BUILD/php80-pecl-memcache-4.0.5.1/php7/memcache.c:43:2: error: expected '}' before 'ZEND_ARG_PASS_INFO'
  • error 26
  • /tmp/B.98HJ_h/BUILD/php80-pecl-memcache-4.0.5.1/php7/memcache.c:49:2: error: initializer element is not constant
  • error 27
  • /tmp/B.98HJ_h/BUILD/php80-pecl-memcache-4.0.5.1/php7/memcache.c:50:2: error: expected '}' before 'ZEND_ARG_PASS_INFO'
  • error 28
  • /tmp/B.98HJ_h/BUILD/php80-pecl-memcache-4.0.5.1/php7/memcache.c:272:27: error: expected ')' before 'TSRMLS_CC'
  • error 29
  • /tmp/B.98HJ_h/BUILD/php80-pecl-memcache-4.0.5.1/php7/memcache.c:272:5: error: too few arguments to function 'php_error_docref'
  • error 30
  • /tmp/B.98HJ_h/BUILD/php80-pecl-memcache-4.0.5.1/php7/memcache.c:461:58: error: 'TSRMLS_C' undeclared (first use in this function); did you mean 'TSRM_H'?
  • error 31
  • error: Bad exit status from /tmp/B.98HJ_h/BUILD/tmp/rpm-tmp.14514 (%build)
  • error 32
  • RPM build errors:
  • error 33
  • error: No files produced.

Content:

checking if we should skip the build
started at: Thu Nov 19 15:17:27 2020
killing old processes on a builder
sending signal 9 to pid -1
Killed
cleaning up /tmp
fetching https://srcbuilder.pld-linux.org/th//srpms/8cdb0722-e62f-4233-9bf6-614e96be8e37/php80-pecl-memcache-4.0.5.1-1.src.rpm
fetched 94289 bytes, 254.6 K/s
installing srpm: php80-pecl-memcache-4.0.5.1-1.src.rpm
+ install -d /tmp/B.98HJ_h/BUILD /tmp/B.98HJ_h/RPMS
+ LC_ALL=en_US.UTF-8
+ rpm -qp --changelog php80-pecl-memcache-4.0.5.1-1.src.rpm
* Thu Nov 19 2020 PLD Linux Team <feedback@pld-linux.org>
- For complete changelog see: http://git.pld-linux.org/?p=packages/php-pecl-memcache.git;a=log;h=master
* Sat Jan 25 2020 Jan Rękorajski <baggins@pld-linux.org> 0b46688
- drop obsolete and outdated manual inclusion of rpm macros * Thu Dec 19 2019 Elan Ruusamäe <glen@pld-linux.org> a92c026
- Update for missing tests/044b.phpt * Thu Dec 19 2019 Elan Ruusamäe <glen@pld-linux.org> 3ed6454
- up to 4.0.5.1 + rpm -Uhv --nodeps --define '_topdir /tmp/B.98HJ_h' --define '_specdir %{_topdir}' --define '_sourcedir %{_specdir}' --define '_rpmdir %{_topdir}/RPMS' --define '_builddir %{_topdir}/BUILD' --define 'php_suffix 80' php80-pecl-memcache-4.0.5.1-1.src.rpm Preparing... ################################################## php80-pecl-memcache ################################################## + rm -f php80-pecl-memcache-4.0.5.1-1.src.rpm + install -m 700 -d /tmp/B.98HJ_h/BUILD/tmp + TMPDIR=/tmp/B.98HJ_h/BUILD/tmp + exec nice -n 0 rpmbuild -bp --short-circuit --nodeps --define '_topdir /tmp/B.98HJ_h' --define '_specdir %{_topdir}' --define '_sourcedir %{_specdir}' --define '_rpmdir %{_topdir}/RPMS' --define '_builddir %{_topdir}/BUILD' --target x32-pld-linux --define 'php_suffix 80' --define 'prep exit 0' /tmp/B.98HJ_h/php-pecl-memcache.spec Building target platforms: x32-pld-linux checking BuildConflict-ing packages no BuildConflicts found checking BR rpm: error: Failed build dependencies: rpm: php80-session is needed by php80-pecl-memcache-4.0.5.1-1.src rpm: php80-simplexml is needed by php80-pecl-memcache-4.0.5.1-1.src rpm: php80-xml is needed by php80-pecl-memcache-4.0.5.1-1.src rpm: php-packagexml2cl is needed by php80-pecl-memcache-4.0.5.1-1.src rpm: memcached is needed by php80-pecl-memcache-4.0.5.1-1.src rpm: Building target platforms: x32-pld-linux updating poldek cache... ready is up to date th is up to date th is up to date th-ready is up to date th-ready is up to date th-test is up to date th-test is up to date checking conflicting packages in BRed packages poldek: Loading [pndir]ready... poldek: Loading [pndir]th-test... poldek: Loading [pndir]th-test... poldek: Loading [pndir]th-ready... poldek: Loading [pndir]th-ready... poldek: Loading [pndir]th... poldek: Loading [pndir]th... poldek: 27583 packages read poldek: Removed 1822 duplicate packages from available set poldek: Processing dependencies... poldek: php-packagexml2cl-0.1-4.noarch marks php80-program-8.0.0-1.RC5.1.x32 (cap /usr/bin/php) poldek: There are 6 packages to install (1 marked by dependencies): poldek: A memcached-1.5.20-2.x32 php-packagexml2cl-0.1-4.noarch poldek: A php80-program-8.0.0-1.RC5.1.x32 php80-session-8.0.0-1.RC5.1.x32 poldek: A php80-simplexml-8.0.0-1.RC5.1.x32 php80-xml-8.0.0-1.RC5.1.x32 poldek: This operation will use 418.2KB of disk space. poldek: Need to get 240.4KB of archives (131.5KB to download). poldek: poldek: Retrieving [1/2] th::memcached-1.5.20-2.x32.rpm............................................done poldek: Retrieving [2/2] th::php-packagexml2cl-0.1-4.noarch.rpm....................................done poldek: Executing pm-command.sh --upgrade -vh --test --root / --define _check_dirname_deps 1... poldek: Preparing... ################################################## no conflicts found checking BR rpm: error: Failed build dependencies: rpm: php80-session is needed by php80-pecl-memcache-4.0.5.1-1.src rpm: php80-simplexml is needed by php80-pecl-memcache-4.0.5.1-1.src rpm: php80-xml is needed by php80-pecl-memcache-4.0.5.1-1.src rpm: php-packagexml2cl is needed by php80-pecl-memcache-4.0.5.1-1.src rpm: memcached is needed by php80-pecl-memcache-4.0.5.1-1.src rpm: Building target platforms: x32-pld-linux installing BR: php\-packagexml2cl memcached php80\-simplexml php80\-session php80\-xml + poldek --noask --caplookup -Q -v '--ignore=hhvm-*' '--ignore=php4-*' '--ignore=php52-*' '--ignore=php53-*' '--ignore=php54-*' '--ignore=php55-*' '--ignore=php56-*' '--ignore=php70-*' '--ignore=php71-*' '--ignore=php72-*' '--ignore=php73-*' '--ignore=php74-*' --upgrade php-packagexml2cl memcached php80-simplexml php80-session php80-xml Loading [pndir]ready... Loading [pndir]th-test... Loading [pndir]th-test... Loading [pndir]th-ready... Loading [pndir]th-ready... Loading [pndir]th... Loading [pndir]th... 27583 packages read Removed 1822 duplicate packages from available set Processing dependencies... There are 3 packages to install: A php80-session-8.0.0-1.RC5.1.x32 php80-simplexml-8.0.0-1.RC5.1.x32 A php80-xml-8.0.0-1.RC5.1.x32 This operation will use 192.5KB of disk space. Need to get 103.2KB of archives. Executing pm-command.sh --upgrade -vh --root / --define _check_dirname_deps 1... Preparing... ################################################## php80-xml ################################################## php80-session ################################################## php80-simplexml ################################################## Installing set #2 Processing dependencies... There are 1 package to install: A memcached-1.5.20-2.x32 This operation will use 224.3KB of disk space. Need to get 128.7KB of archives. Executing pm-command.sh --upgrade -vh --root / --define _check_dirname_deps 1... Preparing... ################################################## Adding group memcached GID=209. Adding user memcached UID=209. memcached ################################################## Run "/sbin/service memcached start" to start memcached service. Installing set #3 Processing dependencies... php-packagexml2cl-0.1-4.noarch marks php80-program-8.0.0-1.RC5.1.x32 (cap /usr/bin/php) There are 2 packages to install (1 marked by dependencies): A php-packagexml2cl-0.1-4.noarch php80-program-8.0.0-1.RC5.1.x32 This operation will use 1.4KB of disk space. Need to get 8.5KB of archives. Executing pm-command.sh --upgrade -vh --root / --define _check_dirname_deps 1... Preparing... ################################################## php80-program ################################################## php-packagexml2cl ################################################## building RPM using: set -ex; : build-id: 8cdb0722-e62f-4233-9bf6-614e96be8e37; TMPDIR=/tmp/B.98HJ_h/BUILD/tmp exec nice -n 0 rpmbuild -bb --define '_smp_mflags -j9' --define '_make_opts -Otarget' --define '_pld_builder 1' --define '_topdir /tmp/B.98HJ_h' --define '_specdir %{_topdir}' --define '_sourcedir %{_specdir}' --define '_rpmdir %{_topdir}/RPMS' --define '_builddir %{_topdir}/BUILD' --target x32-pld-linux --define 'php_suffix 80' /tmp/B.98HJ_h/php-pecl-memcache.spec + : build-id: 8cdb0722-e62f-4233-9bf6-614e96be8e37 + TMPDIR=/tmp/B.98HJ_h/BUILD/tmp + exec nice -n 0 rpmbuild -bb --define '_smp_mflags -j9' --define '_make_opts -Otarget' --define '_pld_builder 1' --define '_topdir /tmp/B.98HJ_h' --define '_specdir %{_topdir}' --define '_sourcedir %{_specdir}' --define '_rpmdir %{_topdir}/RPMS' --define '_builddir %{_topdir}/BUILD' --target x32-pld-linux --define 'php_suffix 80' /tmp/B.98HJ_h/php-pecl-memcache.spec Building target platforms: x32-pld-linux Executing(%prep): /bin/sh -e /tmp/B.98HJ_h/BUILD/tmp/rpm-tmp.14514 + umask 022 + cd /tmp/B.98HJ_h/BUILD + cd /tmp/B.98HJ_h/BUILD + rm -rf php80-pecl-memcache-4.0.5.1 + /bin/mkdir -p php80-pecl-memcache-4.0.5.1 + cd php80-pecl-memcache-4.0.5.1 + /bin/gzip -dc /tmp/B.98HJ_h/memcache-4.0.5.1.tgz + /bin/tar -xf - + STATUS=0 + '[' 0 -ne 0 ']' + /bin/id -u + '[' 1000 '=' 0 ']' + /bin/id -u + '[' 1000 '=' 0 ']' + /bin/chmod -Rf a+rX,u+w,g-w,o-w . + mv memcache-4.0.5.1/CREDITS memcache-4.0.5.1/Dockerfile memcache-4.0.5.1/LICENSE memcache-4.0.5.1/README memcache-4.0.5.1/cloudbuild.yaml memcache-4.0.5.1/config.m4 memcache-4.0.5.1/config.w32 memcache-4.0.5.1/config9.m4 memcache-4.0.5.1/docker memcache-4.0.5.1/example.php memcache-4.0.5.1/memcache.php memcache-4.0.5.1/php7 memcache-4.0.5.1/tests . + echo 'Patch #0 (memcache-webapp.patch):' Patch #0 (memcache-webapp.patch): + '[' -f /tmp/B.98HJ_h/memcache-webapp.patch ']' + /bin/cat /tmp/B.98HJ_h/memcache-webapp.patch + /usr/bin/patch -s -p1 + echo 'Patch #1 (tests.patch):' Patch #1 (tests.patch): + '[' -f /tmp/B.98HJ_h/tests.patch ']' + /bin/cat /tmp/B.98HJ_h/tests.patch + /usr/bin/patch -s -p1 + <<"EOF" #!/bin/sh export NO_INTERACTION=1 REPORT_EXIT_STATUS=1 MALLOC_CHECK_=2 exec /usr/bin/make -Otarget -j9 test \ PHP_EXECUTABLE=/usr/bin/php80 \ PHP_TEST_SHARED_SYSTEM_EXTENSIONS="simplexml session" \ RUN_TESTS_SETTINGS="-q $*" EOF + >run-tests.sh + cat + chmod +x run-tests.sh + <<"EOF" memcache->addServer() [tests/019.phpt] memcache->set()/memcache->get() with multiple keys and load balancing [tests/020.phpt] memcache->getExtendedStats() [tests/022.phpt] memcache_get_extended_stats() [tests/022a.phpt] memcache->delete() with load balancing [tests/023.phpt] memcache->increment() with load balancing [tests/025.phpt] memcache->delete() with load balancing [tests/026.phpt] memcache->addServer() adding server in failed mode [tests/031.phpt] memcache->getServerStatus(), memcache->setServerParams() [tests/032.phpt] memcache::connect() with unix domain socket [tests/035.phpt] ini_set('session.save_handler') [tests/036.phpt] ini_set('session.save_path') [tests/036b.phpt] memcache->increment()/decrement() with multiple keys [tests/040.phpt] memcache->delete() with multiple keys [tests/041.phpt] memcache->set() with multiple values [tests/042.phpt] ini_set('memcache.redundancy') [tests/043.phpt] ini_set('memcache.session_redundancy') [tests/044.phpt] hash strategies and functions [tests/046.phpt] ini_set('session.save_handler') with unix domain socket [tests/053.phpt] memcache multi host save path function [tests/bug73539.phpt] session_regenerate_id() should not cause fatal error [tests/githubbug13.phpt] EOF + xfail + set +x XFAIL: memcache->addServer() [tests/019.phpt] XFAIL: memcache->set()/memcache->get() with multiple keys and load balancing [tests/020.phpt] XFAIL: memcache->getExtendedStats() [tests/022.phpt] XFAIL: memcache_get_extended_stats() [tests/022a.phpt] XFAIL: memcache->delete() with load balancing [tests/023.phpt] XFAIL: memcache->increment() with load balancing [tests/025.phpt] XFAIL: memcache->delete() with load balancing [tests/026.phpt] XFAIL: memcache->addServer() adding server in failed mode [tests/031.phpt] XFAIL: memcache->getServerStatus(), memcache->setServerParams() [tests/032.phpt] XFAIL: memcache::connect() with unix domain socket [tests/035.phpt] XFAIL: ini_set('session.save_handler') [tests/036.phpt] XFAIL: ini_set('session.save_path') [tests/036b.phpt] XFAIL: memcache->increment()/decrement() with multiple keys [tests/040.phpt] XFAIL: memcache->delete() with multiple keys [tests/041.phpt] XFAIL: memcache->set() with multiple values [tests/042.phpt] XFAIL: ini_set('memcache.redundancy') [tests/043.phpt] XFAIL: ini_set('memcache.session_redundancy') [tests/044.phpt] XFAIL: hash strategies and functions [tests/046.phpt] XFAIL: ini_set('session.save_handler') with unix domain socket [tests/053.phpt] XFAIL: memcache multi host save path function [tests/bug73539.phpt] XFAIL: session_regenerate_id() should not cause fatal error [tests/githubbug13.phpt] + exit 0 Executing(%build): /bin/sh -e /tmp/B.98HJ_h/BUILD/tmp/rpm-tmp.14514 HOME=/home/users/builder PATH=/home/users/builder/GNUstep/Tools:/bin:/usr/bin:/usr/local/bin TMPDIR=/tmp/B.98HJ_h/BUILD/tmp + umask 022 + cd /tmp/B.98HJ_h/BUILD + cd php80-pecl-memcache-4.0.5.1 + >ChangeLog + packagexml2cl package.xml + phpize Configuring for: PHP Api Version: 20200930 Zend Module Api No: 20200930 Zend Extension Api No: 420200930 + ./configure 'LDFLAGS=-Wl,--as-needed -Wl,--no-copy-dt-needed-entries -Wl,-z,relro -Wl,-z,combreloc ' 'CFLAGS=-O2 -fwrapv -pipe -Wformat -Werror=format-security -gdwarf-4 -fno-debug-types-section -fvar-tracking-assignments -g2 -Wp,-D_FORTIFY_SOURCE=2 -fstack-protector-strong --param=ssp-buffer-size=4 -Werror=trampolines -fPIC -mtune=generic -march=x86-64 -gdwarf-4 -fno-debug-types-section -fvar-tracking-assignments -g2 ' 'CXXFLAGS=-O2 -fwrapv -pipe -Wformat -Werror=format-security -gdwarf-4 -fno-debug-types-section -fvar-tracking-assignments -g2 -Wp,-D_FORTIFY_SOURCE=2 -fstack-protector-strong --param=ssp-buffer-size=4 -Werror=trampolines -fPIC -mtune=generic -march=x86-64 -gdwarf-4 -fno-debug-types-section -fvar-tracking-assignments -g2 ' 'FFLAGS=-O2 -fwrapv -pipe -Wformat -Werror=format-security -gdwarf-4 -fno-debug-types-section -fvar-tracking-assignments -g2 -Wp,-D_FORTIFY_SOURCE=2 -fstack-protector-strong --param=ssp-buffer-size=4 -Werror=trampolines -fPIC -mtune=generic -march=x86-64 -gdwarf-4 -fno-debug-types-section -fvar-tracking-assignments -g2 ' 'FCFLAGS=-O2 -fwrapv -pipe -Wformat -Werror=format-security -gdwarf-4 -fno-debug-types-section -fvar-tracking-assignments -g2 -Wp,-D_FORTIFY_SOURCE=2 -fstack-protector-strong --param=ssp-buffer-size=4 -Werror=trampolines -fPIC -mtune=generic -march=x86-64 -gdwarf-4 -fno-debug-types-section -fvar-tracking-assignments -g2 ' 'CPPFLAGS=' 'CC=x86_64-pld-linux-gnux32-gcc' 'CXX=x86_64-pld-linux-gnux32-g++' '--host=x86_64-pld-linux-gnux32' '--build=x86_64-pld-linux-gnux32' '--prefix=/usr' '--exec-prefix=/usr' '--bindir=/usr/bin' '--sbindir=/usr/sbin' '--sysconfdir=/etc/webapps/memcache' '--datadir=/usr/share' '--includedir=/usr/include' '--libdir=/usr/libx32' '--libexecdir=/usr/libexec' '--localstatedir=/var' '--sharedstatedir=/var/lib' '--mandir=/usr/share/man' '--infodir=/usr/share/info' '--x-libraries=/usr/libx32' '--with-zlib-dir=/usr' checking for grep that handles long lines and -e... /bin/grep checking for egrep... /bin/grep -E checking for a sed that does not truncate output... /bin/sed checking for x86_64-pld-linux-gnux32-pkg-config... /usr/bin/x86_64-pld-linux-gnux32-pkg-config checking pkg-config is at least version 0.9.0... yes checking for x86_64-pld-linux-gnux32-cc... x86_64-pld-linux-gnux32-gcc checking whether the C compiler works... yes checking for C compiler default output file name... a.out checking for suffix of executables... checking whether we are cross compiling... no checking for suffix of object files... o checking whether we are using the GNU C compiler... yes checking whether x86_64-pld-linux-gnux32-gcc accepts -g... yes checking for x86_64-pld-linux-gnux32-gcc option to accept ISO C89... none needed checking how to run the C preprocessor... x86_64-pld-linux-gnux32-gcc -E checking for icc... no checking for suncc... no checking for system library directory... lib checking if compiler supports -R... no checking if compiler supports -Wl,-rpath,... yes checking build system type... x86_64-pld-linux-gnux32 checking host system type... x86_64-pld-linux-gnux32 checking target system type... x86_64-pld-linux-gnux32 checking for PHP prefix... /usr checking for PHP includes... -I/usr/include/php -I/usr/include/php/main -I/usr/include/php/TSRM -I/usr/include/php/Zend -I/usr/include/php/ext -I/usr/include/php/ext/date/lib checking for PHP extension directory... /usr/libx32/php80 checking for PHP installed headers prefix... /usr/include/php checking if debug is enabled... no checking if zts is enabled... no checking for gawk... gawk checking whether to enable memcache support... yes, shared checking whether to enable memcache session handler support... yes checking for the location of ZLIB... /usr checking for the location of zlib... /usr checking PHP version... PHP 7.x checking for session includes... /usr/include/php checking for memcache session support... enabled checking how to print strings... print -r checking for a sed that does not truncate output... (cached) /bin/sed checking for fgrep... /bin/grep -F checking for ld used by x86_64-pld-linux-gnux32-gcc... /usr/bin/ld checking if the linker (/usr/bin/ld) is GNU ld... yes checking for BSD- or MS-compatible name lister (nm)... /usr/bin/nm -B checking the name lister (/usr/bin/nm -B) interface... BSD nm checking whether ln -s works... yes checking the maximum length of command line arguments... 1572864 checking how to convert x86_64-pld-linux-gnux32 file names to x86_64-pld-linux-gnux32 format... func_convert_file_noop checking how to convert x86_64-pld-linux-gnux32 file names to toolchain format... func_convert_file_noop checking for /usr/bin/ld option to reload object files... -r checking for x86_64-pld-linux-gnux32-objdump... no checking for objdump... objdump checking how to recognize dependent libraries... pass_all checking for x86_64-pld-linux-gnux32-dlltool... no checking for dlltool... no checking how to associate runtime and link libraries... print -r -- checking for x86_64-pld-linux-gnux32-ar... no checking for ar... ar checking for archiver @FILE support... @ checking for x86_64-pld-linux-gnux32-strip... no checking for strip... strip checking for x86_64-pld-linux-gnux32-ranlib... no checking for ranlib... ranlib checking for mawk... (cached) gawk checking command to parse /usr/bin/nm -B output from x86_64-pld-linux-gnux32-gcc object... ok checking for sysroot... no checking for a working dd... /bin/dd checking how to truncate binary pipes... /bin/dd bs=4096 count=1 checking for x86_64-pld-linux-gnux32-mt... no checking for mt... no checking if : is a manifest tool... no checking for ANSI C header files... yes checking for sys/types.h... yes checking for sys/stat.h... yes checking for stdlib.h... yes checking for string.h... yes checking for memory.h... yes checking for strings.h... yes checking for inttypes.h... yes checking for stdint.h... yes checking for unistd.h... yes checking for dlfcn.h... yes checking for objdir... .libs checking if x86_64-pld-linux-gnux32-gcc supports -fno-rtti -fno-exceptions... no checking for x86_64-pld-linux-gnux32-gcc option to produce PIC... -fPIC -DPIC checking if x86_64-pld-linux-gnux32-gcc PIC flag -fPIC -DPIC works... yes checking if x86_64-pld-linux-gnux32-gcc static flag -static works... yes checking if x86_64-pld-linux-gnux32-gcc supports -c -o file.o... yes checking if x86_64-pld-linux-gnux32-gcc supports -c -o file.o... (cached) yes checking whether the x86_64-pld-linux-gnux32-gcc linker (/usr/bin/ld -m elf32_x86_64) supports shared libraries... yes checking whether -lc should be explicitly linked in... no checking dynamic linker characteristics... GNU/Linux ld.so checking how to hardcode library paths into programs... immediate checking whether stripping libraries is possible... yes checking if libtool supports shared libraries... yes checking whether to build shared libraries... yes checking whether to build static libraries... no configure: patching config.h.in configure: creating ./config.status config.status: creating config.h config.status: executing libtool commands + /usr/bin/make -Otarget -j9 /bin/sh /tmp/B.98HJ_h/BUILD/php80-pecl-memcache-4.0.5.1/libtool --mode=compile x86_64-pld-linux-gnux32-gcc -I. -I/tmp/B.98HJ_h/BUILD/php80-pecl-memcache-4.0.5.1 -I/tmp/B.98HJ_h/BUILD/php80-pecl-memcache-4.0.5.1/include -I/tmp/B.98HJ_h/BUILD/php80-pecl-memcache-4.0.5.1/main -I/tmp/B.98HJ_h/BUILD/php80-pecl-memcache-4.0.5.1 -I/usr/include/php -I/usr/include/php/main -I/usr/include/php/TSRM -I/usr/include/php/Zend -I/usr/include/php/ext -I/usr/include/php/ext/date/lib -DHAVE_CONFIG_H -O2 -fwrapv -pipe -Wformat -Werror=format-security -gdwarf-4 -fno-debug-types-section -fvar-tracking-assignments -g2 -Wp,-D_FORTIFY_SOURCE=2 -fstack-protector-strong --param=ssp-buffer-size=4 -Werror=trampolines -fPIC -mtune=generic -march=x86-64 -gdwarf-4 -fno-debug-types-section -fvar-tracking-assignments -g2 -I/usr/include/php -c /tmp/B.98HJ_h/BUILD/php80-pecl-memcache-4.0.5.1/php7/memcache_standard_hash.c -o php7/memcache_standard_hash.lo libtool: compile: x86_64-pld-linux-gnux32-gcc -I. -I/tmp/B.98HJ_h/BUILD/php80-pecl-memcache-4.0.5.1 -I/tmp/B.98HJ_h/BUILD/php80-pecl-memcache-4.0.5.1/include -I/tmp/B.98HJ_h/BUILD/php80-pecl-memcache-4.0.5.1/main -I/tmp/B.98HJ_h/BUILD/php80-pecl-memcache-4.0.5.1 -I/usr/include/php -I/usr/include/php/main -I/usr/include/php/TSRM -I/usr/include/php/Zend -I/usr/include/php/ext -I/usr/include/php/ext/date/lib -DHAVE_CONFIG_H -O2 -fwrapv -pipe -Wformat -Werror=format-security -gdwarf-4 -fno-debug-types-section -fvar-tracking-assignments -g2 -Wp,-D_FORTIFY_SOURCE=2 -fstack-protector-strong --param=ssp-buffer-size=4 -Werror=trampolines -fPIC -mtune=generic -march=x86-64 -gdwarf-4 -fno-debug-types-section -fvar-tracking-assignments -g2 -I/usr/include/php -c /tmp/B.98HJ_h/BUILD/php80-pecl-memcache-4.0.5.1/php7/memcache_standard_hash.c -fPIC -DPIC -o php7/.libs/memcache_standard_hash.o /bin/sh /tmp/B.98HJ_h/BUILD/php80-pecl-memcache-4.0.5.1/libtool --mode=compile x86_64-pld-linux-gnux32-gcc -I. -I/tmp/B.98HJ_h/BUILD/php80-pecl-memcache-4.0.5.1 -I/tmp/B.98HJ_h/BUILD/php80-pecl-memcache-4.0.5.1/include -I/tmp/B.98HJ_h/BUILD/php80-pecl-memcache-4.0.5.1/main -I/tmp/B.98HJ_h/BUILD/php80-pecl-memcache-4.0.5.1 -I/usr/include/php -I/usr/include/php/main -I/usr/include/php/TSRM -I/usr/include/php/Zend -I/usr/include/php/ext -I/usr/include/php/ext/date/lib -DHAVE_CONFIG_H -O2 -fwrapv -pipe -Wformat -Werror=format-security -gdwarf-4 -fno-debug-types-section -fvar-tracking-assignments -g2 -Wp,-D_FORTIFY_SOURCE=2 -fstack-protector-strong --param=ssp-buffer-size=4 -Werror=trampolines -fPIC -mtune=generic -march=x86-64 -gdwarf-4 -fno-debug-types-section -fvar-tracking-assignments -g2 -I/usr/include/php -c /tmp/B.98HJ_h/BUILD/php80-pecl-memcache-4.0.5.1/php7/memcache_consistent_hash.c -o php7/memcache_consistent_hash.lo libtool: compile: x86_64-pld-linux-gnux32-gcc -I. -I/tmp/B.98HJ_h/BUILD/php80-pecl-memcache-4.0.5.1 -I/tmp/B.98HJ_h/BUILD/php80-pecl-memcache-4.0.5.1/include -I/tmp/B.98HJ_h/BUILD/php80-pecl-memcache-4.0.5.1/main -I/tmp/B.98HJ_h/BUILD/php80-pecl-memcache-4.0.5.1 -I/usr/include/php -I/usr/include/php/main -I/usr/include/php/TSRM -I/usr/include/php/Zend -I/usr/include/php/ext -I/usr/include/php/ext/date/lib -DHAVE_CONFIG_H -O2 -fwrapv -pipe -Wformat -Werror=format-security -gdwarf-4 -fno-debug-types-section -fvar-tracking-assignments -g2 -Wp,-D_FORTIFY_SOURCE=2 -fstack-protector-strong --param=ssp-buffer-size=4 -Werror=trampolines -fPIC -mtune=generic -march=x86-64 -gdwarf-4 -fno-debug-types-section -fvar-tracking-assignments -g2 -I/usr/include/php -c /tmp/B.98HJ_h/BUILD/php80-pecl-memcache-4.0.5.1/php7/memcache_consistent_hash.c -fPIC -DPIC -o php7/.libs/memcache_consistent_hash.o /bin/sh /tmp/B.98HJ_h/BUILD/php80-pecl-memcache-4.0.5.1/libtool --mode=compile x86_64-pld-linux-gnux32-gcc -I. -I/tmp/B.98HJ_h/BUILD/php80-pecl-memcache-4.0.5.1 -I/tmp/B.98HJ_h/BUILD/php80-pecl-memcache-4.0.5.1/include -I/tmp/B.98HJ_h/BUILD/php80-pecl-memcache-4.0.5.1/main -I/tmp/B.98HJ_h/BUILD/php80-pecl-memcache-4.0.5.1 -I/usr/include/php -I/usr/include/php/main -I/usr/include/php/TSRM -I/usr/include/php/Zend -I/usr/include/php/ext -I/usr/include/php/ext/date/lib -DHAVE_CONFIG_H -O2 -fwrapv -pipe -Wformat -Werror=format-security -gdwarf-4 -fno-debug-types-section -fvar-tracking-assignments -g2 -Wp,-D_FORTIFY_SOURCE=2 -fstack-protector-strong --param=ssp-buffer-size=4 -Werror=trampolines -fPIC -mtune=generic -march=x86-64 -gdwarf-4 -fno-debug-types-section -fvar-tracking-assignments -g2 -I/usr/include/php -c /tmp/B.98HJ_h/BUILD/php80-pecl-memcache-4.0.5.1/php7/memcache.c -o php7/memcache.lo libtool: compile: x86_64-pld-linux-gnux32-gcc -I. -I/tmp/B.98HJ_h/BUILD/php80-pecl-memcache-4.0.5.1 -I/tmp/B.98HJ_h/BUILD/php80-pecl-memcache-4.0.5.1/include -I/tmp/B.98HJ_h/BUILD/php80-pecl-memcache-4.0.5.1/main -I/tmp/B.98HJ_h/BUILD/php80-pecl-memcache-4.0.5.1 -I/usr/include/php -I/usr/include/php/main -I/usr/include/php/TSRM -I/usr/include/php/Zend -I/usr/include/php/ext -I/usr/include/php/ext/date/lib -DHAVE_CONFIG_H -O2 -fwrapv -pipe -Wformat -Werror=format-security -gdwarf-4 -fno-debug-types-section -fvar-tracking-assignments -g2 -Wp,-D_FORTIFY_SOURCE=2 -fstack-protector-strong --param=ssp-buffer-size=4 -Werror=trampolines -fPIC -mtune=generic -march=x86-64 -gdwarf-4 -fno-debug-types-section -fvar-tracking-assignments -g2 -I/usr/include/php -c /tmp/B.98HJ_h/BUILD/php80-pecl-memcache-4.0.5.1/php7/memcache.c -fPIC -DPIC -o php7/.libs/memcache.o /tmp/B.98HJ_h/BUILD/php80-pecl-memcache-4.0.5.1/php7/memcache.c:42:2: warning: implicit declaration of function 'ZEND_ARG_PASS_INFO'; did you mean 'ZEND_ARG_OBJ_INFO'? [-Wimplicit-function-declaration] 42 | ZEND_ARG_PASS_INFO(0) | ^~~~~~~~~~~~~~~~~~ | ZEND_ARG_OBJ_INFO /tmp/B.98HJ_h/BUILD/php80-pecl-memcache-4.0.5.1/php7/memcache.c:42:2: warning: initialization of 'const char *' from 'int' makes pointer from integer without a cast [-Wint-conversion] /tmp/B.98HJ_h/BUILD/php80-pecl-memcache-4.0.5.1/php7/memcache.c:42:2: note: (near initialization for 'arginfo_memcache_get[1].name') /tmp/B.98HJ_h/BUILD/php80-pecl-memcache-4.0.5.1/php7/memcache.c:42:2: error: initializer element is not constant /tmp/B.98HJ_h/BUILD/php80-pecl-memcache-4.0.5.1/php7/memcache.c:42:2: note: (near initialization for 'arginfo_memcache_get[1].name') /tmp/B.98HJ_h/BUILD/php80-pecl-memcache-4.0.5.1/php7/memcache.c:43:2: error: expected '}' before 'ZEND_ARG_PASS_INFO' 43 | ZEND_ARG_PASS_INFO(0) | ^~~~~~~~~~~~~~~~~~ In file included from /usr/include/php/main/php.h:35, from /tmp/B.98HJ_h/BUILD/php80-pecl-memcache-4.0.5.1/php7/memcache.c:26: /usr/include/php/Zend/zend_API.h:168:47: note: to match this '{' 168 | static const zend_internal_arg_info name[] = { \ | ^ /usr/include/php/Zend/zend_API.h:171:2: note: in expansion of macro 'ZEND_BEGIN_ARG_INFO_EX' 171 | ZEND_BEGIN_ARG_INFO_EX(name, {}, ZEND_RETURN_VALUE, -1) | ^~~~~~~~~~~~~~~~~~~~~~ /tmp/B.98HJ_h/BUILD/php80-pecl-memcache-4.0.5.1/php7/memcache.c:41:1: note: in expansion of macro 'ZEND_BEGIN_ARG_INFO' 41 | ZEND_BEGIN_ARG_INFO(arginfo_memcache_get, 1) | ^~~~~~~~~~~~~~~~~~~ /tmp/B.98HJ_h/BUILD/php80-pecl-memcache-4.0.5.1/php7/memcache.c:49:2: warning: initialization of 'const char *' from 'int' makes pointer from integer without a cast [-Wint-conversion] 49 | ZEND_ARG_PASS_INFO(0) | ^~~~~~~~~~~~~~~~~~ /tmp/B.98HJ_h/BUILD/php80-pecl-memcache-4.0.5.1/php7/memcache.c:49:2: note: (near initialization for 'arginfo_memcache_object_get[1].name') /tmp/B.98HJ_h/BUILD/php80-pecl-memcache-4.0.5.1/php7/memcache.c:49:2: error: initializer element is not constant /tmp/B.98HJ_h/BUILD/php80-pecl-memcache-4.0.5.1/php7/memcache.c:49:2: note: (near initialization for 'arginfo_memcache_object_get[1].name') /tmp/B.98HJ_h/BUILD/php80-pecl-memcache-4.0.5.1/php7/memcache.c:50:2: error: expected '}' before 'ZEND_ARG_PASS_INFO' 50 | ZEND_ARG_PASS_INFO(1) | ^~~~~~~~~~~~~~~~~~ In file included from /usr/include/php/main/php.h:35, from /tmp/B.98HJ_h/BUILD/php80-pecl-memcache-4.0.5.1/php7/memcache.c:26: /usr/include/php/Zend/zend_API.h:168:47: note: to match this '{' 168 | static const zend_internal_arg_info name[] = { \ | ^ /usr/include/php/Zend/zend_API.h:171:2: note: in expansion of macro 'ZEND_BEGIN_ARG_INFO_EX' 171 | ZEND_BEGIN_ARG_INFO_EX(name, {}, ZEND_RETURN_VALUE, -1) | ^~~~~~~~~~~~~~~~~~~~~~ /tmp/B.98HJ_h/BUILD/php80-pecl-memcache-4.0.5.1/php7/memcache.c:48:1: note: in expansion of macro 'ZEND_BEGIN_ARG_INFO' 48 | ZEND_BEGIN_ARG_INFO(arginfo_memcache_object_get, 1) | ^~~~~~~~~~~~~~~~~~~ /tmp/B.98HJ_h/BUILD/php80-pecl-memcache-4.0.5.1/php7/memcache.c: In function 'OnUpdatePrefixStaticKey': /tmp/B.98HJ_h/BUILD/php80-pecl-memcache-4.0.5.1/php7/memcache.c:272:27: error: expected ')' before 'TSRMLS_CC' 272 | php_error_docref(NULL TSRMLS_CC, E_WARNING, "memcache.session_prefix_static_key cannot have dot inside (.)"); | ^~~~~~~~~ /tmp/B.98HJ_h/BUILD/php80-pecl-memcache-4.0.5.1/php7/memcache.c:272:5: error: too few arguments to function 'php_error_docref' 272 | php_error_docref(NULL TSRMLS_CC, E_WARNING, "memcache.session_prefix_static_key cannot have dot inside (.)"); | ^~~~~~~~~~~~~~~~ In file included from /tmp/B.98HJ_h/BUILD/php80-pecl-memcache-4.0.5.1/php7/memcache.c:26: /usr/include/php/main/php.h:341:23: note: declared here 341 | PHPAPI ZEND_COLD void php_error_docref(const char *docref, int type, const char *format, ...) | ^~~~~~~~~~~~~~~~ /tmp/B.98HJ_h/BUILD/php80-pecl-memcache-4.0.5.1/php7/memcache.c: In function 'zm_activate_memcache': /tmp/B.98HJ_h/BUILD/php80-pecl-memcache-4.0.5.1/php7/memcache.c:461:58: error: 'TSRMLS_C' undeclared (first use in this function); did you mean 'TSRM_H'? 461 | MEMCACHE_G(session_key_prefix) = get_session_key_prefix(TSRMLS_C); | ^~~~~~~~ | TSRM_H /tmp/B.98HJ_h/BUILD/php80-pecl-memcache-4.0.5.1/php7/memcache.c:461:58: note: each undeclared identifier is reported only once for each function it appears in /tmp/B.98HJ_h/BUILD/php80-pecl-memcache-4.0.5.1/php7/memcache.c: In function 'php_mmc_pool_addserver': /tmp/B.98HJ_h/BUILD/php80-pecl-memcache-4.0.5.1/php7/memcache.c:1021:52: warning: passing argument 2 of 'zend_read_property' from incompatible pointer type [-Wincompatible-pointer-types] 1021 | zval *username = zend_read_property(memcache_ce, mmc_object, "username", strlen("username"), 1, &rv1); | ^~~~~~~~~~ | | | zval * {aka struct _zval_struct *} In file included from /usr/include/php/main/php.h:35, from /tmp/B.98HJ_h/BUILD/php80-pecl-memcache-4.0.5.1/php7/memcache.c:26: /usr/include/php/Zend/zend_API.h:404:73: note: expected 'zend_object *' {aka 'struct _zend_object *'} but argument is of type 'zval *' {aka 'struct _zval_struct *'} 404 | ZEND_API zval *zend_read_property(zend_class_entry *scope, zend_object *object, const char *name, size_t name_length, zend_bool silent, zval *rv); | ~~~~~~~~~~~~~^~~~~~ /tmp/B.98HJ_h/BUILD/php80-pecl-memcache-4.0.5.1/php7/memcache.c:1022:52: warning: passing argument 2 of 'zend_read_property' from incompatible pointer type [-Wincompatible-pointer-types] 1022 | zval *password = zend_read_property(memcache_ce, mmc_object, "password", strlen("password"), 1, &rv2); | ^~~~~~~~~~ | | | zval * {aka struct _zval_struct *} In file included from /usr/include/php/main/php.h:35, from /tmp/B.98HJ_h/BUILD/php80-pecl-memcache-4.0.5.1/php7/memcache.c:26: /usr/include/php/Zend/zend_API.h:404:73: note: expected 'zend_object *' {aka 'struct _zend_object *'} but argument is of type 'zval *' {aka 'struct _zval_struct *'} 404 | ZEND_API zval *zend_read_property(zend_class_entry *scope, zend_object *object, const char *name, size_t name_length, zend_bool silent, zval *rv); | ~~~~~~~~~~~~~^~~~~~ /tmp/B.98HJ_h/BUILD/php80-pecl-memcache-4.0.5.1/php7/memcache.c: In function 'php_mmc_failure_callback': /tmp/B.98HJ_h/BUILD/php80-pecl-memcache-4.0.5.1/php7/memcache.c:1244:4: warning: implicit declaration of function 'call_user_function_ex'; did you mean 'call_user_function'? [-Wimplicit-function-declaration] 1244 | call_user_function_ex(EG(function_table), NULL, callback, &retval, 5, params, 0, NULL); | ^~~~~~~~~~~~~~~~~~~~~ | call_user_function /tmp/B.98HJ_h/BUILD/php80-pecl-memcache-4.0.5.1/php7/memcache.c: In function 'zif_memcache_set_sasl_auth_data': /tmp/B.98HJ_h/BUILD/php80-pecl-memcache-4.0.5.1/php7/memcache.c:2244:49: warning: passing argument 2 of 'zend_update_property_stringl' from incompatible pointer type [-Wincompatible-pointer-types] 2244 | zend_update_property_stringl(memcache_pool_ce, mmc_object, "username", strlen("username"), user, user_length); | ^~~~~~~~~~ | | | zval * {aka struct _zval_struct *} In file included from /usr/include/php/main/php.h:35, from /tmp/B.98HJ_h/BUILD/php80-pecl-memcache-4.0.5.1/php7/memcache.c:26: /usr/include/php/Zend/zend_API.h:391:82: note: expected 'zend_object *' {aka 'struct _zend_object *'} but argument is of type 'zval *' {aka 'struct _zval_struct *'} 391 | ZEND_API void zend_update_property_stringl(zend_class_entry *scope, zend_object *object, const char *name, size_t name_length, const char *value, size_t value_length); | ~~~~~~~~~~~~~^~~~~~ /tmp/B.98HJ_h/BUILD/php80-pecl-memcache-4.0.5.1/php7/memcache.c:2245:49: warning: passing argument 2 of 'zend_update_property_stringl' from incompatible pointer type [-Wincompatible-pointer-types] 2245 | zend_update_property_stringl(memcache_pool_ce, mmc_object, "password", strlen("password"), password, password_length); | ^~~~~~~~~~ | | | zval * {aka struct _zval_struct *} In file included from /usr/include/php/main/php.h:35, from /tmp/B.98HJ_h/BUILD/php80-pecl-memcache-4.0.5.1/php7/memcache.c:26: /usr/include/php/Zend/zend_API.h:391:82: note: expected 'zend_object *' {aka 'struct _zend_object *'} but argument is of type 'zval *' {aka 'struct _zval_struct *'} 391 | ZEND_API void zend_update_property_stringl(zend_class_entry *scope, zend_object *object, const char *name, size_t name_length, const char *value, size_t value_length); | ~~~~~~~~~~~~~^~~~~~ make: *** [Makefile:228: php7/memcache.lo] Error 1 make: *** Waiting for unfinished jobs.... /bin/sh /tmp/B.98HJ_h/BUILD/php80-pecl-memcache-4.0.5.1/libtool --mode=compile x86_64-pld-linux-gnux32-gcc -I. -I/tmp/B.98HJ_h/BUILD/php80-pecl-memcache-4.0.5.1 -I/tmp/B.98HJ_h/BUILD/php80-pecl-memcache-4.0.5.1/include -I/tmp/B.98HJ_h/BUILD/php80-pecl-memcache-4.0.5.1/main -I/tmp/B.98HJ_h/BUILD/php80-pecl-memcache-4.0.5.1 -I/usr/include/php -I/usr/include/php/main -I/usr/include/php/TSRM -I/usr/include/php/Zend -I/usr/include/php/ext -I/usr/include/php/ext/date/lib -DHAVE_CONFIG_H -O2 -fwrapv -pipe -Wformat -Werror=format-security -gdwarf-4 -fno-debug-types-section -fvar-tracking-assignments -g2 -Wp,-D_FORTIFY_SOURCE=2 -fstack-protector-strong --param=ssp-buffer-size=4 -Werror=trampolines -fPIC -mtune=generic -march=x86-64 -gdwarf-4 -fno-debug-types-section -fvar-tracking-assignments -g2 -I/usr/include/php -c /tmp/B.98HJ_h/BUILD/php80-pecl-memcache-4.0.5.1/php7/memcache_queue.c -o php7/memcache_queue.lo libtool: compile: x86_64-pld-linux-gnux32-gcc -I. -I/tmp/B.98HJ_h/BUILD/php80-pecl-memcache-4.0.5.1 -I/tmp/B.98HJ_h/BUILD/php80-pecl-memcache-4.0.5.1/include -I/tmp/B.98HJ_h/BUILD/php80-pecl-memcache-4.0.5.1/main -I/tmp/B.98HJ_h/BUILD/php80-pecl-memcache-4.0.5.1 -I/usr/include/php -I/usr/include/php/main -I/usr/include/php/TSRM -I/usr/include/php/Zend -I/usr/include/php/ext -I/usr/include/php/ext/date/lib -DHAVE_CONFIG_H -O2 -fwrapv -pipe -Wformat -Werror=format-security -gdwarf-4 -fno-debug-types-section -fvar-tracking-assignments -g2 -Wp,-D_FORTIFY_SOURCE=2 -fstack-protector-strong --param=ssp-buffer-size=4 -Werror=trampolines -fPIC -mtune=generic -march=x86-64 -gdwarf-4 -fno-debug-types-section -fvar-tracking-assignments -g2 -I/usr/include/php -c /tmp/B.98HJ_h/BUILD/php80-pecl-memcache-4.0.5.1/php7/memcache_queue.c -fPIC -DPIC -o php7/.libs/memcache_queue.o /bin/sh /tmp/B.98HJ_h/BUILD/php80-pecl-memcache-4.0.5.1/libtool --mode=compile x86_64-pld-linux-gnux32-gcc -I. -I/tmp/B.98HJ_h/BUILD/php80-pecl-memcache-4.0.5.1 -I/tmp/B.98HJ_h/BUILD/php80-pecl-memcache-4.0.5.1/include -I/tmp/B.98HJ_h/BUILD/php80-pecl-memcache-4.0.5.1/main -I/tmp/B.98HJ_h/BUILD/php80-pecl-memcache-4.0.5.1 -I/usr/include/php -I/usr/include/php/main -I/usr/include/php/TSRM -I/usr/include/php/Zend -I/usr/include/php/ext -I/usr/include/php/ext/date/lib -DHAVE_CONFIG_H -O2 -fwrapv -pipe -Wformat -Werror=format-security -gdwarf-4 -fno-debug-types-section -fvar-tracking-assignments -g2 -Wp,-D_FORTIFY_SOURCE=2 -fstack-protector-strong --param=ssp-buffer-size=4 -Werror=trampolines -fPIC -mtune=generic -march=x86-64 -gdwarf-4 -fno-debug-types-section -fvar-tracking-assignments -g2 -I/usr/include/php -c /tmp/B.98HJ_h/BUILD/php80-pecl-memcache-4.0.5.1/php7/memcache_session.c -o php7/memcache_session.lo libtool: compile: x86_64-pld-linux-gnux32-gcc -I. -I/tmp/B.98HJ_h/BUILD/php80-pecl-memcache-4.0.5.1 -I/tmp/B.98HJ_h/BUILD/php80-pecl-memcache-4.0.5.1/include -I/tmp/B.98HJ_h/BUILD/php80-pecl-memcache-4.0.5.1/main -I/tmp/B.98HJ_h/BUILD/php80-pecl-memcache-4.0.5.1 -I/usr/include/php -I/usr/include/php/main -I/usr/include/php/TSRM -I/usr/include/php/Zend -I/usr/include/php/ext -I/usr/include/php/ext/date/lib -DHAVE_CONFIG_H -O2 -fwrapv -pipe -Wformat -Werror=format-security -gdwarf-4 -fno-debug-types-section -fvar-tracking-assignments -g2 -Wp,-D_FORTIFY_SOURCE=2 -fstack-protector-strong --param=ssp-buffer-size=4 -Werror=trampolines -fPIC -mtune=generic -march=x86-64 -gdwarf-4 -fno-debug-types-section -fvar-tracking-assignments -g2 -I/usr/include/php -c /tmp/B.98HJ_h/BUILD/php80-pecl-memcache-4.0.5.1/php7/memcache_session.c -fPIC -DPIC -o php7/.libs/memcache_session.o /bin/sh /tmp/B.98HJ_h/BUILD/php80-pecl-memcache-4.0.5.1/libtool --mode=compile x86_64-pld-linux-gnux32-gcc -I. -I/tmp/B.98HJ_h/BUILD/php80-pecl-memcache-4.0.5.1 -I/tmp/B.98HJ_h/BUILD/php80-pecl-memcache-4.0.5.1/include -I/tmp/B.98HJ_h/BUILD/php80-pecl-memcache-4.0.5.1/main -I/tmp/B.98HJ_h/BUILD/php80-pecl-memcache-4.0.5.1 -I/usr/include/php -I/usr/include/php/main -I/usr/include/php/TSRM -I/usr/include/php/Zend -I/usr/include/php/ext -I/usr/include/php/ext/date/lib -DHAVE_CONFIG_H -O2 -fwrapv -pipe -Wformat -Werror=format-security -gdwarf-4 -fno-debug-types-section -fvar-tracking-assignments -g2 -Wp,-D_FORTIFY_SOURCE=2 -fstack-protector-strong --param=ssp-buffer-size=4 -Werror=trampolines -fPIC -mtune=generic -march=x86-64 -gdwarf-4 -fno-debug-types-section -fvar-tracking-assignments -g2 -I/usr/include/php -c /tmp/B.98HJ_h/BUILD/php80-pecl-memcache-4.0.5.1/php7/memcache_binary_protocol.c -o php7/memcache_binary_protocol.lo libtool: compile: x86_64-pld-linux-gnux32-gcc -I. -I/tmp/B.98HJ_h/BUILD/php80-pecl-memcache-4.0.5.1 -I/tmp/B.98HJ_h/BUILD/php80-pecl-memcache-4.0.5.1/include -I/tmp/B.98HJ_h/BUILD/php80-pecl-memcache-4.0.5.1/main -I/tmp/B.98HJ_h/BUILD/php80-pecl-memcache-4.0.5.1 -I/usr/include/php -I/usr/include/php/main -I/usr/include/php/TSRM -I/usr/include/php/Zend -I/usr/include/php/ext -I/usr/include/php/ext/date/lib -DHAVE_CONFIG_H -O2 -fwrapv -pipe -Wformat -Werror=format-security -gdwarf-4 -fno-debug-types-section -fvar-tracking-assignments -g2 -Wp,-D_FORTIFY_SOURCE=2 -fstack-protector-strong --param=ssp-buffer-size=4 -Werror=trampolines -fPIC -mtune=generic -march=x86-64 -gdwarf-4 -fno-debug-types-section -fvar-tracking-assignments -g2 -I/usr/include/php -c /tmp/B.98HJ_h/BUILD/php80-pecl-memcache-4.0.5.1/php7/memcache_binary_protocol.c -fPIC -DPIC -o php7/.libs/memcache_binary_protocol.o /bin/sh /tmp/B.98HJ_h/BUILD/php80-pecl-memcache-4.0.5.1/libtool --mode=compile x86_64-pld-linux-gnux32-gcc -I. -I/tmp/B.98HJ_h/BUILD/php80-pecl-memcache-4.0.5.1 -I/tmp/B.98HJ_h/BUILD/php80-pecl-memcache-4.0.5.1/include -I/tmp/B.98HJ_h/BUILD/php80-pecl-memcache-4.0.5.1/main -I/tmp/B.98HJ_h/BUILD/php80-pecl-memcache-4.0.5.1 -I/usr/include/php -I/usr/include/php/main -I/usr/include/php/TSRM -I/usr/include/php/Zend -I/usr/include/php/ext -I/usr/include/php/ext/date/lib -DHAVE_CONFIG_H -O2 -fwrapv -pipe -Wformat -Werror=format-security -gdwarf-4 -fno-debug-types-section -fvar-tracking-assignments -g2 -Wp,-D_FORTIFY_SOURCE=2 -fstack-protector-strong --param=ssp-buffer-size=4 -Werror=trampolines -fPIC -mtune=generic -march=x86-64 -gdwarf-4 -fno-debug-types-section -fvar-tracking-assignments -g2 -I/usr/include/php -c /tmp/B.98HJ_h/BUILD/php80-pecl-memcache-4.0.5.1/php7/memcache_ascii_protocol.c -o php7/memcache_ascii_protocol.lo libtool: compile: x86_64-pld-linux-gnux32-gcc -I. -I/tmp/B.98HJ_h/BUILD/php80-pecl-memcache-4.0.5.1 -I/tmp/B.98HJ_h/BUILD/php80-pecl-memcache-4.0.5.1/include -I/tmp/B.98HJ_h/BUILD/php80-pecl-memcache-4.0.5.1/main -I/tmp/B.98HJ_h/BUILD/php80-pecl-memcache-4.0.5.1 -I/usr/include/php -I/usr/include/php/main -I/usr/include/php/TSRM -I/usr/include/php/Zend -I/usr/include/php/ext -I/usr/include/php/ext/date/lib -DHAVE_CONFIG_H -O2 -fwrapv -pipe -Wformat -Werror=format-security -gdwarf-4 -fno-debug-types-section -fvar-tracking-assignments -g2 -Wp,-D_FORTIFY_SOURCE=2 -fstack-protector-strong --param=ssp-buffer-size=4 -Werror=trampolines -fPIC -mtune=generic -march=x86-64 -gdwarf-4 -fno-debug-types-section -fvar-tracking-assignments -g2 -I/usr/include/php -c /tmp/B.98HJ_h/BUILD/php80-pecl-memcache-4.0.5.1/php7/memcache_ascii_protocol.c -fPIC -DPIC -o php7/.libs/memcache_ascii_protocol.o /bin/sh /tmp/B.98HJ_h/BUILD/php80-pecl-memcache-4.0.5.1/libtool --mode=compile x86_64-pld-linux-gnux32-gcc -I. -I/tmp/B.98HJ_h/BUILD/php80-pecl-memcache-4.0.5.1 -I/tmp/B.98HJ_h/BUILD/php80-pecl-memcache-4.0.5.1/include -I/tmp/B.98HJ_h/BUILD/php80-pecl-memcache-4.0.5.1/main -I/tmp/B.98HJ_h/BUILD/php80-pecl-memcache-4.0.5.1 -I/usr/include/php -I/usr/include/php/main -I/usr/include/php/TSRM -I/usr/include/php/Zend -I/usr/include/php/ext -I/usr/include/php/ext/date/lib -DHAVE_CONFIG_H -O2 -fwrapv -pipe -Wformat -Werror=format-security -gdwarf-4 -fno-debug-types-section -fvar-tracking-assignments -g2 -Wp,-D_FORTIFY_SOURCE=2 -fstack-protector-strong --param=ssp-buffer-size=4 -Werror=trampolines -fPIC -mtune=generic -march=x86-64 -gdwarf-4 -fno-debug-types-section -fvar-tracking-assignments -g2 -I/usr/include/php -c /tmp/B.98HJ_h/BUILD/php80-pecl-memcache-4.0.5.1/php7/memcache_pool.c -o php7/memcache_pool.lo libtool: compile: x86_64-pld-linux-gnux32-gcc -I. -I/tmp/B.98HJ_h/BUILD/php80-pecl-memcache-4.0.5.1 -I/tmp/B.98HJ_h/BUILD/php80-pecl-memcache-4.0.5.1/include -I/tmp/B.98HJ_h/BUILD/php80-pecl-memcache-4.0.5.1/main -I/tmp/B.98HJ_h/BUILD/php80-pecl-memcache-4.0.5.1 -I/usr/include/php -I/usr/include/php/main -I/usr/include/php/TSRM -I/usr/include/php/Zend -I/usr/include/php/ext -I/usr/include/php/ext/date/lib -DHAVE_CONFIG_H -O2 -fwrapv -pipe -Wformat -Werror=format-security -gdwarf-4 -fno-debug-types-section -fvar-tracking-assignments -g2 -Wp,-D_FORTIFY_SOURCE=2 -fstack-protector-strong --param=ssp-buffer-size=4 -Werror=trampolines -fPIC -mtune=generic -march=x86-64 -gdwarf-4 -fno-debug-types-section -fvar-tracking-assignments -g2 -I/usr/include/php -c /tmp/B.98HJ_h/BUILD/php80-pecl-memcache-4.0.5.1/php7/memcache_pool.c -fPIC -DPIC -o php7/.libs/memcache_pool.o error: Bad exit status from /tmp/B.98HJ_h/BUILD/tmp/rpm-tmp.14514 (%build) RPM build errors: Bad exit status from /tmp/B.98HJ_h/BUILD/tmp/rpm-tmp.14514 (%build) ended at: Thu Nov 19 15:17:48 2020, done in 0:00:05.505368 error: No files produced. + chmod -R u+rwX /tmp/B.98HJ_h/BUILD + rm -rf /tmp/B.98HJ_h/tmp /tmp/B.98HJ_h/BUILD + rm -rf /tmp/B.98HJ_h Begin-PLD-Builder-Info Build-Time: user:16.75s sys:3.83s real:21.50s (faults io:136809 non-io:705803) End-PLD-Builder-Info
[Back to list of logs] [View rpm -qa of builder]