FailedOk

th/SRPMS[OK]
th/x32[OK]
th/i686[OK]
th/x86_64[OK]

ac/SRPMS[OK]
ac/i386[OK]
ac/i586[OK]
ac/i686[OK]
ac/alpha[OK]
ac/amd64[OK]
ac/athlon[OK]
ac/ppc[OK]
ac/sparc[OK]
ac/sparc64[OK]

Advanced Search
main()
Powered by PLD Linux
(c) 2002-2019 PLD Team
$Revision: 1.37 $
Powered by Real Operating System.
Your IP: 3.226.243.10

php-pecl-memcache add01156-ccef-4562-a68e-ceff670c0605

Status:Failed
Source URL:ftp://buildlogs.pld-linux.org/th/x32/FAIL/php-pecl-memcache,add01156-ccef-4562-a68e-ceff670c0605.bz2
text/plain URL:View!
full text:View!
rpm -qa of builder:View!
Date:2019/08/16 10:20:38
Runtime:0:00:11.141577

Toc:

  • error 1
  • rpm: error: Failed build dependencies:
  • error 2
  • rpm: error: Failed build dependencies:
  • prep
  • Executing(%prep): /bin/sh -e /tmp/B.JcmvDJ/BUILD/tmp/rpm-tmp.26845
  • error 3
  • XFAIL: memcache->addServer() [tests/019.phpt]
  • error 4
  • XFAIL: memcache->set()/memcache->get() with multiple keys and load balancing [tests/020.phpt]
  • error 5
  • XFAIL: memcache->getExtendedStats() [tests/022.phpt]
  • error 6
  • XFAIL: memcache_get_extended_stats() [tests/022a.phpt]
  • error 7
  • XFAIL: memcache->delete() with load balancing [tests/023.phpt]
  • error 8
  • XFAIL: memcache->increment() with load balancing [tests/025.phpt]
  • error 9
  • XFAIL: memcache->delete() with load balancing [tests/026.phpt]
  • error 10
  • XFAIL: memcache->addServer() adding server in failed mode [tests/031.phpt]
  • error 11
  • XFAIL: memcache->getServerStatus(), memcache->setServerParams() [tests/032.phpt]
  • error 12
  • XFAIL: memcache::connect() with unix domain socket [tests/035.phpt]
  • error 13
  • XFAIL: memcache->get() over UDP [tests/038.phpt]
  • error 14
  • XFAIL: memcache->increment()/decrement() with multiple keys [tests/040.phpt]
  • error 15
  • XFAIL: ini_set('memcache.redundancy') [tests/043.phpt]
  • error 16
  • XFAIL: ini_set('memcache.session_redundancy') [tests/044.phpt]
  • error 17
  • XFAIL: hash strategies and functions [tests/046.phpt]
  • error 18
  • XFAIL: ini_set('session.save_handler') with unix domain socket [tests/053.phpt]
  • error 19
  • XFAIL: FLAKY: memcache->addServer() with microsecond timeout [tests/056.phpt]
  • error 20
  • XFAIL: ini_set('session.save_handler') [tests/036.phpt]
  • error 21
  • XFAIL: ini_set("memcache.allow_failover") [tests/029.phpt]
  • error 22
  • XFAIL: strange keys [tests/005.phpt]
  • error 23
  • XFAIL: memcache multi host save path function [tests/bug73539.phpt]
  • build
  • Executing(%build): /bin/sh -e /tmp/B.JcmvDJ/BUILD/tmp/rpm-tmp.26845
  • error 24
  • error: Bad exit status from /tmp/B.JcmvDJ/BUILD/tmp/rpm-tmp.26845 (%build)
  • error 25
  • RPM build errors:
  • error 26
  • error: No files produced.

Content:

checking if we should skip the build
started at: Fri Aug 16 10:19:50 2019
killing old processes on a builder
sending signal 9 to pid -1
Killed
cleaning up /tmp
fetching https://srcbuilder.pld-linux.org/th//srpms/add01156-ccef-4562-a68e-ceff670c0605/php74-pecl-memcache-3.0.9-3.src.rpm
fetched 132952 bytes, 386.3 K/s
installing srpm: php74-pecl-memcache-3.0.9-3.src.rpm
+ install -d /tmp/B.JcmvDJ/BUILD /tmp/B.JcmvDJ/RPMS
+ LC_ALL=en_US.UTF-8
+ rpm -qp --changelog php74-pecl-memcache-3.0.9-3.src.rpm
* Fri Aug 16 2019 PLD Linux Team <feedback@pld-linux.org>
- For complete changelog see: http://git.pld-linux.org/?p=packages/php-pecl-memcache.git;a=log;h=master
* Tue Nov 13 2018 Elan Ruusamäe <glen@pld-linux.org> 2b5f773
- rel 3; php 7.3 support * Tue Nov 13 2018 Elan Ruusamäe <glen@pld-linux.org> 7b17d00
- [PATCH] fix for PHP 7.3 + fix build warnings * Tue Nov 13 2018 Elan Ruusamäe <glen@pld-linux.org> 4b53237
- [PATCH] Fix #23 Failed to read session data with 7.1/7.2 + rpm -Uhv --nodeps --define '_topdir /tmp/B.JcmvDJ' --define '_specdir %{_topdir}' --define '_sourcedir %{_specdir}' --define '_rpmdir %{_topdir}/RPMS' --define '_builddir %{_topdir}/BUILD' --define 'php_suffix 74' php74-pecl-memcache-3.0.9-3.src.rpm Preparing... ################################################## php74-pecl-memcache ################################################## + rm -f php74-pecl-memcache-3.0.9-3.src.rpm + install -m 700 -d /tmp/B.JcmvDJ/BUILD/tmp + TMPDIR=/tmp/B.JcmvDJ/BUILD/tmp + exec nice -n 0 rpmbuild -bp --short-circuit --nodeps --define '_topdir /tmp/B.JcmvDJ' --define '_specdir %{_topdir}' --define '_sourcedir %{_specdir}' --define '_rpmdir %{_topdir}/RPMS' --define '_builddir %{_topdir}/BUILD' --target x32-pld-linux --define 'php_suffix 74' --define 'prep exit 0' /tmp/B.JcmvDJ/php-pecl-memcache.spec sh: php-config: inaccessible or not found Building target platforms: x32-pld-linux checking BuildConflict-ing packages no BuildConflicts found checking BR rpm: sh: php-config: inaccessible or not found rpm: error: Failed build dependencies: rpm: php74-devel >= 3:5.0.0 is needed by php74-pecl-memcache-3.0.9-3.src rpm: php74-xml is needed by php74-pecl-memcache-3.0.9-3.src rpm: php-packagexml2cl is needed by php74-pecl-memcache-3.0.9-3.src rpm: php74-cli is needed by php74-pecl-memcache-3.0.9-3.src rpm: php74-pcre is needed by php74-pecl-memcache-3.0.9-3.src rpm: php74-session is needed by php74-pecl-memcache-3.0.9-3.src rpm: php74-spl is needed by php74-pecl-memcache-3.0.9-3.src rpm: Building target platforms: x32-pld-linux updating poldek cache... ready is up to date Retrieving th::packages.ndir.md... Retrieving th::packages.ndir.diff.toc.gz... Retrieving diff::packages.ndir.2019.07.21-23.29.00.gz... ..............................done Retrieving diff::packages.ndir.dscr.2019.07.21-23.29.00.gz... ..............................done Loading [pndir]th... Applying packages.ndir.2019.07.21-23.29.00.gz... Writing /root/tmp/poldek-cache-root/[...]/packages.ndir.gz... Retrieving th::packages.ndir.md... Retrieving th::packages.ndir.diff.toc.gz... Retrieving diff::packages.ndir.2019.07.21-23.29.00.gz... ..............................done Retrieving diff::packages.ndir.dscr.2019.07.21-23.29.00.gz... ..............................done Loading [pndir]th... Applying packages.ndir.2019.07.21-23.29.00.gz... Writing /root/tmp/poldek-cache-root/[...]/packages.ndir.gz... Retrieving th-ready::packages.ndir.md... th-ready is up to date Retrieving th-ready::packages.ndir.md... th-ready is up to date Retrieving th-test::packages.ndir.md... Retrieving th-test::packages.ndir.diff.toc.gz... Retrieving diff::packages.ndir.2019.08.13-16.54.02.gz... Loading [pndir]th-test... Applying packages.ndir.2019.08.13-16.54.02.gz... Writing /root/tmp/poldek-cache-root/[...]/packages.ndir.gz... Retrieving th-test::packages.ndir.md... Retrieving th-test::packages.ndir.diff.toc.gz... ..............................done Retrieving diff::packages.ndir.2019.08.13-15.18.01.gz... ..............................done Retrieving diff::packages.ndir.dscr.2019.08.13-15.18.01.gz... ..............................done Loading [pndir]th-test... Applying packages.ndir.2019.08.13-15.18.01.gz... Retrieving diff::packages.ndir.2019.08.14-15.17.01.gz... ..............................done Retrieving diff::packages.ndir.dscr.2019.08.14-15.17.01.gz... ..............................done Applying packages.ndir.2019.08.14-15.17.01.gz... Retrieving diff::packages.ndir.2019.08.14-15.32.01.gz... Applying packages.ndir.2019.08.14-15.32.01.gz... Writing /root/tmp/poldek-cache-root/[...]/packages.ndir.gz... checking conflicting packages in BRed packages poldek: Loading [pndir]ready... poldek: Loading [pndir]th-test... poldek: Loading [pndir]th-test... poldek: Loading [pndir]th-ready... poldek: Loading [pndir]th-ready... poldek: Loading [pndir]th... poldek: Loading [pndir]th... poldek: 27560 packages read poldek: Removed 3163 duplicate packages from available set poldek: Processing dependencies... poldek: php-packagexml2cl-0.1-4.noarch marks php74-program-7.4.0-1.beta2.1.x32 (cap /usr/bin/php) poldek: php-packagexml2cl-0.1-4.noarch marks php74-simplexml-7.4.0-1.beta2.1.x32 (cap php(simplexml)) poldek: There are 8 packages to install (2 marked by dependencies): poldek: I php-packagexml2cl-0.1-4.noarch php74-cli-7.4.0-1.beta2.1.x32 poldek: I php74-common-7.4.0-1.beta2.1.x32 php74-devel-7.4.0-1.beta2.1.x32 poldek: I php74-session-7.4.0-1.beta2.1.x32 php74-xml-7.4.0-1.beta2.1.x32 poldek: D php74-program-7.4.0-1.beta2.1.x32 php74-simplexml-7.4.0-1.beta2.1.x32 poldek: This operation will use 15.1MB of disk space. poldek: Need to get 2.1MB of archives (2.9KB to download). poldek: poldek: Retrieving th::php-packagexml2cl-0.1-4.noarch.rpm... poldek: ..............................done poldek: Executing pm-command.sh --upgrade -vh --test --root / --define _check_dirname_deps 1... poldek: Preparing... ################################################## no conflicts found checking BR rpm: sh: php-config: inaccessible or not found rpm: error: Failed build dependencies: rpm: php74-devel >= 3:5.0.0 is needed by php74-pecl-memcache-3.0.9-3.src rpm: php74-xml is needed by php74-pecl-memcache-3.0.9-3.src rpm: php-packagexml2cl is needed by php74-pecl-memcache-3.0.9-3.src rpm: php74-cli is needed by php74-pecl-memcache-3.0.9-3.src rpm: php74-pcre is needed by php74-pecl-memcache-3.0.9-3.src rpm: php74-session is needed by php74-pecl-memcache-3.0.9-3.src rpm: php74-spl is needed by php74-pecl-memcache-3.0.9-3.src rpm: Building target platforms: x32-pld-linux installing BR: php\-packagexml2cl php74\-pcre php74\-spl php74\-xml php74\-cli php74\-devel php74\-session + poldek --noask --caplookup -Q -v '--ignore=hhvm-*' '--ignore=php4-*' '--ignore=php52-*' '--ignore=php53-*' '--ignore=php54-*' '--ignore=php55-*' '--ignore=php56-*' '--ignore=php70-*' '--ignore=php71-*' '--ignore=php72-*' '--ignore=php73-*' --upgrade php-packagexml2cl php74-pcre php74-spl php74-xml php74-cli php74-devel php74-session Loading [pndir]ready... Loading [pndir]th-test... Loading [pndir]th-test... Loading [pndir]th-ready... Loading [pndir]th-ready... Loading [pndir]th... Loading [pndir]th... 27560 packages read Removed 3163 duplicate packages from available set Processing dependencies... There are 5 packages to install: I php74-cli-7.4.0-1.beta2.1.x32 php74-common-7.4.0-1.beta2.1.x32 I php74-devel-7.4.0-1.beta2.1.x32 php74-session-7.4.0-1.beta2.1.x32 I php74-xml-7.4.0-1.beta2.1.x32 This operation will use 15.1MB of disk space. Need to get 2.1MB of archives. Executing pm-command.sh --upgrade -vh --root / --define _check_dirname_deps 1... Preparing... ################################################## php74-common ################################################## php74-cli ################################################## php74-devel ################################################## php74-session ################################################## php74-xml ################################################## Installing set #2 Processing dependencies... php-packagexml2cl-0.1-4.noarch marks php74-program-7.4.0-1.beta2.1.x32 (cap /usr/bin/php) php-packagexml2cl-0.1-4.noarch marks php74-simplexml-7.4.0-1.beta2.1.x32 (cap php(simplexml)) There are 3 packages to install (2 marked by dependencies): I php-packagexml2cl-0.1-4.noarch D php74-program-7.4.0-1.beta2.1.x32 php74-simplexml-7.4.0-1.beta2.1.x32 This operation will use 55.6KB of disk space. Need to get 39.4KB of archives. Executing pm-command.sh --upgrade -vh --root / --define _check_dirname_deps 1... Preparing... ################################################## php74-program ################################################## php74-simplexml ################################################## php-packagexml2cl ################################################## building RPM using: set -ex; : build-id: add01156-ccef-4562-a68e-ceff670c0605; TMPDIR=/tmp/B.JcmvDJ/BUILD/tmp exec nice -n 0 rpmbuild -bb --define '_smp_mflags -j9' --define '_make_opts -Otarget' --define '_pld_builder 1' --define '_topdir /tmp/B.JcmvDJ' --define '_specdir %{_topdir}' --define '_sourcedir %{_specdir}' --define '_rpmdir %{_topdir}/RPMS' --define '_builddir %{_topdir}/BUILD' --target x32-pld-linux --define 'php_suffix 74' /tmp/B.JcmvDJ/php-pecl-memcache.spec + : build-id: add01156-ccef-4562-a68e-ceff670c0605 + TMPDIR=/tmp/B.JcmvDJ/BUILD/tmp + exec nice -n 0 rpmbuild -bb --define '_smp_mflags -j9' --define '_make_opts -Otarget' --define '_pld_builder 1' --define '_topdir /tmp/B.JcmvDJ' --define '_specdir %{_topdir}' --define '_sourcedir %{_specdir}' --define '_rpmdir %{_topdir}/RPMS' --define '_builddir %{_topdir}/BUILD' --target x32-pld-linux --define 'php_suffix 74' /tmp/B.JcmvDJ/php-pecl-memcache.spec Building target platforms: x32-pld-linux Executing(%prep): /bin/sh -e /tmp/B.JcmvDJ/BUILD/tmp/rpm-tmp.26845 + umask 022 + cd /tmp/B.JcmvDJ/BUILD + cd /tmp/B.JcmvDJ/BUILD + rm -rf php74-pecl-memcache-3.0.9 + /bin/mkdir -p php74-pecl-memcache-3.0.9 + cd php74-pecl-memcache-3.0.9 + /usr/bin/gzip -dc /tmp/B.JcmvDJ/memcache-3.0.9-e702b5f91.tar.gz + /bin/tar -xf - + STATUS=0 + '[' 0 -ne 0 ']' + /bin/id -u + '[' 1000 '=' 0 ']' + /bin/id -u + '[' 1000 '=' 0 ']' + /bin/chmod -Rf a+rX,u+w,g-w,o-w . + mv pecl-memcache-e702b5f91ec222e20d1d5cea0ffc6be012992d70/.gitignore pecl-memcache-e702b5f91ec222e20d1d5cea0ffc6be012992d70/CREDITS pecl-memcache-e702b5f91ec222e20d1d5cea0ffc6be012992d70/LICENSE pecl-memcache-e702b5f91ec222e20d1d5cea0ffc6be012992d70/README pecl-memcache-e702b5f91ec222e20d1d5cea0ffc6be012992d70/config.m4 pecl-memcache-e702b5f91ec222e20d1d5cea0ffc6be012992d70/config.w32 pecl-memcache-e702b5f91ec222e20d1d5cea0ffc6be012992d70/config9.m4 pecl-memcache-e702b5f91ec222e20d1d5cea0ffc6be012992d70/example.php pecl-memcache-e702b5f91ec222e20d1d5cea0ffc6be012992d70/memcache.php pecl-memcache-e702b5f91ec222e20d1d5cea0ffc6be012992d70/package.xml pecl-memcache-e702b5f91ec222e20d1d5cea0ffc6be012992d70/php5 pecl-memcache-e702b5f91ec222e20d1d5cea0ffc6be012992d70/php7 pecl-memcache-e702b5f91ec222e20d1d5cea0ffc6be012992d70/profile.php pecl-memcache-e702b5f91ec222e20d1d5cea0ffc6be012992d70/tests . + echo 'Patch #0 (memcache-webapp.patch):' Patch #0 (memcache-webapp.patch): + '[' -f /tmp/B.JcmvDJ/memcache-webapp.patch ']' + /bin/cat /tmp/B.JcmvDJ/memcache-webapp.patch + /usr/bin/patch -s -p1 + echo 'Patch #1 (26.patch):' Patch #1 (26.patch): + '[' -f /tmp/B.JcmvDJ/26.patch ']' + /bin/cat /tmp/B.JcmvDJ/26.patch + /usr/bin/patch -s -p1 + echo 'Patch #2 (30.patch):' Patch #2 (30.patch): + '[' -f /tmp/B.JcmvDJ/30.patch ']' + /bin/cat /tmp/B.JcmvDJ/30.patch + /usr/bin/patch -s -p1 + rm tests/039.phpt + rm tests/041.phpt + rm tests/042.phpt + <<"EOF" + xfail + set +x XFAIL: memcache->addServer() [tests/019.phpt] XFAIL: memcache->set()/memcache->get() with multiple keys and load balancing [tests/020.phpt] XFAIL: memcache->getExtendedStats() [tests/022.phpt] XFAIL: memcache_get_extended_stats() [tests/022a.phpt] XFAIL: memcache->delete() with load balancing [tests/023.phpt] XFAIL: memcache->increment() with load balancing [tests/025.phpt] XFAIL: memcache->delete() with load balancing [tests/026.phpt] XFAIL: memcache->addServer() adding server in failed mode [tests/031.phpt] XFAIL: memcache->getServerStatus(), memcache->setServerParams() [tests/032.phpt] XFAIL: memcache::connect() with unix domain socket [tests/035.phpt] XFAIL: memcache->get() over UDP [tests/038.phpt] XFAIL: memcache->increment()/decrement() with multiple keys [tests/040.phpt] XFAIL: ini_set('memcache.redundancy') [tests/043.phpt] XFAIL: ini_set('memcache.session_redundancy') [tests/044.phpt] XFAIL: hash strategies and functions [tests/046.phpt] XFAIL: ini_set('session.save_handler') with unix domain socket [tests/053.phpt] XFAIL: FLAKY: memcache->addServer() with microsecond timeout [tests/056.phpt] XFAIL: ini_set('session.save_handler') [tests/036.phpt] XFAIL: ini_set("memcache.allow_failover") [tests/029.phpt] XFAIL: strange keys [tests/005.phpt] XFAIL: memcache multi host save path function [tests/bug73539.phpt] + exit 0 Executing(%build): /bin/sh -e /tmp/B.JcmvDJ/BUILD/tmp/rpm-tmp.26845 HOME=/home/users/builder PATH=/home/users/builder/GNUstep/Tools:/usr/local/bin:/usr/bin:/bin TMPDIR=/tmp/B.JcmvDJ/BUILD/tmp + umask 022 + cd /tmp/B.JcmvDJ/BUILD + cd php74-pecl-memcache-3.0.9 + >ChangeLog + packagexml2cl package.xml + phpize Configuring for: PHP Api Version: 20190529 Zend Module Api No: 20190529 Zend Extension Api No: 320190529 + ./configure 'LDFLAGS=-Wl,--as-needed -Wl,--no-copy-dt-needed-entries -Wl,-z,relro -Wl,-z,combreloc ' 'CFLAGS=-O2 -fwrapv -pipe -Wformat -Werror=format-security -gdwarf-4 -fno-debug-types-section -fvar-tracking-assignments -g2 -Wp,-D_FORTIFY_SOURCE=2 -fstack-protector-strong --param=ssp-buffer-size=4 -Werror=trampolines -fPIC -mtune=generic -march=x86-64 -gdwarf-4 -fno-debug-types-section -fvar-tracking-assignments -g2 ' 'CXXFLAGS=-O2 -fwrapv -pipe -Wformat -Werror=format-security -gdwarf-4 -fno-debug-types-section -fvar-tracking-assignments -g2 -Wp,-D_FORTIFY_SOURCE=2 -fstack-protector-strong --param=ssp-buffer-size=4 -Werror=trampolines -fPIC -mtune=generic -march=x86-64 -gdwarf-4 -fno-debug-types-section -fvar-tracking-assignments -g2 ' 'FFLAGS=-O2 -fwrapv -pipe -Wformat -Werror=format-security -gdwarf-4 -fno-debug-types-section -fvar-tracking-assignments -g2 -Wp,-D_FORTIFY_SOURCE=2 -fstack-protector-strong --param=ssp-buffer-size=4 -Werror=trampolines -fPIC -mtune=generic -march=x86-64 -gdwarf-4 -fno-debug-types-section -fvar-tracking-assignments -g2 ' 'FCFLAGS=-O2 -fwrapv -pipe -Wformat -Werror=format-security -gdwarf-4 -fno-debug-types-section -fvar-tracking-assignments -g2 -Wp,-D_FORTIFY_SOURCE=2 -fstack-protector-strong --param=ssp-buffer-size=4 -Werror=trampolines -fPIC -mtune=generic -march=x86-64 -gdwarf-4 -fno-debug-types-section -fvar-tracking-assignments -g2 ' 'CPPFLAGS=' 'CC=x86_64-pld-linux-gnux32-gcc' 'CXX=x86_64-pld-linux-gnux32-g++' '--host=x86_64-pld-linux-gnux32' '--build=x86_64-pld-linux-gnux32' '--prefix=/usr' '--exec-prefix=/usr' '--bindir=/usr/bin' '--sbindir=/usr/sbin' '--sysconfdir=/etc/webapps/memcache' '--datadir=/usr/share' '--includedir=/usr/include' '--libdir=/usr/libx32' '--libexecdir=/usr/libexec' '--localstatedir=/var' '--sharedstatedir=/var/lib' '--mandir=/usr/share/man' '--infodir=/usr/share/info' '--x-libraries=/usr/libx32' '--with-zlib-dir=/usr' checking for grep that handles long lines and -e... /bin/grep checking for egrep... /bin/grep -E checking for a sed that does not truncate output... /bin/sed checking for x86_64-pld-linux-gnux32-pkg-config... /usr/bin/x86_64-pld-linux-gnux32-pkg-config checking pkg-config is at least version 0.9.0... yes checking for x86_64-pld-linux-gnux32-cc... x86_64-pld-linux-gnux32-gcc checking whether the C compiler works... yes checking for C compiler default output file name... a.out checking for suffix of executables... checking whether we are cross compiling... no checking for suffix of object files... o checking whether we are using the GNU C compiler... yes checking whether x86_64-pld-linux-gnux32-gcc accepts -g... yes checking for x86_64-pld-linux-gnux32-gcc option to accept ISO C89... none needed checking how to run the C preprocessor... x86_64-pld-linux-gnux32-gcc -E checking for icc... no checking for suncc... no checking for system library directory... lib checking if compiler supports -R... no checking if compiler supports -Wl,-rpath,... yes checking build system type... x86_64-pld-linux-gnux32 checking host system type... x86_64-pld-linux-gnux32 checking target system type... x86_64-pld-linux-gnux32 checking for PHP prefix... /usr checking for PHP includes... -I/usr/include/php -I/usr/include/php/main -I/usr/include/php/TSRM -I/usr/include/php/Zend -I/usr/include/php/ext -I/usr/include/php/ext/date/lib checking for PHP extension directory... /usr/libx32/php74 checking for PHP installed headers prefix... /usr/include/php checking if debug is enabled... no checking if zts is enabled... no checking for gawk... gawk checking whether to enable memcache support... yes, shared checking whether to enable memcache session handler support... yes checking for the location of ZLIB... /usr checking for the location of zlib... /usr checking PHP version... PHP 7.x checking for session includes... /usr/include/php checking for memcache session support... enabled checking how to print strings... print -r checking for a sed that does not truncate output... (cached) /bin/sed checking for fgrep... /bin/grep -F checking for ld used by x86_64-pld-linux-gnux32-gcc... /usr/bin/ld checking if the linker (/usr/bin/ld) is GNU ld... yes checking for BSD- or MS-compatible name lister (nm)... /usr/bin/nm -B checking the name lister (/usr/bin/nm -B) interface... BSD nm checking whether ln -s works... yes checking the maximum length of command line arguments... 1572864 checking how to convert x86_64-pld-linux-gnux32 file names to x86_64-pld-linux-gnux32 format... func_convert_file_noop checking how to convert x86_64-pld-linux-gnux32 file names to toolchain format... func_convert_file_noop checking for /usr/bin/ld option to reload object files... -r checking for x86_64-pld-linux-gnux32-objdump... no checking for objdump... objdump checking how to recognize dependent libraries... pass_all checking for x86_64-pld-linux-gnux32-dlltool... no checking for dlltool... no checking how to associate runtime and link libraries... print -r -- checking for x86_64-pld-linux-gnux32-ar... no checking for ar... ar checking for archiver @FILE support... @ checking for x86_64-pld-linux-gnux32-strip... no checking for strip... strip checking for x86_64-pld-linux-gnux32-ranlib... no checking for ranlib... ranlib checking for mawk... (cached) gawk checking command to parse /usr/bin/nm -B output from x86_64-pld-linux-gnux32-gcc object... ok checking for sysroot... no checking for a working dd... /bin/dd checking how to truncate binary pipes... /bin/dd bs=4096 count=1 checking for x86_64-pld-linux-gnux32-mt... no checking for mt... no checking if : is a manifest tool... no checking for ANSI C header files... yes checking for sys/types.h... yes checking for sys/stat.h... yes checking for stdlib.h... yes checking for string.h... yes checking for memory.h... yes checking for strings.h... yes checking for inttypes.h... yes checking for stdint.h... yes checking for unistd.h... yes checking for dlfcn.h... yes checking for objdir... .libs checking if x86_64-pld-linux-gnux32-gcc supports -fno-rtti -fno-exceptions... no checking for x86_64-pld-linux-gnux32-gcc option to produce PIC... -fPIC -DPIC checking if x86_64-pld-linux-gnux32-gcc PIC flag -fPIC -DPIC works... yes checking if x86_64-pld-linux-gnux32-gcc static flag -static works... yes checking if x86_64-pld-linux-gnux32-gcc supports -c -o file.o... yes checking if x86_64-pld-linux-gnux32-gcc supports -c -o file.o... (cached) yes checking whether the x86_64-pld-linux-gnux32-gcc linker (/usr/bin/ld -m elf32_x86_64) supports shared libraries... yes checking whether -lc should be explicitly linked in... no checking dynamic linker characteristics... GNU/Linux ld.so checking how to hardcode library paths into programs... immediate checking whether stripping libraries is possible... yes checking if libtool supports shared libraries... yes checking whether to build shared libraries... yes checking whether to build static libraries... no configure: patching config.h.in configure: creating ./config.status config.status: creating config.h config.status: executing libtool commands + /usr/bin/make -Otarget -j9 /bin/sh /tmp/B.JcmvDJ/BUILD/php74-pecl-memcache-3.0.9/libtool --mode=compile x86_64-pld-linux-gnux32-gcc -I/usr/include/php -I. -I/tmp/B.JcmvDJ/BUILD/php74-pecl-memcache-3.0.9 -DPHP_ATOM_INC -I/tmp/B.JcmvDJ/BUILD/php74-pecl-memcache-3.0.9/include -I/tmp/B.JcmvDJ/BUILD/php74-pecl-memcache-3.0.9/main -I/tmp/B.JcmvDJ/BUILD/php74-pecl-memcache-3.0.9 -I/usr/include/php -I/usr/include/php/main -I/usr/include/php/TSRM -I/usr/include/php/Zend -I/usr/include/php/ext -I/usr/include/php/ext/date/lib -DHAVE_CONFIG_H -O2 -fwrapv -pipe -Wformat -Werror=format-security -gdwarf-4 -fno-debug-types-section -fvar-tracking-assignments -g2 -Wp,-D_FORTIFY_SOURCE=2 -fstack-protector-strong --param=ssp-buffer-size=4 -Werror=trampolines -fPIC -mtune=generic -march=x86-64 -gdwarf-4 -fno-debug-types-section -fvar-tracking-assignments -g2 -c /tmp/B.JcmvDJ/BUILD/php74-pecl-memcache-3.0.9/php7/memcache_standard_hash.c -o php7/memcache_standard_hash.lo libtool: compile: x86_64-pld-linux-gnux32-gcc -I/usr/include/php -I. -I/tmp/B.JcmvDJ/BUILD/php74-pecl-memcache-3.0.9 -DPHP_ATOM_INC -I/tmp/B.JcmvDJ/BUILD/php74-pecl-memcache-3.0.9/include -I/tmp/B.JcmvDJ/BUILD/php74-pecl-memcache-3.0.9/main -I/tmp/B.JcmvDJ/BUILD/php74-pecl-memcache-3.0.9 -I/usr/include/php -I/usr/include/php/main -I/usr/include/php/TSRM -I/usr/include/php/Zend -I/usr/include/php/ext -I/usr/include/php/ext/date/lib -DHAVE_CONFIG_H -O2 -fwrapv -pipe -Wformat -Werror=format-security -gdwarf-4 -fno-debug-types-section -fvar-tracking-assignments -g2 -Wp,-D_FORTIFY_SOURCE=2 -fstack-protector-strong --param=ssp-buffer-size=4 -Werror=trampolines -fPIC -mtune=generic -march=x86-64 -gdwarf-4 -fno-debug-types-section -fvar-tracking-assignments -g2 -c /tmp/B.JcmvDJ/BUILD/php74-pecl-memcache-3.0.9/php7/memcache_standard_hash.c -fPIC -DPIC -o php7/.libs/memcache_standard_hash.o /bin/sh /tmp/B.JcmvDJ/BUILD/php74-pecl-memcache-3.0.9/libtool --mode=compile x86_64-pld-linux-gnux32-gcc -I/usr/include/php -I. -I/tmp/B.JcmvDJ/BUILD/php74-pecl-memcache-3.0.9 -DPHP_ATOM_INC -I/tmp/B.JcmvDJ/BUILD/php74-pecl-memcache-3.0.9/include -I/tmp/B.JcmvDJ/BUILD/php74-pecl-memcache-3.0.9/main -I/tmp/B.JcmvDJ/BUILD/php74-pecl-memcache-3.0.9 -I/usr/include/php -I/usr/include/php/main -I/usr/include/php/TSRM -I/usr/include/php/Zend -I/usr/include/php/ext -I/usr/include/php/ext/date/lib -DHAVE_CONFIG_H -O2 -fwrapv -pipe -Wformat -Werror=format-security -gdwarf-4 -fno-debug-types-section -fvar-tracking-assignments -g2 -Wp,-D_FORTIFY_SOURCE=2 -fstack-protector-strong --param=ssp-buffer-size=4 -Werror=trampolines -fPIC -mtune=generic -march=x86-64 -gdwarf-4 -fno-debug-types-section -fvar-tracking-assignments -g2 -c /tmp/B.JcmvDJ/BUILD/php74-pecl-memcache-3.0.9/php7/memcache_queue.c -o php7/memcache_queue.lo libtool: compile: x86_64-pld-linux-gnux32-gcc -I/usr/include/php -I. -I/tmp/B.JcmvDJ/BUILD/php74-pecl-memcache-3.0.9 -DPHP_ATOM_INC -I/tmp/B.JcmvDJ/BUILD/php74-pecl-memcache-3.0.9/include -I/tmp/B.JcmvDJ/BUILD/php74-pecl-memcache-3.0.9/main -I/tmp/B.JcmvDJ/BUILD/php74-pecl-memcache-3.0.9 -I/usr/include/php -I/usr/include/php/main -I/usr/include/php/TSRM -I/usr/include/php/Zend -I/usr/include/php/ext -I/usr/include/php/ext/date/lib -DHAVE_CONFIG_H -O2 -fwrapv -pipe -Wformat -Werror=format-security -gdwarf-4 -fno-debug-types-section -fvar-tracking-assignments -g2 -Wp,-D_FORTIFY_SOURCE=2 -fstack-protector-strong --param=ssp-buffer-size=4 -Werror=trampolines -fPIC -mtune=generic -march=x86-64 -gdwarf-4 -fno-debug-types-section -fvar-tracking-assignments -g2 -c /tmp/B.JcmvDJ/BUILD/php74-pecl-memcache-3.0.9/php7/memcache_queue.c -fPIC -DPIC -o php7/.libs/memcache_queue.o /bin/sh /tmp/B.JcmvDJ/BUILD/php74-pecl-memcache-3.0.9/libtool --mode=compile x86_64-pld-linux-gnux32-gcc -I/usr/include/php -I. -I/tmp/B.JcmvDJ/BUILD/php74-pecl-memcache-3.0.9 -DPHP_ATOM_INC -I/tmp/B.JcmvDJ/BUILD/php74-pecl-memcache-3.0.9/include -I/tmp/B.JcmvDJ/BUILD/php74-pecl-memcache-3.0.9/main -I/tmp/B.JcmvDJ/BUILD/php74-pecl-memcache-3.0.9 -I/usr/include/php -I/usr/include/php/main -I/usr/include/php/TSRM -I/usr/include/php/Zend -I/usr/include/php/ext -I/usr/include/php/ext/date/lib -DHAVE_CONFIG_H -O2 -fwrapv -pipe -Wformat -Werror=format-security -gdwarf-4 -fno-debug-types-section -fvar-tracking-assignments -g2 -Wp,-D_FORTIFY_SOURCE=2 -fstack-protector-strong --param=ssp-buffer-size=4 -Werror=trampolines -fPIC -mtune=generic -march=x86-64 -gdwarf-4 -fno-debug-types-section -fvar-tracking-assignments -g2 -c /tmp/B.JcmvDJ/BUILD/php74-pecl-memcache-3.0.9/php7/memcache_consistent_hash.c -o php7/memcache_consistent_hash.lo libtool: compile: x86_64-pld-linux-gnux32-gcc -I/usr/include/php -I. -I/tmp/B.JcmvDJ/BUILD/php74-pecl-memcache-3.0.9 -DPHP_ATOM_INC -I/tmp/B.JcmvDJ/BUILD/php74-pecl-memcache-3.0.9/include -I/tmp/B.JcmvDJ/BUILD/php74-pecl-memcache-3.0.9/main -I/tmp/B.JcmvDJ/BUILD/php74-pecl-memcache-3.0.9 -I/usr/include/php -I/usr/include/php/main -I/usr/include/php/TSRM -I/usr/include/php/Zend -I/usr/include/php/ext -I/usr/include/php/ext/date/lib -DHAVE_CONFIG_H -O2 -fwrapv -pipe -Wformat -Werror=format-security -gdwarf-4 -fno-debug-types-section -fvar-tracking-assignments -g2 -Wp,-D_FORTIFY_SOURCE=2 -fstack-protector-strong --param=ssp-buffer-size=4 -Werror=trampolines -fPIC -mtune=generic -march=x86-64 -gdwarf-4 -fno-debug-types-section -fvar-tracking-assignments -g2 -c /tmp/B.JcmvDJ/BUILD/php74-pecl-memcache-3.0.9/php7/memcache_consistent_hash.c -fPIC -DPIC -o php7/.libs/memcache_consistent_hash.o /bin/sh /tmp/B.JcmvDJ/BUILD/php74-pecl-memcache-3.0.9/libtool --mode=compile x86_64-pld-linux-gnux32-gcc -I/usr/include/php -I. -I/tmp/B.JcmvDJ/BUILD/php74-pecl-memcache-3.0.9 -DPHP_ATOM_INC -I/tmp/B.JcmvDJ/BUILD/php74-pecl-memcache-3.0.9/include -I/tmp/B.JcmvDJ/BUILD/php74-pecl-memcache-3.0.9/main -I/tmp/B.JcmvDJ/BUILD/php74-pecl-memcache-3.0.9 -I/usr/include/php -I/usr/include/php/main -I/usr/include/php/TSRM -I/usr/include/php/Zend -I/usr/include/php/ext -I/usr/include/php/ext/date/lib -DHAVE_CONFIG_H -O2 -fwrapv -pipe -Wformat -Werror=format-security -gdwarf-4 -fno-debug-types-section -fvar-tracking-assignments -g2 -Wp,-D_FORTIFY_SOURCE=2 -fstack-protector-strong --param=ssp-buffer-size=4 -Werror=trampolines -fPIC -mtune=generic -march=x86-64 -gdwarf-4 -fno-debug-types-section -fvar-tracking-assignments -g2 -c /tmp/B.JcmvDJ/BUILD/php74-pecl-memcache-3.0.9/php7/memcache_session.c -o php7/memcache_session.lo libtool: compile: x86_64-pld-linux-gnux32-gcc -I/usr/include/php -I. -I/tmp/B.JcmvDJ/BUILD/php74-pecl-memcache-3.0.9 -DPHP_ATOM_INC -I/tmp/B.JcmvDJ/BUILD/php74-pecl-memcache-3.0.9/include -I/tmp/B.JcmvDJ/BUILD/php74-pecl-memcache-3.0.9/main -I/tmp/B.JcmvDJ/BUILD/php74-pecl-memcache-3.0.9 -I/usr/include/php -I/usr/include/php/main -I/usr/include/php/TSRM -I/usr/include/php/Zend -I/usr/include/php/ext -I/usr/include/php/ext/date/lib -DHAVE_CONFIG_H -O2 -fwrapv -pipe -Wformat -Werror=format-security -gdwarf-4 -fno-debug-types-section -fvar-tracking-assignments -g2 -Wp,-D_FORTIFY_SOURCE=2 -fstack-protector-strong --param=ssp-buffer-size=4 -Werror=trampolines -fPIC -mtune=generic -march=x86-64 -gdwarf-4 -fno-debug-types-section -fvar-tracking-assignments -g2 -c /tmp/B.JcmvDJ/BUILD/php74-pecl-memcache-3.0.9/php7/memcache_session.c -fPIC -DPIC -o php7/.libs/memcache_session.o /bin/sh /tmp/B.JcmvDJ/BUILD/php74-pecl-memcache-3.0.9/libtool --mode=compile x86_64-pld-linux-gnux32-gcc -I/usr/include/php -I. -I/tmp/B.JcmvDJ/BUILD/php74-pecl-memcache-3.0.9 -DPHP_ATOM_INC -I/tmp/B.JcmvDJ/BUILD/php74-pecl-memcache-3.0.9/include -I/tmp/B.JcmvDJ/BUILD/php74-pecl-memcache-3.0.9/main -I/tmp/B.JcmvDJ/BUILD/php74-pecl-memcache-3.0.9 -I/usr/include/php -I/usr/include/php/main -I/usr/include/php/TSRM -I/usr/include/php/Zend -I/usr/include/php/ext -I/usr/include/php/ext/date/lib -DHAVE_CONFIG_H -O2 -fwrapv -pipe -Wformat -Werror=format-security -gdwarf-4 -fno-debug-types-section -fvar-tracking-assignments -g2 -Wp,-D_FORTIFY_SOURCE=2 -fstack-protector-strong --param=ssp-buffer-size=4 -Werror=trampolines -fPIC -mtune=generic -march=x86-64 -gdwarf-4 -fno-debug-types-section -fvar-tracking-assignments -g2 -c /tmp/B.JcmvDJ/BUILD/php74-pecl-memcache-3.0.9/php7/memcache_binary_protocol.c -o php7/memcache_binary_protocol.lo libtool: compile: x86_64-pld-linux-gnux32-gcc -I/usr/include/php -I. -I/tmp/B.JcmvDJ/BUILD/php74-pecl-memcache-3.0.9 -DPHP_ATOM_INC -I/tmp/B.JcmvDJ/BUILD/php74-pecl-memcache-3.0.9/include -I/tmp/B.JcmvDJ/BUILD/php74-pecl-memcache-3.0.9/main -I/tmp/B.JcmvDJ/BUILD/php74-pecl-memcache-3.0.9 -I/usr/include/php -I/usr/include/php/main -I/usr/include/php/TSRM -I/usr/include/php/Zend -I/usr/include/php/ext -I/usr/include/php/ext/date/lib -DHAVE_CONFIG_H -O2 -fwrapv -pipe -Wformat -Werror=format-security -gdwarf-4 -fno-debug-types-section -fvar-tracking-assignments -g2 -Wp,-D_FORTIFY_SOURCE=2 -fstack-protector-strong --param=ssp-buffer-size=4 -Werror=trampolines -fPIC -mtune=generic -march=x86-64 -gdwarf-4 -fno-debug-types-section -fvar-tracking-assignments -g2 -c /tmp/B.JcmvDJ/BUILD/php74-pecl-memcache-3.0.9/php7/memcache_binary_protocol.c -fPIC -DPIC -o php7/.libs/memcache_binary_protocol.o /bin/sh /tmp/B.JcmvDJ/BUILD/php74-pecl-memcache-3.0.9/libtool --mode=compile x86_64-pld-linux-gnux32-gcc -I/usr/include/php -I. -I/tmp/B.JcmvDJ/BUILD/php74-pecl-memcache-3.0.9 -DPHP_ATOM_INC -I/tmp/B.JcmvDJ/BUILD/php74-pecl-memcache-3.0.9/include -I/tmp/B.JcmvDJ/BUILD/php74-pecl-memcache-3.0.9/main -I/tmp/B.JcmvDJ/BUILD/php74-pecl-memcache-3.0.9 -I/usr/include/php -I/usr/include/php/main -I/usr/include/php/TSRM -I/usr/include/php/Zend -I/usr/include/php/ext -I/usr/include/php/ext/date/lib -DHAVE_CONFIG_H -O2 -fwrapv -pipe -Wformat -Werror=format-security -gdwarf-4 -fno-debug-types-section -fvar-tracking-assignments -g2 -Wp,-D_FORTIFY_SOURCE=2 -fstack-protector-strong --param=ssp-buffer-size=4 -Werror=trampolines -fPIC -mtune=generic -march=x86-64 -gdwarf-4 -fno-debug-types-section -fvar-tracking-assignments -g2 -c /tmp/B.JcmvDJ/BUILD/php74-pecl-memcache-3.0.9/php7/memcache_ascii_protocol.c -o php7/memcache_ascii_protocol.lo libtool: compile: x86_64-pld-linux-gnux32-gcc -I/usr/include/php -I. -I/tmp/B.JcmvDJ/BUILD/php74-pecl-memcache-3.0.9 -DPHP_ATOM_INC -I/tmp/B.JcmvDJ/BUILD/php74-pecl-memcache-3.0.9/include -I/tmp/B.JcmvDJ/BUILD/php74-pecl-memcache-3.0.9/main -I/tmp/B.JcmvDJ/BUILD/php74-pecl-memcache-3.0.9 -I/usr/include/php -I/usr/include/php/main -I/usr/include/php/TSRM -I/usr/include/php/Zend -I/usr/include/php/ext -I/usr/include/php/ext/date/lib -DHAVE_CONFIG_H -O2 -fwrapv -pipe -Wformat -Werror=format-security -gdwarf-4 -fno-debug-types-section -fvar-tracking-assignments -g2 -Wp,-D_FORTIFY_SOURCE=2 -fstack-protector-strong --param=ssp-buffer-size=4 -Werror=trampolines -fPIC -mtune=generic -march=x86-64 -gdwarf-4 -fno-debug-types-section -fvar-tracking-assignments -g2 -c /tmp/B.JcmvDJ/BUILD/php74-pecl-memcache-3.0.9/php7/memcache_ascii_protocol.c -fPIC -DPIC -o php7/.libs/memcache_ascii_protocol.o /bin/sh /tmp/B.JcmvDJ/BUILD/php74-pecl-memcache-3.0.9/libtool --mode=compile x86_64-pld-linux-gnux32-gcc -I/usr/include/php -I. -I/tmp/B.JcmvDJ/BUILD/php74-pecl-memcache-3.0.9 -DPHP_ATOM_INC -I/tmp/B.JcmvDJ/BUILD/php74-pecl-memcache-3.0.9/include -I/tmp/B.JcmvDJ/BUILD/php74-pecl-memcache-3.0.9/main -I/tmp/B.JcmvDJ/BUILD/php74-pecl-memcache-3.0.9 -I/usr/include/php -I/usr/include/php/main -I/usr/include/php/TSRM -I/usr/include/php/Zend -I/usr/include/php/ext -I/usr/include/php/ext/date/lib -DHAVE_CONFIG_H -O2 -fwrapv -pipe -Wformat -Werror=format-security -gdwarf-4 -fno-debug-types-section -fvar-tracking-assignments -g2 -Wp,-D_FORTIFY_SOURCE=2 -fstack-protector-strong --param=ssp-buffer-size=4 -Werror=trampolines -fPIC -mtune=generic -march=x86-64 -gdwarf-4 -fno-debug-types-section -fvar-tracking-assignments -g2 -c /tmp/B.JcmvDJ/BUILD/php74-pecl-memcache-3.0.9/php7/memcache_pool.c -o php7/memcache_pool.lo libtool: compile: x86_64-pld-linux-gnux32-gcc -I/usr/include/php -I. -I/tmp/B.JcmvDJ/BUILD/php74-pecl-memcache-3.0.9 -DPHP_ATOM_INC -I/tmp/B.JcmvDJ/BUILD/php74-pecl-memcache-3.0.9/include -I/tmp/B.JcmvDJ/BUILD/php74-pecl-memcache-3.0.9/main -I/tmp/B.JcmvDJ/BUILD/php74-pecl-memcache-3.0.9 -I/usr/include/php -I/usr/include/php/main -I/usr/include/php/TSRM -I/usr/include/php/Zend -I/usr/include/php/ext -I/usr/include/php/ext/date/lib -DHAVE_CONFIG_H -O2 -fwrapv -pipe -Wformat -Werror=format-security -gdwarf-4 -fno-debug-types-section -fvar-tracking-assignments -g2 -Wp,-D_FORTIFY_SOURCE=2 -fstack-protector-strong --param=ssp-buffer-size=4 -Werror=trampolines -fPIC -mtune=generic -march=x86-64 -gdwarf-4 -fno-debug-types-section -fvar-tracking-assignments -g2 -c /tmp/B.JcmvDJ/BUILD/php74-pecl-memcache-3.0.9/php7/memcache_pool.c -fPIC -DPIC -o php7/.libs/memcache_pool.o /bin/sh /tmp/B.JcmvDJ/BUILD/php74-pecl-memcache-3.0.9/libtool --mode=compile x86_64-pld-linux-gnux32-gcc -I/usr/include/php -I. -I/tmp/B.JcmvDJ/BUILD/php74-pecl-memcache-3.0.9 -DPHP_ATOM_INC -I/tmp/B.JcmvDJ/BUILD/php74-pecl-memcache-3.0.9/include -I/tmp/B.JcmvDJ/BUILD/php74-pecl-memcache-3.0.9/main -I/tmp/B.JcmvDJ/BUILD/php74-pecl-memcache-3.0.9 -I/usr/include/php -I/usr/include/php/main -I/usr/include/php/TSRM -I/usr/include/php/Zend -I/usr/include/php/ext -I/usr/include/php/ext/date/lib -DHAVE_CONFIG_H -O2 -fwrapv -pipe -Wformat -Werror=format-security -gdwarf-4 -fno-debug-types-section -fvar-tracking-assignments -g2 -Wp,-D_FORTIFY_SOURCE=2 -fstack-protector-strong --param=ssp-buffer-size=4 -Werror=trampolines -fPIC -mtune=generic -march=x86-64 -gdwarf-4 -fno-debug-types-section -fvar-tracking-assignments -g2 -c /tmp/B.JcmvDJ/BUILD/php74-pecl-memcache-3.0.9/php7/memcache.c -o php7/memcache.lo libtool: compile: x86_64-pld-linux-gnux32-gcc -I/usr/include/php -I. -I/tmp/B.JcmvDJ/BUILD/php74-pecl-memcache-3.0.9 -DPHP_ATOM_INC -I/tmp/B.JcmvDJ/BUILD/php74-pecl-memcache-3.0.9/include -I/tmp/B.JcmvDJ/BUILD/php74-pecl-memcache-3.0.9/main -I/tmp/B.JcmvDJ/BUILD/php74-pecl-memcache-3.0.9 -I/usr/include/php -I/usr/include/php/main -I/usr/include/php/TSRM -I/usr/include/php/Zend -I/usr/include/php/ext -I/usr/include/php/ext/date/lib -DHAVE_CONFIG_H -O2 -fwrapv -pipe -Wformat -Werror=format-security -gdwarf-4 -fno-debug-types-section -fvar-tracking-assignments -g2 -Wp,-D_FORTIFY_SOURCE=2 -fstack-protector-strong --param=ssp-buffer-size=4 -Werror=trampolines -fPIC -mtune=generic -march=x86-64 -gdwarf-4 -fno-debug-types-section -fvar-tracking-assignments -g2 -c /tmp/B.JcmvDJ/BUILD/php74-pecl-memcache-3.0.9/php7/memcache.c -fPIC -DPIC -o php7/.libs/memcache.o /bin/sh /tmp/B.JcmvDJ/BUILD/php74-pecl-memcache-3.0.9/libtool --mode=link x86_64-pld-linux-gnux32-gcc -DPHP_ATOM_INC -I/tmp/B.JcmvDJ/BUILD/php74-pecl-memcache-3.0.9/include -I/tmp/B.JcmvDJ/BUILD/php74-pecl-memcache-3.0.9/main -I/tmp/B.JcmvDJ/BUILD/php74-pecl-memcache-3.0.9 -I/usr/include/php -I/usr/include/php/main -I/usr/include/php/TSRM -I/usr/include/php/Zend -I/usr/include/php/ext -I/usr/include/php/ext/date/lib -DHAVE_CONFIG_H -O2 -fwrapv -pipe -Wformat -Werror=format-security -gdwarf-4 -fno-debug-types-section -fvar-tracking-assignments -g2 -Wp,-D_FORTIFY_SOURCE=2 -fstack-protector-strong --param=ssp-buffer-size=4 -Werror=trampolines -fPIC -mtune=generic -march=x86-64 -gdwarf-4 -fno-debug-types-section -fvar-tracking-assignments -g2 -Wl,--as-needed -Wl,--no-copy-dt-needed-entries -Wl,-z,relro -Wl,-z,combreloc -o memcache.la -export-dynamic -avoid-version -prefer-pic -module -rpath /tmp/B.JcmvDJ/BUILD/php74-pecl-memcache-3.0.9/modules php7/memcache.lo php7/memcache_pool.lo php7/memcache_queue.lo php7/memcache_ascii_protocol.lo php7/memcache_binary_protocol.lo php7/memcache_standard_hash.lo php7/memcache_consistent_hash.lo php7/memcache_session.lo -lz libtool: link: x86_64-pld-linux-gnux32-gcc -shared -fPIC -DPIC -O2 -gdwarf-4 -g2 -fstack-protector-strong -mtune=generic -march=x86-64 -gdwarf-4 -g2 -Wl,--as-needed -Wl,--no-copy-dt-needed-entries -Wl,-z -Wl,relro -Wl,-z -Wl,combreloc php7/.libs/memcache.o php7/.libs/memcache_pool.o php7/.libs/memcache_queue.o php7/.libs/memcache_ascii_protocol.o php7/.libs/memcache_binary_protocol.o php7/.libs/memcache_standard_hash.o php7/.libs/memcache_consistent_hash.o php7/.libs/memcache_session.o -lz -Wl,-soname -Wl,memcache.so -o .libs/memcache.so libtool: link: ( cd ".libs" && rm -f "memcache.la" && ln -s "../memcache.la" "memcache.la" ) /bin/sh /tmp/B.JcmvDJ/BUILD/php74-pecl-memcache-3.0.9/libtool --mode=install cp ./memcache.la /tmp/B.JcmvDJ/BUILD/php74-pecl-memcache-3.0.9/modules libtool: install: cp ./.libs/memcache.so /tmp/B.JcmvDJ/BUILD/php74-pecl-memcache-3.0.9/modules/memcache.so libtool: install: cp ./.libs/memcache.lai /tmp/B.JcmvDJ/BUILD/php74-pecl-memcache-3.0.9/modules/memcache.la libtool: finish: PATH="/home/users/builder/GNUstep/Tools:/usr/local/bin:/usr/bin:/bin:/sbin" ldconfig -n /tmp/B.JcmvDJ/BUILD/php74-pecl-memcache-3.0.9/modules ---------------------------------------------------------------------- Libraries have been installed in: /tmp/B.JcmvDJ/BUILD/php74-pecl-memcache-3.0.9/modules If you ever happen to want to link against installed libraries in a given directory, LIBDIR, you must either use libtool, and specify the full pathname of the library, or use the '-LLIBDIR' flag during linking and do at least one of the following: - add LIBDIR to the 'LD_LIBRARY_PATH' environment variable during execution - add LIBDIR to the 'LD_RUN_PATH' environment variable during linking - use the '-Wl,-rpath -Wl,LIBDIR' linker flag - have your system administrator add LIBDIR to '/etc/ld.so.conf' See any operating system documentation about shared libraries for more information, such as the ld(1) and ld.so(8) manual pages. ---------------------------------------------------------------------- Build complete. Don't forget to run 'make test'. + >modules.log + /usr/bin/php74 -n -q -d 'extension_dir=modules' -d 'extension=/usr/libx32/php74/pcre.so' -d 'extension=/usr/libx32/php74/spl.so' -d 'extension=/usr/libx32/php74/session.so' -d 'extension=memcache.so' -m PHP Warning: PHP Startup: Unable to load dynamic library '/usr/libx32/php74/pcre.so' (tried: /usr/libx32/php74/pcre.so (/usr/libx32/php74/pcre.so: cannot open shared object file: No such file or directory), modules//usr/libx32/php74/pcre.so.so (modules//usr/libx32/php74/pcre.so.so: cannot open shared object file: No such file or directory)) in Unknown on line 0 PHP Warning: PHP Startup: Unable to load dynamic library '/usr/libx32/php74/spl.so' (tried: /usr/libx32/php74/spl.so (/usr/libx32/php74/spl.so: cannot open shared object file: No such file or directory), modules//usr/libx32/php74/spl.so.so (modules//usr/libx32/php74/spl.so.so: cannot open shared object file: No such file or directory)) in Unknown on line 0 + grep memcache modules.log memcache + <<"EOF" + >run-tests.sh + cat + chmod +x run-tests.sh + /usr/sbin/memcached -p 11211 -U 11211 -d -P /tmp/B.JcmvDJ/BUILD/php74-pecl-memcache-3.0.9/memcached.pid + trap 'kill $(cat memcached.pid)' EXIT INT + ./run-tests.sh Build complete. Don't forget to run 'make test'. PHP Warning: PHP Startup: Unable to load dynamic library '/usr/libx32/php74/pcre.so' (tried: /usr/libx32/php74/pcre.so (/usr/libx32/php74/pcre.so: cannot open shared object file: No such file or directory), /tmp/B.JcmvDJ/BUILD/php74-pecl-memcache-3.0.9/modules///usr/libx32/php74/pcre.so.so (/tmp/B.JcmvDJ/BUILD/php74-pecl-memcache-3.0.9/modules///usr/libx32/php74/pcre.so.so: cannot open shared object file: No such file or directory)) in Unknown on line 0 PHP Warning: PHP Startup: Unable to load dynamic library '/usr/libx32/php74/spl.so' (tried: /usr/libx32/php74/spl.so (/usr/libx32/php74/spl.so: cannot open shared object file: No such file or directory), /tmp/B.JcmvDJ/BUILD/php74-pecl-memcache-3.0.9/modules///usr/libx32/php74/spl.so.so (/tmp/B.JcmvDJ/BUILD/php74-pecl-memcache-3.0.9/modules///usr/libx32/php74/spl.so.so: cannot open shared object file: No such file or directory)) in Unknown on line 0 PHP Warning: PHP Startup: Unable to load dynamic library '/usr/libx32/php74/pcre.so' (tried: /usr/libx32/php74/pcre.so (/usr/libx32/php74/pcre.so: cannot open shared object file: No such file or directory), /tmp/B.JcmvDJ/BUILD/php74-pecl-memcache-3.0.9/modules///usr/libx32/php74/pcre.so.so (/tmp/B.JcmvDJ/BUILD/php74-pecl-memcache-3.0.9/modules///usr/libx32/php74/pcre.so.so: cannot open shared object file: No such file or directory)) in Unknown on line 0 PHP Warning: PHP Startup: Unable to load dynamic library '/usr/libx32/php74/spl.so' (tried: /usr/libx32/php74/spl.so (/usr/libx32/php74/spl.so: cannot open shared object file: No such file or directory), /tmp/B.JcmvDJ/BUILD/php74-pecl-memcache-3.0.9/modules///usr/libx32/php74/spl.so.so (/tmp/B.JcmvDJ/BUILD/php74-pecl-memcache-3.0.9/modules///usr/libx32/php74/spl.so.so: cannot open shared object file: No such file or directory)) in Unknown on line 0 ===================================================================== PHP : /usr/bin/php74 Warning: PHP Startup: Unable to load dynamic library '/usr/libx32/php74/pcre.so' (tried: /usr/libx32/php74/pcre.so (/usr/libx32/php74/pcre.so: cannot open shared object file: No such file or directory), /tmp/B.JcmvDJ/BUILD/php74-pecl-memcache-3.0.9/modules///usr/libx32/php74/pcre.so.so (/tmp/B.JcmvDJ/BUILD/php74-pecl-memcache-3.0.9/modules///usr/libx32/php74/pcre.so.so: cannot open shared object file: No such file or directory)) in Unknown on line 0 Warning: PHP Startup: Unable to load dynamic library '/usr/libx32/php74/spl.so' (tried: /usr/libx32/php74/spl.so (/usr/libx32/php74/spl.so: cannot open shared object file: No such file or directory), /tmp/B.JcmvDJ/BUILD/php74-pecl-memcache-3.0.9/modules///usr/libx32/php74/spl.so.so (/tmp/B.JcmvDJ/BUILD/php74-pecl-memcache-3.0.9/modules///usr/libx32/php74/spl.so.so: cannot open shared object file: No such file or directory)) in Unknown on line 0 PHP_SAPI : cli PHP_VERSION : 7.4.0beta2 ZEND_VERSION: 3.4.0-dev PHP_OS : Linux - Linux naiad-pld 4.9.189-1 #1 SMP Mon Aug 12 20:23:41 CEST 2019 x86_64 INI actual : /tmp/B.JcmvDJ/BUILD/php74-pecl-memcache-3.0.9/tmp-php.ini More .INIs : CWD : /tmp/B.JcmvDJ/BUILD/php74-pecl-memcache-3.0.9 Extra dirs : VALGRIND : Not used ===================================================================== TIME START 2019-08-16 10:20:33 ===================================================================== TEST 1/71 [tests/001.phpt] FAIL memcache_set() function [tests/001.phpt] TEST 2/71 [tests/002.phpt] FAIL memcache_get() function [tests/002.phpt] TEST 3/71 [tests/003.phpt] FAIL memcache_set()/memcache_get() using compression [tests/003.phpt] TEST 4/71 [tests/004.phpt] FAIL memcache_add() & memcache_replace() [tests/004.phpt] TEST 5/71 [tests/005.phpt] XFAIL strange keys [tests/005.phpt] XFAIL REASON: Skip TEST 6/71 [tests/006.phpt] FAIL memcache_increment() & memcache_decrement() [tests/006.phpt] TEST 7/71 [tests/007.phpt] FAIL memcache_get_version() & memcache_get_stats() [tests/007.phpt] TEST 8/71 [tests/008.phpt] FAIL memcache_delete() [tests/008.phpt] TEST 9/71 [tests/009.phpt] FAIL memcache->set() method [tests/009.phpt] TEST 10/71 [tests/010.phpt] FAIL memcache->get() function [tests/010.phpt] TEST 11/71 [tests/011.phpt] FAIL memcache->set()/memcache->get() using compression [tests/011.phpt] TEST 12/71 [tests/012.phpt] FAIL memcache_add() & memcache_replace() [tests/012.phpt] TEST 13/71 [tests/013.phpt] FAIL memcache->set() & memcache->get() with strange keys [tests/013.phpt] TEST 14/71 [tests/014.phpt] FAIL memcache->increment() & memcache->decrement() [tests/014.phpt] TEST 15/71 [tests/015.phpt] FAIL memcache->getVersion() & memcache->getStats() [tests/015.phpt] TEST 16/71 [tests/016.phpt] FAIL memcache->delete() [tests/016.phpt] TEST 17/71 [tests/017.phpt] FAIL Memcache class should be inheritable [tests/017.phpt] TEST 18/71 [tests/018.phpt] FAIL memcache_set() & memcache_add() [tests/018.phpt] TEST 19/71 [tests/019.phpt] XFAIL memcache->addServer() [tests/019.phpt] XFAIL REASON: Skip TEST 20/71 [tests/019a.phpt] FAIL memcache_add_server() [tests/019a.phpt] TEST 21/71 [tests/020.phpt] XFAIL memcache->set()/memcache->get() with multiple keys and load balancing [tests/020.phpt] XFAIL REASON: Skip TEST 22/71 [tests/021.phpt] FAIL memcache->set()/memcache->get() with failover [tests/021.phpt] TEST 23/71 [tests/022.phpt] XFAIL memcache->getExtendedStats() [tests/022.phpt] XFAIL REASON: Skip TEST 24/71 [tests/022a.phpt] XFAIL memcache_get_extended_stats() [tests/022a.phpt] XFAIL REASON: Skip TEST 25/71 [tests/023.phpt] XFAIL memcache->delete() with load balancing [tests/023.phpt] XFAIL REASON: Skip TEST 26/71 [tests/024.phpt] FAIL memcache->close(), memcache->get() [tests/024.phpt] TEST 27/71 [tests/024a.phpt] FAIL memcache_close(), memcache_get() [tests/024a.phpt] TEST 28/71 [tests/025.phpt] XFAIL memcache->increment() with load balancing [tests/025.phpt] XFAIL REASON: Skip TEST 29/71 [tests/026.phpt] XFAIL memcache->delete() with load balancing [tests/026.phpt] XFAIL REASON: Skip TEST 30/71 [tests/027.phpt] FAIL memcache->setCompressThreshold() [tests/027.phpt] TEST 31/71 [tests/027a.phpt] FAIL memcache_set_compress_threshold() [tests/027a.phpt] TEST 32/71 [tests/028.phpt] FAIL memcache->addServer() and memcache->close() [tests/028.phpt] TEST 33/71 [tests/029.phpt] XFAIL ini_set("memcache.allow_failover") [tests/029.phpt] XFAIL REASON: Skip TEST 34/71 [tests/030.phpt] FAIL ini_set("memcache.chunk_size") [tests/030.phpt] TEST 35/71 [tests/031.phpt] XFAIL memcache->addServer() adding server in failed mode [tests/031.phpt] XFAIL REASON: Skip TEST 36/71 [tests/032.phpt] XFAIL memcache->getServerStatus(), memcache->setServerParams() [tests/032.phpt] XFAIL REASON: Skip TEST 37/71 [tests/033.phpt] FAIL memcache->addServer() with server failure callback [tests/033.phpt] TEST 38/71 [tests/034.phpt] FAIL memcache->getStats() with arguments [tests/034.phpt] TEST 39/71 [tests/035.phpt] XFAIL memcache::connect() with unix domain socket [tests/035.phpt] XFAIL REASON: Skip TEST 40/71 [tests/036.phpt] XFAIL ini_set('session.save_handler') [tests/036.phpt] XFAIL REASON: Skip TEST 41/71 [tests/037.phpt] FAIL ini_set('memcache.hash_strategy') [tests/037.phpt] TEST 42/71 [tests/038.phpt] XFAIL memcache->get() over UDP [tests/038.phpt] XFAIL REASON: Skip TEST 43/71 [tests/040.phpt] XFAIL memcache->increment()/decrement() with multiple keys [tests/040.phpt] XFAIL REASON: Skip TEST 44/71 [tests/043.phpt] XFAIL ini_set('memcache.redundancy') [tests/043.phpt] XFAIL REASON: Skip TEST 45/71 [tests/044.phpt] XFAIL ini_set('memcache.session_redundancy') [tests/044.phpt] XFAIL REASON: Skip TEST 46/71 [tests/045.phpt] FAIL Nested get's in __wakeup() [tests/045.phpt] TEST 47/71 [tests/046.phpt] XFAIL hash strategies and functions [tests/046.phpt] XFAIL REASON: Skip TEST 48/71 [tests/047.phpt] FAIL memcache->get() with flags [tests/047.phpt] TEST 49/71 [tests/047a.phpt] SKIP memcache->get() with flags (PHP 5 only) [tests/047a.phpt] reason: requires PHP 5 TEST 50/71 [tests/048.phpt] FAIL memcache->get(), set() with CAS [tests/048.phpt] TEST 51/71 [tests/049.phpt] FAIL memcache->append(), memcache->prepend() [tests/049.phpt] TEST 52/71 [tests/050.phpt] FAIL failure callback throws exception [tests/050.phpt] TEST 53/71 [tests/051.phpt] FAIL memcache->set() with duplicate keys [tests/051.phpt] TEST 54/71 [tests/052.phpt] FAIL memcache->connect() and memcache->close() in loop [tests/052.phpt] TEST 55/71 [tests/053.phpt] XFAIL ini_set('session.save_handler') with unix domain socket [tests/053.phpt] XFAIL REASON: Skip TEST 56/71 [tests/054.phpt] FAIL memcache->set() with value larger than MTU [tests/054.phpt] TEST 57/71 [tests/055.phpt] FAIL memcache->set()/get() datatype preservation [tests/055.phpt] TEST 58/71 [tests/056.phpt] XFAIL memcache->addServer() with microsecond timeout [tests/056.phpt] XFAIL REASON: Skip TEST 59/71 [tests/057.phpt] SKIP session locking [tests/057.phpt] reason: not compiled with pcntl_fork() support TEST 60/71 [tests/058.phpt] FAIL memcache->findServer() [tests/058.phpt] TEST 61/71 [tests/100.phpt] FAIL memcache->flush() [tests/100.phpt] TEST 62/71 [tests/100a.phpt] FAIL memcache_flush() [tests/100a.phpt] TEST 63/71 [tests/100b.phpt] FAIL memcache->flush() with time in future [tests/100b.phpt] TEST 64/71 [tests/bug73539.phpt] XFAIL memcache multi host save path function [tests/bug73539.phpt] XFAIL REASON: Skip TEST 65/71 [tests/pecl11221.phpt] FAIL PECL bug #11221 (Double free when returning cached object with __sleep) [tests/pecl11221.phpt] TEST 66/71 [tests/pecl16442.phpt] FAIL PECL bug #16442 (memcache_set fail with integer value) [tests/pecl16442.phpt] TEST 67/71 [tests/pecl16536.phpt] FAIL PECL bug #16536 (Weight of 0 causes SegFault on memcache_add_server) [tests/pecl16536.phpt] TEST 68/71 [tests/pecl17518.phpt] FAIL PECL bug #17518 (Strange behavior in increment on non integer and after) [tests/pecl17518.phpt] TEST 69/71 [tests/pecl17566.phpt] FAIL PECL bug #17566 (3.0.4 cache delete bug) [tests/pecl17566.phpt] TEST 70/71 [tests/pecl63142.phpt] FAIL PECL bug #63142 (memcache 3.0.7 segfaults with object (un)serialization) [tests/pecl63142.phpt] TEST 71/71 [tests/pecl63272.phpt] FAIL PECL bug #63272 (Explicitly reserve range of flags in php_memcache.h so application code can use) [tests/pecl63272.phpt] ===================================================================== TIME END 2019-08-16 10:20:38 ===================================================================== TEST RESULT SUMMARY --------------------------------------------------------------------- Exts skipped : 0 Exts tested : 12 --------------------------------------------------------------------- Number of tests : 71 69 Tests skipped : 2 ( 2.8%) -------- Tests warned : 0 ( 0.0%) ( 0.0%) Tests failed : 48 ( 67.6%) ( 69.6%) Expected fail : 21 ( 29.6%) ( 30.4%) Tests passed : 0 ( 0.0%) ( 0.0%) --------------------------------------------------------------------- Time taken : 5 seconds ===================================================================== ===================================================================== EXPECTED FAILED TEST SUMMARY --------------------------------------------------------------------- strange keys [tests/005.phpt] XFAIL REASON: Skip memcache->addServer() [tests/019.phpt] XFAIL REASON: Skip memcache->set()/memcache->get() with multiple keys and load balancing [tests/020.phpt] XFAIL REASON: Skip memcache->getExtendedStats() [tests/022.phpt] XFAIL REASON: Skip memcache_get_extended_stats() [tests/022a.phpt] XFAIL REASON: Skip memcache->delete() with load balancing [tests/023.phpt] XFAIL REASON: Skip memcache->increment() with load balancing [tests/025.phpt] XFAIL REASON: Skip memcache->delete() with load balancing [tests/026.phpt] XFAIL REASON: Skip ini_set("memcache.allow_failover") [tests/029.phpt] XFAIL REASON: Skip memcache->addServer() adding server in failed mode [tests/031.phpt] XFAIL REASON: Skip memcache->getServerStatus(), memcache->setServerParams() [tests/032.phpt] XFAIL REASON: Skip memcache::connect() with unix domain socket [tests/035.phpt] XFAIL REASON: Skip ini_set('session.save_handler') [tests/036.phpt] XFAIL REASON: Skip memcache->get() over UDP [tests/038.phpt] XFAIL REASON: Skip memcache->increment()/decrement() with multiple keys [tests/040.phpt] XFAIL REASON: Skip ini_set('memcache.redundancy') [tests/043.phpt] XFAIL REASON: Skip ini_set('memcache.session_redundancy') [tests/044.phpt] XFAIL REASON: Skip hash strategies and functions [tests/046.phpt] XFAIL REASON: Skip ini_set('session.save_handler') with unix domain socket [tests/053.phpt] XFAIL REASON: Skip memcache->addServer() with microsecond timeout [tests/056.phpt] XFAIL REASON: Skip memcache multi host save path function [tests/bug73539.phpt] XFAIL REASON: Skip ===================================================================== ===================================================================== FAILED TEST SUMMARY --------------------------------------------------------------------- memcache_set() function [tests/001.phpt] memcache_get() function [tests/002.phpt] memcache_set()/memcache_get() using compression [tests/003.phpt] memcache_add() & memcache_replace() [tests/004.phpt] memcache_increment() & memcache_decrement() [tests/006.phpt] memcache_get_version() & memcache_get_stats() [tests/007.phpt] memcache_delete() [tests/008.phpt] memcache->set() method [tests/009.phpt] memcache->get() function [tests/010.phpt] memcache->set()/memcache->get() using compression [tests/011.phpt] memcache_add() & memcache_replace() [tests/012.phpt] memcache->set() & memcache->get() with strange keys [tests/013.phpt] memcache->increment() & memcache->decrement() [tests/014.phpt] memcache->getVersion() & memcache->getStats() [tests/015.phpt] memcache->delete() [tests/016.phpt] Memcache class should be inheritable [tests/017.phpt] memcache_set() & memcache_add() [tests/018.phpt] memcache_add_server() [tests/019a.phpt] memcache->set()/memcache->get() with failover [tests/021.phpt] memcache->close(), memcache->get() [tests/024.phpt] memcache_close(), memcache_get() [tests/024a.phpt] memcache->setCompressThreshold() [tests/027.phpt] memcache_set_compress_threshold() [tests/027a.phpt] memcache->addServer() and memcache->close() [tests/028.phpt] ini_set("memcache.chunk_size") [tests/030.phpt] memcache->addServer() with server failure callback [tests/033.phpt] memcache->getStats() with arguments [tests/034.phpt] ini_set('memcache.hash_strategy') [tests/037.phpt] Nested get's in __wakeup() [tests/045.phpt] memcache->get() with flags [tests/047.phpt] memcache->get(), set() with CAS [tests/048.phpt] memcache->append(), memcache->prepend() [tests/049.phpt] failure callback throws exception [tests/050.phpt] memcache->set() with duplicate keys [tests/051.phpt] memcache->connect() and memcache->close() in loop [tests/052.phpt] memcache->set() with value larger than MTU [tests/054.phpt] memcache->set()/get() datatype preservation [tests/055.phpt] memcache->findServer() [tests/058.phpt] memcache->flush() [tests/100.phpt] memcache_flush() [tests/100a.phpt] memcache->flush() with time in future [tests/100b.phpt] PECL bug #11221 (Double free when returning cached object with __sleep) [tests/pecl11221.phpt] PECL bug #16442 (memcache_set fail with integer value) [tests/pecl16442.phpt] PECL bug #16536 (Weight of 0 causes SegFault on memcache_add_server) [tests/pecl16536.phpt] PECL bug #17518 (Strange behavior in increment on non integer and after) [tests/pecl17518.phpt] PECL bug #17566 (3.0.4 cache delete bug) [tests/pecl17566.phpt] PECL bug #63142 (memcache 3.0.7 segfaults with object (un)serialization) [tests/pecl63142.phpt] PECL bug #63272 (Explicitly reserve range of flags in php_memcache.h so application code can use) [tests/pecl63272.phpt] ===================================================================== make: *** [Makefile:149: test] Error 1 + cat memcached.pid + kill 8320 error: Bad exit status from /tmp/B.JcmvDJ/BUILD/tmp/rpm-tmp.26845 (%build) RPM build errors: Bad exit status from /tmp/B.JcmvDJ/BUILD/tmp/rpm-tmp.26845 (%build) ended at: Fri Aug 16 10:20:38 2019, done in 0:00:11.141577 error: No files produced. + chmod -R u+rwX /tmp/B.JcmvDJ/BUILD + rm -rf /tmp/B.JcmvDJ/tmp /tmp/B.JcmvDJ/BUILD + rm -rf /tmp/B.JcmvDJ Begin-PLD-Builder-Info Build-Time: user:31.48s sys:4.54s real:48.24s (faults io:46 non-io:1039455) End-PLD-Builder-Info
[Back to list of logs] [View rpm -qa of builder]