FailedOk

th/SRPMS[OK]
th/x32[OK]
th/i686[OK]
th/x86_64[OK]

ac/SRPMS[OK]
ac/i386[OK]
ac/i586[OK]
ac/i686[OK]
ac/alpha[OK]
ac/amd64[OK]
ac/athlon[OK]
ac/ppc[OK]
ac/sparc[OK]
ac/sparc64[OK]

Advanced Search
main()
Powered by PLD Linux
(c) 2002-2017 PLD Team
$Revision: 1.37 $
Powered by GNU antilope.
Your IP: 54.91.171.137

php-pecl-memcache cb476eb7-917c-42cd-81f2-bd1c1d089a6e

Status:Failed
Source URL:ftp://buildlogs.pld-linux.org/th/x32/FAIL/php-pecl-memcache,cb476eb7-917c-42cd-81f2-bd1c1d089a6e.bz2
text/plain URL:View!
rpm -qa of builder:View!
Date:2017/12/05 16:45:31
Runtime:0:00:10.168424

Toc:

  • error 1
  • rpm: error: Failed build dependencies:
  • error 2
  • rpm: error: Failed build dependencies:
  • prep
  • Executing(%prep): /bin/sh -e /tmp/B.tb0Ohn/BUILD/tmp/rpm-tmp.35917
  • error 3
  • XFAIL: memcache->addServer() [tests/019.phpt]
  • error 4
  • XFAIL: memcache->set()/memcache->get() with multiple keys and load balancing [tests/020.phpt]
  • error 5
  • XFAIL: memcache->getExtendedStats() [tests/022.phpt]
  • error 6
  • XFAIL: memcache_get_extended_stats() [tests/022a.phpt]
  • error 7
  • XFAIL: memcache->delete() with load balancing [tests/023.phpt]
  • error 8
  • XFAIL: memcache->increment() with load balancing [tests/025.phpt]
  • error 9
  • XFAIL: memcache->delete() with load balancing [tests/026.phpt]
  • error 10
  • XFAIL: memcache->addServer() adding server in failed mode [tests/031.phpt]
  • error 11
  • XFAIL: memcache->getServerStatus(), memcache->setServerParams() [tests/032.phpt]
  • error 12
  • XFAIL: memcache::connect() with unix domain socket [tests/035.phpt]
  • error 13
  • XFAIL: memcache->get() over UDP [tests/038.phpt]
  • error 14
  • XFAIL: memcache->increment()/decrement() with multiple keys [tests/040.phpt]
  • error 15
  • XFAIL: ini_set('memcache.redundancy') [tests/043.phpt]
  • error 16
  • XFAIL: ini_set('memcache.session_redundancy') [tests/044.phpt]
  • error 17
  • XFAIL: hash strategies and functions [tests/046.phpt]
  • error 18
  • XFAIL: ini_set('session.save_handler') with unix domain socket [tests/053.phpt]
  • error 19
  • XFAIL: FLAKY: memcache->addServer() with microsecond timeout [tests/056.phpt]
  • error 20
  • XFAIL: ini_set('session.save_handler') [tests/036.phpt]
  • error 21
  • XFAIL: ini_set("memcache.allow_failover") [tests/029.phpt]
  • build
  • Executing(%build): /bin/sh -e /tmp/B.tb0Ohn/BUILD/tmp/rpm-tmp.35917
  • error 22
  • error: Bad exit status from /tmp/B.tb0Ohn/BUILD/tmp/rpm-tmp.35917 (%build)
  • error 23
  • RPM build errors:
  • error 24
  • error: No files produced.

Content:

request from: glen
checking if we should skip the build
started at: Tue Dec  5 16:44:58 2017
fetching https://srcbuilder.pld-linux.org/th//srpms/cb476eb7-917c-42cd-81f2-bd1c1d089a6e/php53-pecl-memcache-3.0.9-2.src.rpm
fetched 130081 bytes, 254.1 K/s
installing srpm: php53-pecl-memcache-3.0.9-2.src.rpm
+ install -d /tmp/B.tb0Ohn/BUILD /tmp/B.tb0Ohn/RPMS
+ LC_ALL=en_US.UTF-8
+ rpm -qp --changelog php53-pecl-memcache-3.0.9-2.src.rpm
* Tue Dec 05 2017 PLD Linux Team <feedback@pld-linux.org>
- For complete changelog see: http://git.pld-linux.org/?p=packages/php-pecl-memcache.git;a=log;h=master
* Tue Dec 05 2017 Elan Ruusamäe <glen@pld-linux.org> 7362daf
- up to e702b5f91 snapshot * Mon Dec 12 2016 Elan Ruusamäe <glen@delfi.ee> b5fd909
- strange keys [tests/005.phpt] fails on php 7.1 + rpm -Uhv --nodeps --define '_topdir /tmp/B.tb0Ohn' --define '_specdir %{_topdir}' --define '_sourcedir %{_specdir}' --define '_rpmdir %{_topdir}/RPMS' --define '_builddir %{_topdir}/BUILD' --define 'php_suffix 53' php53-pecl-memcache-3.0.9-2.src.rpm Preparing... ################################################## php53-pecl-memcache ################################################## + rm -f php53-pecl-memcache-3.0.9-2.src.rpm + install -m 700 -d /tmp/B.tb0Ohn/BUILD/tmp + TMPDIR=/tmp/B.tb0Ohn/BUILD/tmp + exec nice -n 0 rpmbuild -bp --short-circuit --nodeps --define '_topdir /tmp/B.tb0Ohn' --define '_specdir %{_topdir}' --define '_sourcedir %{_specdir}' --define '_rpmdir %{_topdir}/RPMS' --define '_builddir %{_topdir}/BUILD' --target x32-pld-linux --define 'php_suffix 53' --define 'prep exit 0' /tmp/B.tb0Ohn/php-pecl-memcache.spec sh: php-config: not found Building target platforms: x32-pld-linux checking BuildConflict-ing packages no BuildConflicts found checking BR rpm: sh: php-config: not found rpm: error: Failed build dependencies: rpm: php53-devel >= 3:5.0.0 is needed by php53-pecl-memcache-3.0.9-2.src rpm: php53-xml is needed by php53-pecl-memcache-3.0.9-2.src rpm: php-packagexml2cl is needed by php53-pecl-memcache-3.0.9-2.src rpm: php53-cli is needed by php53-pecl-memcache-3.0.9-2.src rpm: php53-pcre is needed by php53-pecl-memcache-3.0.9-2.src rpm: php53-session is needed by php53-pecl-memcache-3.0.9-2.src rpm: php53-spl is needed by php53-pecl-memcache-3.0.9-2.src rpm: Building target platforms: x32-pld-linux updating poldek cache... ready is up to date Retrieving th::packages.ndir.md... th is up to date Retrieving th::packages.ndir.md... th is up to date Retrieving th-ready::packages.ndir.md... th-ready is up to date Retrieving th-ready::packages.ndir.md... th-ready is up to date Retrieving th-test::packages.ndir.md... th-test is up to date Retrieving th-test::packages.ndir.md... th-test is up to date checking conflicting packages in BRed packages poldek: Loading [pndir]ready... poldek: Loading [pndir]th-test... poldek: Loading [pndir]th-test... poldek: Loading [pndir]th-ready... poldek: Loading [pndir]th-ready... poldek: Loading [pndir]th... poldek: Loading [pndir]th... poldek: 24284 packages read poldek: Removed 1375 duplicate packages from available set poldek: Processing dependencies... poldek: php53-pcre-5.3.29-36.x32 marks php53-common-5.3.29-36.x32 (cap /etc/php53/conf.d) poldek: php53-spl-5.3.29-36.x32 marks php53-simplexml-5.3.29-36.x32 (cap php53-simplexml = 4:5.3.29-36) poldek: php-packagexml2cl-0.1-4.noarch marks php53-program-5.3.29-36.x32 (cap /usr/bin/php) poldek: php53-devel-5.3.29-36.x32 marks php53-embedded-5.3.29-36.x32 (cap php53-embedded = 4:5.3.29-36) poldek: There are 11 packages to install (4 marked by dependencies): poldek: I php-packagexml2cl-0.1-4.noarch php53-cli-5.3.29-36.x32 poldek: I php53-devel-5.3.29-36.x32 php53-pcre-5.3.29-36.x32 poldek: I php53-session-5.3.29-36.x32 php53-spl-5.3.29-36.x32 poldek: I php53-xml-5.3.29-36.x32 poldek: D php53-common-5.3.29-36.x32 php53-embedded-5.3.29-36.x32 poldek: D php53-program-5.3.29-36.x32 php53-simplexml-5.3.29-36.x32 poldek: This operation will use 5.8MB of disk space. poldek: Need to get 1.6MB of archives (1.6MB to download). poldek: poldek: Retrieving [1/11] th::php53-common-5.3.29-36.x32.rpm... poldek: ..............................done poldek: Retrieving [2/11] th::php53-cli-5.3.29-36.x32.rpm... poldek: ..............................done poldek: Retrieving [3/11] th::php53-program-5.3.29-36.x32.rpm... poldek: ..............................done poldek: Retrieving [4/11] th::php53-pcre-5.3.29-36.x32.rpm... poldek: ..............................done poldek: Retrieving [5/11] th::php53-spl-5.3.29-36.x32.rpm... poldek: ..............................done poldek: Retrieving [6/11] th::php53-simplexml-5.3.29-36.x32.rpm... poldek: ..............................done poldek: Retrieving [7/11] th::php53-embedded-5.3.29-36.x32.rpm... poldek: ..............................done poldek: Retrieving [8/11] th::php53-devel-5.3.29-36.x32.rpm... poldek: ..............................done poldek: Retrieving [9/11] th::php53-session-5.3.29-36.x32.rpm... poldek: ..............................done poldek: Retrieving [10/11] th::php53-xml-5.3.29-36.x32.rpm... poldek: ..............................done poldek: Retrieving [11/11] th::php-packagexml2cl-0.1-4.noarch.rpm... poldek: ..............................done poldek: Executing pm-command.sh --upgrade -vh --test --root / --define _check_dirname_deps 1... poldek: Preparing... ################################################## no conflicts found checking BR rpm: sh: php-config: not found rpm: error: Failed build dependencies: rpm: php53-devel >= 3:5.0.0 is needed by php53-pecl-memcache-3.0.9-2.src rpm: php53-xml is needed by php53-pecl-memcache-3.0.9-2.src rpm: php-packagexml2cl is needed by php53-pecl-memcache-3.0.9-2.src rpm: php53-cli is needed by php53-pecl-memcache-3.0.9-2.src rpm: php53-pcre is needed by php53-pecl-memcache-3.0.9-2.src rpm: php53-session is needed by php53-pecl-memcache-3.0.9-2.src rpm: php53-spl is needed by php53-pecl-memcache-3.0.9-2.src rpm: Building target platforms: x32-pld-linux installing BR: php\-packagexml2cl php53\-devel php53\-cli php53\-spl php53\-session php53\-xml php53\-pcre + poldek --noask --caplookup -Q -v '--ignore=hhvm-*' '--ignore=php4-*' '--ignore=php52-*' '--ignore=php54-*' '--ignore=php55-*' '--ignore=php56-*' '--ignore=php70-*' --upgrade php-packagexml2cl php53-devel php53-cli php53-spl php53-session php53-xml php53-pcre Loading [pndir]ready... Loading [pndir]th-test... Loading [pndir]th-test... Loading [pndir]th-ready... Loading [pndir]th-ready... Loading [pndir]th... Loading [pndir]th... 24284 packages read Removed 1375 duplicate packages from available set Processing dependencies... php53-pcre-5.3.29-36.x32 marks php53-common-5.3.29-36.x32 (cap /etc/php53/conf.d) php53-devel-5.3.29-36.x32 marks php53-embedded-5.3.29-36.x32 (cap php53-embedded = 4:5.3.29-36) php53-spl-5.3.29-36.x32 marks php53-simplexml-5.3.29-36.x32 (cap php53-simplexml = 4:5.3.29-36) There are 9 packages to install (3 marked by dependencies): I php53-cli-5.3.29-36.x32 php53-devel-5.3.29-36.x32 I php53-pcre-5.3.29-36.x32 php53-session-5.3.29-36.x32 I php53-spl-5.3.29-36.x32 php53-xml-5.3.29-36.x32 D php53-common-5.3.29-36.x32 php53-embedded-5.3.29-36.x32 D php53-simplexml-5.3.29-36.x32 This operation will use 5.8MB of disk space. Need to get 1.6MB of archives. Executing pm-command.sh --upgrade -vh --root / --define _check_dirname_deps 1... Preparing... ################################################## php53-common ################################################## php53-embedded ################################################## php53-pcre ################################################## php53-cli ################################################## php53-xml ################################################## php53-devel ################################################## php53-spl ################################################## php53-simplexml ################################################## php53-session ################################################## Installing set #2 Processing dependencies... php-packagexml2cl-0.1-4.noarch marks php53-program-5.3.29-36.x32 (cap /usr/bin/php) There are 2 packages to install (1 marked by dependencies): I php-packagexml2cl-0.1-4.noarch D php53-program-5.3.29-36.x32 This operation will use 1.4KB of disk space. Need to get 7.4KB of archives. Executing pm-command.sh --upgrade -vh --root / --define _check_dirname_deps 1... Preparing... ################################################## php53-program ################################################## php-packagexml2cl ################################################## building RPM using: set -ex; : build-id: cb476eb7-917c-42cd-81f2-bd1c1d089a6e; TMPDIR=/tmp/B.tb0Ohn/BUILD/tmp exec nice -n 0 rpmbuild -bb --define '_smp_mflags -j9' --define '_make_opts -Otarget' --define '_pld_builder 1' --define '_topdir /tmp/B.tb0Ohn' --define '_specdir %{_topdir}' --define '_sourcedir %{_specdir}' --define '_rpmdir %{_topdir}/RPMS' --define '_builddir %{_topdir}/BUILD' --target x32-pld-linux --define 'php_suffix 53' /tmp/B.tb0Ohn/php-pecl-memcache.spec + : build-id: cb476eb7-917c-42cd-81f2-bd1c1d089a6e + TMPDIR=/tmp/B.tb0Ohn/BUILD/tmp + exec nice -n 0 rpmbuild -bb --define '_smp_mflags -j9' --define '_make_opts -Otarget' --define '_pld_builder 1' --define '_topdir /tmp/B.tb0Ohn' --define '_specdir %{_topdir}' --define '_sourcedir %{_specdir}' --define '_rpmdir %{_topdir}/RPMS' --define '_builddir %{_topdir}/BUILD' --target x32-pld-linux --define 'php_suffix 53' /tmp/B.tb0Ohn/php-pecl-memcache.spec Building target platforms: x32-pld-linux Executing(%prep): /bin/sh -e /tmp/B.tb0Ohn/BUILD/tmp/rpm-tmp.35917 + umask 022 + cd /tmp/B.tb0Ohn/BUILD + cd /tmp/B.tb0Ohn/BUILD + rm -rf php53-pecl-memcache-3.0.9 + /bin/mkdir -p php53-pecl-memcache-3.0.9 + cd php53-pecl-memcache-3.0.9 + /usr/bin/gzip -dc /tmp/B.tb0Ohn/memcache-3.0.9-e702b5f91.tar.gz + /bin/tar -xf - + STATUS=0 + '[' 0 -ne 0 ']' + /bin/id -u + '[' 1000 '=' 0 ']' + /bin/id -u + '[' 1000 '=' 0 ']' + /bin/chmod -Rf a+rX,u+w,g-w,o-w . + mv pecl-memcache-e702b5f91ec222e20d1d5cea0ffc6be012992d70/.gitignore pecl-memcache-e702b5f91ec222e20d1d5cea0ffc6be012992d70/CREDITS pecl-memcache-e702b5f91ec222e20d1d5cea0ffc6be012992d70/LICENSE pecl-memcache-e702b5f91ec222e20d1d5cea0ffc6be012992d70/README pecl-memcache-e702b5f91ec222e20d1d5cea0ffc6be012992d70/config.m4 pecl-memcache-e702b5f91ec222e20d1d5cea0ffc6be012992d70/config.w32 pecl-memcache-e702b5f91ec222e20d1d5cea0ffc6be012992d70/config9.m4 pecl-memcache-e702b5f91ec222e20d1d5cea0ffc6be012992d70/example.php pecl-memcache-e702b5f91ec222e20d1d5cea0ffc6be012992d70/memcache.php pecl-memcache-e702b5f91ec222e20d1d5cea0ffc6be012992d70/package.xml pecl-memcache-e702b5f91ec222e20d1d5cea0ffc6be012992d70/php5 pecl-memcache-e702b5f91ec222e20d1d5cea0ffc6be012992d70/php7 pecl-memcache-e702b5f91ec222e20d1d5cea0ffc6be012992d70/profile.php pecl-memcache-e702b5f91ec222e20d1d5cea0ffc6be012992d70/tests . + echo 'Patch #0 (memcache-webapp.patch):' Patch #0 (memcache-webapp.patch): + '[' -f /tmp/B.tb0Ohn/memcache-webapp.patch ']' + /bin/cat /tmp/B.tb0Ohn/memcache-webapp.patch + /usr/bin/patch -s -p1 + rm tests/039.phpt + rm tests/041.phpt + rm tests/042.phpt + <<"EOF" + xfail + set +x XFAIL: memcache->addServer() [tests/019.phpt] XFAIL: memcache->set()/memcache->get() with multiple keys and load balancing [tests/020.phpt] XFAIL: memcache->getExtendedStats() [tests/022.phpt] XFAIL: memcache_get_extended_stats() [tests/022a.phpt] XFAIL: memcache->delete() with load balancing [tests/023.phpt] XFAIL: memcache->increment() with load balancing [tests/025.phpt] XFAIL: memcache->delete() with load balancing [tests/026.phpt] XFAIL: memcache->addServer() adding server in failed mode [tests/031.phpt] XFAIL: memcache->getServerStatus(), memcache->setServerParams() [tests/032.phpt] XFAIL: memcache::connect() with unix domain socket [tests/035.phpt] XFAIL: memcache->get() over UDP [tests/038.phpt] XFAIL: memcache->increment()/decrement() with multiple keys [tests/040.phpt] XFAIL: ini_set('memcache.redundancy') [tests/043.phpt] XFAIL: ini_set('memcache.session_redundancy') [tests/044.phpt] XFAIL: hash strategies and functions [tests/046.phpt] XFAIL: ini_set('session.save_handler') with unix domain socket [tests/053.phpt] XFAIL: FLAKY: memcache->addServer() with microsecond timeout [tests/056.phpt] XFAIL: ini_set('session.save_handler') [tests/036.phpt] XFAIL: ini_set("memcache.allow_failover") [tests/029.phpt] + exit 0 Executing(%build): /bin/sh -e /tmp/B.tb0Ohn/BUILD/tmp/rpm-tmp.35917 HOME=/home/users/builder PATH=/home/users/builder/GNUstep/Tools:/usr/local/bin:/usr/bin:/bin TMPDIR=/tmp/B.tb0Ohn/BUILD/tmp + umask 022 + cd /tmp/B.tb0Ohn/BUILD + cd php53-pecl-memcache-3.0.9 + >ChangeLog + packagexml2cl package.xml + phpize Configuring for: PHP Api Version: 20090626 Zend Module Api No: 20090626 Zend Extension Api No: 220090626 configure.in:3: warning: prefer named diversions configure.in:3: warning: prefer named diversions + ./configure 'LDFLAGS=-Wl,--as-needed -Wl,--no-copy-dt-needed-entries -Wl,-z,relro -Wl,-z,combreloc ' 'CFLAGS=-O2 -fwrapv -pipe -Wformat -Werror=format-security -gdwarf-4 -fno-debug-types-section -fvar-tracking-assignments -g2 -Wp,-D_FORTIFY_SOURCE=2 -fstack-protector-strong --param=ssp-buffer-size=4 -fPIC -mtune=generic -march=x86-64 -gdwarf-4 -fno-debug-types-section -fvar-tracking-assignments -g2 ' 'CXXFLAGS=-O2 -fwrapv -pipe -Wformat -Werror=format-security -gdwarf-4 -fno-debug-types-section -fvar-tracking-assignments -g2 -Wp,-D_FORTIFY_SOURCE=2 -fstack-protector-strong --param=ssp-buffer-size=4 -fPIC -mtune=generic -march=x86-64 -gdwarf-4 -fno-debug-types-section -fvar-tracking-assignments -g2 ' 'FFLAGS=-O2 -fwrapv -pipe -Wformat -Werror=format-security -gdwarf-4 -fno-debug-types-section -fvar-tracking-assignments -g2 -Wp,-D_FORTIFY_SOURCE=2 -fstack-protector-strong --param=ssp-buffer-size=4 -fPIC -mtune=generic -march=x86-64 -gdwarf-4 -fno-debug-types-section -fvar-tracking-assignments -g2 ' 'FCFLAGS=-O2 -fwrapv -pipe -Wformat -Werror=format-security -gdwarf-4 -fno-debug-types-section -fvar-tracking-assignments -g2 -Wp,-D_FORTIFY_SOURCE=2 -fstack-protector-strong --param=ssp-buffer-size=4 -fPIC -mtune=generic -march=x86-64 -gdwarf-4 -fno-debug-types-section -fvar-tracking-assignments -g2 ' 'CPPFLAGS=' 'CC=x86_64-pld-linux-gnux32-gcc' 'CXX=x86_64-pld-linux-gnux32-g++' '--host=x86_64-pld-linux-gnux32' '--build=x86_64-pld-linux-gnux32' '--prefix=/usr' '--exec-prefix=/usr' '--bindir=/usr/bin' '--sbindir=/usr/sbin' '--sysconfdir=/etc/webapps/memcache' '--datadir=/usr/share' '--includedir=/usr/include' '--libdir=/usr/libx32' '--libexecdir=/usr/libexec' '--localstatedir=/var' '--sharedstatedir=/var/lib' '--mandir=/usr/share/man' '--infodir=/usr/share/info' '--x-libraries=/usr/libx32' '--with-zlib-dir=/usr' checking for grep that handles long lines and -e... /bin/grep checking for egrep... /bin/grep -E checking for a sed that does not truncate output... /bin/sed checking for x86_64-pld-linux-gnux32-cc... x86_64-pld-linux-gnux32-gcc checking whether the C compiler works... yes checking for C compiler default output file name... a.out checking for suffix of executables... checking whether we are cross compiling... no checking for suffix of object files... o checking whether we are using the GNU C compiler... yes checking whether x86_64-pld-linux-gnux32-gcc accepts -g... yes checking for x86_64-pld-linux-gnux32-gcc option to accept ISO C89... none needed checking how to run the C preprocessor... x86_64-pld-linux-gnux32-gcc -E checking for icc... no checking for suncc... no checking whether x86_64-pld-linux-gnux32-gcc and cc understand -c and -o together... yes checking for system library directory... lib checking if compiler supports -R... no checking if compiler supports -Wl,-rpath,... yes checking build system type... x86_64-pld-linux-gnux32 checking host system type... x86_64-pld-linux-gnux32 checking target system type... x86_64-pld-linux-gnux32 checking for PHP prefix... /usr checking for PHP includes... -I/usr/include/php -I/usr/include/php/main -I/usr/include/php/TSRM -I/usr/include/php/Zend -I/usr/include/php/ext -I/usr/include/php/ext/date/lib checking for PHP extension directory... /usr/libx32/php53 checking for PHP installed headers prefix... /usr/include/php checking if debug is enabled... no checking if zts is enabled... no checking for re2c... re2c checking for re2c version... 0.13.5 (ok) checking for gawk... gawk checking whether to enable memcache support... yes, shared checking whether to enable memcache session handler support... yes checking for the location of ZLIB... /usr checking for the location of zlib... /usr checking PHP version... PHP 5.x checking for session includes... /usr/include/php checking for memcache session support... enabled checking how to print strings... print -r checking for a sed that does not truncate output... (cached) /bin/sed checking for fgrep... /bin/grep -F checking for ld used by x86_64-pld-linux-gnux32-gcc... /usr/bin/ld checking if the linker (/usr/bin/ld) is GNU ld... yes checking for BSD- or MS-compatible name lister (nm)... /usr/bin/nm -B checking the name lister (/usr/bin/nm -B) interface... BSD nm checking whether ln -s works... yes checking the maximum length of command line arguments... 1572864 checking how to convert x86_64-pld-linux-gnux32 file names to x86_64-pld-linux-gnux32 format... func_convert_file_noop checking how to convert x86_64-pld-linux-gnux32 file names to toolchain format... func_convert_file_noop checking for /usr/bin/ld option to reload object files... -r checking for x86_64-pld-linux-gnux32-objdump... no checking for objdump... objdump checking how to recognize dependent libraries... pass_all checking for x86_64-pld-linux-gnux32-dlltool... no checking for dlltool... no checking how to associate runtime and link libraries... print -r -- checking for x86_64-pld-linux-gnux32-ar... no checking for ar... ar checking for archiver @FILE support... @ checking for x86_64-pld-linux-gnux32-strip... no checking for strip... strip checking for x86_64-pld-linux-gnux32-ranlib... no checking for ranlib... ranlib checking for mawk... (cached) gawk checking command to parse /usr/bin/nm -B output from x86_64-pld-linux-gnux32-gcc object... ok checking for sysroot... no checking for a working dd... /bin/dd checking how to truncate binary pipes... /bin/dd bs=4096 count=1 checking for x86_64-pld-linux-gnux32-mt... no checking for mt... no checking if : is a manifest tool... no checking for ANSI C header files... yes checking for sys/types.h... yes checking for sys/stat.h... yes checking for stdlib.h... yes checking for string.h... yes checking for memory.h... yes checking for strings.h... yes checking for inttypes.h... yes checking for stdint.h... yes checking for unistd.h... yes checking for dlfcn.h... yes checking for objdir... .libs checking if x86_64-pld-linux-gnux32-gcc supports -fno-rtti -fno-exceptions... no checking for x86_64-pld-linux-gnux32-gcc option to produce PIC... -fPIC -DPIC checking if x86_64-pld-linux-gnux32-gcc PIC flag -fPIC -DPIC works... yes checking if x86_64-pld-linux-gnux32-gcc static flag -static works... yes checking if x86_64-pld-linux-gnux32-gcc supports -c -o file.o... yes checking if x86_64-pld-linux-gnux32-gcc supports -c -o file.o... (cached) yes checking whether the x86_64-pld-linux-gnux32-gcc linker (/usr/bin/ld -m elf32_x86_64) supports shared libraries... yes checking whether -lc should be explicitly linked in... no checking dynamic linker characteristics... GNU/Linux ld.so checking how to hardcode library paths into programs... immediate checking whether stripping libraries is possible... yes checking if libtool supports shared libraries... yes checking whether to build shared libraries... yes checking whether to build static libraries... no configure: creating ./config.status config.status: creating config.h config.status: executing libtool commands + /usr/bin/make -Otarget -j9 /bin/sh /tmp/B.tb0Ohn/BUILD/php53-pecl-memcache-3.0.9/libtool --mode=compile x86_64-pld-linux-gnux32-gcc -I/usr/include/php -I. -I/tmp/B.tb0Ohn/BUILD/php53-pecl-memcache-3.0.9 -DPHP_ATOM_INC -I/tmp/B.tb0Ohn/BUILD/php53-pecl-memcache-3.0.9/include -I/tmp/B.tb0Ohn/BUILD/php53-pecl-memcache-3.0.9/main -I/tmp/B.tb0Ohn/BUILD/php53-pecl-memcache-3.0.9 -I/usr/include/php -I/usr/include/php/main -I/usr/include/php/TSRM -I/usr/include/php/Zend -I/usr/include/php/ext -I/usr/include/php/ext/date/lib -DHAVE_CONFIG_H -O2 -fwrapv -pipe -Wformat -Werror=format-security -gdwarf-4 -fno-debug-types-section -fvar-tracking-assignments -g2 -Wp,-D_FORTIFY_SOURCE=2 -fstack-protector-strong --param=ssp-buffer-size=4 -fPIC -mtune=generic -march=x86-64 -gdwarf-4 -fno-debug-types-section -fvar-tracking-assignments -g2 -c /tmp/B.tb0Ohn/BUILD/php53-pecl-memcache-3.0.9/php5/memcache_standard_hash.c -o php5/memcache_standard_hash.lo libtool: compile: x86_64-pld-linux-gnux32-gcc -I/usr/include/php -I. -I/tmp/B.tb0Ohn/BUILD/php53-pecl-memcache-3.0.9 -DPHP_ATOM_INC -I/tmp/B.tb0Ohn/BUILD/php53-pecl-memcache-3.0.9/include -I/tmp/B.tb0Ohn/BUILD/php53-pecl-memcache-3.0.9/main -I/tmp/B.tb0Ohn/BUILD/php53-pecl-memcache-3.0.9 -I/usr/include/php -I/usr/include/php/main -I/usr/include/php/TSRM -I/usr/include/php/Zend -I/usr/include/php/ext -I/usr/include/php/ext/date/lib -DHAVE_CONFIG_H -O2 -fwrapv -pipe -Wformat -Werror=format-security -gdwarf-4 -fno-debug-types-section -fvar-tracking-assignments -g2 -Wp,-D_FORTIFY_SOURCE=2 -fstack-protector-strong --param=ssp-buffer-size=4 -fPIC -mtune=generic -march=x86-64 -gdwarf-4 -fno-debug-types-section -fvar-tracking-assignments -g2 -c /tmp/B.tb0Ohn/BUILD/php53-pecl-memcache-3.0.9/php5/memcache_standard_hash.c -fPIC -DPIC -o php5/.libs/memcache_standard_hash.o In file included from /tmp/B.tb0Ohn/BUILD/php53-pecl-memcache-3.0.9/php5/php_memcache.h:34:0, from /tmp/B.tb0Ohn/BUILD/php53-pecl-memcache-3.0.9/php5/memcache_standard_hash.c:27: /tmp/B.tb0Ohn/BUILD/php53-pecl-memcache-3.0.9/php5/memcache_pool.h:406:21: warning: inline function 'mmc_prepare_key' declared but never defined MMC_POOL_INLINE int mmc_prepare_key(zval *, char *, unsigned int *); ^~~~~~~~~~~~~~~ /tmp/B.tb0Ohn/BUILD/php53-pecl-memcache-3.0.9/php5/memcache_pool.h:405:21: warning: inline function 'mmc_prepare_key_ex' declared but never defined MMC_POOL_INLINE int mmc_prepare_key_ex(const char *, unsigned int, char *, unsigned int *); ^~~~~~~~~~~~~~~~~~ In file included from /tmp/B.tb0Ohn/BUILD/php53-pecl-memcache-3.0.9/php5/php_memcache.h:34:0, from /tmp/B.tb0Ohn/BUILD/php53-pecl-memcache-3.0.9/php5/memcache_standard_hash.c:27: /tmp/B.tb0Ohn/BUILD/php53-pecl-memcache-3.0.9/php5/memcache_pool.h:146:22: warning: inline function 'mmc_buffer_free' declared but never defined MMC_POOL_INLINE void mmc_buffer_free(mmc_buffer_t *); ^~~~~~~~~~~~~~~ /tmp/B.tb0Ohn/BUILD/php53-pecl-memcache-3.0.9/php5/memcache_pool.h:145:22: warning: inline function 'mmc_buffer_alloc' declared but never defined MMC_POOL_INLINE void mmc_buffer_alloc(mmc_buffer_t *, unsigned int); ^~~~~~~~~~~~~~~~ In file included from /tmp/B.tb0Ohn/BUILD/php53-pecl-memcache-3.0.9/php5/memcache_pool.h:46:0, from /tmp/B.tb0Ohn/BUILD/php53-pecl-memcache-3.0.9/php5/php_memcache.h:34, from /tmp/B.tb0Ohn/BUILD/php53-pecl-memcache-3.0.9/php5/memcache_standard_hash.c:27: /tmp/B.tb0Ohn/BUILD/php53-pecl-memcache-3.0.9/php5/memcache_queue.h:54:23: warning: inline function 'mmc_queue_remove' declared but never defined MMC_QUEUE_INLINE void mmc_queue_remove(mmc_queue_t *, void *); ^~~~~~~~~~~~~~~~ /tmp/B.tb0Ohn/BUILD/php53-pecl-memcache-3.0.9/php5/memcache_queue.h:53:23: warning: inline function 'mmc_queue_copy' declared but never defined MMC_QUEUE_INLINE void mmc_queue_copy(mmc_queue_t *, mmc_queue_t *); ^~~~~~~~~~~~~~ /tmp/B.tb0Ohn/BUILD/php53-pecl-memcache-3.0.9/php5/memcache_queue.h:52:23: warning: inline function 'mmc_queue_free' declared but never defined MMC_QUEUE_INLINE void mmc_queue_free(mmc_queue_t *); ^~~~~~~~~~~~~~ /tmp/B.tb0Ohn/BUILD/php53-pecl-memcache-3.0.9/php5/memcache_queue.h:51:22: warning: inline function 'mmc_queue_contains' declared but never defined MMC_QUEUE_INLINE int mmc_queue_contains(mmc_queue_t *, void *); ^~~~~~~~~~~~~~~~~~ /tmp/B.tb0Ohn/BUILD/php53-pecl-memcache-3.0.9/php5/memcache_queue.h:50:24: warning: inline function 'mmc_queue_pop' declared but never defined MMC_QUEUE_INLINE void *mmc_queue_pop(mmc_queue_t *); ^~~~~~~~~~~~~ /tmp/B.tb0Ohn/BUILD/php53-pecl-memcache-3.0.9/php5/memcache_queue.h:49:23: warning: inline function 'mmc_queue_push' declared but never defined MMC_QUEUE_INLINE void mmc_queue_push(mmc_queue_t *, void *); ^~~~~~~~~~~~~~ /bin/sh /tmp/B.tb0Ohn/BUILD/php53-pecl-memcache-3.0.9/libtool --mode=compile x86_64-pld-linux-gnux32-gcc -I/usr/include/php -I. -I/tmp/B.tb0Ohn/BUILD/php53-pecl-memcache-3.0.9 -DPHP_ATOM_INC -I/tmp/B.tb0Ohn/BUILD/php53-pecl-memcache-3.0.9/include -I/tmp/B.tb0Ohn/BUILD/php53-pecl-memcache-3.0.9/main -I/tmp/B.tb0Ohn/BUILD/php53-pecl-memcache-3.0.9 -I/usr/include/php -I/usr/include/php/main -I/usr/include/php/TSRM -I/usr/include/php/Zend -I/usr/include/php/ext -I/usr/include/php/ext/date/lib -DHAVE_CONFIG_H -O2 -fwrapv -pipe -Wformat -Werror=format-security -gdwarf-4 -fno-debug-types-section -fvar-tracking-assignments -g2 -Wp,-D_FORTIFY_SOURCE=2 -fstack-protector-strong --param=ssp-buffer-size=4 -fPIC -mtune=generic -march=x86-64 -gdwarf-4 -fno-debug-types-section -fvar-tracking-assignments -g2 -c /tmp/B.tb0Ohn/BUILD/php53-pecl-memcache-3.0.9/php5/memcache_consistent_hash.c -o php5/memcache_consistent_hash.lo libtool: compile: x86_64-pld-linux-gnux32-gcc -I/usr/include/php -I. -I/tmp/B.tb0Ohn/BUILD/php53-pecl-memcache-3.0.9 -DPHP_ATOM_INC -I/tmp/B.tb0Ohn/BUILD/php53-pecl-memcache-3.0.9/include -I/tmp/B.tb0Ohn/BUILD/php53-pecl-memcache-3.0.9/main -I/tmp/B.tb0Ohn/BUILD/php53-pecl-memcache-3.0.9 -I/usr/include/php -I/usr/include/php/main -I/usr/include/php/TSRM -I/usr/include/php/Zend -I/usr/include/php/ext -I/usr/include/php/ext/date/lib -DHAVE_CONFIG_H -O2 -fwrapv -pipe -Wformat -Werror=format-security -gdwarf-4 -fno-debug-types-section -fvar-tracking-assignments -g2 -Wp,-D_FORTIFY_SOURCE=2 -fstack-protector-strong --param=ssp-buffer-size=4 -fPIC -mtune=generic -march=x86-64 -gdwarf-4 -fno-debug-types-section -fvar-tracking-assignments -g2 -c /tmp/B.tb0Ohn/BUILD/php53-pecl-memcache-3.0.9/php5/memcache_consistent_hash.c -fPIC -DPIC -o php5/.libs/memcache_consistent_hash.o In file included from /tmp/B.tb0Ohn/BUILD/php53-pecl-memcache-3.0.9/php5/php_memcache.h:34:0, from /tmp/B.tb0Ohn/BUILD/php53-pecl-memcache-3.0.9/php5/memcache_consistent_hash.c:29: /tmp/B.tb0Ohn/BUILD/php53-pecl-memcache-3.0.9/php5/memcache_pool.h:406:21: warning: inline function 'mmc_prepare_key' declared but never defined MMC_POOL_INLINE int mmc_prepare_key(zval *, char *, unsigned int *); ^~~~~~~~~~~~~~~ /tmp/B.tb0Ohn/BUILD/php53-pecl-memcache-3.0.9/php5/memcache_pool.h:405:21: warning: inline function 'mmc_prepare_key_ex' declared but never defined MMC_POOL_INLINE int mmc_prepare_key_ex(const char *, unsigned int, char *, unsigned int *); ^~~~~~~~~~~~~~~~~~ In file included from /tmp/B.tb0Ohn/BUILD/php53-pecl-memcache-3.0.9/php5/php_memcache.h:34:0, from /tmp/B.tb0Ohn/BUILD/php53-pecl-memcache-3.0.9/php5/memcache_consistent_hash.c:29: /tmp/B.tb0Ohn/BUILD/php53-pecl-memcache-3.0.9/php5/memcache_pool.h:146:22: warning: inline function 'mmc_buffer_free' declared but never defined MMC_POOL_INLINE void mmc_buffer_free(mmc_buffer_t *); ^~~~~~~~~~~~~~~ /tmp/B.tb0Ohn/BUILD/php53-pecl-memcache-3.0.9/php5/memcache_pool.h:145:22: warning: inline function 'mmc_buffer_alloc' declared but never defined MMC_POOL_INLINE void mmc_buffer_alloc(mmc_buffer_t *, unsigned int); ^~~~~~~~~~~~~~~~ In file included from /tmp/B.tb0Ohn/BUILD/php53-pecl-memcache-3.0.9/php5/memcache_pool.h:46:0, from /tmp/B.tb0Ohn/BUILD/php53-pecl-memcache-3.0.9/php5/php_memcache.h:34, from /tmp/B.tb0Ohn/BUILD/php53-pecl-memcache-3.0.9/php5/memcache_consistent_hash.c:29: /tmp/B.tb0Ohn/BUILD/php53-pecl-memcache-3.0.9/php5/memcache_queue.h:54:23: warning: inline function 'mmc_queue_remove' declared but never defined MMC_QUEUE_INLINE void mmc_queue_remove(mmc_queue_t *, void *); ^~~~~~~~~~~~~~~~ /tmp/B.tb0Ohn/BUILD/php53-pecl-memcache-3.0.9/php5/memcache_queue.h:53:23: warning: inline function 'mmc_queue_copy' declared but never defined MMC_QUEUE_INLINE void mmc_queue_copy(mmc_queue_t *, mmc_queue_t *); ^~~~~~~~~~~~~~ /tmp/B.tb0Ohn/BUILD/php53-pecl-memcache-3.0.9/php5/memcache_queue.h:52:23: warning: inline function 'mmc_queue_free' declared but never defined MMC_QUEUE_INLINE void mmc_queue_free(mmc_queue_t *); ^~~~~~~~~~~~~~ /tmp/B.tb0Ohn/BUILD/php53-pecl-memcache-3.0.9/php5/memcache_queue.h:51:22: warning: inline function 'mmc_queue_contains' declared but never defined MMC_QUEUE_INLINE int mmc_queue_contains(mmc_queue_t *, void *); ^~~~~~~~~~~~~~~~~~ /tmp/B.tb0Ohn/BUILD/php53-pecl-memcache-3.0.9/php5/memcache_queue.h:50:24: warning: inline function 'mmc_queue_pop' declared but never defined MMC_QUEUE_INLINE void *mmc_queue_pop(mmc_queue_t *); ^~~~~~~~~~~~~ /tmp/B.tb0Ohn/BUILD/php53-pecl-memcache-3.0.9/php5/memcache_queue.h:49:23: warning: inline function 'mmc_queue_push' declared but never defined MMC_QUEUE_INLINE void mmc_queue_push(mmc_queue_t *, void *); ^~~~~~~~~~~~~~ /bin/sh /tmp/B.tb0Ohn/BUILD/php53-pecl-memcache-3.0.9/libtool --mode=compile x86_64-pld-linux-gnux32-gcc -I/usr/include/php -I. -I/tmp/B.tb0Ohn/BUILD/php53-pecl-memcache-3.0.9 -DPHP_ATOM_INC -I/tmp/B.tb0Ohn/BUILD/php53-pecl-memcache-3.0.9/include -I/tmp/B.tb0Ohn/BUILD/php53-pecl-memcache-3.0.9/main -I/tmp/B.tb0Ohn/BUILD/php53-pecl-memcache-3.0.9 -I/usr/include/php -I/usr/include/php/main -I/usr/include/php/TSRM -I/usr/include/php/Zend -I/usr/include/php/ext -I/usr/include/php/ext/date/lib -DHAVE_CONFIG_H -O2 -fwrapv -pipe -Wformat -Werror=format-security -gdwarf-4 -fno-debug-types-section -fvar-tracking-assignments -g2 -Wp,-D_FORTIFY_SOURCE=2 -fstack-protector-strong --param=ssp-buffer-size=4 -fPIC -mtune=generic -march=x86-64 -gdwarf-4 -fno-debug-types-section -fvar-tracking-assignments -g2 -c /tmp/B.tb0Ohn/BUILD/php53-pecl-memcache-3.0.9/php5/memcache_queue.c -o php5/memcache_queue.lo libtool: compile: x86_64-pld-linux-gnux32-gcc -I/usr/include/php -I. -I/tmp/B.tb0Ohn/BUILD/php53-pecl-memcache-3.0.9 -DPHP_ATOM_INC -I/tmp/B.tb0Ohn/BUILD/php53-pecl-memcache-3.0.9/include -I/tmp/B.tb0Ohn/BUILD/php53-pecl-memcache-3.0.9/main -I/tmp/B.tb0Ohn/BUILD/php53-pecl-memcache-3.0.9 -I/usr/include/php -I/usr/include/php/main -I/usr/include/php/TSRM -I/usr/include/php/Zend -I/usr/include/php/ext -I/usr/include/php/ext/date/lib -DHAVE_CONFIG_H -O2 -fwrapv -pipe -Wformat -Werror=format-security -gdwarf-4 -fno-debug-types-section -fvar-tracking-assignments -g2 -Wp,-D_FORTIFY_SOURCE=2 -fstack-protector-strong --param=ssp-buffer-size=4 -fPIC -mtune=generic -march=x86-64 -gdwarf-4 -fno-debug-types-section -fvar-tracking-assignments -g2 -c /tmp/B.tb0Ohn/BUILD/php53-pecl-memcache-3.0.9/php5/memcache_queue.c -fPIC -DPIC -o php5/.libs/memcache_queue.o /bin/sh /tmp/B.tb0Ohn/BUILD/php53-pecl-memcache-3.0.9/libtool --mode=compile x86_64-pld-linux-gnux32-gcc -I/usr/include/php -I. -I/tmp/B.tb0Ohn/BUILD/php53-pecl-memcache-3.0.9 -DPHP_ATOM_INC -I/tmp/B.tb0Ohn/BUILD/php53-pecl-memcache-3.0.9/include -I/tmp/B.tb0Ohn/BUILD/php53-pecl-memcache-3.0.9/main -I/tmp/B.tb0Ohn/BUILD/php53-pecl-memcache-3.0.9 -I/usr/include/php -I/usr/include/php/main -I/usr/include/php/TSRM -I/usr/include/php/Zend -I/usr/include/php/ext -I/usr/include/php/ext/date/lib -DHAVE_CONFIG_H -O2 -fwrapv -pipe -Wformat -Werror=format-security -gdwarf-4 -fno-debug-types-section -fvar-tracking-assignments -g2 -Wp,-D_FORTIFY_SOURCE=2 -fstack-protector-strong --param=ssp-buffer-size=4 -fPIC -mtune=generic -march=x86-64 -gdwarf-4 -fno-debug-types-section -fvar-tracking-assignments -g2 -c /tmp/B.tb0Ohn/BUILD/php53-pecl-memcache-3.0.9/php5/memcache_session.c -o php5/memcache_session.lo libtool: compile: x86_64-pld-linux-gnux32-gcc -I/usr/include/php -I. -I/tmp/B.tb0Ohn/BUILD/php53-pecl-memcache-3.0.9 -DPHP_ATOM_INC -I/tmp/B.tb0Ohn/BUILD/php53-pecl-memcache-3.0.9/include -I/tmp/B.tb0Ohn/BUILD/php53-pecl-memcache-3.0.9/main -I/tmp/B.tb0Ohn/BUILD/php53-pecl-memcache-3.0.9 -I/usr/include/php -I/usr/include/php/main -I/usr/include/php/TSRM -I/usr/include/php/Zend -I/usr/include/php/ext -I/usr/include/php/ext/date/lib -DHAVE_CONFIG_H -O2 -fwrapv -pipe -Wformat -Werror=format-security -gdwarf-4 -fno-debug-types-section -fvar-tracking-assignments -g2 -Wp,-D_FORTIFY_SOURCE=2 -fstack-protector-strong --param=ssp-buffer-size=4 -fPIC -mtune=generic -march=x86-64 -gdwarf-4 -fno-debug-types-section -fvar-tracking-assignments -g2 -c /tmp/B.tb0Ohn/BUILD/php53-pecl-memcache-3.0.9/php5/memcache_session.c -fPIC -DPIC -o php5/.libs/memcache_session.o In file included from /tmp/B.tb0Ohn/BUILD/php53-pecl-memcache-3.0.9/php5/php_memcache.h:34:0, from /tmp/B.tb0Ohn/BUILD/php53-pecl-memcache-3.0.9/php5/memcache_session.c:42: /tmp/B.tb0Ohn/BUILD/php53-pecl-memcache-3.0.9/php5/memcache_pool.h:406:21: warning: inline function 'mmc_prepare_key' declared but never defined MMC_POOL_INLINE int mmc_prepare_key(zval *, char *, unsigned int *); ^~~~~~~~~~~~~~~ /tmp/B.tb0Ohn/BUILD/php53-pecl-memcache-3.0.9/php5/memcache_pool.h:405:21: warning: inline function 'mmc_prepare_key_ex' declared but never defined MMC_POOL_INLINE int mmc_prepare_key_ex(const char *, unsigned int, char *, unsigned int *); ^~~~~~~~~~~~~~~~~~ In file included from /tmp/B.tb0Ohn/BUILD/php53-pecl-memcache-3.0.9/php5/php_memcache.h:34:0, from /tmp/B.tb0Ohn/BUILD/php53-pecl-memcache-3.0.9/php5/memcache_session.c:42: /tmp/B.tb0Ohn/BUILD/php53-pecl-memcache-3.0.9/php5/memcache_pool.h:146:22: warning: inline function 'mmc_buffer_free' declared but never defined MMC_POOL_INLINE void mmc_buffer_free(mmc_buffer_t *); ^~~~~~~~~~~~~~~ /tmp/B.tb0Ohn/BUILD/php53-pecl-memcache-3.0.9/php5/memcache_pool.h:145:22: warning: inline function 'mmc_buffer_alloc' declared but never defined MMC_POOL_INLINE void mmc_buffer_alloc(mmc_buffer_t *, unsigned int); ^~~~~~~~~~~~~~~~ In file included from /tmp/B.tb0Ohn/BUILD/php53-pecl-memcache-3.0.9/php5/memcache_pool.h:46:0, from /tmp/B.tb0Ohn/BUILD/php53-pecl-memcache-3.0.9/php5/php_memcache.h:34, from /tmp/B.tb0Ohn/BUILD/php53-pecl-memcache-3.0.9/php5/memcache_session.c:42: /tmp/B.tb0Ohn/BUILD/php53-pecl-memcache-3.0.9/php5/memcache_queue.h:54:23: warning: inline function 'mmc_queue_remove' declared but never defined MMC_QUEUE_INLINE void mmc_queue_remove(mmc_queue_t *, void *); ^~~~~~~~~~~~~~~~ /tmp/B.tb0Ohn/BUILD/php53-pecl-memcache-3.0.9/php5/memcache_queue.h:53:23: warning: inline function 'mmc_queue_copy' declared but never defined MMC_QUEUE_INLINE void mmc_queue_copy(mmc_queue_t *, mmc_queue_t *); ^~~~~~~~~~~~~~ /tmp/B.tb0Ohn/BUILD/php53-pecl-memcache-3.0.9/php5/memcache_queue.h:52:23: warning: inline function 'mmc_queue_free' declared but never defined MMC_QUEUE_INLINE void mmc_queue_free(mmc_queue_t *); ^~~~~~~~~~~~~~ /tmp/B.tb0Ohn/BUILD/php53-pecl-memcache-3.0.9/php5/memcache_queue.h:51:22: warning: inline function 'mmc_queue_contains' declared but never defined MMC_QUEUE_INLINE int mmc_queue_contains(mmc_queue_t *, void *); ^~~~~~~~~~~~~~~~~~ /tmp/B.tb0Ohn/BUILD/php53-pecl-memcache-3.0.9/php5/memcache_queue.h:50:24: warning: inline function 'mmc_queue_pop' declared but never defined MMC_QUEUE_INLINE void *mmc_queue_pop(mmc_queue_t *); ^~~~~~~~~~~~~ /tmp/B.tb0Ohn/BUILD/php53-pecl-memcache-3.0.9/php5/memcache_queue.h:49:23: warning: inline function 'mmc_queue_push' declared but never defined MMC_QUEUE_INLINE void mmc_queue_push(mmc_queue_t *, void *); ^~~~~~~~~~~~~~ /bin/sh /tmp/B.tb0Ohn/BUILD/php53-pecl-memcache-3.0.9/libtool --mode=compile x86_64-pld-linux-gnux32-gcc -I/usr/include/php -I. -I/tmp/B.tb0Ohn/BUILD/php53-pecl-memcache-3.0.9 -DPHP_ATOM_INC -I/tmp/B.tb0Ohn/BUILD/php53-pecl-memcache-3.0.9/include -I/tmp/B.tb0Ohn/BUILD/php53-pecl-memcache-3.0.9/main -I/tmp/B.tb0Ohn/BUILD/php53-pecl-memcache-3.0.9 -I/usr/include/php -I/usr/include/php/main -I/usr/include/php/TSRM -I/usr/include/php/Zend -I/usr/include/php/ext -I/usr/include/php/ext/date/lib -DHAVE_CONFIG_H -O2 -fwrapv -pipe -Wformat -Werror=format-security -gdwarf-4 -fno-debug-types-section -fvar-tracking-assignments -g2 -Wp,-D_FORTIFY_SOURCE=2 -fstack-protector-strong --param=ssp-buffer-size=4 -fPIC -mtune=generic -march=x86-64 -gdwarf-4 -fno-debug-types-section -fvar-tracking-assignments -g2 -c /tmp/B.tb0Ohn/BUILD/php53-pecl-memcache-3.0.9/php5/memcache_binary_protocol.c -o php5/memcache_binary_protocol.lo libtool: compile: x86_64-pld-linux-gnux32-gcc -I/usr/include/php -I. -I/tmp/B.tb0Ohn/BUILD/php53-pecl-memcache-3.0.9 -DPHP_ATOM_INC -I/tmp/B.tb0Ohn/BUILD/php53-pecl-memcache-3.0.9/include -I/tmp/B.tb0Ohn/BUILD/php53-pecl-memcache-3.0.9/main -I/tmp/B.tb0Ohn/BUILD/php53-pecl-memcache-3.0.9 -I/usr/include/php -I/usr/include/php/main -I/usr/include/php/TSRM -I/usr/include/php/Zend -I/usr/include/php/ext -I/usr/include/php/ext/date/lib -DHAVE_CONFIG_H -O2 -fwrapv -pipe -Wformat -Werror=format-security -gdwarf-4 -fno-debug-types-section -fvar-tracking-assignments -g2 -Wp,-D_FORTIFY_SOURCE=2 -fstack-protector-strong --param=ssp-buffer-size=4 -fPIC -mtune=generic -march=x86-64 -gdwarf-4 -fno-debug-types-section -fvar-tracking-assignments -g2 -c /tmp/B.tb0Ohn/BUILD/php53-pecl-memcache-3.0.9/php5/memcache_binary_protocol.c -fPIC -DPIC -o php5/.libs/memcache_binary_protocol.o /tmp/B.tb0Ohn/BUILD/php53-pecl-memcache-3.0.9/php5/memcache_binary_protocol.c: In function 'mmc_binary_store': /tmp/B.tb0Ohn/BUILD/php53-pecl-memcache-3.0.9/php5/memcache_binary_protocol.c:563:10: warning: assignment from incompatible pointer type [-Wincompatible-pointer-types] header = (mmc_store_request_header_t *)(request->sendbuf.value.c + prevlen); ^ In file included from /tmp/B.tb0Ohn/BUILD/php53-pecl-memcache-3.0.9/php5/memcache_binary_protocol.c:36:0: /tmp/B.tb0Ohn/BUILD/php53-pecl-memcache-3.0.9/php5/memcache_binary_protocol.c: At top level: /tmp/B.tb0Ohn/BUILD/php53-pecl-memcache-3.0.9/php5/memcache_pool.h:406:21: warning: inline function 'mmc_prepare_key' declared but never defined MMC_POOL_INLINE int mmc_prepare_key(zval *, char *, unsigned int *); ^~~~~~~~~~~~~~~ /tmp/B.tb0Ohn/BUILD/php53-pecl-memcache-3.0.9/php5/memcache_pool.h:405:21: warning: inline function 'mmc_prepare_key_ex' declared but never defined MMC_POOL_INLINE int mmc_prepare_key_ex(const char *, unsigned int, char *, unsigned int *); ^~~~~~~~~~~~~~~~~~ In file included from /tmp/B.tb0Ohn/BUILD/php53-pecl-memcache-3.0.9/php5/memcache_binary_protocol.c:36:0: /tmp/B.tb0Ohn/BUILD/php53-pecl-memcache-3.0.9/php5/memcache_pool.h:146:22: warning: inline function 'mmc_buffer_free' declared but never defined MMC_POOL_INLINE void mmc_buffer_free(mmc_buffer_t *); ^~~~~~~~~~~~~~~ /tmp/B.tb0Ohn/BUILD/php53-pecl-memcache-3.0.9/php5/memcache_pool.h:145:22: warning: inline function 'mmc_buffer_alloc' declared but never defined MMC_POOL_INLINE void mmc_buffer_alloc(mmc_buffer_t *, unsigned int); ^~~~~~~~~~~~~~~~ In file included from /tmp/B.tb0Ohn/BUILD/php53-pecl-memcache-3.0.9/php5/memcache_pool.h:46:0, from /tmp/B.tb0Ohn/BUILD/php53-pecl-memcache-3.0.9/php5/memcache_binary_protocol.c:36: /tmp/B.tb0Ohn/BUILD/php53-pecl-memcache-3.0.9/php5/memcache_queue.h:54:23: warning: inline function 'mmc_queue_remove' declared but never defined MMC_QUEUE_INLINE void mmc_queue_remove(mmc_queue_t *, void *); ^~~~~~~~~~~~~~~~ /tmp/B.tb0Ohn/BUILD/php53-pecl-memcache-3.0.9/php5/memcache_queue.h:53:23: warning: inline function 'mmc_queue_copy' declared but never defined MMC_QUEUE_INLINE void mmc_queue_copy(mmc_queue_t *, mmc_queue_t *); ^~~~~~~~~~~~~~ /tmp/B.tb0Ohn/BUILD/php53-pecl-memcache-3.0.9/php5/memcache_queue.h:52:23: warning: inline function 'mmc_queue_free' declared but never defined MMC_QUEUE_INLINE void mmc_queue_free(mmc_queue_t *); ^~~~~~~~~~~~~~ /tmp/B.tb0Ohn/BUILD/php53-pecl-memcache-3.0.9/php5/memcache_queue.h:51:22: warning: inline function 'mmc_queue_contains' declared but never defined MMC_QUEUE_INLINE int mmc_queue_contains(mmc_queue_t *, void *); ^~~~~~~~~~~~~~~~~~ /tmp/B.tb0Ohn/BUILD/php53-pecl-memcache-3.0.9/php5/memcache_queue.h:50:24: warning: inline function 'mmc_queue_pop' declared but never defined MMC_QUEUE_INLINE void *mmc_queue_pop(mmc_queue_t *); ^~~~~~~~~~~~~ /tmp/B.tb0Ohn/BUILD/php53-pecl-memcache-3.0.9/php5/memcache_queue.h:49:23: warning: inline function 'mmc_queue_push' declared but never defined MMC_QUEUE_INLINE void mmc_queue_push(mmc_queue_t *, void *); ^~~~~~~~~~~~~~ /bin/sh /tmp/B.tb0Ohn/BUILD/php53-pecl-memcache-3.0.9/libtool --mode=compile x86_64-pld-linux-gnux32-gcc -I/usr/include/php -I. -I/tmp/B.tb0Ohn/BUILD/php53-pecl-memcache-3.0.9 -DPHP_ATOM_INC -I/tmp/B.tb0Ohn/BUILD/php53-pecl-memcache-3.0.9/include -I/tmp/B.tb0Ohn/BUILD/php53-pecl-memcache-3.0.9/main -I/tmp/B.tb0Ohn/BUILD/php53-pecl-memcache-3.0.9 -I/usr/include/php -I/usr/include/php/main -I/usr/include/php/TSRM -I/usr/include/php/Zend -I/usr/include/php/ext -I/usr/include/php/ext/date/lib -DHAVE_CONFIG_H -O2 -fwrapv -pipe -Wformat -Werror=format-security -gdwarf-4 -fno-debug-types-section -fvar-tracking-assignments -g2 -Wp,-D_FORTIFY_SOURCE=2 -fstack-protector-strong --param=ssp-buffer-size=4 -fPIC -mtune=generic -march=x86-64 -gdwarf-4 -fno-debug-types-section -fvar-tracking-assignments -g2 -c /tmp/B.tb0Ohn/BUILD/php53-pecl-memcache-3.0.9/php5/memcache_ascii_protocol.c -o php5/memcache_ascii_protocol.lo libtool: compile: x86_64-pld-linux-gnux32-gcc -I/usr/include/php -I. -I/tmp/B.tb0Ohn/BUILD/php53-pecl-memcache-3.0.9 -DPHP_ATOM_INC -I/tmp/B.tb0Ohn/BUILD/php53-pecl-memcache-3.0.9/include -I/tmp/B.tb0Ohn/BUILD/php53-pecl-memcache-3.0.9/main -I/tmp/B.tb0Ohn/BUILD/php53-pecl-memcache-3.0.9 -I/usr/include/php -I/usr/include/php/main -I/usr/include/php/TSRM -I/usr/include/php/Zend -I/usr/include/php/ext -I/usr/include/php/ext/date/lib -DHAVE_CONFIG_H -O2 -fwrapv -pipe -Wformat -Werror=format-security -gdwarf-4 -fno-debug-types-section -fvar-tracking-assignments -g2 -Wp,-D_FORTIFY_SOURCE=2 -fstack-protector-strong --param=ssp-buffer-size=4 -fPIC -mtune=generic -march=x86-64 -gdwarf-4 -fno-debug-types-section -fvar-tracking-assignments -g2 -c /tmp/B.tb0Ohn/BUILD/php53-pecl-memcache-3.0.9/php5/memcache_ascii_protocol.c -fPIC -DPIC -o php5/.libs/memcache_ascii_protocol.o In file included from /tmp/B.tb0Ohn/BUILD/php53-pecl-memcache-3.0.9/php5/memcache_ascii_protocol.c:26:0: /tmp/B.tb0Ohn/BUILD/php53-pecl-memcache-3.0.9/php5/memcache_pool.h:406:21: warning: inline function 'mmc_prepare_key' declared but never defined MMC_POOL_INLINE int mmc_prepare_key(zval *, char *, unsigned int *); ^~~~~~~~~~~~~~~ /tmp/B.tb0Ohn/BUILD/php53-pecl-memcache-3.0.9/php5/memcache_pool.h:405:21: warning: inline function 'mmc_prepare_key_ex' declared but never defined MMC_POOL_INLINE int mmc_prepare_key_ex(const char *, unsigned int, char *, unsigned int *); ^~~~~~~~~~~~~~~~~~ In file included from /tmp/B.tb0Ohn/BUILD/php53-pecl-memcache-3.0.9/php5/memcache_ascii_protocol.c:26:0: /tmp/B.tb0Ohn/BUILD/php53-pecl-memcache-3.0.9/php5/memcache_pool.h:146:22: warning: inline function 'mmc_buffer_free' declared but never defined MMC_POOL_INLINE void mmc_buffer_free(mmc_buffer_t *); ^~~~~~~~~~~~~~~ /tmp/B.tb0Ohn/BUILD/php53-pecl-memcache-3.0.9/php5/memcache_pool.h:145:22: warning: inline function 'mmc_buffer_alloc' declared but never defined MMC_POOL_INLINE void mmc_buffer_alloc(mmc_buffer_t *, unsigned int); ^~~~~~~~~~~~~~~~ In file included from /tmp/B.tb0Ohn/BUILD/php53-pecl-memcache-3.0.9/php5/memcache_pool.h:46:0, from /tmp/B.tb0Ohn/BUILD/php53-pecl-memcache-3.0.9/php5/memcache_ascii_protocol.c:26: /tmp/B.tb0Ohn/BUILD/php53-pecl-memcache-3.0.9/php5/memcache_queue.h:54:23: warning: inline function 'mmc_queue_remove' declared but never defined MMC_QUEUE_INLINE void mmc_queue_remove(mmc_queue_t *, void *); ^~~~~~~~~~~~~~~~ /tmp/B.tb0Ohn/BUILD/php53-pecl-memcache-3.0.9/php5/memcache_queue.h:53:23: warning: inline function 'mmc_queue_copy' declared but never defined MMC_QUEUE_INLINE void mmc_queue_copy(mmc_queue_t *, mmc_queue_t *); ^~~~~~~~~~~~~~ /tmp/B.tb0Ohn/BUILD/php53-pecl-memcache-3.0.9/php5/memcache_queue.h:52:23: warning: inline function 'mmc_queue_free' declared but never defined MMC_QUEUE_INLINE void mmc_queue_free(mmc_queue_t *); ^~~~~~~~~~~~~~ /tmp/B.tb0Ohn/BUILD/php53-pecl-memcache-3.0.9/php5/memcache_queue.h:51:22: warning: inline function 'mmc_queue_contains' declared but never defined MMC_QUEUE_INLINE int mmc_queue_contains(mmc_queue_t *, void *); ^~~~~~~~~~~~~~~~~~ /tmp/B.tb0Ohn/BUILD/php53-pecl-memcache-3.0.9/php5/memcache_queue.h:50:24: warning: inline function 'mmc_queue_pop' declared but never defined MMC_QUEUE_INLINE void *mmc_queue_pop(mmc_queue_t *); ^~~~~~~~~~~~~ /tmp/B.tb0Ohn/BUILD/php53-pecl-memcache-3.0.9/php5/memcache_queue.h:49:23: warning: inline function 'mmc_queue_push' declared but never defined MMC_QUEUE_INLINE void mmc_queue_push(mmc_queue_t *, void *); ^~~~~~~~~~~~~~ /bin/sh /tmp/B.tb0Ohn/BUILD/php53-pecl-memcache-3.0.9/libtool --mode=compile x86_64-pld-linux-gnux32-gcc -I/usr/include/php -I. -I/tmp/B.tb0Ohn/BUILD/php53-pecl-memcache-3.0.9 -DPHP_ATOM_INC -I/tmp/B.tb0Ohn/BUILD/php53-pecl-memcache-3.0.9/include -I/tmp/B.tb0Ohn/BUILD/php53-pecl-memcache-3.0.9/main -I/tmp/B.tb0Ohn/BUILD/php53-pecl-memcache-3.0.9 -I/usr/include/php -I/usr/include/php/main -I/usr/include/php/TSRM -I/usr/include/php/Zend -I/usr/include/php/ext -I/usr/include/php/ext/date/lib -DHAVE_CONFIG_H -O2 -fwrapv -pipe -Wformat -Werror=format-security -gdwarf-4 -fno-debug-types-section -fvar-tracking-assignments -g2 -Wp,-D_FORTIFY_SOURCE=2 -fstack-protector-strong --param=ssp-buffer-size=4 -fPIC -mtune=generic -march=x86-64 -gdwarf-4 -fno-debug-types-section -fvar-tracking-assignments -g2 -c /tmp/B.tb0Ohn/BUILD/php53-pecl-memcache-3.0.9/php5/memcache_pool.c -o php5/memcache_pool.lo libtool: compile: x86_64-pld-linux-gnux32-gcc -I/usr/include/php -I. -I/tmp/B.tb0Ohn/BUILD/php53-pecl-memcache-3.0.9 -DPHP_ATOM_INC -I/tmp/B.tb0Ohn/BUILD/php53-pecl-memcache-3.0.9/include -I/tmp/B.tb0Ohn/BUILD/php53-pecl-memcache-3.0.9/main -I/tmp/B.tb0Ohn/BUILD/php53-pecl-memcache-3.0.9 -I/usr/include/php -I/usr/include/php/main -I/usr/include/php/TSRM -I/usr/include/php/Zend -I/usr/include/php/ext -I/usr/include/php/ext/date/lib -DHAVE_CONFIG_H -O2 -fwrapv -pipe -Wformat -Werror=format-security -gdwarf-4 -fno-debug-types-section -fvar-tracking-assignments -g2 -Wp,-D_FORTIFY_SOURCE=2 -fstack-protector-strong --param=ssp-buffer-size=4 -fPIC -mtune=generic -march=x86-64 -gdwarf-4 -fno-debug-types-section -fvar-tracking-assignments -g2 -c /tmp/B.tb0Ohn/BUILD/php53-pecl-memcache-3.0.9/php5/memcache_pool.c -fPIC -DPIC -o php5/.libs/memcache_pool.o In file included from /tmp/B.tb0Ohn/BUILD/php53-pecl-memcache-3.0.9/php5/memcache_pool.h:46:0, from /tmp/B.tb0Ohn/BUILD/php53-pecl-memcache-3.0.9/php5/memcache_pool.c:39: /tmp/B.tb0Ohn/BUILD/php53-pecl-memcache-3.0.9/php5/memcache_queue.h:54:23: warning: inline function 'mmc_queue_remove' declared but never defined MMC_QUEUE_INLINE void mmc_queue_remove(mmc_queue_t *, void *); ^~~~~~~~~~~~~~~~ /tmp/B.tb0Ohn/BUILD/php53-pecl-memcache-3.0.9/php5/memcache_queue.h:53:23: warning: inline function 'mmc_queue_copy' declared but never defined MMC_QUEUE_INLINE void mmc_queue_copy(mmc_queue_t *, mmc_queue_t *); ^~~~~~~~~~~~~~ /tmp/B.tb0Ohn/BUILD/php53-pecl-memcache-3.0.9/php5/memcache_queue.h:52:23: warning: inline function 'mmc_queue_free' declared but never defined MMC_QUEUE_INLINE void mmc_queue_free(mmc_queue_t *); ^~~~~~~~~~~~~~ /tmp/B.tb0Ohn/BUILD/php53-pecl-memcache-3.0.9/php5/memcache_queue.h:51:22: warning: inline function 'mmc_queue_contains' declared but never defined MMC_QUEUE_INLINE int mmc_queue_contains(mmc_queue_t *, void *); ^~~~~~~~~~~~~~~~~~ /tmp/B.tb0Ohn/BUILD/php53-pecl-memcache-3.0.9/php5/memcache_queue.h:50:24: warning: inline function 'mmc_queue_pop' declared but never defined MMC_QUEUE_INLINE void *mmc_queue_pop(mmc_queue_t *); ^~~~~~~~~~~~~ /tmp/B.tb0Ohn/BUILD/php53-pecl-memcache-3.0.9/php5/memcache_queue.h:49:23: warning: inline function 'mmc_queue_push' declared but never defined MMC_QUEUE_INLINE void mmc_queue_push(mmc_queue_t *, void *); ^~~~~~~~~~~~~~ /bin/sh /tmp/B.tb0Ohn/BUILD/php53-pecl-memcache-3.0.9/libtool --mode=compile x86_64-pld-linux-gnux32-gcc -I/usr/include/php -I. -I/tmp/B.tb0Ohn/BUILD/php53-pecl-memcache-3.0.9 -DPHP_ATOM_INC -I/tmp/B.tb0Ohn/BUILD/php53-pecl-memcache-3.0.9/include -I/tmp/B.tb0Ohn/BUILD/php53-pecl-memcache-3.0.9/main -I/tmp/B.tb0Ohn/BUILD/php53-pecl-memcache-3.0.9 -I/usr/include/php -I/usr/include/php/main -I/usr/include/php/TSRM -I/usr/include/php/Zend -I/usr/include/php/ext -I/usr/include/php/ext/date/lib -DHAVE_CONFIG_H -O2 -fwrapv -pipe -Wformat -Werror=format-security -gdwarf-4 -fno-debug-types-section -fvar-tracking-assignments -g2 -Wp,-D_FORTIFY_SOURCE=2 -fstack-protector-strong --param=ssp-buffer-size=4 -fPIC -mtune=generic -march=x86-64 -gdwarf-4 -fno-debug-types-section -fvar-tracking-assignments -g2 -c /tmp/B.tb0Ohn/BUILD/php53-pecl-memcache-3.0.9/php5/memcache.c -o php5/memcache.lo libtool: compile: x86_64-pld-linux-gnux32-gcc -I/usr/include/php -I. -I/tmp/B.tb0Ohn/BUILD/php53-pecl-memcache-3.0.9 -DPHP_ATOM_INC -I/tmp/B.tb0Ohn/BUILD/php53-pecl-memcache-3.0.9/include -I/tmp/B.tb0Ohn/BUILD/php53-pecl-memcache-3.0.9/main -I/tmp/B.tb0Ohn/BUILD/php53-pecl-memcache-3.0.9 -I/usr/include/php -I/usr/include/php/main -I/usr/include/php/TSRM -I/usr/include/php/Zend -I/usr/include/php/ext -I/usr/include/php/ext/date/lib -DHAVE_CONFIG_H -O2 -fwrapv -pipe -Wformat -Werror=format-security -gdwarf-4 -fno-debug-types-section -fvar-tracking-assignments -g2 -Wp,-D_FORTIFY_SOURCE=2 -fstack-protector-strong --param=ssp-buffer-size=4 -fPIC -mtune=generic -march=x86-64 -gdwarf-4 -fno-debug-types-section -fvar-tracking-assignments -g2 -c /tmp/B.tb0Ohn/BUILD/php53-pecl-memcache-3.0.9/php5/memcache.c -fPIC -DPIC -o php5/.libs/memcache.o In file included from /tmp/B.tb0Ohn/BUILD/php53-pecl-memcache-3.0.9/php5/php_memcache.h:34:0, from /tmp/B.tb0Ohn/BUILD/php53-pecl-memcache-3.0.9/php5/memcache.c:30: /tmp/B.tb0Ohn/BUILD/php53-pecl-memcache-3.0.9/php5/memcache_pool.h:406:21: warning: inline function 'mmc_prepare_key' declared but never defined MMC_POOL_INLINE int mmc_prepare_key(zval *, char *, unsigned int *); ^~~~~~~~~~~~~~~ /tmp/B.tb0Ohn/BUILD/php53-pecl-memcache-3.0.9/php5/memcache_pool.h:405:21: warning: inline function 'mmc_prepare_key_ex' declared but never defined MMC_POOL_INLINE int mmc_prepare_key_ex(const char *, unsigned int, char *, unsigned int *); ^~~~~~~~~~~~~~~~~~ In file included from /tmp/B.tb0Ohn/BUILD/php53-pecl-memcache-3.0.9/php5/php_memcache.h:34:0, from /tmp/B.tb0Ohn/BUILD/php53-pecl-memcache-3.0.9/php5/memcache.c:30: /tmp/B.tb0Ohn/BUILD/php53-pecl-memcache-3.0.9/php5/memcache_pool.h:146:22: warning: inline function 'mmc_buffer_free' declared but never defined MMC_POOL_INLINE void mmc_buffer_free(mmc_buffer_t *); ^~~~~~~~~~~~~~~ /tmp/B.tb0Ohn/BUILD/php53-pecl-memcache-3.0.9/php5/memcache_pool.h:145:22: warning: inline function 'mmc_buffer_alloc' declared but never defined MMC_POOL_INLINE void mmc_buffer_alloc(mmc_buffer_t *, unsigned int); ^~~~~~~~~~~~~~~~ In file included from /tmp/B.tb0Ohn/BUILD/php53-pecl-memcache-3.0.9/php5/memcache_pool.h:46:0, from /tmp/B.tb0Ohn/BUILD/php53-pecl-memcache-3.0.9/php5/php_memcache.h:34, from /tmp/B.tb0Ohn/BUILD/php53-pecl-memcache-3.0.9/php5/memcache.c:30: /tmp/B.tb0Ohn/BUILD/php53-pecl-memcache-3.0.9/php5/memcache_queue.h:54:23: warning: inline function 'mmc_queue_remove' declared but never defined MMC_QUEUE_INLINE void mmc_queue_remove(mmc_queue_t *, void *); ^~~~~~~~~~~~~~~~ /tmp/B.tb0Ohn/BUILD/php53-pecl-memcache-3.0.9/php5/memcache_queue.h:53:23: warning: inline function 'mmc_queue_copy' declared but never defined MMC_QUEUE_INLINE void mmc_queue_copy(mmc_queue_t *, mmc_queue_t *); ^~~~~~~~~~~~~~ /tmp/B.tb0Ohn/BUILD/php53-pecl-memcache-3.0.9/php5/memcache_queue.h:52:23: warning: inline function 'mmc_queue_free' declared but never defined MMC_QUEUE_INLINE void mmc_queue_free(mmc_queue_t *); ^~~~~~~~~~~~~~ /tmp/B.tb0Ohn/BUILD/php53-pecl-memcache-3.0.9/php5/memcache_queue.h:51:22: warning: inline function 'mmc_queue_contains' declared but never defined MMC_QUEUE_INLINE int mmc_queue_contains(mmc_queue_t *, void *); ^~~~~~~~~~~~~~~~~~ /tmp/B.tb0Ohn/BUILD/php53-pecl-memcache-3.0.9/php5/memcache_queue.h:50:24: warning: inline function 'mmc_queue_pop' declared but never defined MMC_QUEUE_INLINE void *mmc_queue_pop(mmc_queue_t *); ^~~~~~~~~~~~~ /tmp/B.tb0Ohn/BUILD/php53-pecl-memcache-3.0.9/php5/memcache_queue.h:49:23: warning: inline function 'mmc_queue_push' declared but never defined MMC_QUEUE_INLINE void mmc_queue_push(mmc_queue_t *, void *); ^~~~~~~~~~~~~~ /bin/sh /tmp/B.tb0Ohn/BUILD/php53-pecl-memcache-3.0.9/libtool --mode=link x86_64-pld-linux-gnux32-gcc -DPHP_ATOM_INC -I/tmp/B.tb0Ohn/BUILD/php53-pecl-memcache-3.0.9/include -I/tmp/B.tb0Ohn/BUILD/php53-pecl-memcache-3.0.9/main -I/tmp/B.tb0Ohn/BUILD/php53-pecl-memcache-3.0.9 -I/usr/include/php -I/usr/include/php/main -I/usr/include/php/TSRM -I/usr/include/php/Zend -I/usr/include/php/ext -I/usr/include/php/ext/date/lib -DHAVE_CONFIG_H -O2 -fwrapv -pipe -Wformat -Werror=format-security -gdwarf-4 -fno-debug-types-section -fvar-tracking-assignments -g2 -Wp,-D_FORTIFY_SOURCE=2 -fstack-protector-strong --param=ssp-buffer-size=4 -fPIC -mtune=generic -march=x86-64 -gdwarf-4 -fno-debug-types-section -fvar-tracking-assignments -g2 -Wl,--as-needed -Wl,--no-copy-dt-needed-entries -Wl,-z,relro -Wl,-z,combreloc -o memcache.la -export-dynamic -avoid-version -prefer-pic -module -rpath /tmp/B.tb0Ohn/BUILD/php53-pecl-memcache-3.0.9/modules php5/memcache.lo php5/memcache_pool.lo php5/memcache_queue.lo php5/memcache_ascii_protocol.lo php5/memcache_binary_protocol.lo php5/memcache_standard_hash.lo php5/memcache_consistent_hash.lo php5/memcache_session.lo -lz libtool: link: x86_64-pld-linux-gnux32-gcc -shared -fPIC -DPIC -O2 -gdwarf-4 -g2 -fstack-protector-strong -mtune=generic -march=x86-64 -gdwarf-4 -g2 -Wl,--as-needed -Wl,--no-copy-dt-needed-entries -Wl,-z -Wl,relro -Wl,-z -Wl,combreloc php5/.libs/memcache.o php5/.libs/memcache_pool.o php5/.libs/memcache_queue.o php5/.libs/memcache_ascii_protocol.o php5/.libs/memcache_binary_protocol.o php5/.libs/memcache_standard_hash.o php5/.libs/memcache_consistent_hash.o php5/.libs/memcache_session.o -lz -Wl,-soname -Wl,memcache.so -o .libs/memcache.so libtool: link: ( cd ".libs" && rm -f "memcache.la" && ln -s "../memcache.la" "memcache.la" ) /bin/sh /tmp/B.tb0Ohn/BUILD/php53-pecl-memcache-3.0.9/libtool --mode=install cp ./memcache.la /tmp/B.tb0Ohn/BUILD/php53-pecl-memcache-3.0.9/modules libtool: install: cp ./.libs/memcache.so /tmp/B.tb0Ohn/BUILD/php53-pecl-memcache-3.0.9/modules/memcache.so libtool: install: cp ./.libs/memcache.lai /tmp/B.tb0Ohn/BUILD/php53-pecl-memcache-3.0.9/modules/memcache.la libtool: finish: PATH="/home/users/builder/GNUstep/Tools:/usr/local/bin:/usr/bin:/bin:/sbin" ldconfig -n /tmp/B.tb0Ohn/BUILD/php53-pecl-memcache-3.0.9/modules ---------------------------------------------------------------------- Libraries have been installed in: /tmp/B.tb0Ohn/BUILD/php53-pecl-memcache-3.0.9/modules If you ever happen to want to link against installed libraries in a given directory, LIBDIR, you must either use libtool, and specify the full pathname of the library, or use the '-LLIBDIR' flag during linking and do at least one of the following: - add LIBDIR to the 'LD_LIBRARY_PATH' environment variable during execution - add LIBDIR to the 'LD_RUN_PATH' environment variable during linking - use the '-Wl,-rpath -Wl,LIBDIR' linker flag - have your system administrator add LIBDIR to '/etc/ld.so.conf' See any operating system documentation about shared libraries for more information, such as the ld(1) and ld.so(8) manual pages. ---------------------------------------------------------------------- Build complete. Don't forget to run 'make test'. + >modules.log + /usr/bin/php53 -n -q -d 'extension_dir=modules' -d 'extension=/usr/libx32/php53/pcre.so' -d 'extension=/usr/libx32/php53/spl.so' -d 'extension=/usr/libx32/php53/session.so' -d 'extension=memcache.so' -m + grep memcache modules.log memcache + <<"EOF" + >run-tests.sh + cat + chmod +x run-tests.sh + /usr/sbin/memcached -p 11211 -U 11211 -d -P /tmp/B.tb0Ohn/BUILD/php53-pecl-memcache-3.0.9/memcached.pid + trap 'kill $(cat memcached.pid)' EXIT INT + ./run-tests.sh Build complete. Don't forget to run 'make test'. ===================================================================== PHP : /usr/bin/php53 PHP_SAPI : cli PHP_VERSION : 5.3.29 ZEND_VERSION: 2.3.0 PHP_OS : Linux - Linux naiad-pld 4.1.45-1 #1 SMP Sat Oct 21 22:54:13 CEST 2017 x86_64 INI actual : /tmp/B.tb0Ohn/BUILD/php53-pecl-memcache-3.0.9/tmp-php.ini More .INIs : CWD : /tmp/B.tb0Ohn/BUILD/php53-pecl-memcache-3.0.9 Extra dirs : VALGRIND : Not used ===================================================================== TIME START 2017-12-05 15:45:26 ===================================================================== TEST 1/71 [tests/001.phpt] PASS memcache_set() function [tests/001.phpt] TEST 2/71 [tests/002.phpt] PASS memcache_get() function [tests/002.phpt] TEST 3/71 [tests/003.phpt] PASS memcache_set()/memcache_get() using compression [tests/003.phpt] TEST 4/71 [tests/004.phpt] PASS memcache_add() & memcache_replace() [tests/004.phpt] TEST 5/71 [tests/005.phpt] PASS strange keys [tests/005.phpt] TEST 6/71 [tests/006.phpt] PASS memcache_increment() & memcache_decrement() [tests/006.phpt] TEST 7/71 [tests/007.phpt] PASS memcache_get_version() & memcache_get_stats() [tests/007.phpt] TEST 8/71 [tests/008.phpt] PASS memcache_delete() [tests/008.phpt] TEST 9/71 [tests/009.phpt] PASS memcache->set() method [tests/009.phpt] TEST 10/71 [tests/010.phpt] PASS memcache->get() function [tests/010.phpt] TEST 11/71 [tests/011.phpt] PASS memcache->set()/memcache->get() using compression [tests/011.phpt] TEST 12/71 [tests/012.phpt] PASS memcache_add() & memcache_replace() [tests/012.phpt] TEST 13/71 [tests/013.phpt] PASS memcache->set() & memcache->get() with strange keys [tests/013.phpt] TEST 14/71 [tests/014.phpt] PASS memcache->increment() & memcache->decrement() [tests/014.phpt] TEST 15/71 [tests/015.phpt] PASS memcache->getVersion() & memcache->getStats() [tests/015.phpt] TEST 16/71 [tests/016.phpt] PASS memcache->delete() [tests/016.phpt] TEST 17/71 [tests/017.phpt] PASS Memcache class should be inheritable [tests/017.phpt] TEST 18/71 [tests/018.phpt] PASS memcache_set() & memcache_add() [tests/018.phpt] TEST 19/71 [tests/019.phpt] XFAIL memcache->addServer() [tests/019.phpt] XFAIL REASON: Skip TEST 20/71 [tests/019a.phpt] PASS memcache_add_server() [tests/019a.phpt] TEST 21/71 [tests/020.phpt] XFAIL memcache->set()/memcache->get() with multiple keys and load balancing [tests/020.phpt] XFAIL REASON: Skip TEST 22/71 [tests/021.phpt] PASS memcache->set()/memcache->get() with failover [tests/021.phpt] TEST 23/71 [tests/022.phpt] XFAIL memcache->getExtendedStats() [tests/022.phpt] XFAIL REASON: Skip TEST 24/71 [tests/022a.phpt] XFAIL memcache_get_extended_stats() [tests/022a.phpt] XFAIL REASON: Skip TEST 25/71 [tests/023.phpt] XFAIL memcache->delete() with load balancing [tests/023.phpt] XFAIL REASON: Skip TEST 26/71 [tests/024.phpt] PASS memcache->close(), memcache->get() [tests/024.phpt] TEST 27/71 [tests/024a.phpt] PASS memcache_close(), memcache_get() [tests/024a.phpt] TEST 28/71 [tests/025.phpt] XFAIL memcache->increment() with load balancing [tests/025.phpt] XFAIL REASON: Skip TEST 29/71 [tests/026.phpt] XFAIL memcache->delete() with load balancing [tests/026.phpt] XFAIL REASON: Skip TEST 30/71 [tests/027.phpt] PASS memcache->setCompressThreshold() [tests/027.phpt] TEST 31/71 [tests/027a.phpt] PASS memcache_set_compress_threshold() [tests/027a.phpt] TEST 32/71 [tests/028.phpt] PASS memcache->addServer() and memcache->close() [tests/028.phpt] TEST 33/71 [tests/029.phpt] WARN ini_set("memcache.allow_failover") [tests/029.phpt] (warn: XFAIL section but test passes) TEST 34/71 [tests/030.phpt] PASS ini_set("memcache.chunk_size") [tests/030.phpt] TEST 35/71 [tests/031.phpt] XFAIL memcache->addServer() adding server in failed mode [tests/031.phpt] XFAIL REASON: Skip TEST 36/71 [tests/032.phpt] XFAIL memcache->getServerStatus(), memcache->setServerParams() [tests/032.phpt] XFAIL REASON: Skip TEST 37/71 [tests/033.phpt] PASS memcache->addServer() with server failure callback [tests/033.phpt] TEST 38/71 [tests/034.phpt] PASS memcache->getStats() with arguments [tests/034.phpt] TEST 39/71 [tests/035.phpt] XFAIL memcache::connect() with unix domain socket [tests/035.phpt] XFAIL REASON: Skip TEST 40/71 [tests/036.phpt] WARN ini_set('session.save_handler') [tests/036.phpt] (warn: XFAIL section but test passes) TEST 41/71 [tests/037.phpt] PASS ini_set('memcache.hash_strategy') [tests/037.phpt] TEST 42/71 [tests/038.phpt] XFAIL memcache->get() over UDP [tests/038.phpt] XFAIL REASON: Skip TEST 43/71 [tests/040.phpt] XFAIL memcache->increment()/decrement() with multiple keys [tests/040.phpt] XFAIL REASON: Skip TEST 44/71 [tests/043.phpt] XFAIL ini_set('memcache.redundancy') [tests/043.phpt] XFAIL REASON: Skip TEST 45/71 [tests/044.phpt] XFAIL ini_set('memcache.session_redundancy') [tests/044.phpt] XFAIL REASON: Skip TEST 46/71 [tests/045.phpt] PASS Nested get's in __wakeup() [tests/045.phpt] TEST 47/71 [tests/046.phpt] XFAIL hash strategies and functions [tests/046.phpt] XFAIL REASON: Skip TEST 48/71 [tests/047.phpt] PASS memcache->get() with flags [tests/047.phpt] TEST 49/71 [tests/047a.phpt] PASS memcache->get() with flags (PHP 5 only) [tests/047a.phpt] TEST 50/71 [tests/048.phpt] PASS memcache->get(), set() with CAS [tests/048.phpt] TEST 51/71 [tests/049.phpt] PASS memcache->append(), memcache->prepend() [tests/049.phpt] TEST 52/71 [tests/050.phpt] PASS failure callback throws exception [tests/050.phpt] TEST 53/71 [tests/051.phpt] PASS memcache->set() with duplicate keys [tests/051.phpt] TEST 54/71 [tests/052.phpt] PASS memcache->connect() and memcache->close() in loop [tests/052.phpt] TEST 55/71 [tests/053.phpt] XFAIL ini_set('session.save_handler') with unix domain socket [tests/053.phpt] XFAIL REASON: Skip TEST 56/71 [tests/054.phpt] PASS memcache->set() with value larger than MTU [tests/054.phpt] TEST 57/71 [tests/055.phpt] PASS memcache->set()/get() datatype preservation [tests/055.phpt] TEST 58/71 [tests/056.phpt] XFAIL memcache->addServer() with microsecond timeout [tests/056.phpt] XFAIL REASON: Skip TEST 59/71 [tests/057.phpt] SKIP session locking [tests/057.phpt] reason: not compiled with pcntl_fork() support TEST 60/71 [tests/058.phpt] PASS memcache->findServer() [tests/058.phpt] TEST 61/71 [tests/100.phpt] PASS memcache->flush() [tests/100.phpt] TEST 62/71 [tests/100a.phpt] PASS memcache_flush() [tests/100a.phpt] TEST 63/71 [tests/100b.phpt] PASS memcache->flush() with time in future [tests/100b.phpt] TEST 64/71 [tests/bug73539.phpt] FAIL memcache multi host save path function [tests/bug73539.phpt] TEST 65/71 [tests/pecl11221.phpt] PASS PECL bug #11221 (Double free when returning cached object with __sleep) [tests/pecl11221.phpt] TEST 66/71 [tests/pecl16442.phpt] PASS PECL bug #16442 (memcache_set fail with integer value) [tests/pecl16442.phpt] TEST 67/71 [tests/pecl16536.phpt] PASS PECL bug #16536 (Weight of 0 causes SegFault on memcache_add_server) [tests/pecl16536.phpt] TEST 68/71 [tests/pecl17518.phpt] PASS PECL bug #17518 (Strange behavior in increment on non integer and after) [tests/pecl17518.phpt] TEST 69/71 [tests/pecl17566.phpt] PASS PECL bug #17566 (3.0.4 cache delete bug) [tests/pecl17566.phpt] TEST 70/71 [tests/pecl63142.phpt] PASS PECL bug #63142 (memcache 3.0.7 segfaults with object (un)serialization) [tests/pecl63142.phpt] TEST 71/71 [tests/pecl63272.phpt] PASS PECL bug #63272 (Explicitly reserve range of flags in php_memcache.h so application code can use) [tests/pecl63272.phpt] ===================================================================== TIME END 2017-12-05 15:45:31 ===================================================================== TEST RESULT SUMMARY --------------------------------------------------------------------- Exts skipped : 0 Exts tested : 10 --------------------------------------------------------------------- Number of tests : 71 70 Tests skipped : 1 ( 1.4%) -------- Tests warned : 2 ( 2.8%) ( 2.9%) Tests failed : 1 ( 1.4%) ( 1.4%) Expected fail : 17 ( 23.9%) ( 24.3%) Tests passed : 50 ( 70.4%) ( 71.4%) --------------------------------------------------------------------- Time taken : 5 seconds ===================================================================== ===================================================================== EXPECTED FAILED TEST SUMMARY --------------------------------------------------------------------- memcache->addServer() [tests/019.phpt] XFAIL REASON: Skip memcache->set()/memcache->get() with multiple keys and load balancing [tests/020.phpt] XFAIL REASON: Skip memcache->getExtendedStats() [tests/022.phpt] XFAIL REASON: Skip memcache_get_extended_stats() [tests/022a.phpt] XFAIL REASON: Skip memcache->delete() with load balancing [tests/023.phpt] XFAIL REASON: Skip memcache->increment() with load balancing [tests/025.phpt] XFAIL REASON: Skip memcache->delete() with load balancing [tests/026.phpt] XFAIL REASON: Skip memcache->addServer() adding server in failed mode [tests/031.phpt] XFAIL REASON: Skip memcache->getServerStatus(), memcache->setServerParams() [tests/032.phpt] XFAIL REASON: Skip memcache::connect() with unix domain socket [tests/035.phpt] XFAIL REASON: Skip memcache->get() over UDP [tests/038.phpt] XFAIL REASON: Skip memcache->increment()/decrement() with multiple keys [tests/040.phpt] XFAIL REASON: Skip ini_set('memcache.redundancy') [tests/043.phpt] XFAIL REASON: Skip ini_set('memcache.session_redundancy') [tests/044.phpt] XFAIL REASON: Skip hash strategies and functions [tests/046.phpt] XFAIL REASON: Skip ini_set('session.save_handler') with unix domain socket [tests/053.phpt] XFAIL REASON: Skip memcache->addServer() with microsecond timeout [tests/056.phpt] XFAIL REASON: Skip ===================================================================== ===================================================================== FAILED TEST SUMMARY --------------------------------------------------------------------- memcache multi host save path function [tests/bug73539.phpt] ===================================================================== ===================================================================== WARNED TEST SUMMARY --------------------------------------------------------------------- ini_set("memcache.allow_failover") [tests/029.phpt] (warn: XFAIL section but test passes) ini_set('session.save_handler') [tests/036.phpt] (warn: XFAIL section but test passes) ===================================================================== make: *** [Makefile:147: test] Error 1 + cat memcached.pid + kill 4085 error: Bad exit status from /tmp/B.tb0Ohn/BUILD/tmp/rpm-tmp.35917 (%build) RPM build errors: Bad exit status from /tmp/B.tb0Ohn/BUILD/tmp/rpm-tmp.35917 (%build) ended at: Tue Dec 5 16:45:31 2017, done in 0:00:10.168424 error: No files produced. + chmod -R u+rwX /tmp/B.tb0Ohn/BUILD + rm -rf /tmp/B.tb0Ohn/tmp /tmp/B.tb0Ohn/BUILD + rm -rf /tmp/B.tb0Ohn Begin-PLD-Builder-Info Build-Time: user:15.90s sys:2.62s real:32.89s (faults io:0 non-io:911355) End-PLD-Builder-Info
[Back to list of logs] [View rpm -qa of builder]