FailedOk

th/SRPMS[OK]
th/x32[OK]
th/i686[OK]
th/x86_64[OK]

ac/SRPMS[OK]
ac/i386[OK]
ac/i586[OK]
ac/i686[OK]
ac/alpha[OK]
ac/amd64[OK]
ac/athlon[OK]
ac/ppc[OK]
ac/sparc[OK]
ac/sparc64[OK]

Advanced Search
main()
Powered by PLD Linux
(c) 2002-2018 PLD Team
$Revision: 1.37 $
Powered by achelon.
Your IP: 54.162.133.222

php-pecl-propro 951678d4-c8eb-4cae-8d04-cecdc662f94f

Status:Failed
Source URL:ftp://buildlogs.pld-linux.org/th/x32/FAIL/php-pecl-propro,951678d4-c8eb-4cae-8d04-cecdc662f94f.bz2
text/plain URL:View!
full text:View!
rpm -qa of builder:View!
Date:2018/10/11 18:49:42
Runtime:0:00:04.681156

Toc:

  • error 1
  • rpm: error: Failed build dependencies:
  • error 2
  • rpm: error: Failed build dependencies:
  • prep
  • Executing(%prep): /bin/sh -e /tmp/B.B4jmW6/BUILD/tmp/rpm-tmp.58346
  • build
  • Executing(%build): /bin/sh -e /tmp/B.B4jmW6/BUILD/tmp/rpm-tmp.58346
  • error 3
  • /tmp/B.B4jmW6/BUILD/php55-pecl-propro-2.1.0/src/php_propro_api.h:27:2: error: unknown type name 'zend_string'
  • error 4
  • /tmp/B.B4jmW6/BUILD/php55-pecl-propro-2.1.0/src/php_propro_api.h:89:3: error: unknown type name 'zend_string'; did you mean 'zend_stream'?
  • error 5
  • /tmp/B.B4jmW6/BUILD/php55-pecl-propro-2.1.0/src/php_propro_api.c:162:64: error: unknown type name 'zend_string'; did you mean 'zend_stream'?
  • error 6
  • /tmp/B.B4jmW6/BUILD/php55-pecl-propro-2.1.0/src/php_propro_api.c:232:7: error: 'zend_object' {aka 'struct _zend_object'} has no member named 'handlers'
  • error 7
  • ./php_propro.h:33:54: error: 'zend_object' {aka 'struct _zend_object'} has no member named 'handlers'
  • error 8
  • ./php_propro.h:33:54: error: invalid type argument of '->' (have 'int')
  • error 9
  • /usr/include/php/Zend/zend_API.h:608:18: error: lvalue required as unary '&' operand
  • error 10
  • /usr/include/php/Zend/zend_operators.h:487:35: error: invalid type argument of unary '*' (have 'zval' {aka 'struct _zval_struct'})
  • error 11
  • /usr/include/php/Zend/zend.h:783:20: error: incompatible type for argument 1 of 'zval_isref_p'
  • error 12
  • /usr/include/php/Zend/zend.h:340:42: error: incompatible type for argument 1 of 'zval_refcount_p'
  • error 13
  • /usr/include/php/Zend/zend.h:343:38: error: incompatible type for argument 1 of 'zval_delref_p'
  • error 14
  • /usr/include/php/Zend/zend.h:759:19: error: invalid type argument of '->' (have 'zval' {aka 'struct _zval_struct'})
  • error 15
  • /usr/include/php/Zend/zend_operators.h:486:33: error: invalid type argument of unary '*' (have 'zval' {aka 'struct _zval_struct'})
  • error 16
  • /usr/include/php/Zend/zend.h:777:12: error: incompatible types when assigning to type 'zval' {aka 'struct _zval_struct'} from type 'zval *' {aka 'struct _zval_struct *'}
  • error 17
  • /usr/include/php/Zend/zend_operators.h:420:28: error: incompatible type for argument 1 of 'convert_to_null'
  • error 18
  • /usr/include/php/Zend/zend_operators.h:420:28: error: incompatible type for argument 1 of 'convert_to_long'
  • error 19
  • /usr/include/php/Zend/zend_operators.h:420:28: error: incompatible type for argument 1 of 'convert_to_double'
  • error 20
  • /usr/include/php/Zend/zend_operators.h:420:28: error: incompatible type for argument 1 of 'convert_to_boolean'
  • error 21
  • /usr/include/php/Zend/zend_operators.h:420:28: error: incompatible type for argument 1 of 'convert_to_array'
  • error 22
  • /usr/include/php/Zend/zend_operators.h:420:28: error: incompatible type for argument 1 of 'convert_to_object'
  • error 23
  • /usr/include/php/Zend/zend_operators.h:342:39: error: invalid type argument of '->' (have 'zval' {aka 'struct _zval_struct'})
  • error 24
  • /usr/include/php/Zend/zend_operators.h:420:28: error: incompatible type for argument 1 of '_convert_to_string'
  • error 25
  • /usr/include/php/Zend/zend_API.h:608:18: error: lvalue required as unary '&' operand
  • error 26
  • /tmp/B.B4jmW6/BUILD/php55-pecl-propro-2.1.0/src/php_propro_api.c:360:58: error: unknown type name 'zend_string'; did you mean 'zend_stream'?
  • error 27
  • /tmp/B.B4jmW6/BUILD/php55-pecl-propro-2.1.0/src/php_propro_api.c:402:7: error: 'IS_UNDEF' undeclared (first use in this function); did you mean 'IS_UNUSED'?
  • error 28
  • /usr/include/php/Zend/zend.h:340:42: error: incompatible type for argument 1 of 'zval_refcount_p'
  • error 29
  • /usr/include/php/Zend/zend.h:343:38: error: incompatible type for argument 1 of 'zval_delref_p'
  • error 30
  • /usr/include/php/Zend/zend.h:759:19: error: invalid type argument of '->' (have 'zval' {aka 'struct _zval_struct'})
  • error 31
  • /usr/include/php/Zend/zend_operators.h:486:33: error: invalid type argument of unary '*' (have 'zval' {aka 'struct _zval_struct'})
  • error 32
  • /usr/include/php/Zend/zend.h:777:12: error: incompatible types when assigning to type 'zval' {aka 'struct _zval_struct'} from type 'zval *' {aka 'struct _zval_struct *'}
  • error 33
  • /tmp/B.B4jmW6/BUILD/php55-pecl-propro-2.1.0/src/php_propro_api.c:416:58: error: unknown type name 'zend_string'; did you mean 'zend_stream'?
  • error 34
  • /tmp/B.B4jmW6/BUILD/php55-pecl-propro-2.1.0/src/php_propro_api.c:430:68: error: macro "zend_hash_next_index_insert" requires 4 arguments, but only 2 given
  • error 35
  • /tmp/B.B4jmW6/BUILD/php55-pecl-propro-2.1.0/src/php_propro_api.c:493:2: error: unknown type name 'zend_string'; did you mean 'zend_stream'?
  • error 36
  • /usr/include/php/Zend/zend.h:759:19: error: invalid type argument of '->' (have 'int')
  • error 37
  • /usr/include/php/Zend/zend_operators.h:486:33: error: invalid type argument of unary '*' (have 'int')
  • error 38
  • /usr/include/php/Zend/zend_operators.h:486:33: error: invalid type argument of unary '*' (have 'int')
  • error 39
  • /usr/include/php/Zend/zend_API.h:608:18: error: lvalue required as unary '&' operand
  • error 40
  • /tmp/B.B4jmW6/BUILD/php55-pecl-propro-2.1.0/src/php_propro_api.c:556:3: error: unknown type name 'zend_string'; did you mean 'zend_stream'?
  • error 41
  • /tmp/B.B4jmW6/BUILD/php55-pecl-propro-2.1.0/src/php_propro_api.c:560:19: error: too few arguments to function 'zend_symtable_find'
  • error 42
  • /tmp/B.B4jmW6/BUILD/php55-pecl-propro-2.1.0/src/php_propro_api.c:582:2: error: unknown type name 'zend_string'; did you mean 'zend_stream'?
  • error 43
  • /tmp/B.B4jmW6/BUILD/php55-pecl-propro-2.1.0/src/php_propro_api.c:617:3: error: unknown type name 'zend_string'; did you mean 'zend_stream'?
  • error 44
  • /tmp/B.B4jmW6/BUILD/php55-pecl-propro-2.1.0/src/php_propro_api.c:620:3: error: too few arguments to function 'zend_symtable_del'
  • error 45
  • /tmp/B.B4jmW6/BUILD/php55-pecl-propro-2.1.0/src/php_propro_api.c:638:2: error: unknown type name 'zend_string'; did you mean 'zend_stream'?
  • error 46
  • /tmp/B.B4jmW6/BUILD/php55-pecl-propro-2.1.0/src/php_propro_api.c:678:37: error: 'zend_object_handlers' {aka 'struct _zend_object_handlers'} has no member named 'offset'; did you mean 'set'?
  • error 47
  • /tmp/B.B4jmW6/BUILD/php55-pecl-propro-2.1.0/src/php_propro_api.c:679:37: error: 'zend_object_handlers' {aka 'struct _zend_object_handlers'} has no member named 'free_obj'; did you mean 'clone_obj'?
  • error 48
  • error: Bad exit status from /tmp/B.B4jmW6/BUILD/tmp/rpm-tmp.58346 (%build)
  • error 49
  • RPM build errors:
  • error 50
  • error: No files produced.

Content:

checking if we should skip the build
started at: Thu Oct 11 18:49:18 2018
killing old processes on a builder
sending signal 9 to pid -1
Killed
cleaning up /tmp
fetching https://srcbuilder.pld-linux.org/th//srpms/951678d4-c8eb-4cae-8d04-cecdc662f94f/php55-pecl-propro-2.1.0-1.src.rpm
fetched 24969 bytes, 62.5 K/s
installing srpm: php55-pecl-propro-2.1.0-1.src.rpm
+ install -d /tmp/B.B4jmW6/BUILD /tmp/B.B4jmW6/RPMS
+ LC_ALL=en_US.UTF-8
+ rpm -qp --changelog php55-pecl-propro-2.1.0-1.src.rpm
* Thu Oct 11 2018 PLD Linux Team <feedback@pld-linux.org>
- For complete changelog see: http://git.pld-linux.org/?p=packages/php-pecl-propro.git;a=log;h=auto/th/php-pecl-propro-2.1.0-1
* Mon Oct 08 2018 Adam Gołębiowski <adamg@pld-linux.org> 4dd19ff
- updated to 2.1.0 + rpm -Uhv --nodeps --define '_topdir /tmp/B.B4jmW6' --define '_specdir %{_topdir}' --define '_sourcedir %{_specdir}' --define '_rpmdir %{_topdir}/RPMS' --define '_builddir %{_topdir}/BUILD' --define 'php_suffix 55' php55-pecl-propro-2.1.0-1.src.rpm Preparing... ################################################## php55-pecl-propro ################################################## + rm -f php55-pecl-propro-2.1.0-1.src.rpm + install -m 700 -d /tmp/B.B4jmW6/BUILD/tmp + TMPDIR=/tmp/B.B4jmW6/BUILD/tmp + exec nice -n 0 rpmbuild -bp --short-circuit --nodeps --define '_topdir /tmp/B.B4jmW6' --define '_specdir %{_topdir}' --define '_sourcedir %{_specdir}' --define '_rpmdir %{_topdir}/RPMS' --define '_builddir %{_topdir}/BUILD' --target x32-pld-linux --define 'php_suffix 55' --define 'prep exit 0' /tmp/B.B4jmW6/php-pecl-propro.spec Building target platforms: x32-pld-linux checking BuildConflict-ing packages no BuildConflicts found checking BR rpm: error: Failed build dependencies: rpm: php55-devel >= 3:5.3.0 is needed by php55-pecl-propro-2.1.0-1.src rpm: Building target platforms: x32-pld-linux updating poldek cache... ready is up to date Retrieving th::packages.ndir.md... th is up to date Retrieving th::packages.ndir.md... th is up to date Retrieving th-ready::packages.ndir.md... th-ready is up to date Retrieving th-ready::packages.ndir.md... th-ready is up to date Retrieving th-test::packages.ndir.md... th-test is up to date Retrieving th-test::packages.ndir.md... th-test is up to date checking conflicting packages in BRed packages poldek: Loading [pndir]ready... poldek: Loading [pndir]th-test... poldek: Loading [pndir]th-test... poldek: Loading [pndir]th-ready... poldek: Loading [pndir]th-ready... poldek: Loading [pndir]th... poldek: Loading [pndir]th... poldek: 28753 packages read poldek: Removed 5124 duplicate packages from available set poldek: Processing dependencies... poldek: php55-devel-5.5.38-15.x32 marks php55-common-5.5.38-15.x32 (cap /usr/libx32/php55) poldek: There are 2 packages to install (1 marked by dependencies): poldek: I php55-devel-5.5.38-15.x32 poldek: D php55-common-5.5.38-15.x32 poldek: This operation will use 6.7MB of disk space. poldek: Need to get 1.6MB of archives (1.6MB to download). poldek: poldek: Retrieving [1/2] th-test::php55-common-5.5.38-15.x32.rpm... poldek: ..............................done poldek: Retrieving [2/2] th-test::php55-devel-5.5.38-15.x32.rpm... poldek: ..............................done poldek: Executing pm-command.sh --upgrade -vh --test --root / --define _check_dirname_deps 1... poldek: Preparing... ################################################## no conflicts found checking BR rpm: error: Failed build dependencies: rpm: php55-devel >= 3:5.3.0 is needed by php55-pecl-propro-2.1.0-1.src rpm: Building target platforms: x32-pld-linux installing BR: php55\-devel + poldek --noask --caplookup -Q -v '--ignore=hhvm-*' '--ignore=php4-*' '--ignore=php52-*' '--ignore=php53-*' '--ignore=php54-*' '--ignore=php56-*' '--ignore=php70-*' '--ignore=php71-*' '--ignore=php72-*' '--ignore=php73-*' --upgrade php55-devel Loading [pndir]ready... Loading [pndir]th-test... Loading [pndir]th-test... Loading [pndir]th-ready... Loading [pndir]th-ready... Loading [pndir]th... Loading [pndir]th... 28753 packages read Removed 5124 duplicate packages from available set Processing dependencies... php55-devel-5.5.38-15.x32 marks php55-common-5.5.38-15.x32 (cap /usr/libx32/php55) There are 2 packages to install (1 marked by dependencies): I php55-devel-5.5.38-15.x32 D php55-common-5.5.38-15.x32 This operation will use 6.7MB of disk space. Need to get 1.6MB of archives. Executing pm-command.sh --upgrade -vh --root / --define _check_dirname_deps 1... Preparing... ################################################## php55-common ################################################## php55-devel ################################################## building RPM using: set -ex; : build-id: 951678d4-c8eb-4cae-8d04-cecdc662f94f; TMPDIR=/tmp/B.B4jmW6/BUILD/tmp exec nice -n 0 rpmbuild -bb --define '_smp_mflags -j9' --define '_make_opts -Otarget' --define '_pld_builder 1' --define '_topdir /tmp/B.B4jmW6' --define '_specdir %{_topdir}' --define '_sourcedir %{_specdir}' --define '_rpmdir %{_topdir}/RPMS' --define '_builddir %{_topdir}/BUILD' --target x32-pld-linux --define 'php_suffix 55' /tmp/B.B4jmW6/php-pecl-propro.spec + : build-id: 951678d4-c8eb-4cae-8d04-cecdc662f94f + TMPDIR=/tmp/B.B4jmW6/BUILD/tmp + exec nice -n 0 rpmbuild -bb --define '_smp_mflags -j9' --define '_make_opts -Otarget' --define '_pld_builder 1' --define '_topdir /tmp/B.B4jmW6' --define '_specdir %{_topdir}' --define '_sourcedir %{_specdir}' --define '_rpmdir %{_topdir}/RPMS' --define '_builddir %{_topdir}/BUILD' --target x32-pld-linux --define 'php_suffix 55' /tmp/B.B4jmW6/php-pecl-propro.spec Building target platforms: x32-pld-linux Executing(%prep): /bin/sh -e /tmp/B.B4jmW6/BUILD/tmp/rpm-tmp.58346 + umask 022 + cd /tmp/B.B4jmW6/BUILD + cd /tmp/B.B4jmW6/BUILD + rm -rf php55-pecl-propro-2.1.0 + /bin/mkdir -p php55-pecl-propro-2.1.0 + cd php55-pecl-propro-2.1.0 + /usr/bin/gzip -dc /tmp/B.B4jmW6/propro-2.1.0.tgz + /bin/tar -xf - + STATUS=0 + '[' 0 -ne 0 ']' + /bin/id -u + '[' 1000 '=' 0 ']' + /bin/id -u + '[' 1000 '=' 0 ']' + /bin/chmod -Rf a+rX,u+w,g-w,o-w . + mv propro-2.1.0/AUTHORS propro-2.1.0/BUGS propro-2.1.0/CONTRIBUTING.md propro-2.1.0/CREDITS propro-2.1.0/Doxyfile propro-2.1.0/LICENSE propro-2.1.0/Makefile.frag propro-2.1.0/README.md propro-2.1.0/THANKS propro-2.1.0/TODO propro-2.1.0/config.m4 propro-2.1.0/config.w32 propro-2.1.0/config0.m4 propro-2.1.0/php_propro.h propro-2.1.0/scripts propro-2.1.0/src propro-2.1.0/tests . + exit 0 Executing(%build): /bin/sh -e /tmp/B.B4jmW6/BUILD/tmp/rpm-tmp.58346 HOME=/home/users/builder PATH=/home/users/builder/GNUstep/Tools:/usr/local/bin:/usr/bin:/bin TMPDIR=/tmp/B.B4jmW6/BUILD/tmp + umask 022 + cd /tmp/B.B4jmW6/BUILD + cd php55-pecl-propro-2.1.0 + phpize Configuring for: PHP Api Version: 20121113 Zend Module Api No: 20121212 Zend Extension Api No: 220121212 + libtoolize --copy --force --install libtoolize: putting auxiliary files in '.'. libtoolize: copying file './config.guess' libtoolize: copying file './config.sub' libtoolize: copying file './install-sh' libtoolize: copying file './ltmain.sh' libtoolize: Consider adding 'AC_CONFIG_MACRO_DIRS([m4])' to configure.in, libtoolize: and rerunning libtoolize and aclocal. libtoolize: Consider adding '-I m4' to ACLOCAL_AMFLAGS in Makefile.am. + ./configure 'LDFLAGS=-Wl,--as-needed -Wl,--no-copy-dt-needed-entries -Wl,-z,relro -Wl,-z,combreloc ' 'CFLAGS=-O2 -fwrapv -pipe -Wformat -Werror=format-security -gdwarf-4 -fno-debug-types-section -fvar-tracking-assignments -g2 -Wp,-D_FORTIFY_SOURCE=2 -fstack-protector-strong --param=ssp-buffer-size=4 -fPIC -mtune=generic -march=x86-64 -gdwarf-4 -fno-debug-types-section -fvar-tracking-assignments -g2 ' 'CXXFLAGS=-O2 -fwrapv -pipe -Wformat -Werror=format-security -gdwarf-4 -fno-debug-types-section -fvar-tracking-assignments -g2 -Wp,-D_FORTIFY_SOURCE=2 -fstack-protector-strong --param=ssp-buffer-size=4 -fPIC -mtune=generic -march=x86-64 -gdwarf-4 -fno-debug-types-section -fvar-tracking-assignments -g2 ' 'FFLAGS=-O2 -fwrapv -pipe -Wformat -Werror=format-security -gdwarf-4 -fno-debug-types-section -fvar-tracking-assignments -g2 -Wp,-D_FORTIFY_SOURCE=2 -fstack-protector-strong --param=ssp-buffer-size=4 -fPIC -mtune=generic -march=x86-64 -gdwarf-4 -fno-debug-types-section -fvar-tracking-assignments -g2 ' 'FCFLAGS=-O2 -fwrapv -pipe -Wformat -Werror=format-security -gdwarf-4 -fno-debug-types-section -fvar-tracking-assignments -g2 -Wp,-D_FORTIFY_SOURCE=2 -fstack-protector-strong --param=ssp-buffer-size=4 -fPIC -mtune=generic -march=x86-64 -gdwarf-4 -fno-debug-types-section -fvar-tracking-assignments -g2 ' 'CPPFLAGS=' 'CC=x86_64-pld-linux-gnux32-gcc' 'CXX=x86_64-pld-linux-gnux32-g++' '--host=x86_64-pld-linux-gnux32' '--build=x86_64-pld-linux-gnux32' '--prefix=/usr' '--exec-prefix=/usr' '--bindir=/usr/bin' '--sbindir=/usr/sbin' '--sysconfdir=/etc' '--datadir=/usr/share' '--includedir=/usr/include' '--libdir=/usr/libx32' '--libexecdir=/usr/libexec' '--localstatedir=/var' '--sharedstatedir=/var/lib' '--mandir=/usr/share/man' '--infodir=/usr/share/info' '--x-libraries=/usr/libx32' checking for grep that handles long lines and -e... /bin/grep checking for egrep... /bin/grep -E checking for a sed that does not truncate output... /bin/sed checking for x86_64-pld-linux-gnux32-cc... x86_64-pld-linux-gnux32-gcc checking whether the C compiler works... yes checking for C compiler default output file name... a.out checking for suffix of executables... checking whether we are cross compiling... no checking for suffix of object files... o checking whether we are using the GNU C compiler... yes checking whether x86_64-pld-linux-gnux32-gcc accepts -g... yes checking for x86_64-pld-linux-gnux32-gcc option to accept ISO C89... none needed checking how to run the C preprocessor... x86_64-pld-linux-gnux32-gcc -E checking for icc... no checking for suncc... no checking whether x86_64-pld-linux-gnux32-gcc and cc understand -c and -o together... yes checking for system library directory... lib checking if compiler supports -R... no checking if compiler supports -Wl,-rpath,... yes checking build system type... x86_64-pld-linux-gnux32 checking host system type... x86_64-pld-linux-gnux32 checking target system type... x86_64-pld-linux-gnux32 checking for PHP prefix... /usr checking for PHP includes... -I/usr/include/php -I/usr/include/php/main -I/usr/include/php/TSRM -I/usr/include/php/Zend -I/usr/include/php/ext -I/usr/include/php/ext/date/lib checking for PHP extension directory... /usr/libx32/php55 checking for PHP installed headers prefix... /usr/include/php checking if debug is enabled... no checking if zts is enabled... no checking for re2c... re2c checking for re2c version... 0.13.5 (ok) checking for gawk... gawk checking whether to enable property proxy support... yes, shared checking how to print strings... print -r checking for a sed that does not truncate output... (cached) /bin/sed checking for fgrep... /bin/grep -F checking for ld used by x86_64-pld-linux-gnux32-gcc... /usr/bin/ld checking if the linker (/usr/bin/ld) is GNU ld... yes checking for BSD- or MS-compatible name lister (nm)... /usr/bin/nm -B checking the name lister (/usr/bin/nm -B) interface... BSD nm checking whether ln -s works... yes checking the maximum length of command line arguments... 1572864 checking how to convert x86_64-pld-linux-gnux32 file names to x86_64-pld-linux-gnux32 format... func_convert_file_noop checking how to convert x86_64-pld-linux-gnux32 file names to toolchain format... func_convert_file_noop checking for /usr/bin/ld option to reload object files... -r checking for x86_64-pld-linux-gnux32-objdump... no checking for objdump... objdump checking how to recognize dependent libraries... pass_all checking for x86_64-pld-linux-gnux32-dlltool... no checking for dlltool... no checking how to associate runtime and link libraries... print -r -- checking for x86_64-pld-linux-gnux32-ar... no checking for ar... ar checking for archiver @FILE support... @ checking for x86_64-pld-linux-gnux32-strip... no checking for strip... strip checking for x86_64-pld-linux-gnux32-ranlib... no checking for ranlib... ranlib checking for mawk... (cached) gawk checking command to parse /usr/bin/nm -B output from x86_64-pld-linux-gnux32-gcc object... ok checking for sysroot... no checking for a working dd... /bin/dd checking how to truncate binary pipes... /bin/dd bs=4096 count=1 checking for x86_64-pld-linux-gnux32-mt... no checking for mt... no checking if : is a manifest tool... no checking for ANSI C header files... yes checking for sys/types.h... yes checking for sys/stat.h... yes checking for stdlib.h... yes checking for string.h... yes checking for memory.h... yes checking for strings.h... yes checking for inttypes.h... yes checking for stdint.h... yes checking for unistd.h... yes checking for dlfcn.h... yes checking for objdir... .libs checking if x86_64-pld-linux-gnux32-gcc supports -fno-rtti -fno-exceptions... no checking for x86_64-pld-linux-gnux32-gcc option to produce PIC... -fPIC -DPIC checking if x86_64-pld-linux-gnux32-gcc PIC flag -fPIC -DPIC works... yes checking if x86_64-pld-linux-gnux32-gcc static flag -static works... yes checking if x86_64-pld-linux-gnux32-gcc supports -c -o file.o... yes checking if x86_64-pld-linux-gnux32-gcc supports -c -o file.o... (cached) yes checking whether the x86_64-pld-linux-gnux32-gcc linker (/usr/bin/ld -m elf32_x86_64) supports shared libraries... yes checking whether -lc should be explicitly linked in... no checking dynamic linker characteristics... GNU/Linux ld.so checking how to hardcode library paths into programs... immediate checking whether stripping libraries is possible... yes checking if libtool supports shared libraries... yes checking whether to build shared libraries... yes checking whether to build static libraries... no configure: creating ./config.status config.status: creating config.h config.status: executing libtool commands + /usr/bin/make -Otarget -j9 /bin/sh /tmp/B.B4jmW6/BUILD/php55-pecl-propro-2.1.0/libtool --mode=compile x86_64-pld-linux-gnux32-gcc -I. -I/tmp/B.B4jmW6/BUILD/php55-pecl-propro-2.1.0 -DPHP_ATOM_INC -I/tmp/B.B4jmW6/BUILD/php55-pecl-propro-2.1.0/include -I/tmp/B.B4jmW6/BUILD/php55-pecl-propro-2.1.0/main -I/tmp/B.B4jmW6/BUILD/php55-pecl-propro-2.1.0 -I/usr/include/php -I/usr/include/php/main -I/usr/include/php/TSRM -I/usr/include/php/Zend -I/usr/include/php/ext -I/usr/include/php/ext/date/lib -I/tmp/B.B4jmW6/BUILD/php55-pecl-propro-2.1.0/src -DHAVE_CONFIG_H -O2 -fwrapv -pipe -Wformat -Werror=format-security -gdwarf-4 -fno-debug-types-section -fvar-tracking-assignments -g2 -Wp,-D_FORTIFY_SOURCE=2 -fstack-protector-strong --param=ssp-buffer-size=4 -fPIC -mtune=generic -march=x86-64 -gdwarf-4 -fno-debug-types-section -fvar-tracking-assignments -g2 -c /tmp/B.B4jmW6/BUILD/php55-pecl-propro-2.1.0/src/php_propro_api.c -o src/php_propro_api.lo libtool: compile: x86_64-pld-linux-gnux32-gcc -I. -I/tmp/B.B4jmW6/BUILD/php55-pecl-propro-2.1.0 -DPHP_ATOM_INC -I/tmp/B.B4jmW6/BUILD/php55-pecl-propro-2.1.0/include -I/tmp/B.B4jmW6/BUILD/php55-pecl-propro-2.1.0/main -I/tmp/B.B4jmW6/BUILD/php55-pecl-propro-2.1.0 -I/usr/include/php -I/usr/include/php/main -I/usr/include/php/TSRM -I/usr/include/php/Zend -I/usr/include/php/ext -I/usr/include/php/ext/date/lib -I/tmp/B.B4jmW6/BUILD/php55-pecl-propro-2.1.0/src -DHAVE_CONFIG_H -O2 -fwrapv -pipe -Wformat -Werror=format-security -gdwarf-4 -fno-debug-types-section -fvar-tracking-assignments -g2 -Wp,-D_FORTIFY_SOURCE=2 -fstack-protector-strong --param=ssp-buffer-size=4 -fPIC -mtune=generic -march=x86-64 -gdwarf-4 -fno-debug-types-section -fvar-tracking-assignments -g2 -c /tmp/B.B4jmW6/BUILD/php55-pecl-propro-2.1.0/src/php_propro_api.c -fPIC -DPIC -o src/.libs/php_propro_api.o In file included from /tmp/B.B4jmW6/BUILD/php55-pecl-propro-2.1.0/src/php_propro_api.c:21: /tmp/B.B4jmW6/BUILD/php55-pecl-propro-2.1.0/src/php_propro_api.h:27:2: error: unknown type name 'zend_string' zend_string *member; ^~~~~~~~~~~ /tmp/B.B4jmW6/BUILD/php55-pecl-propro-2.1.0/src/php_propro_api.h:89:3: error: unknown type name 'zend_string'; did you mean 'zend_stream'? zend_string *member); ^~~~~~~~~~~ zend_stream /tmp/B.B4jmW6/BUILD/php55-pecl-propro-2.1.0/src/php_propro_api.c:162:64: error: unknown type name 'zend_string'; did you mean 'zend_stream'? php_property_proxy_t *php_property_proxy_init(zval *container, zend_string *member) ^~~~~~~~~~~ zend_stream /tmp/B.B4jmW6/BUILD/php55-pecl-propro-2.1.0/src/php_propro_api.c: In function 'php_property_proxy_free': /tmp/B.B4jmW6/BUILD/php55-pecl-propro-2.1.0/src/php_propro_api.c:195:8: warning: implicit declaration of function 'Z_ISUNDEF'; did you mean 'Z_ISREF'? [-Wimplicit-function-declaration] if (!Z_ISUNDEF((*proxy)->container)) { ^~~~~~~~~ Z_ISREF In file included from /usr/include/php/Zend/zend.h:841, from /usr/include/php/main/php.h:34, from /tmp/B.B4jmW6/BUILD/php55-pecl-propro-2.1.0/src/php_propro_api.c:18: /tmp/B.B4jmW6/BUILD/php55-pecl-propro-2.1.0/src/php_propro_api.c:196:18: warning: passing argument 1 of '_zval_ptr_dtor' from incompatible pointer type [-Wincompatible-pointer-types] zval_ptr_dtor(&(*proxy)->container); /usr/include/php/Zend/zend_variables.h:57:49: note: in definition of macro 'zval_ptr_dtor' #define zval_ptr_dtor(zval_ptr) _zval_ptr_dtor((zval_ptr) ZEND_FILE_LINE_CC) ^~~~~~~~ /usr/include/php/Zend/zend_variables.h:51:37: note: expected 'zval **' {aka 'struct _zval_struct **'} but argument is of type 'zval *' {aka 'struct _zval_struct *'} ZEND_API void _zval_ptr_dtor(zval **zval_ptr ZEND_FILE_LINE_DC); ~~~~~~~^~~~~~~~ /tmp/B.B4jmW6/BUILD/php55-pecl-propro-2.1.0/src/php_propro_api.c:197:4: warning: implicit declaration of function 'ZVAL_UNDEF'; did you mean 'ZVAL_TRUE'? [-Wimplicit-function-declaration] ZVAL_UNDEF(&(*proxy)->container); ^~~~~~~~~~ ZVAL_TRUE /tmp/B.B4jmW6/BUILD/php55-pecl-propro-2.1.0/src/php_propro_api.c:199:3: warning: implicit declaration of function 'zend_string_release'; did you mean 'zend_stack_base'? [-Wimplicit-function-declaration] zend_string_release((*proxy)->member); ^~~~~~~~~~~~~~~~~~~ zend_stack_base /tmp/B.B4jmW6/BUILD/php55-pecl-propro-2.1.0/src/php_propro_api.c: In function 'php_property_proxy_object_new_ex': /tmp/B.B4jmW6/BUILD/php55-pecl-propro-2.1.0/src/php_propro_api.c:232:7: error: 'zend_object' {aka 'struct _zend_object'} has no member named 'handlers' o->zo.handlers = &php_property_proxy_object_handlers; ^ In file included from /tmp/B.B4jmW6/BUILD/php55-pecl-propro-2.1.0/src/php_propro_api.h:16, from /tmp/B.B4jmW6/BUILD/php55-pecl-propro-2.1.0/src/php_propro_api.c:21: /tmp/B.B4jmW6/BUILD/php55-pecl-propro-2.1.0/src/php_propro_api.c: In function 'destroy_obj': ./php_propro.h:33:54: error: 'zend_object' {aka 'struct _zend_object'} has no member named 'handlers' #define PHP_PROPRO_PTR(zo) (void*)(((char*)(zo))-(zo)->handlers->offset) ^~ /tmp/B.B4jmW6/BUILD/php55-pecl-propro-2.1.0/src/php_propro_api.c:244:35: note: in expansion of macro 'PHP_PROPRO_PTR' php_property_proxy_object_t *o = PHP_PROPRO_PTR(object); ^~~~~~~~~~~~~~ In file included from /usr/include/php/Zend/zend.h:841, from /usr/include/php/main/php.h:34, from /tmp/B.B4jmW6/BUILD/php55-pecl-propro-2.1.0/src/php_propro_api.c:18: /tmp/B.B4jmW6/BUILD/php55-pecl-propro-2.1.0/src/php_propro_api.c:250:17: warning: passing argument 1 of '_zval_ptr_dtor' from incompatible pointer type [-Wincompatible-pointer-types] zval_ptr_dtor(&o->parent); /usr/include/php/Zend/zend_variables.h:57:49: note: in definition of macro 'zval_ptr_dtor' #define zval_ptr_dtor(zval_ptr) _zval_ptr_dtor((zval_ptr) ZEND_FILE_LINE_CC) ^~~~~~~~ /usr/include/php/Zend/zend_variables.h:51:37: note: expected 'zval **' {aka 'struct _zval_struct **'} but argument is of type 'zval *' {aka 'struct _zval_struct *'} ZEND_API void _zval_ptr_dtor(zval **zval_ptr ZEND_FILE_LINE_DC); ~~~~~~~^~~~~~~~ In file included from /tmp/B.B4jmW6/BUILD/php55-pecl-propro-2.1.0/src/php_propro_api.h:16, from /tmp/B.B4jmW6/BUILD/php55-pecl-propro-2.1.0/src/php_propro_api.c:21: /tmp/B.B4jmW6/BUILD/php55-pecl-propro-2.1.0/src/php_propro_api.c: In function 'get_propro': /tmp/B.B4jmW6/BUILD/php55-pecl-propro-2.1.0/src/php_propro_api.c:259:24: warning: implicit declaration of function 'Z_OBJ_P'; did you mean 'Z_OBJ_HT'? [-Wimplicit-function-declaration] return PHP_PROPRO_PTR(Z_OBJ_P(object)); ^~~~~~~ ./php_propro.h:33:45: note: in definition of macro 'PHP_PROPRO_PTR' #define PHP_PROPRO_PTR(zo) (void*)(((char*)(zo))-(zo)->handlers->offset) ^~ ./php_propro.h:33:54: error: invalid type argument of '->' (have 'int') #define PHP_PROPRO_PTR(zo) (void*)(((char*)(zo))-(zo)->handlers->offset) ^~ /tmp/B.B4jmW6/BUILD/php55-pecl-propro-2.1.0/src/php_propro_api.c:259:9: note: in expansion of macro 'PHP_PROPRO_PTR' return PHP_PROPRO_PTR(Z_OBJ_P(object)); ^~~~~~~~~~~~~~ /tmp/B.B4jmW6/BUILD/php55-pecl-propro-2.1.0/src/php_propro_api.c: In function 'get_debug_info': /tmp/B.B4jmW6/BUILD/php55-pecl-propro-2.1.0/src/php_propro_api.c:285:3: warning: implicit declaration of function 'zend_hash_str_add_empty_element'; did you mean 'zend_hash_add_empty_element'? [-Wimplicit-function-declaration] zend_hash_str_add_empty_element(ht, "parent", sizeof("parent")-1); ^~~~~~~~~~~~~~~~~~~~~~~~~~~~~~~ zend_hash_add_empty_element /tmp/B.B4jmW6/BUILD/php55-pecl-propro-2.1.0/src/php_propro_api.c:286:3: warning: implicit declaration of function 'zend_hash_str_add'; did you mean 'zend_hash_add'? [-Wimplicit-function-declaration] zend_hash_str_add(ht, "container", sizeof("container")-1, &obj->proxy->container); ^~~~~~~~~~~~~~~~~ zend_hash_add /tmp/B.B4jmW6/BUILD/php55-pecl-propro-2.1.0/src/php_propro_api.c:292:10: warning: assignment to 'zval *' {aka 'struct _zval_struct *'} from 'int' makes pointer from integer without a cast [-Wint-conversion] zmember = zend_hash_str_add_empty_element(ht, "member", sizeof("member")-1); ^ /tmp/B.B4jmW6/BUILD/php55-pecl-propro-2.1.0/src/php_propro_api.c:293:2: warning: implicit declaration of function 'ZVAL_STR'; did you mean 'ZVAL_STRING'? [-Wimplicit-function-declaration] ZVAL_STR(zmember, obj->proxy->member); ^~~~~~~~ ZVAL_STRING In file included from /usr/include/php/Zend/zend.h:841, from /usr/include/php/main/php.h:34, from /tmp/B.B4jmW6/BUILD/php55-pecl-propro-2.1.0/src/php_propro_api.c:18: /tmp/B.B4jmW6/BUILD/php55-pecl-propro-2.1.0/src/php_propro_api.c: In function 'cast_obj': /usr/include/php/Zend/zend_API.h:608:18: error: lvalue required as unary '&' operand zval_ptr_dtor(&zv); \ ^ /usr/include/php/Zend/zend_variables.h:57:49: note: in definition of macro 'zval_ptr_dtor' #define zval_ptr_dtor(zval_ptr) _zval_ptr_dtor((zval_ptr) ZEND_FILE_LINE_CC) ^~~~~~~~ /usr/include/php/Zend/zend_API.h:625:38: note: in expansion of macro 'ZVAL_ZVAL' #define RETVAL_ZVAL(zv, copy, dtor) ZVAL_ZVAL(return_value, zv, copy, dtor) ^~~~~~~~~ /tmp/B.B4jmW6/BUILD/php55-pecl-propro-2.1.0/src/php_propro_api.c:304:2: note: in expansion of macro 'RETVAL_ZVAL' RETVAL_ZVAL(get_proxied_value(object, &tmp), 1, 0); ^~~~~~~~~~~ /tmp/B.B4jmW6/BUILD/php55-pecl-propro-2.1.0/src/php_propro_api.c:308:7: warning: implicit declaration of function 'Z_ISUNDEF_P'; did you mean 'Z_ISREF_P'? [-Wimplicit-function-declaration] if (!Z_ISUNDEF_P(return_value)) { ^~~~~~~~~~~ Z_ISREF_P /tmp/B.B4jmW6/BUILD/php55-pecl-propro-2.1.0/src/php_propro_api.c:309:3: warning: implicit declaration of function 'ZVAL_DEREF'; did you mean 'ZVAL_TRUE'? [-Wimplicit-function-declaration] ZVAL_DEREF(return_value); ^~~~~~~~~~ ZVAL_TRUE In file included from /usr/include/php/Zend/zend.h:840, from /usr/include/php/main/php.h:34, from /tmp/B.B4jmW6/BUILD/php55-pecl-propro-2.1.0/src/php_propro_api.c:18: /usr/include/php/Zend/zend_operators.h:487:35: error: invalid type argument of unary '*' (have 'zval' {aka 'struct _zval_struct'}) #define Z_TYPE_PP(zval_pp) Z_TYPE(**zval_pp) /usr/include/php/Zend/zend_operators.h:485:24: note: in definition of macro 'Z_TYPE' #define Z_TYPE(zval) (zval).type ^~~~ /usr/include/php/Zend/zend_operators.h:418:6: note: in expansion of macro 'Z_TYPE_PP' if (Z_TYPE_PP(ppzv) != str_type) { \ ^~~~~~~~~ /tmp/B.B4jmW6/BUILD/php55-pecl-propro-2.1.0/src/php_propro_api.c:310:3: note: in expansion of macro 'convert_to_explicit_type_ex' convert_to_explicit_type_ex(return_value, type); ^~~~~~~~~~~~~~~~~~~~~~~~~~~ In file included from /usr/include/php/main/php.h:34, from /tmp/B.B4jmW6/BUILD/php55-pecl-propro-2.1.0/src/php_propro_api.c:18: /usr/include/php/Zend/zend.h:783:20: error: incompatible type for argument 1 of 'zval_isref_p' if (!PZVAL_IS_REF(*ppzv)) { \ /usr/include/php/Zend/zend.h:353:38: note: in definition of macro 'Z_ISREF_P' #define Z_ISREF_P(pz) zval_isref_p(pz) ^~ /usr/include/php/Zend/zend.h:783:7: note: in expansion of macro 'PZVAL_IS_REF' if (!PZVAL_IS_REF(*ppzv)) { \ ^~~~~~~~~~~~ /usr/include/php/Zend/zend_operators.h:419:3: note: in expansion of macro 'SEPARATE_ZVAL_IF_NOT_REF' SEPARATE_ZVAL_IF_NOT_REF(ppzv); \ ^~~~~~~~~~~~~~~~~~~~~~~~ /tmp/B.B4jmW6/BUILD/php55-pecl-propro-2.1.0/src/php_propro_api.c:310:3: note: in expansion of macro 'convert_to_explicit_type_ex' convert_to_explicit_type_ex(return_value, type); ^~~~~~~~~~~~~~~~~~~~~~~~~~~ /usr/include/php/Zend/zend.h:412:56: note: expected 'zval *' {aka 'struct _zval_struct *'} but argument is of type 'zval' {aka 'struct _zval_struct'} static zend_always_inline zend_bool zval_isref_p(zval* pz) { ~~~~~~^~ /usr/include/php/Zend/zend.h:340:42: error: incompatible type for argument 1 of 'zval_refcount_p' #define Z_REFCOUNT_PP(ppz) Z_REFCOUNT_P(*(ppz)) ^~~~~~ /usr/include/php/Zend/zend.h:349:43: note: in definition of macro 'Z_REFCOUNT_P' #define Z_REFCOUNT_P(pz) zval_refcount_p(pz) ^~ /usr/include/php/Zend/zend.h:772:7: note: in expansion of macro 'Z_REFCOUNT_PP' if (Z_REFCOUNT_PP((ppzv)) > 1) { \ ^~~~~~~~~~~~~ /usr/include/php/Zend/zend.h:784:3: note: in expansion of macro 'SEPARATE_ZVAL' SEPARATE_ZVAL(ppzv); \ ^~~~~~~~~~~~~ /usr/include/php/Zend/zend_operators.h:419:3: note: in expansion of macro 'SEPARATE_ZVAL_IF_NOT_REF' SEPARATE_ZVAL_IF_NOT_REF(ppzv); \ ^~~~~~~~~~~~~~~~~~~~~~~~ /tmp/B.B4jmW6/BUILD/php55-pecl-propro-2.1.0/src/php_propro_api.c:310:3: note: in expansion of macro 'convert_to_explicit_type_ex' convert_to_explicit_type_ex(return_value, type); ^~~~~~~~~~~~~~~~~~~~~~~~~~~ /usr/include/php/Zend/zend.h:396:59: note: expected 'zval *' {aka 'struct _zval_struct *'} but argument is of type 'zval' {aka 'struct _zval_struct'} static zend_always_inline zend_uint zval_refcount_p(zval* pz) { ~~~~~~^~ /usr/include/php/Zend/zend.h:343:38: error: incompatible type for argument 1 of 'zval_delref_p' #define Z_DELREF_PP(ppz) Z_DELREF_P(*(ppz)) ^~~~~~ /usr/include/php/Zend/zend.h:352:40: note: in definition of macro 'Z_DELREF_P' #define Z_DELREF_P(pz) zval_delref_p(pz) ^~ /usr/include/php/Zend/zend.h:774:4: note: in expansion of macro 'Z_DELREF_PP' Z_DELREF_PP(ppzv); \ ^~~~~~~~~~~ /usr/include/php/Zend/zend.h:784:3: note: in expansion of macro 'SEPARATE_ZVAL' SEPARATE_ZVAL(ppzv); \ ^~~~~~~~~~~~~ /usr/include/php/Zend/zend_operators.h:419:3: note: in expansion of macro 'SEPARATE_ZVAL_IF_NOT_REF' SEPARATE_ZVAL_IF_NOT_REF(ppzv); \ ^~~~~~~~~~~~~~~~~~~~~~~~ /tmp/B.B4jmW6/BUILD/php55-pecl-propro-2.1.0/src/php_propro_api.c:310:3: note: in expansion of macro 'convert_to_explicit_type_ex' convert_to_explicit_type_ex(return_value, type); ^~~~~~~~~~~~~~~~~~~~~~~~~~~ /usr/include/php/Zend/zend.h:408:57: note: expected 'zval *' {aka 'struct _zval_struct *'} but argument is of type 'zval' {aka 'struct _zval_struct'} static zend_always_inline zend_uint zval_delref_p(zval* pz) { ~~~~~~^~ In file included from /usr/include/php/main/php.h:34, from /tmp/B.B4jmW6/BUILD/php55-pecl-propro-2.1.0/src/php_propro_api.c:18: /usr/include/php/Zend/zend.h:759:19: error: invalid type argument of '->' (have 'zval' {aka 'struct _zval_struct'}) (z)->value = (v)->value; \ ^~ /usr/include/php/Zend/zend.h:765:3: note: in expansion of macro 'ZVAL_COPY_VALUE' ZVAL_COPY_VALUE(z, v); \ ^~~~~~~~~~~~~~~ /usr/include/php/Zend/zend.h:776:4: note: in expansion of macro 'INIT_PZVAL_COPY' INIT_PZVAL_COPY(new_zv, *(ppzv)); \ ^~~~~~~~~~~~~~~ /usr/include/php/Zend/zend.h:784:3: note: in expansion of macro 'SEPARATE_ZVAL' SEPARATE_ZVAL(ppzv); \ ^~~~~~~~~~~~~ /usr/include/php/Zend/zend_operators.h:419:3: note: in expansion of macro 'SEPARATE_ZVAL_IF_NOT_REF' SEPARATE_ZVAL_IF_NOT_REF(ppzv); \ ^~~~~~~~~~~~~~~~~~~~~~~~ /tmp/B.B4jmW6/BUILD/php55-pecl-propro-2.1.0/src/php_propro_api.c:310:3: note: in expansion of macro 'convert_to_explicit_type_ex' convert_to_explicit_type_ex(return_value, type); ^~~~~~~~~~~~~~~~~~~~~~~~~~~ In file included from /usr/include/php/Zend/zend.h:840, from /usr/include/php/main/php.h:34, from /tmp/B.B4jmW6/BUILD/php55-pecl-propro-2.1.0/src/php_propro_api.c:18: /usr/include/php/Zend/zend_operators.h:486:33: error: invalid type argument of unary '*' (have 'zval' {aka 'struct _zval_struct'}) #define Z_TYPE_P(zval_p) Z_TYPE(*zval_p) /usr/include/php/Zend/zend_operators.h:485:24: note: in definition of macro 'Z_TYPE' #define Z_TYPE(zval) (zval).type ^~~~ /usr/include/php/Zend/zend.h:760:17: note: in expansion of macro 'Z_TYPE_P' Z_TYPE_P(z) = Z_TYPE_P(v); \ ^~~~~~~~ /usr/include/php/Zend/zend.h:765:3: note: in expansion of macro 'ZVAL_COPY_VALUE' ZVAL_COPY_VALUE(z, v); \ ^~~~~~~~~~~~~~~ /usr/include/php/Zend/zend.h:776:4: note: in expansion of macro 'INIT_PZVAL_COPY' INIT_PZVAL_COPY(new_zv, *(ppzv)); \ ^~~~~~~~~~~~~~~ /usr/include/php/Zend/zend.h:784:3: note: in expansion of macro 'SEPARATE_ZVAL' SEPARATE_ZVAL(ppzv); \ ^~~~~~~~~~~~~ /usr/include/php/Zend/zend_operators.h:419:3: note: in expansion of macro 'SEPARATE_ZVAL_IF_NOT_REF' SEPARATE_ZVAL_IF_NOT_REF(ppzv); \ ^~~~~~~~~~~~~~~~~~~~~~~~ /tmp/B.B4jmW6/BUILD/php55-pecl-propro-2.1.0/src/php_propro_api.c:310:3: note: in expansion of macro 'convert_to_explicit_type_ex' convert_to_explicit_type_ex(return_value, type); ^~~~~~~~~~~~~~~~~~~~~~~~~~~ In file included from /usr/include/php/main/php.h:34, from /tmp/B.B4jmW6/BUILD/php55-pecl-propro-2.1.0/src/php_propro_api.c:18: /usr/include/php/Zend/zend.h:777:12: error: incompatible types when assigning to type 'zval' {aka 'struct _zval_struct'} from type 'zval *' {aka 'struct _zval_struct *'} *(ppzv) = new_zv; \ ^ /usr/include/php/Zend/zend.h:784:3: note: in expansion of macro 'SEPARATE_ZVAL' SEPARATE_ZVAL(ppzv); \ ^~~~~~~~~~~~~ /usr/include/php/Zend/zend_operators.h:419:3: note: in expansion of macro 'SEPARATE_ZVAL_IF_NOT_REF' SEPARATE_ZVAL_IF_NOT_REF(ppzv); \ ^~~~~~~~~~~~~~~~~~~~~~~~ /tmp/B.B4jmW6/BUILD/php55-pecl-propro-2.1.0/src/php_propro_api.c:310:3: note: in expansion of macro 'convert_to_explicit_type_ex' convert_to_explicit_type_ex(return_value, type); ^~~~~~~~~~~~~~~~~~~~~~~~~~~ In file included from /usr/include/php/Zend/zend.h:840, from /usr/include/php/main/php.h:34, from /tmp/B.B4jmW6/BUILD/php55-pecl-propro-2.1.0/src/php_propro_api.c:18: /usr/include/php/Zend/zend_operators.h:420:28: error: incompatible type for argument 1 of 'convert_to_null' convert_to_explicit_type(*ppzv, str_type); \ /usr/include/php/Zend/zend_operators.h:391:21: note: in definition of macro 'convert_to_explicit_type' convert_to_null(pzv); \ ^~~ /tmp/B.B4jmW6/BUILD/php55-pecl-propro-2.1.0/src/php_propro_api.c:310:3: note: in expansion of macro 'convert_to_explicit_type_ex' convert_to_explicit_type_ex(return_value, type); ^~~~~~~~~~~~~~~~~~~~~~~~~~~ /usr/include/php/Zend/zend_operators.h:332:37: note: expected 'zval *' {aka 'struct _zval_struct *'} but argument is of type 'zval' {aka 'struct _zval_struct'} ZEND_API void convert_to_null(zval *op); ~~~~~~^~ /usr/include/php/Zend/zend_operators.h:420:28: error: incompatible type for argument 1 of 'convert_to_long' convert_to_explicit_type(*ppzv, str_type); \ /usr/include/php/Zend/zend_operators.h:394:21: note: in definition of macro 'convert_to_explicit_type' convert_to_long(pzv); \ ^~~ /tmp/B.B4jmW6/BUILD/php55-pecl-propro-2.1.0/src/php_propro_api.c:310:3: note: in expansion of macro 'convert_to_explicit_type_ex' convert_to_explicit_type_ex(return_value, type); ^~~~~~~~~~~~~~~~~~~~~~~~~~~ /usr/include/php/Zend/zend_operators.h:329:37: note: expected 'zval *' {aka 'struct _zval_struct *'} but argument is of type 'zval' {aka 'struct _zval_struct'} ZEND_API void convert_to_long(zval *op); ~~~~~~^~ /usr/include/php/Zend/zend_operators.h:420:28: error: incompatible type for argument 1 of 'convert_to_double' convert_to_explicit_type(*ppzv, str_type); \ /usr/include/php/Zend/zend_operators.h:397:23: note: in definition of macro 'convert_to_explicit_type' convert_to_double(pzv); \ ^~~ /tmp/B.B4jmW6/BUILD/php55-pecl-propro-2.1.0/src/php_propro_api.c:310:3: note: in expansion of macro 'convert_to_explicit_type_ex' convert_to_explicit_type_ex(return_value, type); ^~~~~~~~~~~~~~~~~~~~~~~~~~~ /usr/include/php/Zend/zend_operators.h:330:39: note: expected 'zval *' {aka 'struct _zval_struct *'} but argument is of type 'zval' {aka 'struct _zval_struct'} ZEND_API void convert_to_double(zval *op); ~~~~~~^~ /usr/include/php/Zend/zend_operators.h:420:28: error: incompatible type for argument 1 of 'convert_to_boolean' convert_to_explicit_type(*ppzv, str_type); \ /usr/include/php/Zend/zend_operators.h:400:24: note: in definition of macro 'convert_to_explicit_type' convert_to_boolean(pzv); \ ^~~ /tmp/B.B4jmW6/BUILD/php55-pecl-propro-2.1.0/src/php_propro_api.c:310:3: note: in expansion of macro 'convert_to_explicit_type_ex' convert_to_explicit_type_ex(return_value, type); ^~~~~~~~~~~~~~~~~~~~~~~~~~~ /usr/include/php/Zend/zend_operators.h:333:40: note: expected 'zval *' {aka 'struct _zval_struct *'} but argument is of type 'zval' {aka 'struct _zval_struct'} ZEND_API void convert_to_boolean(zval *op); ~~~~~~^~ /usr/include/php/Zend/zend_operators.h:420:28: error: incompatible type for argument 1 of 'convert_to_array' convert_to_explicit_type(*ppzv, str_type); \ /usr/include/php/Zend/zend_operators.h:403:22: note: in definition of macro 'convert_to_explicit_type' convert_to_array(pzv); \ ^~~ /tmp/B.B4jmW6/BUILD/php55-pecl-propro-2.1.0/src/php_propro_api.c:310:3: note: in expansion of macro 'convert_to_explicit_type_ex' convert_to_explicit_type_ex(return_value, type); ^~~~~~~~~~~~~~~~~~~~~~~~~~~ /usr/include/php/Zend/zend_operators.h:334:38: note: expected 'zval *' {aka 'struct _zval_struct *'} but argument is of type 'zval' {aka 'struct _zval_struct'} ZEND_API void convert_to_array(zval *op); ~~~~~~^~ /usr/include/php/Zend/zend_operators.h:420:28: error: incompatible type for argument 1 of 'convert_to_object' convert_to_explicit_type(*ppzv, str_type); \ /usr/include/php/Zend/zend_operators.h:406:23: note: in definition of macro 'convert_to_explicit_type' convert_to_object(pzv); \ ^~~ /tmp/B.B4jmW6/BUILD/php55-pecl-propro-2.1.0/src/php_propro_api.c:310:3: note: in expansion of macro 'convert_to_explicit_type_ex' convert_to_explicit_type_ex(return_value, type); ^~~~~~~~~~~~~~~~~~~~~~~~~~~ /usr/include/php/Zend/zend_operators.h:335:39: note: expected 'zval *' {aka 'struct _zval_struct *'} but argument is of type 'zval' {aka 'struct _zval_struct'} ZEND_API void convert_to_object(zval *op); ~~~~~~^~ /usr/include/php/Zend/zend_operators.h:342:39: error: invalid type argument of '->' (have 'zval' {aka 'struct _zval_struct'}) #define convert_to_string(op) if ((op)->type != IS_STRING) { _convert_to_string((op) ZEND_FILE_LINE_CC); } ^~ /usr/include/php/Zend/zend_operators.h:409:5: note: in expansion of macro 'convert_to_string' convert_to_string(pzv); \ ^~~~~~~~~~~~~~~~~ /usr/include/php/Zend/zend_operators.h:420:3: note: in expansion of macro 'convert_to_explicit_type' convert_to_explicit_type(*ppzv, str_type); \ ^~~~~~~~~~~~~~~~~~~~~~~~ /tmp/B.B4jmW6/BUILD/php55-pecl-propro-2.1.0/src/php_propro_api.c:310:3: note: in expansion of macro 'convert_to_explicit_type_ex' convert_to_explicit_type_ex(return_value, type); ^~~~~~~~~~~~~~~~~~~~~~~~~~~ /usr/include/php/Zend/zend_operators.h:420:28: error: incompatible type for argument 1 of '_convert_to_string' convert_to_explicit_type(*ppzv, str_type); \ ^ /usr/include/php/Zend/zend_operators.h:342:82: note: in definition of macro 'convert_to_string' #define convert_to_string(op) if ((op)->type != IS_STRING) { _convert_to_string((op) ZEND_FILE_LINE_CC); } ^~ /usr/include/php/Zend/zend_operators.h:420:3: note: in expansion of macro 'convert_to_explicit_type' convert_to_explicit_type(*ppzv, str_type); \ ^~~~~~~~~~~~~~~~~~~~~~~~ /tmp/B.B4jmW6/BUILD/php55-pecl-propro-2.1.0/src/php_propro_api.c:310:3: note: in expansion of macro 'convert_to_explicit_type_ex' convert_to_explicit_type_ex(return_value, type); ^~~~~~~~~~~~~~~~~~~~~~~~~~~ /usr/include/php/Zend/zend_operators.h:328:40: note: expected 'zval *' {aka 'struct _zval_struct *'} but argument is of type 'zval' {aka 'struct _zval_struct'} ZEND_API void _convert_to_string(zval *op ZEND_FILE_LINE_DC); ~~~~~~^~ In file included from /usr/include/php/Zend/zend.h:841, from /usr/include/php/main/php.h:34, from /tmp/B.B4jmW6/BUILD/php55-pecl-propro-2.1.0/src/php_propro_api.c:18: /tmp/B.B4jmW6/BUILD/php55-pecl-propro-2.1.0/src/php_propro_api.c: In function 'get_obj': /usr/include/php/Zend/zend_API.h:608:18: error: lvalue required as unary '&' operand zval_ptr_dtor(&zv); \ ^ /usr/include/php/Zend/zend_variables.h:57:49: note: in definition of macro 'zval_ptr_dtor' #define zval_ptr_dtor(zval_ptr) _zval_ptr_dtor((zval_ptr) ZEND_FILE_LINE_CC) ^~~~~~~~ /usr/include/php/Zend/zend_API.h:625:38: note: in expansion of macro 'ZVAL_ZVAL' #define RETVAL_ZVAL(zv, copy, dtor) ZVAL_ZVAL(return_value, zv, copy, dtor) ^~~~~~~~~ /tmp/B.B4jmW6/BUILD/php55-pecl-propro-2.1.0/src/php_propro_api.c:322:2: note: in expansion of macro 'RETVAL_ZVAL' RETVAL_ZVAL(get_proxied_value(object, &tmp), 1, 0); ^~~~~~~~~~~ /tmp/B.B4jmW6/BUILD/php55-pecl-propro-2.1.0/src/php_propro_api.c: In function 'set_container': /tmp/B.B4jmW6/BUILD/php55-pecl-propro-2.1.0/src/php_propro_api.c:352:4: warning: implicit declaration of function 'ZVAL_COPY'; did you mean 'ZVAL_LONG'? [-Wimplicit-function-declaration] ZVAL_COPY(&obj->proxy->container, container); ^~~~~~~~~ ZVAL_LONG In file included from /usr/include/php/Zend/zend.h:841, from /usr/include/php/main/php.h:34, from /tmp/B.B4jmW6/BUILD/php55-pecl-propro-2.1.0/src/php_propro_api.c:18: /tmp/B.B4jmW6/BUILD/php55-pecl-propro-2.1.0/src/php_propro_api.c:353:18: warning: passing argument 1 of '_zval_ptr_dtor' from incompatible pointer type [-Wincompatible-pointer-types] zval_ptr_dtor(&tmp); /usr/include/php/Zend/zend_variables.h:57:49: note: in definition of macro 'zval_ptr_dtor' #define zval_ptr_dtor(zval_ptr) _zval_ptr_dtor((zval_ptr) ZEND_FILE_LINE_CC) ^~~~~~~~ /usr/include/php/Zend/zend_variables.h:51:37: note: expected 'zval **' {aka 'struct _zval_struct **'} but argument is of type 'zval *' {aka 'struct _zval_struct *'} ZEND_API void _zval_ptr_dtor(zval **zval_ptr ZEND_FILE_LINE_DC); ~~~~~~~^~~~~~~~ /tmp/B.B4jmW6/BUILD/php55-pecl-propro-2.1.0/src/php_propro_api.c: At top level: /tmp/B.B4jmW6/BUILD/php55-pecl-propro-2.1.0/src/php_propro_api.c:360:58: error: unknown type name 'zend_string'; did you mean 'zend_stream'? static inline zval *get_container_value(zval *container, zend_string *member, zval *return_value) ^~~~~~~~~~~ zend_stream In file included from /usr/include/php/Zend/zend.h:841, from /usr/include/php/main/php.h:34, from /tmp/B.B4jmW6/BUILD/php55-pecl-propro-2.1.0/src/php_propro_api.c:18: /tmp/B.B4jmW6/BUILD/php55-pecl-propro-2.1.0/src/php_propro_api.c: In function 'cleanup_container': /usr/include/php/Zend/zend_variables.h:57:48: warning: passing argument 1 of '_zval_ptr_dtor' from incompatible pointer type [-Wincompatible-pointer-types] #define zval_ptr_dtor(zval_ptr) _zval_ptr_dtor((zval_ptr) ZEND_FILE_LINE_CC) ^~~~~~~~~~ /tmp/B.B4jmW6/BUILD/php55-pecl-propro-2.1.0/src/php_propro_api.c:387:3: note: in expansion of macro 'zval_ptr_dtor' zval_ptr_dtor(container); ^~~~~~~~~~~~~ /usr/include/php/Zend/zend_variables.h:51:37: note: expected 'zval **' {aka 'struct _zval_struct **'} but argument is of type 'zval *' {aka 'struct _zval_struct *'} ZEND_API void _zval_ptr_dtor(zval **zval_ptr ZEND_FILE_LINE_DC); ~~~~~~~^~~~~~~~ /tmp/B.B4jmW6/BUILD/php55-pecl-propro-2.1.0/src/php_propro_api.c: In function 'separate_container': /tmp/B.B4jmW6/BUILD/php55-pecl-propro-2.1.0/src/php_propro_api.c:399:3: warning: implicit declaration of function 'ZVAL_ARR'; did you mean 'ZVAL_TRUE'? [-Wimplicit-function-declaration] ZVAL_ARR(container, zend_array_dup(Z_ARRVAL_P(container))); ^~~~~~~~ ZVAL_TRUE /tmp/B.B4jmW6/BUILD/php55-pecl-propro-2.1.0/src/php_propro_api.c:399:23: warning: implicit declaration of function 'zend_array_dup'; did you mean 'zend_strndup'? [-Wimplicit-function-declaration] ZVAL_ARR(container, zend_array_dup(Z_ARRVAL_P(container))); ^~~~~~~~~~~~~~ zend_strndup /tmp/B.B4jmW6/BUILD/php55-pecl-propro-2.1.0/src/php_propro_api.c:402:7: error: 'IS_UNDEF' undeclared (first use in this function); did you mean 'IS_UNUSED'? case IS_UNDEF: ^~~~~~~~ IS_UNUSED /tmp/B.B4jmW6/BUILD/php55-pecl-propro-2.1.0/src/php_propro_api.c:402:7: note: each undeclared identifier is reported only once for each function it appears in In file included from /usr/include/php/main/php.h:34, from /tmp/B.B4jmW6/BUILD/php55-pecl-propro-2.1.0/src/php_propro_api.c:18: /usr/include/php/Zend/zend.h:340:42: error: incompatible type for argument 1 of 'zval_refcount_p' #define Z_REFCOUNT_PP(ppz) Z_REFCOUNT_P(*(ppz)) ^~~~~~ /usr/include/php/Zend/zend.h:349:43: note: in definition of macro 'Z_REFCOUNT_P' #define Z_REFCOUNT_P(pz) zval_refcount_p(pz) ^~ /usr/include/php/Zend/zend.h:772:7: note: in expansion of macro 'Z_REFCOUNT_PP' if (Z_REFCOUNT_PP((ppzv)) > 1) { \ ^~~~~~~~~~~~~ /tmp/B.B4jmW6/BUILD/php55-pecl-propro-2.1.0/src/php_propro_api.c:407:3: note: in expansion of macro 'SEPARATE_ZVAL' SEPARATE_ZVAL(container); ^~~~~~~~~~~~~ /usr/include/php/Zend/zend.h:396:59: note: expected 'zval *' {aka 'struct _zval_struct *'} but argument is of type 'zval' {aka 'struct _zval_struct'} static zend_always_inline zend_uint zval_refcount_p(zval* pz) { ~~~~~~^~ /usr/include/php/Zend/zend.h:343:38: error: incompatible type for argument 1 of 'zval_delref_p' #define Z_DELREF_PP(ppz) Z_DELREF_P(*(ppz)) ^~~~~~ /usr/include/php/Zend/zend.h:352:40: note: in definition of macro 'Z_DELREF_P' #define Z_DELREF_P(pz) zval_delref_p(pz) ^~ /usr/include/php/Zend/zend.h:774:4: note: in expansion of macro 'Z_DELREF_PP' Z_DELREF_PP(ppzv); \ ^~~~~~~~~~~ /tmp/B.B4jmW6/BUILD/php55-pecl-propro-2.1.0/src/php_propro_api.c:407:3: note: in expansion of macro 'SEPARATE_ZVAL' SEPARATE_ZVAL(container); ^~~~~~~~~~~~~ /usr/include/php/Zend/zend.h:408:57: note: expected 'zval *' {aka 'struct _zval_struct *'} but argument is of type 'zval' {aka 'struct _zval_struct'} static zend_always_inline zend_uint zval_delref_p(zval* pz) { ~~~~~~^~ In file included from /usr/include/php/main/php.h:34, from /tmp/B.B4jmW6/BUILD/php55-pecl-propro-2.1.0/src/php_propro_api.c:18: /usr/include/php/Zend/zend.h:759:19: error: invalid type argument of '->' (have 'zval' {aka 'struct _zval_struct'}) (z)->value = (v)->value; \ ^~ /usr/include/php/Zend/zend.h:765:3: note: in expansion of macro 'ZVAL_COPY_VALUE' ZVAL_COPY_VALUE(z, v); \ ^~~~~~~~~~~~~~~ /usr/include/php/Zend/zend.h:776:4: note: in expansion of macro 'INIT_PZVAL_COPY' INIT_PZVAL_COPY(new_zv, *(ppzv)); \ ^~~~~~~~~~~~~~~ /tmp/B.B4jmW6/BUILD/php55-pecl-propro-2.1.0/src/php_propro_api.c:407:3: note: in expansion of macro 'SEPARATE_ZVAL' SEPARATE_ZVAL(container); ^~~~~~~~~~~~~ In file included from /usr/include/php/Zend/zend.h:840, from /usr/include/php/main/php.h:34, from /tmp/B.B4jmW6/BUILD/php55-pecl-propro-2.1.0/src/php_propro_api.c:18: /usr/include/php/Zend/zend_operators.h:486:33: error: invalid type argument of unary '*' (have 'zval' {aka 'struct _zval_struct'}) #define Z_TYPE_P(zval_p) Z_TYPE(*zval_p) /usr/include/php/Zend/zend_operators.h:485:24: note: in definition of macro 'Z_TYPE' #define Z_TYPE(zval) (zval).type ^~~~ /usr/include/php/Zend/zend.h:760:17: note: in expansion of macro 'Z_TYPE_P' Z_TYPE_P(z) = Z_TYPE_P(v); \ ^~~~~~~~ /usr/include/php/Zend/zend.h:765:3: note: in expansion of macro 'ZVAL_COPY_VALUE' ZVAL_COPY_VALUE(z, v); \ ^~~~~~~~~~~~~~~ /usr/include/php/Zend/zend.h:776:4: note: in expansion of macro 'INIT_PZVAL_COPY' INIT_PZVAL_COPY(new_zv, *(ppzv)); \ ^~~~~~~~~~~~~~~ /tmp/B.B4jmW6/BUILD/php55-pecl-propro-2.1.0/src/php_propro_api.c:407:3: note: in expansion of macro 'SEPARATE_ZVAL' SEPARATE_ZVAL(container); ^~~~~~~~~~~~~ In file included from /usr/include/php/main/php.h:34, from /tmp/B.B4jmW6/BUILD/php55-pecl-propro-2.1.0/src/php_propro_api.c:18: /usr/include/php/Zend/zend.h:777:12: error: incompatible types when assigning to type 'zval' {aka 'struct _zval_struct'} from type 'zval *' {aka 'struct _zval_struct *'} *(ppzv) = new_zv; \ ^ /tmp/B.B4jmW6/BUILD/php55-pecl-propro-2.1.0/src/php_propro_api.c:407:3: note: in expansion of macro 'SEPARATE_ZVAL' SEPARATE_ZVAL(container); ^~~~~~~~~~~~~ /tmp/B.B4jmW6/BUILD/php55-pecl-propro-2.1.0/src/php_propro_api.c:408:3: warning: implicit declaration of function 'Z_TRY_ADDREF_P'; did you mean 'Z_ADDREF_P'? [-Wimplicit-function-declaration] Z_TRY_ADDREF_P(container); ^~~~~~~~~~~~~~ Z_ADDREF_P /tmp/B.B4jmW6/BUILD/php55-pecl-propro-2.1.0/src/php_propro_api.c: At top level: /tmp/B.B4jmW6/BUILD/php55-pecl-propro-2.1.0/src/php_propro_api.c:416:58: error: unknown type name 'zend_string'; did you mean 'zend_stream'? static inline zval *set_container_value(zval *container, zend_string *member, zval *value) ^~~~~~~~~~~ zend_stream /tmp/B.B4jmW6/BUILD/php55-pecl-propro-2.1.0/src/php_propro_api.c:430:68: error: macro "zend_hash_next_index_insert" requires 4 arguments, but only 2 given value = zend_hash_next_index_insert(Z_ARRVAL_P(container), value); ^ /tmp/B.B4jmW6/BUILD/php55-pecl-propro-2.1.0/src/php_propro_api.c: In function 'get_proxied_value': /tmp/B.B4jmW6/BUILD/php55-pecl-propro-2.1.0/src/php_propro_api.c:455:18: warning: implicit declaration of function 'get_container_value'; did you mean 'get_container'? [-Wimplicit-function-declaration] return_value = get_container_value(container, obj->proxy->member, return_value); ^~~~~~~~~~~~~~~~~~~ get_container /tmp/B.B4jmW6/BUILD/php55-pecl-propro-2.1.0/src/php_propro_api.c:455:16: warning: assignment to 'zval *' {aka 'struct _zval_struct *'} from 'int' makes pointer from integer without a cast [-Wint-conversion] return_value = get_container_value(container, obj->proxy->member, return_value); ^ /tmp/B.B4jmW6/BUILD/php55-pecl-propro-2.1.0/src/php_propro_api.c: In function 'set_proxied_value': /tmp/B.B4jmW6/BUILD/php55-pecl-propro-2.1.0/src/php_propro_api.c:478:3: warning: implicit declaration of function 'set_container_value'; did you mean 'set_container'? [-Wimplicit-function-declaration] set_container_value(container, obj->proxy->member, value); ^~~~~~~~~~~~~~~~~~~ set_container /tmp/B.B4jmW6/BUILD/php55-pecl-propro-2.1.0/src/php_propro_api.c:482:3: warning: implicit declaration of function 'Z_TRY_DELREF_P'; did you mean 'Z_DELREF_P'? [-Wimplicit-function-declaration] Z_TRY_DELREF_P(value); ^~~~~~~~~~~~~~ Z_DELREF_P /tmp/B.B4jmW6/BUILD/php55-pecl-propro-2.1.0/src/php_propro_api.c: In function 'read_dimension': /tmp/B.B4jmW6/BUILD/php55-pecl-propro-2.1.0/src/php_propro_api.c:493:2: error: unknown type name 'zend_string'; did you mean 'zend_stream'? zend_string *member = offset ? zval_get_string(offset) : NULL; ^~~~~~~~~~~ zend_stream /tmp/B.B4jmW6/BUILD/php55-pecl-propro-2.1.0/src/php_propro_api.c:493:33: warning: implicit declaration of function 'zval_get_string'; did you mean 'cfg_get_string'? [-Wimplicit-function-declaration] zend_string *member = offset ? zval_get_string(offset) : NULL; ^~~~~~~~~~~~~~~ cfg_get_string /tmp/B.B4jmW6/BUILD/php55-pecl-propro-2.1.0/src/php_propro_api.c:493:57: warning: pointer/integer type mismatch in conditional expression zend_string *member = offset ? zval_get_string(offset) : NULL; ^ In file included from /usr/include/php/main/php.h:34, from /tmp/B.B4jmW6/BUILD/php55-pecl-propro-2.1.0/src/php_propro_api.c:18: /usr/include/php/Zend/zend.h:759:19: error: invalid type argument of '->' (have 'int') (z)->value = (v)->value; \ ^~ /usr/include/php/Zend/zend_API.h:600:3: note: in expansion of macro 'ZVAL_COPY_VALUE' ZVAL_COPY_VALUE(z, zv); \ ^~~~~~~~~~~~~~~ /usr/include/php/Zend/zend_API.h:625:38: note: in expansion of macro 'ZVAL_ZVAL' #define RETVAL_ZVAL(zv, copy, dtor) ZVAL_ZVAL(return_value, zv, copy, dtor) ^~~~~~~~~ /tmp/B.B4jmW6/BUILD/php55-pecl-propro-2.1.0/src/php_propro_api.c:508:4: note: in expansion of macro 'RETVAL_ZVAL' RETVAL_ZVAL(get_container_value(value, member, &tmp), 1, 0); ^~~~~~~~~~~ In file included from /usr/include/php/Zend/zend.h:840, from /usr/include/php/main/php.h:34, from /tmp/B.B4jmW6/BUILD/php55-pecl-propro-2.1.0/src/php_propro_api.c:18: /usr/include/php/Zend/zend_operators.h:486:33: error: invalid type argument of unary '*' (have 'int') #define Z_TYPE_P(zval_p) Z_TYPE(*zval_p) /usr/include/php/Zend/zend_operators.h:485:24: note: in definition of macro 'Z_TYPE' #define Z_TYPE(zval) (zval).type ^~~~ /usr/include/php/Zend/zend.h:760:17: note: in expansion of macro 'Z_TYPE_P' Z_TYPE_P(z) = Z_TYPE_P(v); \ ^~~~~~~~ /usr/include/php/Zend/zend_API.h:600:3: note: in expansion of macro 'ZVAL_COPY_VALUE' ZVAL_COPY_VALUE(z, zv); \ ^~~~~~~~~~~~~~~ /usr/include/php/Zend/zend_API.h:625:38: note: in expansion of macro 'ZVAL_ZVAL' #define RETVAL_ZVAL(zv, copy, dtor) ZVAL_ZVAL(return_value, zv, copy, dtor) ^~~~~~~~~ /tmp/B.B4jmW6/BUILD/php55-pecl-propro-2.1.0/src/php_propro_api.c:508:4: note: in expansion of macro 'RETVAL_ZVAL' RETVAL_ZVAL(get_container_value(value, member, &tmp), 1, 0); ^~~~~~~~~~~ /usr/include/php/Zend/zend_operators.h:486:33: error: invalid type argument of unary '*' (have 'int') #define Z_TYPE_P(zval_p) Z_TYPE(*zval_p) /usr/include/php/Zend/zend_operators.h:485:24: note: in definition of macro 'Z_TYPE' #define Z_TYPE(zval) (zval).type ^~~~ /usr/include/php/Zend/zend_API.h:559:3: note: in expansion of macro 'Z_TYPE_P' Z_TYPE_P(z) = IS_NULL; \ ^~~~~~~~ /usr/include/php/Zend/zend_API.h:606:5: note: in expansion of macro 'ZVAL_NULL' ZVAL_NULL(zv); \ ^~~~~~~~~ /usr/include/php/Zend/zend_API.h:625:38: note: in expansion of macro 'ZVAL_ZVAL' #define RETVAL_ZVAL(zv, copy, dtor) ZVAL_ZVAL(return_value, zv, copy, dtor) ^~~~~~~~~ /tmp/B.B4jmW6/BUILD/php55-pecl-propro-2.1.0/src/php_propro_api.c:508:4: note: in expansion of macro 'RETVAL_ZVAL' RETVAL_ZVAL(get_container_value(value, member, &tmp), 1, 0); ^~~~~~~~~~~ In file included from /usr/include/php/Zend/zend.h:841, from /usr/include/php/main/php.h:34, from /tmp/B.B4jmW6/BUILD/php55-pecl-propro-2.1.0/src/php_propro_api.c:18: /usr/include/php/Zend/zend_API.h:608:18: error: lvalue required as unary '&' operand zval_ptr_dtor(&zv); \ ^ /usr/include/php/Zend/zend_variables.h:57:49: note: in definition of macro 'zval_ptr_dtor' #define zval_ptr_dtor(zval_ptr) _zval_ptr_dtor((zval_ptr) ZEND_FILE_LINE_CC) ^~~~~~~~ /usr/include/php/Zend/zend_API.h:625:38: note: in expansion of macro 'ZVAL_ZVAL' #define RETVAL_ZVAL(zv, copy, dtor) ZVAL_ZVAL(return_value, zv, copy, dtor) ^~~~~~~~~ /tmp/B.B4jmW6/BUILD/php55-pecl-propro-2.1.0/src/php_propro_api.c:508:4: note: in expansion of macro 'RETVAL_ZVAL' RETVAL_ZVAL(get_container_value(value, member, &tmp), 1, 0); ^~~~~~~~~~~ /tmp/B.B4jmW6/BUILD/php55-pecl-propro-2.1.0/src/php_propro_api.c:520:14: warning: implicit declaration of function 'zend_long_to_str'; did you mean 'zend_do_goto'? [-Wimplicit-function-declaration] member = zend_long_to_str(zend_hash_next_free_element( ^~~~~~~~~~~~~~~~ zend_do_goto /tmp/B.B4jmW6/BUILD/php55-pecl-propro-2.1.0/src/php_propro_api.c:520:12: warning: assignment to 'int *' from 'int' makes pointer from integer without a cast [-Wint-conversion] member = zend_long_to_str(zend_hash_next_free_element( ^ /tmp/B.B4jmW6/BUILD/php55-pecl-propro-2.1.0/src/php_propro_api.c:523:12: warning: assignment to 'int *' from 'int' makes pointer from integer without a cast [-Wint-conversion] member = zend_long_to_str(0); ^ /tmp/B.B4jmW6/BUILD/php55-pecl-propro-2.1.0/src/php_propro_api.c:527:11: warning: implicit declaration of function 'php_property_proxy_init'; did you mean 'php_property_proxy_free'? [-Wimplicit-function-declaration] proxy = php_property_proxy_init(NULL, member); ^~~~~~~~~~~~~~~~~~~~~~~ php_property_proxy_free /tmp/B.B4jmW6/BUILD/php55-pecl-propro-2.1.0/src/php_propro_api.c:527:9: warning: assignment to 'php_property_proxy_t *' {aka 'struct php_property_proxy *'} from 'int' makes pointer from integer without a cast [-Wint-conversion] proxy = php_property_proxy_init(NULL, member); ^ /tmp/B.B4jmW6/BUILD/php55-pecl-propro-2.1.0/src/php_propro_api.c:530:3: warning: implicit declaration of function 'RETVAL_OBJ'; did you mean 'RETVAL_BOOL'? [-Wimplicit-function-declaration] RETVAL_OBJ(&proxy_obj->zo); ^~~~~~~~~~ RETVAL_BOOL /tmp/B.B4jmW6/BUILD/php55-pecl-propro-2.1.0/src/php_propro_api.c: In function 'has_dimension': /tmp/B.B4jmW6/BUILD/php55-pecl-propro-2.1.0/src/php_propro_api.c:556:3: error: unknown type name 'zend_string'; did you mean 'zend_stream'? zend_string *zs = zval_get_string(offset); ^~~~~~~~~~~ zend_stream /tmp/B.B4jmW6/BUILD/php55-pecl-propro-2.1.0/src/php_propro_api.c:556:21: warning: initialization of 'int *' from 'int' makes pointer from integer without a cast [-Wint-conversion] zend_string *zs = zval_get_string(offset); ^~~~~~~~~~~~~~~ /tmp/B.B4jmW6/BUILD/php55-pecl-propro-2.1.0/src/php_propro_api.c:560:57: warning: passing argument 2 of 'zend_symtable_find' from incompatible pointer type [-Wincompatible-pointer-types] zval *zentry = zend_symtable_find(Z_ARRVAL_P(value), zs); ^~ In file included from /usr/include/php/Zend/zend.h:286, from /usr/include/php/main/php.h:34, from /tmp/B.B4jmW6/BUILD/php55-pecl-propro-2.1.0/src/php_propro_api.c:18: /usr/include/php/Zend/zend_hash.h:365:65: note: expected 'const char *' but argument is of type 'int *' static inline int zend_symtable_find(HashTable *ht, const char *arKey, uint nKeyLength, void **pData) ~~~~~~~~~~~~^~~~~ /tmp/B.B4jmW6/BUILD/php55-pecl-propro-2.1.0/src/php_propro_api.c:560:19: error: too few arguments to function 'zend_symtable_find' zval *zentry = zend_symtable_find(Z_ARRVAL_P(value), zs); ^~~~~~~~~~~~~~~~~~ In file included from /usr/include/php/Zend/zend.h:286, from /usr/include/php/main/php.h:34, from /tmp/B.B4jmW6/BUILD/php55-pecl-propro-2.1.0/src/php_propro_api.c:18: /usr/include/php/Zend/zend_hash.h:365:19: note: declared here static inline int zend_symtable_find(HashTable *ht, const char *arKey, uint nKeyLength, void **pData) ^~~~~~~~~~~~~~~~~~ /tmp/B.B4jmW6/BUILD/php55-pecl-propro-2.1.0/src/php_propro_api.c:564:16: warning: implicit declaration of function 'Z_ISNULL_P'; did you mean 'Z_ISREF_P'? [-Wimplicit-function-declaration] exists = !Z_ISNULL_P(zentry); ^~~~~~~~~~ Z_ISREF_P /tmp/B.B4jmW6/BUILD/php55-pecl-propro-2.1.0/src/php_propro_api.c: In function 'write_dimension': /tmp/B.B4jmW6/BUILD/php55-pecl-propro-2.1.0/src/php_propro_api.c:582:2: error: unknown type name 'zend_string'; did you mean 'zend_stream'? zend_string *zs = NULL; ^~~~~~~~~~~ zend_stream /tmp/B.B4jmW6/BUILD/php55-pecl-propro-2.1.0/src/php_propro_api.c:588:6: warning: assignment to 'int *' from 'int' makes pointer from integer without a cast [-Wint-conversion] zs = zval_get_string(offset); ^ /tmp/B.B4jmW6/BUILD/php55-pecl-propro-2.1.0/src/php_propro_api.c: In function 'unset_dimension': /tmp/B.B4jmW6/BUILD/php55-pecl-propro-2.1.0/src/php_propro_api.c:617:3: error: unknown type name 'zend_string'; did you mean 'zend_stream'? zend_string *o = zval_get_string(offset); ^~~~~~~~~~~ zend_stream /tmp/B.B4jmW6/BUILD/php55-pecl-propro-2.1.0/src/php_propro_api.c:617:20: warning: initialization of 'int *' from 'int' makes pointer from integer without a cast [-Wint-conversion] zend_string *o = zval_get_string(offset); ^~~~~~~~~~~~~~~ /tmp/B.B4jmW6/BUILD/php55-pecl-propro-2.1.0/src/php_propro_api.c:619:3: warning: implicit declaration of function 'SEPARATE_ARRAY'; did you mean 'SEPARATE_ZVAL'? [-Wimplicit-function-declaration] SEPARATE_ARRAY(array); ^~~~~~~~~~~~~~ SEPARATE_ZVAL /tmp/B.B4jmW6/BUILD/php55-pecl-propro-2.1.0/src/php_propro_api.c:620:40: warning: passing argument 2 of 'zend_symtable_del' from incompatible pointer type [-Wincompatible-pointer-types] zend_symtable_del(Z_ARRVAL_P(array), o); ^ In file included from /usr/include/php/Zend/zend.h:286, from /usr/include/php/main/php.h:34, from /tmp/B.B4jmW6/BUILD/php55-pecl-propro-2.1.0/src/php_propro_api.c:18: /usr/include/php/Zend/zend_hash.h:358:64: note: expected 'const char *' but argument is of type 'int *' static inline int zend_symtable_del(HashTable *ht, const char *arKey, uint nKeyLength) ~~~~~~~~~~~~^~~~~ /tmp/B.B4jmW6/BUILD/php55-pecl-propro-2.1.0/src/php_propro_api.c:620:3: error: too few arguments to function 'zend_symtable_del' zend_symtable_del(Z_ARRVAL_P(array), o); ^~~~~~~~~~~~~~~~~ In file included from /usr/include/php/Zend/zend.h:286, from /usr/include/php/main/php.h:34, from /tmp/B.B4jmW6/BUILD/php55-pecl-propro-2.1.0/src/php_propro_api.c:18: /usr/include/php/Zend/zend_hash.h:358:19: note: declared here static inline int zend_symtable_del(HashTable *ht, const char *arKey, uint nKeyLength) ^~~~~~~~~~~~~~~~~ /tmp/B.B4jmW6/BUILD/php55-pecl-propro-2.1.0/src/php_propro_api.c: In function 'zim_propro___construct': /tmp/B.B4jmW6/BUILD/php55-pecl-propro-2.1.0/src/php_propro_api.c:638:2: error: unknown type name 'zend_string'; did you mean 'zend_stream'? zend_string *member; ^~~~~~~~~~~ zend_stream /tmp/B.B4jmW6/BUILD/php55-pecl-propro-2.1.0/src/php_propro_api.c:650:15: warning: assignment to 'php_property_proxy_t *' {aka 'struct php_property_proxy *'} from 'int' makes pointer from integer without a cast [-Wint-conversion] obj->proxy = php_property_proxy_init(NULL, member); ^ /tmp/B.B4jmW6/BUILD/php55-pecl-propro-2.1.0/src/php_propro_api.c:653:15: warning: assignment to 'php_property_proxy_t *' {aka 'struct php_property_proxy *'} from 'int' makes pointer from integer without a cast [-Wint-conversion] obj->proxy = php_property_proxy_init(container, member); ^ /tmp/B.B4jmW6/BUILD/php55-pecl-propro-2.1.0/src/php_propro_api.c: In function 'zm_startup_propro': /tmp/B.B4jmW6/BUILD/php55-pecl-propro-2.1.0/src/php_propro_api.c:673:48: warning: assignment to 'zend_object_value (*)(zend_class_entry *)' {aka 'struct _zend_object_value (*)(struct _zend_class_entry *)'} from incompatible pointer type 'zend_object * (*)(zend_class_entry *)' {aka 'struct _zend_object * (*)(struct _zend_class_entry *)'} [-Wincompatible-pointer-types] php_property_proxy_class_entry->create_object = php_property_proxy_object_new; ^ /tmp/B.B4jmW6/BUILD/php55-pecl-propro-2.1.0/src/php_propro_api.c:678:37: error: 'zend_object_handlers' {aka 'struct _zend_object_handlers'} has no member named 'offset'; did you mean 'set'? php_property_proxy_object_handlers.offset = XtOffsetOf(php_property_proxy_object_t, zo); ^~~~~~ set /tmp/B.B4jmW6/BUILD/php55-pecl-propro-2.1.0/src/php_propro_api.c:679:37: error: 'zend_object_handlers' {aka 'struct _zend_object_handlers'} has no member named 'free_obj'; did you mean 'clone_obj'? php_property_proxy_object_handlers.free_obj = destroy_obj; ^~~~~~~~ clone_obj /tmp/B.B4jmW6/BUILD/php55-pecl-propro-2.1.0/src/php_propro_api.c:680:44: warning: assignment to 'zend_object_get_gc_t' {aka 'struct _hashtable * (*)(struct _zval_struct *, struct _zval_struct ***, int *)'} from incompatible pointer type 'HashTable * (*)(zval *, zval **, int *)' {aka 'struct _hashtable * (*)(struct _zval_struct *, struct _zval_struct **, int *)'} [-Wincompatible-pointer-types] php_property_proxy_object_handlers.get_gc = get_gc; ^ /tmp/B.B4jmW6/BUILD/php55-pecl-propro-2.1.0/src/php_propro_api.c:682:41: warning: assignment to 'zend_object_set_t' {aka 'void (*)(struct _zval_struct **, struct _zval_struct *)'} from incompatible pointer type 'void (*)(zval *, zval *)' {aka 'void (*)(struct _zval_struct *, struct _zval_struct *)'} [-Wincompatible-pointer-types] php_property_proxy_object_handlers.set = set_obj; ^ /tmp/B.B4jmW6/BUILD/php55-pecl-propro-2.1.0/src/php_propro_api.c:683:41: warning: assignment to 'zend_object_get_t' {aka 'struct _zval_struct * (*)(struct _zval_struct *)'} from incompatible pointer type 'zval * (*)(zval *, zval *)' {aka 'struct _zval_struct * (*)(struct _zval_struct *, struct _zval_struct *)'} [-Wincompatible-pointer-types] php_property_proxy_object_handlers.get = get_obj; ^ /tmp/B.B4jmW6/BUILD/php55-pecl-propro-2.1.0/src/php_propro_api.c:685:52: warning: assignment to 'zend_object_read_dimension_t' {aka 'struct _zval_struct * (*)(struct _zval_struct *, struct _zval_struct *, int)'} from incompatible pointer type 'zval * (*)(zval *, zval *, int, zval *)' {aka 'struct _zval_struct * (*)(struct _zval_struct *, struct _zval_struct *, int, struct _zval_struct *)'} [-Wincompatible-pointer-types] php_property_proxy_object_handlers.read_dimension = read_dimension; ^ make: *** [Makefile:220: src/php_propro_api.lo] Error 1 error: Bad exit status from /tmp/B.B4jmW6/BUILD/tmp/rpm-tmp.58346 (%build) RPM build errors: Bad exit status from /tmp/B.B4jmW6/BUILD/tmp/rpm-tmp.58346 (%build) ended at: Thu Oct 11 18:49:42 2018, done in 0:00:04.681156 error: No files produced. + chmod -R u+rwX /tmp/B.B4jmW6/BUILD + rm -rf /tmp/B.B4jmW6/tmp /tmp/B.B4jmW6/BUILD + rm -rf /tmp/B.B4jmW6 Begin-PLD-Builder-Info Build-Time: user:13.57s sys:2.43s real:24.70s (faults io:0 non-io:712528) End-PLD-Builder-Info
[Back to list of logs] [View rpm -qa of builder]