FailedOk

th/SRPMS[OK]
th/x32[OK]
th/i686[OK]
th/x86_64[OK]

ac/SRPMS[OK]
ac/i386[OK]
ac/i586[OK]
ac/i686[OK]
ac/alpha[OK]
ac/amd64[OK]
ac/athlon[OK]
ac/ppc[OK]
ac/sparc[OK]
ac/sparc64[OK]

Advanced Search
main()
Powered by PLD Linux
(c) 2002-2018 PLD Team
$Revision: 1.37 $
Powered by sqlite3.
Your IP: 54.92.160.119

php-pecl-propro cfa76e35-fec4-4fb0-8180-e7b55b921e64

Status:Failed
Source URL:ftp://buildlogs.pld-linux.org/th/x32/FAIL/php-pecl-propro,cfa76e35-fec4-4fb0-8180-e7b55b921e64.bz2
text/plain URL:View!
rpm -qa of builder:View!
Date:2018/10/11 18:48:01
Runtime:0:00:06.035891

Toc:

  • error 1
  • rpm: error: Failed build dependencies:
  • error 2
  • rpm: error: Failed build dependencies:
  • prep
  • Executing(%prep): /bin/sh -e /tmp/B.ebtcnw/BUILD/tmp/rpm-tmp.62404
  • build
  • Executing(%build): /bin/sh -e /tmp/B.ebtcnw/BUILD/tmp/rpm-tmp.62404
  • error 3
  • /tmp/B.ebtcnw/BUILD/php52-pecl-propro-2.1.0/src/php_propro_api.h:27:2: error: unknown type name 'zend_string'
  • error 4
  • /tmp/B.ebtcnw/BUILD/php52-pecl-propro-2.1.0/src/php_propro_api.h:89:3: error: unknown type name 'zend_string'; did you mean 'zend_stream'?
  • error 5
  • /tmp/B.ebtcnw/BUILD/php52-pecl-propro-2.1.0/src/php_propro_api.c:30:8: error: unknown type name 'ZEND_RESULT_CODE'
  • error 6
  • /tmp/B.ebtcnw/BUILD/php52-pecl-propro-2.1.0/src/php_propro_api.c:162:64: error: unknown type name 'zend_string'; did you mean 'zend_stream'?
  • error 7
  • /tmp/B.ebtcnw/BUILD/php52-pecl-propro-2.1.0/src/php_propro_api.c:227:50: error: 'zend_class_entry' {aka 'struct _zend_class_entry'} has no member named 'default_properties_count'; did you mean 'default_properties'?
  • error 8
  • /tmp/B.ebtcnw/BUILD/php52-pecl-propro-2.1.0/src/php_propro_api.c:232:7: error: 'zend_object' {aka 'struct _zend_object'} has no member named 'handlers'
  • error 9
  • ./php_propro.h:33:54: error: 'zend_object' {aka 'struct _zend_object'} has no member named 'handlers'
  • error 10
  • ./php_propro.h:33:54: error: invalid type argument of '->' (have 'int')
  • error 11
  • /tmp/B.ebtcnw/BUILD/php52-pecl-propro-2.1.0/src/php_propro_api.c:299:8: error: unknown type name 'ZEND_RESULT_CODE'
  • error 12
  • /usr/include/php/Zend/zend_API.h:496:18: error: lvalue required as unary '&' operand
  • error 13
  • /usr/include/php/Zend/zend_operators.h:413:35: error: invalid type argument of unary '*' (have 'zval' {aka 'struct _zval_struct'})
  • error 14
  • /usr/include/php/Zend/zend.h:611:30: error: invalid type argument of '->' (have 'zval' {aka 'struct _zval_struct'})
  • error 15
  • /usr/include/php/Zend/zend.h:615:20: error: incompatible types when initializing type 'zval *' {aka 'struct _zval_struct *'} using type 'zval' {aka 'struct _zval_struct'}
  • error 16
  • /usr/include/php/Zend/zend_alloc.h:156:6: error: incompatible types when assigning to type 'zval' {aka 'struct _zval_struct'} from type 'zval *' {aka 'struct _zval_struct *'}
  • error 17
  • /usr/include/php/Zend/zend.h:620:4: error: invalid type argument of unary '*' (have 'zval' {aka 'struct _zval_struct'})
  • error 18
  • /usr/include/php/Zend/zend.h:621:19: error: incompatible type for argument 1 of '_zval_copy_ctor'
  • error 19
  • /usr/include/php/Zend/zend.h:622:13: error: invalid type argument of '->' (have 'zval' {aka 'struct _zval_struct'})
  • error 20
  • /usr/include/php/Zend/zend.h:623:13: error: invalid type argument of '->' (have 'zval' {aka 'struct _zval_struct'})
  • error 21
  • /usr/include/php/Zend/zend_operators.h:349:28: error: incompatible type for argument 1 of 'convert_to_null'
  • error 22
  • /usr/include/php/Zend/zend_operators.h:349:28: error: incompatible type for argument 1 of 'convert_to_long'
  • error 23
  • /usr/include/php/Zend/zend_operators.h:349:28: error: incompatible type for argument 1 of 'convert_to_double'
  • error 24
  • /usr/include/php/Zend/zend_operators.h:349:28: error: incompatible type for argument 1 of 'convert_to_boolean'
  • error 25
  • /usr/include/php/Zend/zend_operators.h:349:28: error: incompatible type for argument 1 of 'convert_to_array'
  • error 26
  • /usr/include/php/Zend/zend_operators.h:349:28: error: incompatible type for argument 1 of 'convert_to_object'
  • error 27
  • /usr/include/php/Zend/zend_operators.h:268:39: error: invalid type argument of '->' (have 'zval' {aka 'struct _zval_struct'})
  • error 28
  • /usr/include/php/Zend/zend_operators.h:349:28: error: incompatible type for argument 1 of '_convert_to_string'
  • error 29
  • /usr/include/php/Zend/zend_API.h:496:18: error: lvalue required as unary '&' operand
  • error 30
  • /tmp/B.ebtcnw/BUILD/php52-pecl-propro-2.1.0/src/php_propro_api.c:360:58: error: unknown type name 'zend_string'; did you mean 'zend_stream'?
  • error 31
  • /tmp/B.ebtcnw/BUILD/php52-pecl-propro-2.1.0/src/php_propro_api.c:402:7: error: 'IS_UNDEF' undeclared (first use in this function); did you mean 'IS_UNUSED'?
  • error 32
  • /usr/include/php/Zend/zend.h:615:20: error: incompatible types when initializing type 'zval *' {aka 'struct _zval_struct *'} using type 'zval' {aka 'struct _zval_struct'}
  • error 33
  • /usr/include/php/Zend/zend_alloc.h:156:6: error: incompatible types when assigning to type 'zval' {aka 'struct _zval_struct'} from type 'zval *' {aka 'struct _zval_struct *'}
  • error 34
  • /usr/include/php/Zend/zend.h:620:4: error: invalid type argument of unary '*' (have 'zval' {aka 'struct _zval_struct'})
  • error 35
  • /usr/include/php/Zend/zend.h:621:19: error: incompatible type for argument 1 of '_zval_copy_ctor'
  • error 36
  • /usr/include/php/Zend/zend.h:622:13: error: invalid type argument of '->' (have 'zval' {aka 'struct _zval_struct'})
  • error 37
  • /usr/include/php/Zend/zend.h:623:13: error: invalid type argument of '->' (have 'zval' {aka 'struct _zval_struct'})
  • error 38
  • /tmp/B.ebtcnw/BUILD/php52-pecl-propro-2.1.0/src/php_propro_api.c:416:58: error: unknown type name 'zend_string'; did you mean 'zend_stream'?
  • error 39
  • /tmp/B.ebtcnw/BUILD/php52-pecl-propro-2.1.0/src/php_propro_api.c:430:68: error: macro "zend_hash_next_index_insert" requires 4 arguments, but only 2 given
  • error 40
  • /tmp/B.ebtcnw/BUILD/php52-pecl-propro-2.1.0/src/php_propro_api.c:493:2: error: unknown type name 'zend_string'; did you mean 'zend_stream'?
  • error 41
  • /usr/include/php/Zend/zend_API.h:488:10: error: invalid type argument of unary '*' (have 'int')
  • error 42
  • /usr/include/php/Zend/zend_operators.h:412:33: error: invalid type argument of unary '*' (have 'int')
  • error 43
  • /usr/include/php/Zend/zend_API.h:496:18: error: lvalue required as unary '&' operand
  • error 44
  • /tmp/B.ebtcnw/BUILD/php52-pecl-propro-2.1.0/src/php_propro_api.c:556:3: error: unknown type name 'zend_string'; did you mean 'zend_stream'?
  • error 45
  • /tmp/B.ebtcnw/BUILD/php52-pecl-propro-2.1.0/src/php_propro_api.c:560:19: error: too few arguments to function 'zend_symtable_find'
  • error 46
  • /tmp/B.ebtcnw/BUILD/php52-pecl-propro-2.1.0/src/php_propro_api.c:582:2: error: unknown type name 'zend_string'; did you mean 'zend_stream'?
  • error 47
  • /tmp/B.ebtcnw/BUILD/php52-pecl-propro-2.1.0/src/php_propro_api.c:617:3: error: unknown type name 'zend_string'; did you mean 'zend_stream'?
  • error 48
  • /tmp/B.ebtcnw/BUILD/php52-pecl-propro-2.1.0/src/php_propro_api.c:620:3: error: too few arguments to function 'zend_symtable_del'
  • error 49
  • /tmp/B.ebtcnw/BUILD/php52-pecl-propro-2.1.0/src/php_propro_api.c:636:2: error: unknown type name 'zend_error_handling'; did you mean 'php_std_error_handling'?
  • error 50
  • /tmp/B.ebtcnw/BUILD/php52-pecl-propro-2.1.0/src/php_propro_api.c:638:2: error: unknown type name 'zend_string'; did you mean 'zend_stream'?
  • error 51
  • /tmp/B.ebtcnw/BUILD/php52-pecl-propro-2.1.0/src/php_propro_api.c:678:37: error: 'zend_object_handlers' {aka 'struct _zend_object_handlers'} has no member named 'offset'; did you mean 'set'?
  • error 52
  • /tmp/B.ebtcnw/BUILD/php52-pecl-propro-2.1.0/src/php_propro_api.c:679:37: error: 'zend_object_handlers' {aka 'struct _zend_object_handlers'} has no member named 'free_obj'; did you mean 'clone_obj'?
  • error 53
  • /tmp/B.ebtcnw/BUILD/php52-pecl-propro-2.1.0/src/php_propro_api.c:680:37: error: 'zend_object_handlers' {aka 'struct _zend_object_handlers'} has no member named 'get_gc'; did you mean 'get'?
  • error 54
  • /tmp/B.ebtcnw/BUILD/php52-pecl-propro-2.1.0/src/php_propro_api.c:681:36: error: 'zend_object_handlers' {aka 'struct _zend_object_handlers'} has no member named 'get_debug_info'
  • error 55
  • error: Bad exit status from /tmp/B.ebtcnw/BUILD/tmp/rpm-tmp.62404 (%build)
  • error 56
  • RPM build errors:
  • error 57
  • error: No files produced.

Content:

request from: adamg
checking if we should skip the build
started at: Thu Oct 11 18:47:35 2018
killing old processes on a builder
sending signal 9 to pid -1
Killed
cleaning up /tmp
fetching https://srcbuilder.pld-linux.org/th//srpms/cfa76e35-fec4-4fb0-8180-e7b55b921e64/php52-pecl-propro-2.1.0-1.src.rpm
fetched 24969 bytes, 62.3 K/s
installing srpm: php52-pecl-propro-2.1.0-1.src.rpm
+ install -d /tmp/B.ebtcnw/BUILD /tmp/B.ebtcnw/RPMS
+ LC_ALL=en_US.UTF-8
+ rpm -qp --changelog php52-pecl-propro-2.1.0-1.src.rpm
* Thu Oct 11 2018 PLD Linux Team <feedback@pld-linux.org>
- For complete changelog see: http://git.pld-linux.org/?p=packages/php-pecl-propro.git;a=log;h=auto/th/php-pecl-propro-2.1.0-1
* Mon Oct 08 2018 Adam Gołębiowski <adamg@pld-linux.org> 4dd19ff
- updated to 2.1.0 + rpm -Uhv --nodeps --define '_topdir /tmp/B.ebtcnw' --define '_specdir %{_topdir}' --define '_sourcedir %{_specdir}' --define '_rpmdir %{_topdir}/RPMS' --define '_builddir %{_topdir}/BUILD' --define 'php_suffix 52' php52-pecl-propro-2.1.0-1.src.rpm Preparing... ################################################## php52-pecl-propro ################################################## + rm -f php52-pecl-propro-2.1.0-1.src.rpm + install -m 700 -d /tmp/B.ebtcnw/BUILD/tmp + TMPDIR=/tmp/B.ebtcnw/BUILD/tmp + exec nice -n 0 rpmbuild -bp --short-circuit --nodeps --define '_topdir /tmp/B.ebtcnw' --define '_specdir %{_topdir}' --define '_sourcedir %{_specdir}' --define '_rpmdir %{_topdir}/RPMS' --define '_builddir %{_topdir}/BUILD' --target x32-pld-linux --define 'php_suffix 52' --define 'prep exit 0' /tmp/B.ebtcnw/php-pecl-propro.spec Building target platforms: x32-pld-linux checking BuildConflict-ing packages no BuildConflicts found checking BR rpm: error: Failed build dependencies: rpm: php52-devel >= 3:5.3.0 is needed by php52-pecl-propro-2.1.0-1.src rpm: Building target platforms: x32-pld-linux updating poldek cache... ready is up to date Retrieving th::packages.ndir.md... th is up to date Retrieving th::packages.ndir.md... th is up to date Retrieving th-ready::packages.ndir.md... th-ready is up to date Retrieving th-ready::packages.ndir.md... th-ready is up to date Retrieving th-test::packages.ndir.md... th-test is up to date Retrieving th-test::packages.ndir.md... th-test is up to date checking conflicting packages in BRed packages poldek: Loading [pndir]ready... poldek: Loading [pndir]th-test... poldek: Loading [pndir]th-test... poldek: Loading [pndir]th-ready... poldek: Loading [pndir]th-ready... poldek: Loading [pndir]th... poldek: Loading [pndir]th... poldek: 28727 packages read poldek: Removed 5120 duplicate packages from available set poldek: Processing dependencies... poldek: php52-devel-5.2.17-20130717.31.x32 marks php52-common-5.2.17-20130717.31.x32 (cap /usr/libx32/php52) poldek: There are 2 packages to install (1 marked by dependencies): poldek: I php52-devel-5.2.17-20130717.31.x32 poldek: D php52-common-5.2.17-20130717.31.x32 poldek: This operation will use 4.7MB of disk space. poldek: Need to get 1.2MB of archives (1.2MB to download). poldek: poldek: Retrieving [1/2] th-test::php52-common-5.2.17-20130717.31.x32.rpm... poldek: ..............................done poldek: Retrieving [2/2] th-test::php52-devel-5.2.17-20130717.31.x32.rpm... poldek: ..............................done poldek: Executing pm-command.sh --upgrade -vh --test --root / --define _check_dirname_deps 1... poldek: Preparing... ################################################## no conflicts found checking BR rpm: error: Failed build dependencies: rpm: php52-devel >= 3:5.3.0 is needed by php52-pecl-propro-2.1.0-1.src rpm: Building target platforms: x32-pld-linux installing BR: php52\-devel + poldek --noask --caplookup -Q -v '--ignore=hhvm-*' '--ignore=php4-*' '--ignore=php53-*' '--ignore=php54-*' '--ignore=php55-*' '--ignore=php56-*' '--ignore=php70-*' '--ignore=php71-*' '--ignore=php72-*' '--ignore=php73-*' --upgrade php52-devel Loading [pndir]ready... Loading [pndir]th-test... Loading [pndir]th-test... Loading [pndir]th-ready... Loading [pndir]th-ready... Loading [pndir]th... Loading [pndir]th... 28727 packages read Removed 5120 duplicate packages from available set Processing dependencies... php52-devel-5.2.17-20130717.31.x32 marks php52-common-5.2.17-20130717.31.x32 (cap /usr/libx32/php52) There are 2 packages to install (1 marked by dependencies): I php52-devel-5.2.17-20130717.31.x32 D php52-common-5.2.17-20130717.31.x32 This operation will use 4.7MB of disk space. Need to get 1.2MB of archives. Executing pm-command.sh --upgrade -vh --root / --define _check_dirname_deps 1... Preparing... ################################################## php52-common ################################################## php52-devel ################################################## building RPM using: set -ex; : build-id: cfa76e35-fec4-4fb0-8180-e7b55b921e64; TMPDIR=/tmp/B.ebtcnw/BUILD/tmp exec nice -n 0 rpmbuild -bb --define '_smp_mflags -j9' --define '_make_opts -Otarget' --define '_pld_builder 1' --define '_topdir /tmp/B.ebtcnw' --define '_specdir %{_topdir}' --define '_sourcedir %{_specdir}' --define '_rpmdir %{_topdir}/RPMS' --define '_builddir %{_topdir}/BUILD' --target x32-pld-linux --define 'php_suffix 52' /tmp/B.ebtcnw/php-pecl-propro.spec + : build-id: cfa76e35-fec4-4fb0-8180-e7b55b921e64 + TMPDIR=/tmp/B.ebtcnw/BUILD/tmp + exec nice -n 0 rpmbuild -bb --define '_smp_mflags -j9' --define '_make_opts -Otarget' --define '_pld_builder 1' --define '_topdir /tmp/B.ebtcnw' --define '_specdir %{_topdir}' --define '_sourcedir %{_specdir}' --define '_rpmdir %{_topdir}/RPMS' --define '_builddir %{_topdir}/BUILD' --target x32-pld-linux --define 'php_suffix 52' /tmp/B.ebtcnw/php-pecl-propro.spec Building target platforms: x32-pld-linux Executing(%prep): /bin/sh -e /tmp/B.ebtcnw/BUILD/tmp/rpm-tmp.62404 + umask 022 + cd /tmp/B.ebtcnw/BUILD + cd /tmp/B.ebtcnw/BUILD + rm -rf php52-pecl-propro-2.1.0 + /bin/mkdir -p php52-pecl-propro-2.1.0 + cd php52-pecl-propro-2.1.0 + /usr/bin/gzip -dc /tmp/B.ebtcnw/propro-2.1.0.tgz + /bin/tar -xf - + STATUS=0 + '[' 0 -ne 0 ']' + /bin/id -u + '[' 1000 '=' 0 ']' + /bin/id -u + '[' 1000 '=' 0 ']' + /bin/chmod -Rf a+rX,u+w,g-w,o-w . + mv propro-2.1.0/AUTHORS propro-2.1.0/BUGS propro-2.1.0/CONTRIBUTING.md propro-2.1.0/CREDITS propro-2.1.0/Doxyfile propro-2.1.0/LICENSE propro-2.1.0/Makefile.frag propro-2.1.0/README.md propro-2.1.0/THANKS propro-2.1.0/TODO propro-2.1.0/config.m4 propro-2.1.0/config.w32 propro-2.1.0/config0.m4 propro-2.1.0/php_propro.h propro-2.1.0/scripts propro-2.1.0/src propro-2.1.0/tests . + exit 0 Executing(%build): /bin/sh -e /tmp/B.ebtcnw/BUILD/tmp/rpm-tmp.62404 HOME=/home/users/builder PATH=/home/users/builder/GNUstep/Tools:/usr/local/bin:/usr/bin:/bin TMPDIR=/tmp/B.ebtcnw/BUILD/tmp + umask 022 + cd /tmp/B.ebtcnw/BUILD + cd php52-pecl-propro-2.1.0 + phpize Configuring for: PHP Api Version: 20041225 Zend Module Api No: 20060613 Zend Extension Api No: 220060519 configure.in:3: warning: prefer named diversions configure.in:3: warning: prefer named diversions + libtoolize --copy --force --install libtoolize: putting auxiliary files in '.'. libtoolize: copying file './config.guess' libtoolize: copying file './config.sub' libtoolize: copying file './install-sh' libtoolize: copying file './ltmain.sh' libtoolize: Consider adding 'AC_CONFIG_MACRO_DIRS([m4])' to configure.in, libtoolize: and rerunning libtoolize and aclocal. libtoolize: Consider adding '-I m4' to ACLOCAL_AMFLAGS in Makefile.am. + ./configure 'LDFLAGS=-Wl,--as-needed -Wl,--no-copy-dt-needed-entries -Wl,-z,relro -Wl,-z,combreloc ' 'CFLAGS=-O2 -fwrapv -pipe -Wformat -Werror=format-security -gdwarf-4 -fno-debug-types-section -fvar-tracking-assignments -g2 -Wp,-D_FORTIFY_SOURCE=2 -fstack-protector-strong --param=ssp-buffer-size=4 -fPIC -mtune=generic -march=x86-64 -gdwarf-4 -fno-debug-types-section -fvar-tracking-assignments -g2 ' 'CXXFLAGS=-O2 -fwrapv -pipe -Wformat -Werror=format-security -gdwarf-4 -fno-debug-types-section -fvar-tracking-assignments -g2 -Wp,-D_FORTIFY_SOURCE=2 -fstack-protector-strong --param=ssp-buffer-size=4 -fPIC -mtune=generic -march=x86-64 -gdwarf-4 -fno-debug-types-section -fvar-tracking-assignments -g2 ' 'FFLAGS=-O2 -fwrapv -pipe -Wformat -Werror=format-security -gdwarf-4 -fno-debug-types-section -fvar-tracking-assignments -g2 -Wp,-D_FORTIFY_SOURCE=2 -fstack-protector-strong --param=ssp-buffer-size=4 -fPIC -mtune=generic -march=x86-64 -gdwarf-4 -fno-debug-types-section -fvar-tracking-assignments -g2 ' 'FCFLAGS=-O2 -fwrapv -pipe -Wformat -Werror=format-security -gdwarf-4 -fno-debug-types-section -fvar-tracking-assignments -g2 -Wp,-D_FORTIFY_SOURCE=2 -fstack-protector-strong --param=ssp-buffer-size=4 -fPIC -mtune=generic -march=x86-64 -gdwarf-4 -fno-debug-types-section -fvar-tracking-assignments -g2 ' 'CPPFLAGS=' 'CC=x86_64-pld-linux-gnux32-gcc' 'CXX=x86_64-pld-linux-gnux32-g++' '--host=x86_64-pld-linux-gnux32' '--build=x86_64-pld-linux-gnux32' '--prefix=/usr' '--exec-prefix=/usr' '--bindir=/usr/bin' '--sbindir=/usr/sbin' '--sysconfdir=/etc' '--datadir=/usr/share' '--includedir=/usr/include' '--libdir=/usr/libx32' '--libexecdir=/usr/libexec' '--localstatedir=/var' '--sharedstatedir=/var/lib' '--mandir=/usr/share/man' '--infodir=/usr/share/info' '--x-libraries=/usr/libx32' checking for grep that handles long lines and -e... /bin/grep checking for egrep... /bin/grep -E checking for a sed that does not truncate output... /bin/sed checking for x86_64-pld-linux-gnux32-cc... x86_64-pld-linux-gnux32-gcc checking whether the C compiler works... yes checking for C compiler default output file name... a.out checking for suffix of executables... checking whether we are cross compiling... no checking for suffix of object files... o checking whether we are using the GNU C compiler... yes checking whether x86_64-pld-linux-gnux32-gcc accepts -g... yes checking for x86_64-pld-linux-gnux32-gcc option to accept ISO C89... none needed checking how to run the C preprocessor... x86_64-pld-linux-gnux32-gcc -E checking for icc... no checking for suncc... no checking whether x86_64-pld-linux-gnux32-gcc and cc understand -c and -o together... yes checking for system library directory... lib checking if compiler supports -R... no checking if compiler supports -Wl,-rpath,... yes checking build system type... x86_64-pld-linux-gnux32 checking host system type... x86_64-pld-linux-gnux32 checking target system type... x86_64-pld-linux-gnux32 checking for PHP prefix... /usr checking for PHP includes... -I/usr/include/php -I/usr/include/php/main -I/usr/include/php/TSRM -I/usr/include/php/Zend -I/usr/include/php/ext -I/usr/include/php/ext/date/lib checking for PHP extension directory... /usr/libx32/php52 checking for PHP installed headers prefix... /usr/include/php checking if debug is enabled... no checking if zts is enabled... no checking for re2c... re2c checking for re2c version... 0.13.5 (ok) checking for gawk... gawk checking whether to enable property proxy support... yes, shared checking how to print strings... print -r checking for a sed that does not truncate output... (cached) /bin/sed checking for fgrep... /bin/grep -F checking for ld used by x86_64-pld-linux-gnux32-gcc... /usr/bin/ld checking if the linker (/usr/bin/ld) is GNU ld... yes checking for BSD- or MS-compatible name lister (nm)... /usr/bin/nm -B checking the name lister (/usr/bin/nm -B) interface... BSD nm checking whether ln -s works... yes checking the maximum length of command line arguments... 1572864 checking how to convert x86_64-pld-linux-gnux32 file names to x86_64-pld-linux-gnux32 format... func_convert_file_noop checking how to convert x86_64-pld-linux-gnux32 file names to toolchain format... func_convert_file_noop checking for /usr/bin/ld option to reload object files... -r checking for x86_64-pld-linux-gnux32-objdump... no checking for objdump... objdump checking how to recognize dependent libraries... pass_all checking for x86_64-pld-linux-gnux32-dlltool... no checking for dlltool... no checking how to associate runtime and link libraries... print -r -- checking for x86_64-pld-linux-gnux32-ar... no checking for ar... ar checking for archiver @FILE support... @ checking for x86_64-pld-linux-gnux32-strip... no checking for strip... strip checking for x86_64-pld-linux-gnux32-ranlib... no checking for ranlib... ranlib checking for mawk... (cached) gawk checking command to parse /usr/bin/nm -B output from x86_64-pld-linux-gnux32-gcc object... ok checking for sysroot... no checking for a working dd... /bin/dd checking how to truncate binary pipes... /bin/dd bs=4096 count=1 checking for x86_64-pld-linux-gnux32-mt... no checking for mt... no checking if : is a manifest tool... no checking for ANSI C header files... yes checking for sys/types.h... yes checking for sys/stat.h... yes checking for stdlib.h... yes checking for string.h... yes checking for memory.h... yes checking for strings.h... yes checking for inttypes.h... yes checking for stdint.h... yes checking for unistd.h... yes checking for dlfcn.h... yes checking for objdir... .libs checking if x86_64-pld-linux-gnux32-gcc supports -fno-rtti -fno-exceptions... no checking for x86_64-pld-linux-gnux32-gcc option to produce PIC... -fPIC -DPIC checking if x86_64-pld-linux-gnux32-gcc PIC flag -fPIC -DPIC works... yes checking if x86_64-pld-linux-gnux32-gcc static flag -static works... yes checking if x86_64-pld-linux-gnux32-gcc supports -c -o file.o... yes checking if x86_64-pld-linux-gnux32-gcc supports -c -o file.o... (cached) yes checking whether the x86_64-pld-linux-gnux32-gcc linker (/usr/bin/ld -m elf32_x86_64) supports shared libraries... yes checking whether -lc should be explicitly linked in... no checking dynamic linker characteristics... GNU/Linux ld.so checking how to hardcode library paths into programs... immediate checking whether stripping libraries is possible... yes checking if libtool supports shared libraries... yes checking whether to build shared libraries... yes checking whether to build static libraries... no configure: creating ./config.status config.status: creating config.h config.status: executing libtool commands + /usr/bin/make -Otarget -j9 /bin/sh /tmp/B.ebtcnw/BUILD/php52-pecl-propro-2.1.0/libtool --mode=compile x86_64-pld-linux-gnux32-gcc -I. -I/tmp/B.ebtcnw/BUILD/php52-pecl-propro-2.1.0 -DPHP_ATOM_INC -I/tmp/B.ebtcnw/BUILD/php52-pecl-propro-2.1.0/include -I/tmp/B.ebtcnw/BUILD/php52-pecl-propro-2.1.0/main -I/tmp/B.ebtcnw/BUILD/php52-pecl-propro-2.1.0 -I/usr/include/php -I/usr/include/php/main -I/usr/include/php/TSRM -I/usr/include/php/Zend -I/usr/include/php/ext -I/usr/include/php/ext/date/lib -I/tmp/B.ebtcnw/BUILD/php52-pecl-propro-2.1.0/src -DHAVE_CONFIG_H -O2 -fwrapv -pipe -Wformat -Werror=format-security -gdwarf-4 -fno-debug-types-section -fvar-tracking-assignments -g2 -Wp,-D_FORTIFY_SOURCE=2 -fstack-protector-strong --param=ssp-buffer-size=4 -fPIC -mtune=generic -march=x86-64 -gdwarf-4 -fno-debug-types-section -fvar-tracking-assignments -g2 -c /tmp/B.ebtcnw/BUILD/php52-pecl-propro-2.1.0/src/php_propro_api.c -o src/php_propro_api.lo libtool: compile: x86_64-pld-linux-gnux32-gcc -I. -I/tmp/B.ebtcnw/BUILD/php52-pecl-propro-2.1.0 -DPHP_ATOM_INC -I/tmp/B.ebtcnw/BUILD/php52-pecl-propro-2.1.0/include -I/tmp/B.ebtcnw/BUILD/php52-pecl-propro-2.1.0/main -I/tmp/B.ebtcnw/BUILD/php52-pecl-propro-2.1.0 -I/usr/include/php -I/usr/include/php/main -I/usr/include/php/TSRM -I/usr/include/php/Zend -I/usr/include/php/ext -I/usr/include/php/ext/date/lib -I/tmp/B.ebtcnw/BUILD/php52-pecl-propro-2.1.0/src -DHAVE_CONFIG_H -O2 -fwrapv -pipe -Wformat -Werror=format-security -gdwarf-4 -fno-debug-types-section -fvar-tracking-assignments -g2 -Wp,-D_FORTIFY_SOURCE=2 -fstack-protector-strong --param=ssp-buffer-size=4 -fPIC -mtune=generic -march=x86-64 -gdwarf-4 -fno-debug-types-section -fvar-tracking-assignments -g2 -c /tmp/B.ebtcnw/BUILD/php52-pecl-propro-2.1.0/src/php_propro_api.c -fPIC -DPIC -o src/.libs/php_propro_api.o In file included from /tmp/B.ebtcnw/BUILD/php52-pecl-propro-2.1.0/src/php_propro_api.c:21: /tmp/B.ebtcnw/BUILD/php52-pecl-propro-2.1.0/src/php_propro_api.h:27:2: error: unknown type name 'zend_string' zend_string *member; ^~~~~~~~~~~ /tmp/B.ebtcnw/BUILD/php52-pecl-propro-2.1.0/src/php_propro_api.h:89:3: error: unknown type name 'zend_string'; did you mean 'zend_stream'? zend_string *member); ^~~~~~~~~~~ zend_stream /tmp/B.ebtcnw/BUILD/php52-pecl-propro-2.1.0/src/php_propro_api.c:30:8: error: unknown type name 'ZEND_RESULT_CODE' static ZEND_RESULT_CODE cast_obj(zval *object, zval *return_value, int type); ^~~~~~~~~~~~~~~~ /tmp/B.ebtcnw/BUILD/php52-pecl-propro-2.1.0/src/php_propro_api.c:162:64: error: unknown type name 'zend_string'; did you mean 'zend_stream'? php_property_proxy_t *php_property_proxy_init(zval *container, zend_string *member) ^~~~~~~~~~~ zend_stream /tmp/B.ebtcnw/BUILD/php52-pecl-propro-2.1.0/src/php_propro_api.c: In function 'php_property_proxy_free': /tmp/B.ebtcnw/BUILD/php52-pecl-propro-2.1.0/src/php_propro_api.c:195:8: warning: implicit declaration of function 'Z_ISUNDEF'; did you mean 'S_ISUID'? [-Wimplicit-function-declaration] if (!Z_ISUNDEF((*proxy)->container)) { ^~~~~~~~~ S_ISUID In file included from /usr/include/php/Zend/zend.h:685, from /usr/include/php/main/php.h:34, from /tmp/B.ebtcnw/BUILD/php52-pecl-propro-2.1.0/src/php_propro_api.c:18: /tmp/B.ebtcnw/BUILD/php52-pecl-propro-2.1.0/src/php_propro_api.c:196:18: warning: passing argument 1 of '_zval_ptr_dtor' from incompatible pointer type [-Wincompatible-pointer-types] zval_ptr_dtor(&(*proxy)->container); /usr/include/php/Zend/zend_variables.h:55:49: note: in definition of macro 'zval_ptr_dtor' #define zval_ptr_dtor(zval_ptr) _zval_ptr_dtor((zval_ptr) ZEND_FILE_LINE_CC) ^~~~~~~~ /usr/include/php/Zend/zend_variables.h:50:37: note: expected 'zval **' {aka 'struct _zval_struct **'} but argument is of type 'zval *' {aka 'struct _zval_struct *'} ZEND_API void _zval_ptr_dtor(zval **zval_ptr ZEND_FILE_LINE_DC); ~~~~~~~^~~~~~~~ /tmp/B.ebtcnw/BUILD/php52-pecl-propro-2.1.0/src/php_propro_api.c:197:4: warning: implicit declaration of function 'ZVAL_UNDEF'; did you mean 'ZVAL_ADDREF'? [-Wimplicit-function-declaration] ZVAL_UNDEF(&(*proxy)->container); ^~~~~~~~~~ ZVAL_ADDREF /tmp/B.ebtcnw/BUILD/php52-pecl-propro-2.1.0/src/php_propro_api.c:199:3: warning: implicit declaration of function 'zend_string_release'; did you mean 'zend_stream_read'? [-Wimplicit-function-declaration] zend_string_release((*proxy)->member); ^~~~~~~~~~~~~~~~~~~ zend_stream_read In file included from /usr/include/php/Zend/zend.h:242, from /usr/include/php/main/php.h:34, from /tmp/B.ebtcnw/BUILD/php52-pecl-propro-2.1.0/src/php_propro_api.c:18: /tmp/B.ebtcnw/BUILD/php52-pecl-propro-2.1.0/src/php_propro_api.c: In function 'php_property_proxy_object_new_ex': /tmp/B.ebtcnw/BUILD/php52-pecl-propro-2.1.0/src/php_propro_api.c:227:50: error: 'zend_class_entry' {aka 'struct _zend_class_entry'} has no member named 'default_properties_count'; did you mean 'default_properties'? o = ecalloc(1, sizeof(*o) + sizeof(zval) * (ce->default_properties_count - 1)); ^~~~~~~~~~~~~~~~~~~~~~~~ /usr/include/php/Zend/zend_alloc.h:59:52: note: in definition of macro 'ecalloc' #define ecalloc(nmemb, size) _ecalloc((nmemb), (size) ZEND_FILE_LINE_CC ZEND_FILE_LINE_EMPTY_CC) ^~~~ /tmp/B.ebtcnw/BUILD/php52-pecl-propro-2.1.0/src/php_propro_api.c:229:2: warning: implicit declaration of function 'object_properties_init'; did you mean 'object_and_properties_init'? [-Wimplicit-function-declaration] object_properties_init(&o->zo, ce); ^~~~~~~~~~~~~~~~~~~~~~ object_and_properties_init /tmp/B.ebtcnw/BUILD/php52-pecl-propro-2.1.0/src/php_propro_api.c:232:7: error: 'zend_object' {aka 'struct _zend_object'} has no member named 'handlers' o->zo.handlers = &php_property_proxy_object_handlers; ^ In file included from /tmp/B.ebtcnw/BUILD/php52-pecl-propro-2.1.0/src/php_propro_api.h:16, from /tmp/B.ebtcnw/BUILD/php52-pecl-propro-2.1.0/src/php_propro_api.c:21: /tmp/B.ebtcnw/BUILD/php52-pecl-propro-2.1.0/src/php_propro_api.c: In function 'destroy_obj': ./php_propro.h:33:54: error: 'zend_object' {aka 'struct _zend_object'} has no member named 'handlers' #define PHP_PROPRO_PTR(zo) (void*)(((char*)(zo))-(zo)->handlers->offset) ^~ /tmp/B.ebtcnw/BUILD/php52-pecl-propro-2.1.0/src/php_propro_api.c:244:35: note: in expansion of macro 'PHP_PROPRO_PTR' php_property_proxy_object_t *o = PHP_PROPRO_PTR(object); ^~~~~~~~~~~~~~ In file included from /usr/include/php/Zend/zend.h:685, from /usr/include/php/main/php.h:34, from /tmp/B.ebtcnw/BUILD/php52-pecl-propro-2.1.0/src/php_propro_api.c:18: /tmp/B.ebtcnw/BUILD/php52-pecl-propro-2.1.0/src/php_propro_api.c:250:17: warning: passing argument 1 of '_zval_ptr_dtor' from incompatible pointer type [-Wincompatible-pointer-types] zval_ptr_dtor(&o->parent); /usr/include/php/Zend/zend_variables.h:55:49: note: in definition of macro 'zval_ptr_dtor' #define zval_ptr_dtor(zval_ptr) _zval_ptr_dtor((zval_ptr) ZEND_FILE_LINE_CC) ^~~~~~~~ /usr/include/php/Zend/zend_variables.h:50:37: note: expected 'zval **' {aka 'struct _zval_struct **'} but argument is of type 'zval *' {aka 'struct _zval_struct *'} ZEND_API void _zval_ptr_dtor(zval **zval_ptr ZEND_FILE_LINE_DC); ~~~~~~~^~~~~~~~ /tmp/B.ebtcnw/BUILD/php52-pecl-propro-2.1.0/src/php_propro_api.c: In function 'get_propro': /tmp/B.ebtcnw/BUILD/php52-pecl-propro-2.1.0/src/php_propro_api.c:258:2: warning: implicit declaration of function 'ZEND_ASSERT'; did you mean 'ZEND_ISSET'? [-Wimplicit-function-declaration] ZEND_ASSERT(Z_TYPE_P(object) == IS_OBJECT); ^~~~~~~~~~~ ZEND_ISSET In file included from /tmp/B.ebtcnw/BUILD/php52-pecl-propro-2.1.0/src/php_propro_api.h:16, from /tmp/B.ebtcnw/BUILD/php52-pecl-propro-2.1.0/src/php_propro_api.c:21: /tmp/B.ebtcnw/BUILD/php52-pecl-propro-2.1.0/src/php_propro_api.c:259:24: warning: implicit declaration of function 'Z_OBJ_P'; did you mean 'Z_OBJ_HT'? [-Wimplicit-function-declaration] return PHP_PROPRO_PTR(Z_OBJ_P(object)); ^~~~~~~ ./php_propro.h:33:45: note: in definition of macro 'PHP_PROPRO_PTR' #define PHP_PROPRO_PTR(zo) (void*)(((char*)(zo))-(zo)->handlers->offset) ^~ ./php_propro.h:33:54: error: invalid type argument of '->' (have 'int') #define PHP_PROPRO_PTR(zo) (void*)(((char*)(zo))-(zo)->handlers->offset) ^~ /tmp/B.ebtcnw/BUILD/php52-pecl-propro-2.1.0/src/php_propro_api.c:259:9: note: in expansion of macro 'PHP_PROPRO_PTR' return PHP_PROPRO_PTR(Z_OBJ_P(object)); ^~~~~~~~~~~~~~ /tmp/B.ebtcnw/BUILD/php52-pecl-propro-2.1.0/src/php_propro_api.c: In function 'get_debug_info': /tmp/B.ebtcnw/BUILD/php52-pecl-propro-2.1.0/src/php_propro_api.c:285:3: warning: implicit declaration of function 'zend_hash_str_add_empty_element'; did you mean 'zend_hash_add_empty_element'? [-Wimplicit-function-declaration] zend_hash_str_add_empty_element(ht, "parent", sizeof("parent")-1); ^~~~~~~~~~~~~~~~~~~~~~~~~~~~~~~ zend_hash_add_empty_element /tmp/B.ebtcnw/BUILD/php52-pecl-propro-2.1.0/src/php_propro_api.c:286:3: warning: implicit declaration of function 'zend_hash_str_add'; did you mean 'zend_hash_add'? [-Wimplicit-function-declaration] zend_hash_str_add(ht, "container", sizeof("container")-1, &obj->proxy->container); ^~~~~~~~~~~~~~~~~ zend_hash_add /tmp/B.ebtcnw/BUILD/php52-pecl-propro-2.1.0/src/php_propro_api.c:292:10: warning: assignment to 'zval *' {aka 'struct _zval_struct *'} from 'int' makes pointer from integer without a cast [-Wint-conversion] zmember = zend_hash_str_add_empty_element(ht, "member", sizeof("member")-1); ^ /tmp/B.ebtcnw/BUILD/php52-pecl-propro-2.1.0/src/php_propro_api.c:293:2: warning: implicit declaration of function 'ZVAL_STR'; did you mean 'ZVAL_STRING'? [-Wimplicit-function-declaration] ZVAL_STR(zmember, obj->proxy->member); ^~~~~~~~ ZVAL_STRING /tmp/B.ebtcnw/BUILD/php52-pecl-propro-2.1.0/src/php_propro_api.c: At top level: /tmp/B.ebtcnw/BUILD/php52-pecl-propro-2.1.0/src/php_propro_api.c:299:8: error: unknown type name 'ZEND_RESULT_CODE' static ZEND_RESULT_CODE cast_obj(zval *object, zval *return_value, int type) ^~~~~~~~~~~~~~~~ In file included from /usr/include/php/Zend/zend.h:685, from /usr/include/php/main/php.h:34, from /tmp/B.ebtcnw/BUILD/php52-pecl-propro-2.1.0/src/php_propro_api.c:18: /tmp/B.ebtcnw/BUILD/php52-pecl-propro-2.1.0/src/php_propro_api.c: In function 'cast_obj': /usr/include/php/Zend/zend_API.h:496:18: error: lvalue required as unary '&' operand zval_ptr_dtor(&zv); \ ^ /usr/include/php/Zend/zend_variables.h:55:49: note: in definition of macro 'zval_ptr_dtor' #define zval_ptr_dtor(zval_ptr) _zval_ptr_dtor((zval_ptr) ZEND_FILE_LINE_CC) ^~~~~~~~ /usr/include/php/Zend/zend_API.h:513:38: note: in expansion of macro 'ZVAL_ZVAL' #define RETVAL_ZVAL(zv, copy, dtor) ZVAL_ZVAL(return_value, zv, copy, dtor) ^~~~~~~~~ /tmp/B.ebtcnw/BUILD/php52-pecl-propro-2.1.0/src/php_propro_api.c:304:2: note: in expansion of macro 'RETVAL_ZVAL' RETVAL_ZVAL(get_proxied_value(object, &tmp), 1, 0); ^~~~~~~~~~~ /tmp/B.ebtcnw/BUILD/php52-pecl-propro-2.1.0/src/php_propro_api.c:308:7: warning: implicit declaration of function 'Z_ISUNDEF_P'; did you mean 'Z_STRLEN_P'? [-Wimplicit-function-declaration] if (!Z_ISUNDEF_P(return_value)) { ^~~~~~~~~~~ Z_STRLEN_P /tmp/B.ebtcnw/BUILD/php52-pecl-propro-2.1.0/src/php_propro_api.c:309:3: warning: implicit declaration of function 'ZVAL_DEREF'; did you mean 'ZVAL_DELREF'? [-Wimplicit-function-declaration] ZVAL_DEREF(return_value); ^~~~~~~~~~ ZVAL_DELREF In file included from /usr/include/php/Zend/zend.h:684, from /usr/include/php/main/php.h:34, from /tmp/B.ebtcnw/BUILD/php52-pecl-propro-2.1.0/src/php_propro_api.c:18: /usr/include/php/Zend/zend_operators.h:413:35: error: invalid type argument of unary '*' (have 'zval' {aka 'struct _zval_struct'}) #define Z_TYPE_PP(zval_pp) Z_TYPE(**zval_pp) /usr/include/php/Zend/zend_operators.h:411:24: note: in definition of macro 'Z_TYPE' #define Z_TYPE(zval) (zval).type ^~~~ /usr/include/php/Zend/zend_operators.h:347:6: note: in expansion of macro 'Z_TYPE_PP' if (Z_TYPE_PP(ppzv) != str_type) { \ ^~~~~~~~~ /tmp/B.ebtcnw/BUILD/php52-pecl-propro-2.1.0/src/php_propro_api.c:310:3: note: in expansion of macro 'convert_to_explicit_type_ex' convert_to_explicit_type_ex(return_value, type); ^~~~~~~~~~~~~~~~~~~~~~~~~~~ In file included from /usr/include/php/main/php.h:34, from /tmp/B.ebtcnw/BUILD/php52-pecl-propro-2.1.0/src/php_propro_api.c:18: /usr/include/php/Zend/zend.h:611:30: error: invalid type argument of '->' (have 'zval' {aka 'struct _zval_struct'}) #define PZVAL_IS_REF(z) ((z)->is_ref) ^~ /usr/include/php/Zend/zend.h:628:7: note: in expansion of macro 'PZVAL_IS_REF' if (!PZVAL_IS_REF(*ppzv)) { \ ^~~~~~~~~~~~ /usr/include/php/Zend/zend_operators.h:348:3: note: in expansion of macro 'SEPARATE_ZVAL_IF_NOT_REF' SEPARATE_ZVAL_IF_NOT_REF(ppzv); \ ^~~~~~~~~~~~~~~~~~~~~~~~ /tmp/B.ebtcnw/BUILD/php52-pecl-propro-2.1.0/src/php_propro_api.c:310:3: note: in expansion of macro 'convert_to_explicit_type_ex' convert_to_explicit_type_ex(return_value, type); ^~~~~~~~~~~~~~~~~~~~~~~~~~~ /usr/include/php/Zend/zend.h:615:20: error: incompatible types when initializing type 'zval *' {aka 'struct _zval_struct *'} using type 'zval' {aka 'struct _zval_struct'} zval *orig_ptr = *(ppzv); \ ^ /usr/include/php/Zend/zend.h:629:3: note: in expansion of macro 'SEPARATE_ZVAL' SEPARATE_ZVAL(ppzv); \ ^~~~~~~~~~~~~ /usr/include/php/Zend/zend_operators.h:348:3: note: in expansion of macro 'SEPARATE_ZVAL_IF_NOT_REF' SEPARATE_ZVAL_IF_NOT_REF(ppzv); \ ^~~~~~~~~~~~~~~~~~~~~~~~ /tmp/B.ebtcnw/BUILD/php52-pecl-propro-2.1.0/src/php_propro_api.c:310:3: note: in expansion of macro 'convert_to_explicit_type_ex' convert_to_explicit_type_ex(return_value, type); ^~~~~~~~~~~~~~~~~~~~~~~~~~~ In file included from /usr/include/php/Zend/zend.h:242, from /usr/include/php/main/php.h:34, from /tmp/B.ebtcnw/BUILD/php52-pecl-propro-2.1.0/src/php_propro_api.c:18: /usr/include/php/Zend/zend_alloc.h:156:6: error: incompatible types when assigning to type 'zval' {aka 'struct _zval_struct'} from type 'zval *' {aka 'struct _zval_struct *'} (p) = (type *) emalloc(sizeof(type)) ^ /usr/include/php/Zend/zend_alloc.h:169:2: note: in expansion of macro 'ZEND_FAST_ALLOC' ZEND_FAST_ALLOC(z, zval, ZVAL_CACHE_LIST) ^~~~~~~~~~~~~~~ /usr/include/php/Zend/zend.h:619:4: note: in expansion of macro 'ALLOC_ZVAL' ALLOC_ZVAL(*(ppzv)); \ ^~~~~~~~~~ /usr/include/php/Zend/zend.h:629:3: note: in expansion of macro 'SEPARATE_ZVAL' SEPARATE_ZVAL(ppzv); \ ^~~~~~~~~~~~~ /usr/include/php/Zend/zend_operators.h:348:3: note: in expansion of macro 'SEPARATE_ZVAL_IF_NOT_REF' SEPARATE_ZVAL_IF_NOT_REF(ppzv); \ ^~~~~~~~~~~~~~~~~~~~~~~~ /tmp/B.ebtcnw/BUILD/php52-pecl-propro-2.1.0/src/php_propro_api.c:310:3: note: in expansion of macro 'convert_to_explicit_type_ex' convert_to_explicit_type_ex(return_value, type); ^~~~~~~~~~~~~~~~~~~~~~~~~~~ In file included from /usr/include/php/main/php.h:34, from /tmp/B.ebtcnw/BUILD/php52-pecl-propro-2.1.0/src/php_propro_api.c:18: /usr/include/php/Zend/zend.h:620:4: error: invalid type argument of unary '*' (have 'zval' {aka 'struct _zval_struct'}) **(ppzv) = *orig_ptr; \ ^~~~~~~~ /usr/include/php/Zend/zend.h:629:3: note: in expansion of macro 'SEPARATE_ZVAL' SEPARATE_ZVAL(ppzv); \ ^~~~~~~~~~~~~ /usr/include/php/Zend/zend_operators.h:348:3: note: in expansion of macro 'SEPARATE_ZVAL_IF_NOT_REF' SEPARATE_ZVAL_IF_NOT_REF(ppzv); \ ^~~~~~~~~~~~~~~~~~~~~~~~ /tmp/B.ebtcnw/BUILD/php52-pecl-propro-2.1.0/src/php_propro_api.c:310:3: note: in expansion of macro 'convert_to_explicit_type_ex' convert_to_explicit_type_ex(return_value, type); ^~~~~~~~~~~~~~~~~~~~~~~~~~~ In file included from /usr/include/php/Zend/zend.h:685, from /usr/include/php/main/php.h:34, from /tmp/B.ebtcnw/BUILD/php52-pecl-propro-2.1.0/src/php_propro_api.c:18: /usr/include/php/Zend/zend.h:621:19: error: incompatible type for argument 1 of '_zval_copy_ctor' zval_copy_ctor(*(ppzv)); \ /usr/include/php/Zend/zend_variables.h:53:49: note: in definition of macro 'zval_copy_ctor' #define zval_copy_ctor(zvalue) _zval_copy_ctor((zvalue) ZEND_FILE_LINE_CC) ^~~~~~ /usr/include/php/Zend/zend.h:629:3: note: in expansion of macro 'SEPARATE_ZVAL' SEPARATE_ZVAL(ppzv); \ ^~~~~~~~~~~~~ /usr/include/php/Zend/zend_operators.h:348:3: note: in expansion of macro 'SEPARATE_ZVAL_IF_NOT_REF' SEPARATE_ZVAL_IF_NOT_REF(ppzv); \ ^~~~~~~~~~~~~~~~~~~~~~~~ /tmp/B.ebtcnw/BUILD/php52-pecl-propro-2.1.0/src/php_propro_api.c:310:3: note: in expansion of macro 'convert_to_explicit_type_ex' convert_to_explicit_type_ex(return_value, type); ^~~~~~~~~~~~~~~~~~~~~~~~~~~ /usr/include/php/Zend/zend_variables.h:40:42: note: expected 'zval *' {aka 'struct _zval_struct *'} but argument is of type 'zval' {aka 'struct _zval_struct'} static inline void _zval_copy_ctor(zval *zvalue ZEND_FILE_LINE_DC) ~~~~~~^~~~~~ In file included from /usr/include/php/main/php.h:34, from /tmp/B.ebtcnw/BUILD/php52-pecl-propro-2.1.0/src/php_propro_api.c:18: /usr/include/php/Zend/zend.h:622:13: error: invalid type argument of '->' (have 'zval' {aka 'struct _zval_struct'}) (*(ppzv))->refcount=1; \ ^~ /usr/include/php/Zend/zend.h:629:3: note: in expansion of macro 'SEPARATE_ZVAL' SEPARATE_ZVAL(ppzv); \ ^~~~~~~~~~~~~ /usr/include/php/Zend/zend_operators.h:348:3: note: in expansion of macro 'SEPARATE_ZVAL_IF_NOT_REF' SEPARATE_ZVAL_IF_NOT_REF(ppzv); \ ^~~~~~~~~~~~~~~~~~~~~~~~ /tmp/B.ebtcnw/BUILD/php52-pecl-propro-2.1.0/src/php_propro_api.c:310:3: note: in expansion of macro 'convert_to_explicit_type_ex' convert_to_explicit_type_ex(return_value, type); ^~~~~~~~~~~~~~~~~~~~~~~~~~~ /usr/include/php/Zend/zend.h:623:13: error: invalid type argument of '->' (have 'zval' {aka 'struct _zval_struct'}) (*(ppzv))->is_ref = 0; \ ^~ /usr/include/php/Zend/zend.h:629:3: note: in expansion of macro 'SEPARATE_ZVAL' SEPARATE_ZVAL(ppzv); \ ^~~~~~~~~~~~~ /usr/include/php/Zend/zend_operators.h:348:3: note: in expansion of macro 'SEPARATE_ZVAL_IF_NOT_REF' SEPARATE_ZVAL_IF_NOT_REF(ppzv); \ ^~~~~~~~~~~~~~~~~~~~~~~~ /tmp/B.ebtcnw/BUILD/php52-pecl-propro-2.1.0/src/php_propro_api.c:310:3: note: in expansion of macro 'convert_to_explicit_type_ex' convert_to_explicit_type_ex(return_value, type); ^~~~~~~~~~~~~~~~~~~~~~~~~~~ In file included from /usr/include/php/Zend/zend.h:684, from /usr/include/php/main/php.h:34, from /tmp/B.ebtcnw/BUILD/php52-pecl-propro-2.1.0/src/php_propro_api.c:18: /usr/include/php/Zend/zend_operators.h:349:28: error: incompatible type for argument 1 of 'convert_to_null' convert_to_explicit_type(*ppzv, str_type); \ /usr/include/php/Zend/zend_operators.h:320:21: note: in definition of macro 'convert_to_explicit_type' convert_to_null(pzv); \ ^~~ /tmp/B.ebtcnw/BUILD/php52-pecl-propro-2.1.0/src/php_propro_api.c:310:3: note: in expansion of macro 'convert_to_explicit_type_ex' convert_to_explicit_type_ex(return_value, type); ^~~~~~~~~~~~~~~~~~~~~~~~~~~ /usr/include/php/Zend/zend_operators.h:259:37: note: expected 'zval *' {aka 'struct _zval_struct *'} but argument is of type 'zval' {aka 'struct _zval_struct'} ZEND_API void convert_to_null(zval *op); ~~~~~~^~ /usr/include/php/Zend/zend_operators.h:349:28: error: incompatible type for argument 1 of 'convert_to_long' convert_to_explicit_type(*ppzv, str_type); \ /usr/include/php/Zend/zend_operators.h:323:21: note: in definition of macro 'convert_to_explicit_type' convert_to_long(pzv); \ ^~~ /tmp/B.ebtcnw/BUILD/php52-pecl-propro-2.1.0/src/php_propro_api.c:310:3: note: in expansion of macro 'convert_to_explicit_type_ex' convert_to_explicit_type_ex(return_value, type); ^~~~~~~~~~~~~~~~~~~~~~~~~~~ /usr/include/php/Zend/zend_operators.h:256:37: note: expected 'zval *' {aka 'struct _zval_struct *'} but argument is of type 'zval' {aka 'struct _zval_struct'} ZEND_API void convert_to_long(zval *op); ~~~~~~^~ /usr/include/php/Zend/zend_operators.h:349:28: error: incompatible type for argument 1 of 'convert_to_double' convert_to_explicit_type(*ppzv, str_type); \ /usr/include/php/Zend/zend_operators.h:326:23: note: in definition of macro 'convert_to_explicit_type' convert_to_double(pzv); \ ^~~ /tmp/B.ebtcnw/BUILD/php52-pecl-propro-2.1.0/src/php_propro_api.c:310:3: note: in expansion of macro 'convert_to_explicit_type_ex' convert_to_explicit_type_ex(return_value, type); ^~~~~~~~~~~~~~~~~~~~~~~~~~~ /usr/include/php/Zend/zend_operators.h:257:39: note: expected 'zval *' {aka 'struct _zval_struct *'} but argument is of type 'zval' {aka 'struct _zval_struct'} ZEND_API void convert_to_double(zval *op); ~~~~~~^~ /usr/include/php/Zend/zend_operators.h:349:28: error: incompatible type for argument 1 of 'convert_to_boolean' convert_to_explicit_type(*ppzv, str_type); \ /usr/include/php/Zend/zend_operators.h:329:24: note: in definition of macro 'convert_to_explicit_type' convert_to_boolean(pzv); \ ^~~ /tmp/B.ebtcnw/BUILD/php52-pecl-propro-2.1.0/src/php_propro_api.c:310:3: note: in expansion of macro 'convert_to_explicit_type_ex' convert_to_explicit_type_ex(return_value, type); ^~~~~~~~~~~~~~~~~~~~~~~~~~~ /usr/include/php/Zend/zend_operators.h:260:40: note: expected 'zval *' {aka 'struct _zval_struct *'} but argument is of type 'zval' {aka 'struct _zval_struct'} ZEND_API void convert_to_boolean(zval *op); ~~~~~~^~ /usr/include/php/Zend/zend_operators.h:349:28: error: incompatible type for argument 1 of 'convert_to_array' convert_to_explicit_type(*ppzv, str_type); \ /usr/include/php/Zend/zend_operators.h:332:22: note: in definition of macro 'convert_to_explicit_type' convert_to_array(pzv); \ ^~~ /tmp/B.ebtcnw/BUILD/php52-pecl-propro-2.1.0/src/php_propro_api.c:310:3: note: in expansion of macro 'convert_to_explicit_type_ex' convert_to_explicit_type_ex(return_value, type); ^~~~~~~~~~~~~~~~~~~~~~~~~~~ /usr/include/php/Zend/zend_operators.h:261:38: note: expected 'zval *' {aka 'struct _zval_struct *'} but argument is of type 'zval' {aka 'struct _zval_struct'} ZEND_API void convert_to_array(zval *op); ~~~~~~^~ /usr/include/php/Zend/zend_operators.h:349:28: error: incompatible type for argument 1 of 'convert_to_object' convert_to_explicit_type(*ppzv, str_type); \ /usr/include/php/Zend/zend_operators.h:335:23: note: in definition of macro 'convert_to_explicit_type' convert_to_object(pzv); \ ^~~ /tmp/B.ebtcnw/BUILD/php52-pecl-propro-2.1.0/src/php_propro_api.c:310:3: note: in expansion of macro 'convert_to_explicit_type_ex' convert_to_explicit_type_ex(return_value, type); ^~~~~~~~~~~~~~~~~~~~~~~~~~~ /usr/include/php/Zend/zend_operators.h:262:39: note: expected 'zval *' {aka 'struct _zval_struct *'} but argument is of type 'zval' {aka 'struct _zval_struct'} ZEND_API void convert_to_object(zval *op); ~~~~~~^~ /usr/include/php/Zend/zend_operators.h:268:39: error: invalid type argument of '->' (have 'zval' {aka 'struct _zval_struct'}) #define convert_to_string(op) if ((op)->type != IS_STRING) { _convert_to_string((op) ZEND_FILE_LINE_CC); } ^~ /usr/include/php/Zend/zend_operators.h:338:5: note: in expansion of macro 'convert_to_string' convert_to_string(pzv); \ ^~~~~~~~~~~~~~~~~ /usr/include/php/Zend/zend_operators.h:349:3: note: in expansion of macro 'convert_to_explicit_type' convert_to_explicit_type(*ppzv, str_type); \ ^~~~~~~~~~~~~~~~~~~~~~~~ /tmp/B.ebtcnw/BUILD/php52-pecl-propro-2.1.0/src/php_propro_api.c:310:3: note: in expansion of macro 'convert_to_explicit_type_ex' convert_to_explicit_type_ex(return_value, type); ^~~~~~~~~~~~~~~~~~~~~~~~~~~ /usr/include/php/Zend/zend_operators.h:349:28: error: incompatible type for argument 1 of '_convert_to_string' convert_to_explicit_type(*ppzv, str_type); \ ^ /usr/include/php/Zend/zend_operators.h:268:82: note: in definition of macro 'convert_to_string' #define convert_to_string(op) if ((op)->type != IS_STRING) { _convert_to_string((op) ZEND_FILE_LINE_CC); } ^~ /usr/include/php/Zend/zend_operators.h:349:3: note: in expansion of macro 'convert_to_explicit_type' convert_to_explicit_type(*ppzv, str_type); \ ^~~~~~~~~~~~~~~~~~~~~~~~ /tmp/B.ebtcnw/BUILD/php52-pecl-propro-2.1.0/src/php_propro_api.c:310:3: note: in expansion of macro 'convert_to_explicit_type_ex' convert_to_explicit_type_ex(return_value, type); ^~~~~~~~~~~~~~~~~~~~~~~~~~~ /usr/include/php/Zend/zend_operators.h:255:40: note: expected 'zval *' {aka 'struct _zval_struct *'} but argument is of type 'zval' {aka 'struct _zval_struct'} ZEND_API void _convert_to_string(zval *op ZEND_FILE_LINE_DC); ~~~~~~^~ In file included from /usr/include/php/Zend/zend.h:685, from /usr/include/php/main/php.h:34, from /tmp/B.ebtcnw/BUILD/php52-pecl-propro-2.1.0/src/php_propro_api.c:18: /tmp/B.ebtcnw/BUILD/php52-pecl-propro-2.1.0/src/php_propro_api.c: In function 'get_obj': /usr/include/php/Zend/zend_API.h:496:18: error: lvalue required as unary '&' operand zval_ptr_dtor(&zv); \ ^ /usr/include/php/Zend/zend_variables.h:55:49: note: in definition of macro 'zval_ptr_dtor' #define zval_ptr_dtor(zval_ptr) _zval_ptr_dtor((zval_ptr) ZEND_FILE_LINE_CC) ^~~~~~~~ /usr/include/php/Zend/zend_API.h:513:38: note: in expansion of macro 'ZVAL_ZVAL' #define RETVAL_ZVAL(zv, copy, dtor) ZVAL_ZVAL(return_value, zv, copy, dtor) ^~~~~~~~~ /tmp/B.ebtcnw/BUILD/php52-pecl-propro-2.1.0/src/php_propro_api.c:322:2: note: in expansion of macro 'RETVAL_ZVAL' RETVAL_ZVAL(get_proxied_value(object, &tmp), 1, 0); ^~~~~~~~~~~ /tmp/B.ebtcnw/BUILD/php52-pecl-propro-2.1.0/src/php_propro_api.c: In function 'set_container': /tmp/B.ebtcnw/BUILD/php52-pecl-propro-2.1.0/src/php_propro_api.c:351:4: warning: implicit declaration of function 'ZVAL_COPY_VALUE'; did you mean 'ZVAL_COPY_CTOR'? [-Wimplicit-function-declaration] ZVAL_COPY_VALUE(&tmp, &obj->proxy->container); ^~~~~~~~~~~~~~~ ZVAL_COPY_CTOR /tmp/B.ebtcnw/BUILD/php52-pecl-propro-2.1.0/src/php_propro_api.c:352:4: warning: implicit declaration of function 'ZVAL_COPY'; did you mean 'ZVAL_LONG'? [-Wimplicit-function-declaration] ZVAL_COPY(&obj->proxy->container, container); ^~~~~~~~~ ZVAL_LONG In file included from /usr/include/php/Zend/zend.h:685, from /usr/include/php/main/php.h:34, from /tmp/B.ebtcnw/BUILD/php52-pecl-propro-2.1.0/src/php_propro_api.c:18: /tmp/B.ebtcnw/BUILD/php52-pecl-propro-2.1.0/src/php_propro_api.c:353:18: warning: passing argument 1 of '_zval_ptr_dtor' from incompatible pointer type [-Wincompatible-pointer-types] zval_ptr_dtor(&tmp); /usr/include/php/Zend/zend_variables.h:55:49: note: in definition of macro 'zval_ptr_dtor' #define zval_ptr_dtor(zval_ptr) _zval_ptr_dtor((zval_ptr) ZEND_FILE_LINE_CC) ^~~~~~~~ /usr/include/php/Zend/zend_variables.h:50:37: note: expected 'zval **' {aka 'struct _zval_struct **'} but argument is of type 'zval *' {aka 'struct _zval_struct *'} ZEND_API void _zval_ptr_dtor(zval **zval_ptr ZEND_FILE_LINE_DC); ~~~~~~~^~~~~~~~ /tmp/B.ebtcnw/BUILD/php52-pecl-propro-2.1.0/src/php_propro_api.c: At top level: /tmp/B.ebtcnw/BUILD/php52-pecl-propro-2.1.0/src/php_propro_api.c:360:58: error: unknown type name 'zend_string'; did you mean 'zend_stream'? static inline zval *get_container_value(zval *container, zend_string *member, zval *return_value) ^~~~~~~~~~~ zend_stream In file included from /usr/include/php/Zend/zend.h:685, from /usr/include/php/main/php.h:34, from /tmp/B.ebtcnw/BUILD/php52-pecl-propro-2.1.0/src/php_propro_api.c:18: /tmp/B.ebtcnw/BUILD/php52-pecl-propro-2.1.0/src/php_propro_api.c: In function 'cleanup_container': /usr/include/php/Zend/zend_variables.h:55:48: warning: passing argument 1 of '_zval_ptr_dtor' from incompatible pointer type [-Wincompatible-pointer-types] #define zval_ptr_dtor(zval_ptr) _zval_ptr_dtor((zval_ptr) ZEND_FILE_LINE_CC) ^~~~~~~~~~ /tmp/B.ebtcnw/BUILD/php52-pecl-propro-2.1.0/src/php_propro_api.c:387:3: note: in expansion of macro 'zval_ptr_dtor' zval_ptr_dtor(container); ^~~~~~~~~~~~~ /usr/include/php/Zend/zend_variables.h:50:37: note: expected 'zval **' {aka 'struct _zval_struct **'} but argument is of type 'zval *' {aka 'struct _zval_struct *'} ZEND_API void _zval_ptr_dtor(zval **zval_ptr ZEND_FILE_LINE_DC); ~~~~~~~^~~~~~~~ /tmp/B.ebtcnw/BUILD/php52-pecl-propro-2.1.0/src/php_propro_api.c: In function 'separate_container': /tmp/B.ebtcnw/BUILD/php52-pecl-propro-2.1.0/src/php_propro_api.c:399:3: warning: implicit declaration of function 'ZVAL_ARR'; did you mean 'ZVAL_TRUE'? [-Wimplicit-function-declaration] ZVAL_ARR(container, zend_array_dup(Z_ARRVAL_P(container))); ^~~~~~~~ ZVAL_TRUE /tmp/B.ebtcnw/BUILD/php52-pecl-propro-2.1.0/src/php_propro_api.c:399:23: warning: implicit declaration of function 'zend_array_dup'; did you mean 'zend_strndup'? [-Wimplicit-function-declaration] ZVAL_ARR(container, zend_array_dup(Z_ARRVAL_P(container))); ^~~~~~~~~~~~~~ zend_strndup /tmp/B.ebtcnw/BUILD/php52-pecl-propro-2.1.0/src/php_propro_api.c:402:7: error: 'IS_UNDEF' undeclared (first use in this function); did you mean 'IS_UNUSED'? case IS_UNDEF: ^~~~~~~~ IS_UNUSED /tmp/B.ebtcnw/BUILD/php52-pecl-propro-2.1.0/src/php_propro_api.c:402:7: note: each undeclared identifier is reported only once for each function it appears in In file included from /usr/include/php/main/php.h:34, from /tmp/B.ebtcnw/BUILD/php52-pecl-propro-2.1.0/src/php_propro_api.c:18: /usr/include/php/Zend/zend.h:615:20: error: incompatible types when initializing type 'zval *' {aka 'struct _zval_struct *'} using type 'zval' {aka 'struct _zval_struct'} zval *orig_ptr = *(ppzv); \ ^ /tmp/B.ebtcnw/BUILD/php52-pecl-propro-2.1.0/src/php_propro_api.c:407:3: note: in expansion of macro 'SEPARATE_ZVAL' SEPARATE_ZVAL(container); ^~~~~~~~~~~~~ In file included from /usr/include/php/Zend/zend.h:242, from /usr/include/php/main/php.h:34, from /tmp/B.ebtcnw/BUILD/php52-pecl-propro-2.1.0/src/php_propro_api.c:18: /usr/include/php/Zend/zend_alloc.h:156:6: error: incompatible types when assigning to type 'zval' {aka 'struct _zval_struct'} from type 'zval *' {aka 'struct _zval_struct *'} (p) = (type *) emalloc(sizeof(type)) ^ /usr/include/php/Zend/zend_alloc.h:169:2: note: in expansion of macro 'ZEND_FAST_ALLOC' ZEND_FAST_ALLOC(z, zval, ZVAL_CACHE_LIST) ^~~~~~~~~~~~~~~ /usr/include/php/Zend/zend.h:619:4: note: in expansion of macro 'ALLOC_ZVAL' ALLOC_ZVAL(*(ppzv)); \ ^~~~~~~~~~ /tmp/B.ebtcnw/BUILD/php52-pecl-propro-2.1.0/src/php_propro_api.c:407:3: note: in expansion of macro 'SEPARATE_ZVAL' SEPARATE_ZVAL(container); ^~~~~~~~~~~~~ In file included from /usr/include/php/main/php.h:34, from /tmp/B.ebtcnw/BUILD/php52-pecl-propro-2.1.0/src/php_propro_api.c:18: /usr/include/php/Zend/zend.h:620:4: error: invalid type argument of unary '*' (have 'zval' {aka 'struct _zval_struct'}) **(ppzv) = *orig_ptr; \ ^~~~~~~~ /tmp/B.ebtcnw/BUILD/php52-pecl-propro-2.1.0/src/php_propro_api.c:407:3: note: in expansion of macro 'SEPARATE_ZVAL' SEPARATE_ZVAL(container); ^~~~~~~~~~~~~ In file included from /usr/include/php/Zend/zend.h:685, from /usr/include/php/main/php.h:34, from /tmp/B.ebtcnw/BUILD/php52-pecl-propro-2.1.0/src/php_propro_api.c:18: /usr/include/php/Zend/zend.h:621:19: error: incompatible type for argument 1 of '_zval_copy_ctor' zval_copy_ctor(*(ppzv)); \ /usr/include/php/Zend/zend_variables.h:53:49: note: in definition of macro 'zval_copy_ctor' #define zval_copy_ctor(zvalue) _zval_copy_ctor((zvalue) ZEND_FILE_LINE_CC) ^~~~~~ /tmp/B.ebtcnw/BUILD/php52-pecl-propro-2.1.0/src/php_propro_api.c:407:3: note: in expansion of macro 'SEPARATE_ZVAL' SEPARATE_ZVAL(container); ^~~~~~~~~~~~~ /usr/include/php/Zend/zend_variables.h:40:42: note: expected 'zval *' {aka 'struct _zval_struct *'} but argument is of type 'zval' {aka 'struct _zval_struct'} static inline void _zval_copy_ctor(zval *zvalue ZEND_FILE_LINE_DC) ~~~~~~^~~~~~ In file included from /usr/include/php/main/php.h:34, from /tmp/B.ebtcnw/BUILD/php52-pecl-propro-2.1.0/src/php_propro_api.c:18: /usr/include/php/Zend/zend.h:622:13: error: invalid type argument of '->' (have 'zval' {aka 'struct _zval_struct'}) (*(ppzv))->refcount=1; \ ^~ /tmp/B.ebtcnw/BUILD/php52-pecl-propro-2.1.0/src/php_propro_api.c:407:3: note: in expansion of macro 'SEPARATE_ZVAL' SEPARATE_ZVAL(container); ^~~~~~~~~~~~~ /usr/include/php/Zend/zend.h:623:13: error: invalid type argument of '->' (have 'zval' {aka 'struct _zval_struct'}) (*(ppzv))->is_ref = 0; \ ^~ /tmp/B.ebtcnw/BUILD/php52-pecl-propro-2.1.0/src/php_propro_api.c:407:3: note: in expansion of macro 'SEPARATE_ZVAL' SEPARATE_ZVAL(container); ^~~~~~~~~~~~~ /tmp/B.ebtcnw/BUILD/php52-pecl-propro-2.1.0/src/php_propro_api.c:408:3: warning: implicit declaration of function 'Z_TRY_ADDREF_P'; did you mean 'ZVAL_ADDREF'? [-Wimplicit-function-declaration] Z_TRY_ADDREF_P(container); ^~~~~~~~~~~~~~ ZVAL_ADDREF /tmp/B.ebtcnw/BUILD/php52-pecl-propro-2.1.0/src/php_propro_api.c: At top level: /tmp/B.ebtcnw/BUILD/php52-pecl-propro-2.1.0/src/php_propro_api.c:416:58: error: unknown type name 'zend_string'; did you mean 'zend_stream'? static inline zval *set_container_value(zval *container, zend_string *member, zval *value) ^~~~~~~~~~~ zend_stream /tmp/B.ebtcnw/BUILD/php52-pecl-propro-2.1.0/src/php_propro_api.c:430:68: error: macro "zend_hash_next_index_insert" requires 4 arguments, but only 2 given value = zend_hash_next_index_insert(Z_ARRVAL_P(container), value); ^ /tmp/B.ebtcnw/BUILD/php52-pecl-propro-2.1.0/src/php_propro_api.c: In function 'get_proxied_value': /tmp/B.ebtcnw/BUILD/php52-pecl-propro-2.1.0/src/php_propro_api.c:455:18: warning: implicit declaration of function 'get_container_value'; did you mean 'get_container'? [-Wimplicit-function-declaration] return_value = get_container_value(container, obj->proxy->member, return_value); ^~~~~~~~~~~~~~~~~~~ get_container /tmp/B.ebtcnw/BUILD/php52-pecl-propro-2.1.0/src/php_propro_api.c:455:16: warning: assignment to 'zval *' {aka 'struct _zval_struct *'} from 'int' makes pointer from integer without a cast [-Wint-conversion] return_value = get_container_value(container, obj->proxy->member, return_value); ^ /tmp/B.ebtcnw/BUILD/php52-pecl-propro-2.1.0/src/php_propro_api.c: In function 'set_proxied_value': /tmp/B.ebtcnw/BUILD/php52-pecl-propro-2.1.0/src/php_propro_api.c:478:3: warning: implicit declaration of function 'set_container_value'; did you mean 'set_container'? [-Wimplicit-function-declaration] set_container_value(container, obj->proxy->member, value); ^~~~~~~~~~~~~~~~~~~ set_container /tmp/B.ebtcnw/BUILD/php52-pecl-propro-2.1.0/src/php_propro_api.c:482:3: warning: implicit declaration of function 'Z_TRY_DELREF_P'; did you mean 'ZVAL_DELREF'? [-Wimplicit-function-declaration] Z_TRY_DELREF_P(value); ^~~~~~~~~~~~~~ ZVAL_DELREF /tmp/B.ebtcnw/BUILD/php52-pecl-propro-2.1.0/src/php_propro_api.c: In function 'read_dimension': /tmp/B.ebtcnw/BUILD/php52-pecl-propro-2.1.0/src/php_propro_api.c:493:2: error: unknown type name 'zend_string'; did you mean 'zend_stream'? zend_string *member = offset ? zval_get_string(offset) : NULL; ^~~~~~~~~~~ zend_stream /tmp/B.ebtcnw/BUILD/php52-pecl-propro-2.1.0/src/php_propro_api.c:493:33: warning: implicit declaration of function 'zval_get_string'; did you mean 'zend_eval_string'? [-Wimplicit-function-declaration] zend_string *member = offset ? zval_get_string(offset) : NULL; ^~~~~~~~~~~~~~~ zend_eval_string /tmp/B.ebtcnw/BUILD/php52-pecl-propro-2.1.0/src/php_propro_api.c:493:57: warning: pointer/integer type mismatch in conditional expression zend_string *member = offset ? zval_get_string(offset) : NULL; ^ In file included from /usr/include/php/main/php.h:38, from /tmp/B.ebtcnw/BUILD/php52-pecl-propro-2.1.0/src/php_propro_api.c:18: /usr/include/php/Zend/zend_API.h:488:10: error: invalid type argument of unary '*' (have 'int') *(z) = *(zv); \ ^~~~~ /usr/include/php/Zend/zend_API.h:513:38: note: in expansion of macro 'ZVAL_ZVAL' #define RETVAL_ZVAL(zv, copy, dtor) ZVAL_ZVAL(return_value, zv, copy, dtor) ^~~~~~~~~ /tmp/B.ebtcnw/BUILD/php52-pecl-propro-2.1.0/src/php_propro_api.c:508:4: note: in expansion of macro 'RETVAL_ZVAL' RETVAL_ZVAL(get_container_value(value, member, &tmp), 1, 0); ^~~~~~~~~~~ In file included from /usr/include/php/Zend/zend.h:684, from /usr/include/php/main/php.h:34, from /tmp/B.ebtcnw/BUILD/php52-pecl-propro-2.1.0/src/php_propro_api.c:18: /usr/include/php/Zend/zend_operators.h:412:33: error: invalid type argument of unary '*' (have 'int') #define Z_TYPE_P(zval_p) Z_TYPE(*zval_p) /usr/include/php/Zend/zend_operators.h:411:24: note: in definition of macro 'Z_TYPE' #define Z_TYPE(zval) (zval).type ^~~~ /usr/include/php/Zend/zend_API.h:451:3: note: in expansion of macro 'Z_TYPE_P' Z_TYPE_P(z) = IS_NULL; \ ^~~~~~~~ /usr/include/php/Zend/zend_API.h:494:5: note: in expansion of macro 'ZVAL_NULL' ZVAL_NULL(zv); \ ^~~~~~~~~ /usr/include/php/Zend/zend_API.h:513:38: note: in expansion of macro 'ZVAL_ZVAL' #define RETVAL_ZVAL(zv, copy, dtor) ZVAL_ZVAL(return_value, zv, copy, dtor) ^~~~~~~~~ /tmp/B.ebtcnw/BUILD/php52-pecl-propro-2.1.0/src/php_propro_api.c:508:4: note: in expansion of macro 'RETVAL_ZVAL' RETVAL_ZVAL(get_container_value(value, member, &tmp), 1, 0); ^~~~~~~~~~~ In file included from /usr/include/php/Zend/zend.h:685, from /usr/include/php/main/php.h:34, from /tmp/B.ebtcnw/BUILD/php52-pecl-propro-2.1.0/src/php_propro_api.c:18: /usr/include/php/Zend/zend_API.h:496:18: error: lvalue required as unary '&' operand zval_ptr_dtor(&zv); \ ^ /usr/include/php/Zend/zend_variables.h:55:49: note: in definition of macro 'zval_ptr_dtor' #define zval_ptr_dtor(zval_ptr) _zval_ptr_dtor((zval_ptr) ZEND_FILE_LINE_CC) ^~~~~~~~ /usr/include/php/Zend/zend_API.h:513:38: note: in expansion of macro 'ZVAL_ZVAL' #define RETVAL_ZVAL(zv, copy, dtor) ZVAL_ZVAL(return_value, zv, copy, dtor) ^~~~~~~~~ /tmp/B.ebtcnw/BUILD/php52-pecl-propro-2.1.0/src/php_propro_api.c:508:4: note: in expansion of macro 'RETVAL_ZVAL' RETVAL_ZVAL(get_container_value(value, member, &tmp), 1, 0); ^~~~~~~~~~~ /tmp/B.ebtcnw/BUILD/php52-pecl-propro-2.1.0/src/php_propro_api.c:520:14: warning: implicit declaration of function 'zend_long_to_str'; did you mean 'zend_do_cast'? [-Wimplicit-function-declaration] member = zend_long_to_str(zend_hash_next_free_element( ^~~~~~~~~~~~~~~~ zend_do_cast /tmp/B.ebtcnw/BUILD/php52-pecl-propro-2.1.0/src/php_propro_api.c:520:12: warning: assignment to 'int *' from 'int' makes pointer from integer without a cast [-Wint-conversion] member = zend_long_to_str(zend_hash_next_free_element( ^ /tmp/B.ebtcnw/BUILD/php52-pecl-propro-2.1.0/src/php_propro_api.c:523:12: warning: assignment to 'int *' from 'int' makes pointer from integer without a cast [-Wint-conversion] member = zend_long_to_str(0); ^ /tmp/B.ebtcnw/BUILD/php52-pecl-propro-2.1.0/src/php_propro_api.c:527:11: warning: implicit declaration of function 'php_property_proxy_init'; did you mean 'php_property_proxy_free'? [-Wimplicit-function-declaration] proxy = php_property_proxy_init(NULL, member); ^~~~~~~~~~~~~~~~~~~~~~~ php_property_proxy_free /tmp/B.ebtcnw/BUILD/php52-pecl-propro-2.1.0/src/php_propro_api.c:527:9: warning: assignment to 'php_property_proxy_t *' {aka 'struct php_property_proxy *'} from 'int' makes pointer from integer without a cast [-Wint-conversion] proxy = php_property_proxy_init(NULL, member); ^ /tmp/B.ebtcnw/BUILD/php52-pecl-propro-2.1.0/src/php_propro_api.c:530:3: warning: implicit declaration of function 'RETVAL_OBJ'; did you mean 'RETVAL_BOOL'? [-Wimplicit-function-declaration] RETVAL_OBJ(&proxy_obj->zo); ^~~~~~~~~~ RETVAL_BOOL /tmp/B.ebtcnw/BUILD/php52-pecl-propro-2.1.0/src/php_propro_api.c: In function 'has_dimension': /tmp/B.ebtcnw/BUILD/php52-pecl-propro-2.1.0/src/php_propro_api.c:556:3: error: unknown type name 'zend_string'; did you mean 'zend_stream'? zend_string *zs = zval_get_string(offset); ^~~~~~~~~~~ zend_stream /tmp/B.ebtcnw/BUILD/php52-pecl-propro-2.1.0/src/php_propro_api.c:556:21: warning: initialization of 'int *' from 'int' makes pointer from integer without a cast [-Wint-conversion] zend_string *zs = zval_get_string(offset); ^~~~~~~~~~~~~~~ /tmp/B.ebtcnw/BUILD/php52-pecl-propro-2.1.0/src/php_propro_api.c:560:57: warning: passing argument 2 of 'zend_symtable_find' from incompatible pointer type [-Wincompatible-pointer-types] zval *zentry = zend_symtable_find(Z_ARRVAL_P(value), zs); ^~ In file included from /usr/include/php/Zend/zend.h:276, from /usr/include/php/main/php.h:34, from /tmp/B.ebtcnw/BUILD/php52-pecl-propro-2.1.0/src/php_propro_api.c:18: /usr/include/php/Zend/zend_hash.h:352:59: note: expected 'char *' but argument is of type 'int *' static inline int zend_symtable_find(HashTable *ht, char *arKey, uint nKeyLength, void **pData) ~~~~~~^~~~~ /tmp/B.ebtcnw/BUILD/php52-pecl-propro-2.1.0/src/php_propro_api.c:560:19: error: too few arguments to function 'zend_symtable_find' zval *zentry = zend_symtable_find(Z_ARRVAL_P(value), zs); ^~~~~~~~~~~~~~~~~~ In file included from /usr/include/php/Zend/zend.h:276, from /usr/include/php/main/php.h:34, from /tmp/B.ebtcnw/BUILD/php52-pecl-propro-2.1.0/src/php_propro_api.c:18: /usr/include/php/Zend/zend_hash.h:352:19: note: declared here static inline int zend_symtable_find(HashTable *ht, char *arKey, uint nKeyLength, void **pData) ^~~~~~~~~~~~~~~~~~ /tmp/B.ebtcnw/BUILD/php52-pecl-propro-2.1.0/src/php_propro_api.c:564:16: warning: implicit declaration of function 'Z_ISNULL_P'; did you mean 'Z_ARRVAL_P'? [-Wimplicit-function-declaration] exists = !Z_ISNULL_P(zentry); ^~~~~~~~~~ Z_ARRVAL_P /tmp/B.ebtcnw/BUILD/php52-pecl-propro-2.1.0/src/php_propro_api.c: In function 'write_dimension': /tmp/B.ebtcnw/BUILD/php52-pecl-propro-2.1.0/src/php_propro_api.c:582:2: error: unknown type name 'zend_string'; did you mean 'zend_stream'? zend_string *zs = NULL; ^~~~~~~~~~~ zend_stream /tmp/B.ebtcnw/BUILD/php52-pecl-propro-2.1.0/src/php_propro_api.c:588:6: warning: assignment to 'int *' from 'int' makes pointer from integer without a cast [-Wint-conversion] zs = zval_get_string(offset); ^ /tmp/B.ebtcnw/BUILD/php52-pecl-propro-2.1.0/src/php_propro_api.c: In function 'unset_dimension': /tmp/B.ebtcnw/BUILD/php52-pecl-propro-2.1.0/src/php_propro_api.c:617:3: error: unknown type name 'zend_string'; did you mean 'zend_stream'? zend_string *o = zval_get_string(offset); ^~~~~~~~~~~ zend_stream /tmp/B.ebtcnw/BUILD/php52-pecl-propro-2.1.0/src/php_propro_api.c:617:20: warning: initialization of 'int *' from 'int' makes pointer from integer without a cast [-Wint-conversion] zend_string *o = zval_get_string(offset); ^~~~~~~~~~~~~~~ /tmp/B.ebtcnw/BUILD/php52-pecl-propro-2.1.0/src/php_propro_api.c:619:3: warning: implicit declaration of function 'SEPARATE_ARRAY'; did you mean 'SEPARATE_ZVAL'? [-Wimplicit-function-declaration] SEPARATE_ARRAY(array); ^~~~~~~~~~~~~~ SEPARATE_ZVAL /tmp/B.ebtcnw/BUILD/php52-pecl-propro-2.1.0/src/php_propro_api.c:620:40: warning: passing argument 2 of 'zend_symtable_del' from incompatible pointer type [-Wincompatible-pointer-types] zend_symtable_del(Z_ARRVAL_P(array), o); ^ In file included from /usr/include/php/Zend/zend.h:276, from /usr/include/php/main/php.h:34, from /tmp/B.ebtcnw/BUILD/php52-pecl-propro-2.1.0/src/php_propro_api.c:18: /usr/include/php/Zend/zend_hash.h:345:58: note: expected 'char *' but argument is of type 'int *' static inline int zend_symtable_del(HashTable *ht, char *arKey, uint nKeyLength) ~~~~~~^~~~~ /tmp/B.ebtcnw/BUILD/php52-pecl-propro-2.1.0/src/php_propro_api.c:620:3: error: too few arguments to function 'zend_symtable_del' zend_symtable_del(Z_ARRVAL_P(array), o); ^~~~~~~~~~~~~~~~~ In file included from /usr/include/php/Zend/zend.h:276, from /usr/include/php/main/php.h:34, from /tmp/B.ebtcnw/BUILD/php52-pecl-propro-2.1.0/src/php_propro_api.c:18: /usr/include/php/Zend/zend_hash.h:345:19: note: declared here static inline int zend_symtable_del(HashTable *ht, char *arKey, uint nKeyLength) ^~~~~~~~~~~~~~~~~ /tmp/B.ebtcnw/BUILD/php52-pecl-propro-2.1.0/src/php_propro_api.c: In function 'zim_propro___construct': /tmp/B.ebtcnw/BUILD/php52-pecl-propro-2.1.0/src/php_propro_api.c:636:2: error: unknown type name 'zend_error_handling'; did you mean 'php_std_error_handling'? zend_error_handling zeh; ^~~~~~~~~~~~~~~~~~~ php_std_error_handling /tmp/B.ebtcnw/BUILD/php52-pecl-propro-2.1.0/src/php_propro_api.c:638:2: error: unknown type name 'zend_string'; did you mean 'zend_stream'? zend_string *member; ^~~~~~~~~~~ zend_stream /tmp/B.ebtcnw/BUILD/php52-pecl-propro-2.1.0/src/php_propro_api.c:640:2: warning: implicit declaration of function 'zend_replace_error_handling'; did you mean 'php_set_error_handling'? [-Wimplicit-function-declaration] zend_replace_error_handling(EH_THROW, NULL, &zeh); ^~~~~~~~~~~~~~~~~~~~~~~~~~~ php_set_error_handling /tmp/B.ebtcnw/BUILD/php52-pecl-propro-2.1.0/src/php_propro_api.c:650:15: warning: assignment to 'php_property_proxy_t *' {aka 'struct php_property_proxy *'} from 'int' makes pointer from integer without a cast [-Wint-conversion] obj->proxy = php_property_proxy_init(NULL, member); ^ /tmp/B.ebtcnw/BUILD/php52-pecl-propro-2.1.0/src/php_propro_api.c:653:15: warning: assignment to 'php_property_proxy_t *' {aka 'struct php_property_proxy *'} from 'int' makes pointer from integer without a cast [-Wint-conversion] obj->proxy = php_property_proxy_init(container, member); ^ /tmp/B.ebtcnw/BUILD/php52-pecl-propro-2.1.0/src/php_propro_api.c:658:2: warning: implicit declaration of function 'zend_restore_error_handling'; did you mean 'php_set_error_handling'? [-Wimplicit-function-declaration] zend_restore_error_handling(&zeh); ^~~~~~~~~~~~~~~~~~~~~~~~~~~ php_set_error_handling /tmp/B.ebtcnw/BUILD/php52-pecl-propro-2.1.0/src/php_propro_api.c: In function 'zm_startup_propro': /tmp/B.ebtcnw/BUILD/php52-pecl-propro-2.1.0/src/php_propro_api.c:670:2: warning: implicit declaration of function 'INIT_NS_CLASS_ENTRY'; did you mean 'INIT_CLASS_ENTRY'? [-Wimplicit-function-declaration] INIT_NS_CLASS_ENTRY(ce, "php", "PropertyProxy", ^~~~~~~~~~~~~~~~~~~ INIT_CLASS_ENTRY /tmp/B.ebtcnw/BUILD/php52-pecl-propro-2.1.0/src/php_propro_api.c:673:48: warning: assignment to 'zend_object_value (*)(zend_class_entry *)' {aka 'struct _zend_object_value (*)(struct _zend_class_entry *)'} from incompatible pointer type 'zend_object * (*)(zend_class_entry *)' {aka 'struct _zend_object * (*)(struct _zend_class_entry *)'} [-Wincompatible-pointer-types] php_property_proxy_class_entry->create_object = php_property_proxy_object_new; ^ /tmp/B.ebtcnw/BUILD/php52-pecl-propro-2.1.0/src/php_propro_api.c:678:37: error: 'zend_object_handlers' {aka 'struct _zend_object_handlers'} has no member named 'offset'; did you mean 'set'? php_property_proxy_object_handlers.offset = XtOffsetOf(php_property_proxy_object_t, zo); ^~~~~~ set /tmp/B.ebtcnw/BUILD/php52-pecl-propro-2.1.0/src/php_propro_api.c:679:37: error: 'zend_object_handlers' {aka 'struct _zend_object_handlers'} has no member named 'free_obj'; did you mean 'clone_obj'? php_property_proxy_object_handlers.free_obj = destroy_obj; ^~~~~~~~ clone_obj /tmp/B.ebtcnw/BUILD/php52-pecl-propro-2.1.0/src/php_propro_api.c:680:37: error: 'zend_object_handlers' {aka 'struct _zend_object_handlers'} has no member named 'get_gc'; did you mean 'get'? php_property_proxy_object_handlers.get_gc = get_gc; ^~~~~~ get /tmp/B.ebtcnw/BUILD/php52-pecl-propro-2.1.0/src/php_propro_api.c:681:36: error: 'zend_object_handlers' {aka 'struct _zend_object_handlers'} has no member named 'get_debug_info' php_property_proxy_object_handlers.get_debug_info = get_debug_info; ^ /tmp/B.ebtcnw/BUILD/php52-pecl-propro-2.1.0/src/php_propro_api.c:682:41: warning: assignment to 'zend_object_set_t' {aka 'void (*)(struct _zval_struct **, struct _zval_struct *)'} from incompatible pointer type 'void (*)(zval *, zval *)' {aka 'void (*)(struct _zval_struct *, struct _zval_struct *)'} [-Wincompatible-pointer-types] php_property_proxy_object_handlers.set = set_obj; ^ /tmp/B.ebtcnw/BUILD/php52-pecl-propro-2.1.0/src/php_propro_api.c:683:41: warning: assignment to 'zend_object_get_t' {aka 'struct _zval_struct * (*)(struct _zval_struct *)'} from incompatible pointer type 'zval * (*)(zval *, zval *)' {aka 'struct _zval_struct * (*)(struct _zval_struct *, struct _zval_struct *)'} [-Wincompatible-pointer-types] php_property_proxy_object_handlers.get = get_obj; ^ /tmp/B.ebtcnw/BUILD/php52-pecl-propro-2.1.0/src/php_propro_api.c:685:52: warning: assignment to 'zend_object_read_dimension_t' {aka 'struct _zval_struct * (*)(struct _zval_struct *, struct _zval_struct *, int)'} from incompatible pointer type 'zval * (*)(zval *, zval *, int, zval *)' {aka 'struct _zval_struct * (*)(struct _zval_struct *, struct _zval_struct *, int, struct _zval_struct *)'} [-Wincompatible-pointer-types] php_property_proxy_object_handlers.read_dimension = read_dimension; ^ /tmp/B.ebtcnw/BUILD/php52-pecl-propro-2.1.0/src/php_propro_api.c: At top level: /tmp/B.ebtcnw/BUILD/php52-pecl-propro-2.1.0/src/php_propro_api.c:708:2: warning: initialization discards 'const' qualifier from pointer target type [-Wdiscarded-qualifiers] propro_functions, ^~~~~~~~~~~~~~~~ make: *** [Makefile:203: src/php_propro_api.lo] Error 1 error: Bad exit status from /tmp/B.ebtcnw/BUILD/tmp/rpm-tmp.62404 (%build) RPM build errors: Bad exit status from /tmp/B.ebtcnw/BUILD/tmp/rpm-tmp.62404 (%build) ended at: Thu Oct 11 18:48:01 2018, done in 0:00:06.035891 error: No files produced. + chmod -R u+rwX /tmp/B.ebtcnw/BUILD + rm -rf /tmp/B.ebtcnw/tmp /tmp/B.ebtcnw/BUILD + rm -rf /tmp/B.ebtcnw Begin-PLD-Builder-Info Build-Time: user:15.02s sys:2.64s real:26.39s (faults io:0 non-io:719032) End-PLD-Builder-Info
[Back to list of logs] [View rpm -qa of builder]