FailedOk

th/SRPMS[OK]
th/x32[OK]
th/i686[OK]
th/x86_64[OK]

ac/SRPMS[OK]
ac/i386[OK]
ac/i586[OK]
ac/i686[OK]
ac/alpha[OK]
ac/amd64[OK]
ac/athlon[OK]
ac/ppc[OK]
ac/sparc[OK]
ac/sparc64[OK]

Advanced Search
main()
Powered by PLD Linux
(c) 2002-2020 PLD Team
$Revision: 1.37 $
Powered by Leppe'.
Your IP: 18.232.146.10

php-pecl-ssh2 8cdb0722-e62f-4233-9bf6-614e96be8e37

Status:Failed
Source URL:https://buildlogs.pld-linux.org/pld/th/x32/FAIL/php-pecl-ssh2,8cdb0722-e62f-4233-9bf6-614e96be8e37.bz2
text/plain URL:View!
full text:View!
rpm -qa of builder:View!
Date:2020/11/19 15:18:29
Runtime:0:00:05.265131

Toc:

  • error 1
  • /tmp/B.uL3daO/BUILD/php80-pecl-ssh2-1.2/ssh2.c:49:2: error: initializer element is not constant
  • error 2
  • /tmp/B.uL3daO/BUILD/php80-pecl-ssh2-1.2/ssh2.c:443:6: error: void value not ignored as it ought to be
  • error 3
  • /tmp/B.uL3daO/BUILD/php80-pecl-ssh2-1.2/ssh2.c:443:41: error: invalid operands to binary != (have 'const zend_internal_arg_info[1]' {aka 'const struct _zend_internal_arg_info[1]'} and 'int')
  • error 4
  • error: Bad exit status from /tmp/B.uL3daO/BUILD/tmp/rpm-tmp.65912 (%build)
  • error 5
  • RPM build errors:
  • error 6
  • error: No files produced.

Content:

checking for suffix of executables... 
checking whether we are cross compiling... no
checking for suffix of object files... o
checking whether we are using the GNU C compiler... yes
checking whether x86_64-pld-linux-gnux32-gcc accepts -g... yes
checking for x86_64-pld-linux-gnux32-gcc option to accept ISO C89... none needed
checking how to run the C preprocessor... x86_64-pld-linux-gnux32-gcc -E
checking for icc... no
checking for suncc... no
checking for system library directory... lib
checking if compiler supports -R... no
checking if compiler supports -Wl,-rpath,... yes
checking build system type... x86_64-pld-linux-gnux32
checking host system type... x86_64-pld-linux-gnux32
checking target system type... x86_64-pld-linux-gnux32
checking for PHP prefix... /usr
checking for PHP includes... -I/usr/include/php -I/usr/include/php/main -I/usr/include/php/TSRM -I/usr/include/php/Zend -I/usr/include/php/ext -I/usr/include/php/ext/date/lib
checking for PHP extension directory... /usr/libx32/php80
checking for PHP installed headers prefix... /usr/include/php
checking if debug is enabled... no
checking if zts is enabled... no
checking for gawk... gawk
checking for ssh2 support... yes, shared
checking for ssh2 files in default path... found in /usr
checking for libssh2_session_hostkey in -lssh2... yes
checking for libssh2_agent_init in -lssh2... yes
checking for libssh2_session_set_timeout in -lssh2... yes
checking how to print strings... print -r
checking for a sed that does not truncate output... (cached) /bin/sed
checking for fgrep... /bin/grep -F
checking for ld used by x86_64-pld-linux-gnux32-gcc... /usr/bin/ld
checking if the linker (/usr/bin/ld) is GNU ld... yes
checking for BSD- or MS-compatible name lister (nm)... /usr/bin/nm -B
checking the name lister (/usr/bin/nm -B) interface... BSD nm
checking whether ln -s works... yes
checking the maximum length of command line arguments... 1572864
checking how to convert x86_64-pld-linux-gnux32 file names to x86_64-pld-linux-gnux32 format... func_convert_file_noop
checking how to convert x86_64-pld-linux-gnux32 file names to toolchain format... func_convert_file_noop
checking for /usr/bin/ld option to reload object files... -r
checking for x86_64-pld-linux-gnux32-objdump... no
checking for objdump... objdump
checking how to recognize dependent libraries... pass_all
checking for x86_64-pld-linux-gnux32-dlltool... no
checking for dlltool... no
checking how to associate runtime and link libraries... print -r --
checking for x86_64-pld-linux-gnux32-ar... no
checking for ar... ar
checking for archiver @FILE support... @
checking for x86_64-pld-linux-gnux32-strip... no
checking for strip... strip
checking for x86_64-pld-linux-gnux32-ranlib... no
checking for ranlib... ranlib
checking for mawk... (cached) gawk
checking command to parse /usr/bin/nm -B output from x86_64-pld-linux-gnux32-gcc object... ok
checking for sysroot... no
checking for a working dd... /bin/dd
checking how to truncate binary pipes... /bin/dd bs=4096 count=1
checking for x86_64-pld-linux-gnux32-mt... no
checking for mt... no
checking if : is a manifest tool... no
checking for ANSI C header files... yes
checking for sys/types.h... yes
checking for sys/stat.h... yes
checking for stdlib.h... yes
checking for string.h... yes
checking for memory.h... yes
checking for strings.h... yes
checking for inttypes.h... yes
checking for stdint.h... yes
checking for unistd.h... yes
checking for dlfcn.h... yes
checking for objdir... .libs
checking if x86_64-pld-linux-gnux32-gcc supports -fno-rtti -fno-exceptions... no
checking for x86_64-pld-linux-gnux32-gcc option to produce PIC... -fPIC -DPIC
checking if x86_64-pld-linux-gnux32-gcc PIC flag -fPIC -DPIC works... yes
checking if x86_64-pld-linux-gnux32-gcc static flag -static works... yes
checking if x86_64-pld-linux-gnux32-gcc supports -c -o file.o... yes
checking if x86_64-pld-linux-gnux32-gcc supports -c -o file.o... (cached) yes
checking whether the x86_64-pld-linux-gnux32-gcc linker (/usr/bin/ld -m elf32_x86_64) supports shared libraries... yes
checking whether -lc should be explicitly linked in... no
checking dynamic linker characteristics... GNU/Linux ld.so
checking how to hardcode library paths into programs... immediate
checking whether stripping libraries is possible... yes
checking if libtool supports shared libraries... yes
checking whether to build shared libraries... yes
checking whether to build static libraries... no
configure: patching config.h.in
configure: creating ./config.status
config.status: creating config.h
config.status: executing libtool commands
+ /usr/bin/make -Otarget -j9
/bin/sh /tmp/B.uL3daO/BUILD/php80-pecl-ssh2-1.2/libtool --mode=compile x86_64-pld-linux-gnux32-gcc -I. -I/tmp/B.uL3daO/BUILD/php80-pecl-ssh2-1.2 -I/tmp/B.uL3daO/BUILD/php80-pecl-ssh2-1.2/include -I/tmp/B.uL3daO/BUILD/php80-pecl-ssh2-1.2/main -I/tmp/B.uL3daO/BUILD/php80-pecl-ssh2-1.2 -I/usr/include/php -I/usr/include/php/main -I/usr/include/php/TSRM -I/usr/include/php/Zend -I/usr/include/php/ext -I/usr/include/php/ext/date/lib  -DHAVE_CONFIG_H  -O2 -fwrapv -pipe -Wformat -Werror=format-security -gdwarf-4 -fno-debug-types-section -fvar-tracking-assignments -g2 -Wp,-D_FORTIFY_SOURCE=2 -fstack-protector-strong --param=ssp-buffer-size=4 -Werror=trampolines -fPIC -mtune=generic -march=x86-64 -gdwarf-4 -fno-debug-types-section -fvar-tracking-assignments -g2    -c /tmp/B.uL3daO/BUILD/php80-pecl-ssh2-1.2/ssh2.c -o ssh2.lo 
libtool: compile:  x86_64-pld-linux-gnux32-gcc -I. -I/tmp/B.uL3daO/BUILD/php80-pecl-ssh2-1.2 -I/tmp/B.uL3daO/BUILD/php80-pecl-ssh2-1.2/include -I/tmp/B.uL3daO/BUILD/php80-pecl-ssh2-1.2/main -I/tmp/B.uL3daO/BUILD/php80-pecl-ssh2-1.2 -I/usr/include/php -I/usr/include/php/main -I/usr/include/php/TSRM -I/usr/include/php/Zend -I/usr/include/php/ext -I/usr/include/php/ext/date/lib -DHAVE_CONFIG_H -O2 -fwrapv -pipe -Wformat -Werror=format-security -gdwarf-4 -fno-debug-types-section -fvar-tracking-assignments -g2 -Wp,-D_FORTIFY_SOURCE=2 -fstack-protector-strong --param=ssp-buffer-size=4 -Werror=trampolines -fPIC -mtune=generic -march=x86-64 -gdwarf-4 -fno-debug-types-section -fvar-tracking-assignments -g2 -c /tmp/B.uL3daO/BUILD/php80-pecl-ssh2-1.2/ssh2.c  -fPIC -DPIC -o .libs/ssh2.o
/tmp/B.uL3daO/BUILD/php80-pecl-ssh2-1.2/ssh2.c:49:2: warning: implicit declaration of function 'ZEND_ARG_PASS_INFO'; did you mean 'ZEND_ARG_OBJ_INFO'? [-Wimplicit-function-declaration]
   49 |  ZEND_ARG_PASS_INFO(1)
      |  ^~~~~~~~~~~~~~~~~~
      |  ZEND_ARG_OBJ_INFO
/tmp/B.uL3daO/BUILD/php80-pecl-ssh2-1.2/ssh2.c:49:2: warning: initialization of 'const char *' from 'int' makes pointer from integer without a cast [-Wint-conversion]
/tmp/B.uL3daO/BUILD/php80-pecl-ssh2-1.2/ssh2.c:49:2: note: (near initialization for 'php_ssh2_first_arg_force_ref[1].name')
/tmp/B.uL3daO/BUILD/php80-pecl-ssh2-1.2/ssh2.c:49:2: error: initializer element is not constant
/tmp/B.uL3daO/BUILD/php80-pecl-ssh2-1.2/ssh2.c:49:2: note: (near initialization for 'php_ssh2_first_arg_force_ref[1].name')
/tmp/B.uL3daO/BUILD/php80-pecl-ssh2-1.2/ssh2.c: In function 'php_ssh2_debug_cb':
/tmp/B.uL3daO/BUILD/php80-pecl-ssh2-1.2/ssh2.c:103:17: warning: implicit declaration of function 'call_user_function_ex'; did you mean 'call_user_function'? [-Wimplicit-function-declaration]
  103 |  if (FAILURE == call_user_function_ex(NULL, NULL, data->disconnect_cb, NULL, 3, args, 0, NULL)) {
      |                 ^~~~~~~~~~~~~~~~~~~~~
      |                 call_user_function
/tmp/B.uL3daO/BUILD/php80-pecl-ssh2-1.2/ssh2.c: In function 'zif_ssh2_disconnect':
/tmp/B.uL3daO/BUILD/php80-pecl-ssh2-1.2/ssh2.c:443:6: error: void value not ignored as it ought to be
  443 |  if (zend_list_close(Z_RES_P(zsession)) != SUCCESS) {
      |      ^~~~~~~~~~~~~~~~~~~~~~~~~~~~~~~~~~
/tmp/B.uL3daO/BUILD/php80-pecl-ssh2-1.2/ssh2.c:443:41: error: invalid operands to binary != (have 'const zend_internal_arg_info[1]' {aka 'const struct _zend_internal_arg_info[1]'} and 'int')
  443 |  if (zend_list_close(Z_RES_P(zsession)) != SUCCESS) {
      |      ~~~~~~~~~~~~~~~~~~~~~~~~~~~~~~~~~~ ^~
      |      |
      |      void
make: *** [Makefile:228: ssh2.lo] Error 1
make: *** Waiting for unfinished jobs....
/bin/sh /tmp/B.uL3daO/BUILD/php80-pecl-ssh2-1.2/libtool --mode=compile x86_64-pld-linux-gnux32-gcc -I. -I/tmp/B.uL3daO/BUILD/php80-pecl-ssh2-1.2 -I/tmp/B.uL3daO/BUILD/php80-pecl-ssh2-1.2/include -I/tmp/B.uL3daO/BUILD/php80-pecl-ssh2-1.2/main -I/tmp/B.uL3daO/BUILD/php80-pecl-ssh2-1.2 -I/usr/include/php -I/usr/include/php/main -I/usr/include/php/TSRM -I/usr/include/php/Zend -I/usr/include/php/ext -I/usr/include/php/ext/date/lib  -DHAVE_CONFIG_H  -O2 -fwrapv -pipe -Wformat -Werror=format-security -gdwarf-4 -fno-debug-types-section -fvar-tracking-assignments -g2 -Wp,-D_FORTIFY_SOURCE=2 -fstack-protector-strong --param=ssp-buffer-size=4 -Werror=trampolines -fPIC -mtune=generic -march=x86-64 -gdwarf-4 -fno-debug-types-section -fvar-tracking-assignments -g2    -c /tmp/B.uL3daO/BUILD/php80-pecl-ssh2-1.2/ssh2_sftp.c -o ssh2_sftp.lo 
libtool: compile:  x86_64-pld-linux-gnux32-gcc -I. -I/tmp/B.uL3daO/BUILD/php80-pecl-ssh2-1.2 -I/tmp/B.uL3daO/BUILD/php80-pecl-ssh2-1.2/include -I/tmp/B.uL3daO/BUILD/php80-pecl-ssh2-1.2/main -I/tmp/B.uL3daO/BUILD/php80-pecl-ssh2-1.2 -I/usr/include/php -I/usr/include/php/main -I/usr/include/php/TSRM -I/usr/include/php/Zend -I/usr/include/php/ext -I/usr/include/php/ext/date/lib -DHAVE_CONFIG_H -O2 -fwrapv -pipe -Wformat -Werror=format-security -gdwarf-4 -fno-debug-types-section -fvar-tracking-assignments -g2 -Wp,-D_FORTIFY_SOURCE=2 -fstack-protector-strong --param=ssp-buffer-size=4 -Werror=trampolines -fPIC -mtune=generic -march=x86-64 -gdwarf-4 -fno-debug-types-section -fvar-tracking-assignments -g2 -c /tmp/B.uL3daO/BUILD/php80-pecl-ssh2-1.2/ssh2_sftp.c  -fPIC -DPIC -o .libs/ssh2_sftp.o
/tmp/B.uL3daO/BUILD/php80-pecl-ssh2-1.2/ssh2_sftp.c:203:2: warning: initialization of 'ssize_t (*)(php_stream *, const char *, size_t)' {aka 'int (*)(struct _php_stream *, const char *, unsigned int)'} from incompatible pointer type 'size_t (*)(php_stream *, const char *, size_t)' {aka 'unsigned int (*)(struct _php_stream *, const char *, unsigned int)'} [-Wincompatible-pointer-types]
  203 |  php_ssh2_sftp_stream_write,
      |  ^~~~~~~~~~~~~~~~~~~~~~~~~~
/tmp/B.uL3daO/BUILD/php80-pecl-ssh2-1.2/ssh2_sftp.c:203:2: note: (near initialization for 'php_ssh2_sftp_stream_ops.write')
/tmp/B.uL3daO/BUILD/php80-pecl-ssh2-1.2/ssh2_sftp.c:204:2: warning: initialization of 'ssize_t (*)(php_stream *, char *, size_t)' {aka 'int (*)(struct _php_stream *, char *, unsigned int)'} from incompatible pointer type 'size_t (*)(php_stream *, char *, size_t)' {aka 'unsigned int (*)(struct _php_stream *, char *, unsigned int)'} [-Wincompatible-pointer-types]
  204 |  php_ssh2_sftp_stream_read,
      |  ^~~~~~~~~~~~~~~~~~~~~~~~~
/tmp/B.uL3daO/BUILD/php80-pecl-ssh2-1.2/ssh2_sftp.c:204:2: note: (near initialization for 'php_ssh2_sftp_stream_ops.read')
/tmp/B.uL3daO/BUILD/php80-pecl-ssh2-1.2/ssh2_sftp.c:309:2: warning: initialization of 'ssize_t (*)(php_stream *, char *, size_t)' {aka 'int (*)(struct _php_stream *, char *, unsigned int)'} from incompatible pointer type 'size_t (*)(php_stream *, char *, size_t)' {aka 'unsigned int (*)(struct _php_stream *, char *, unsigned int)'} [-Wincompatible-pointer-types]
  309 |  php_ssh2_sftp_dirstream_read,
      |  ^~~~~~~~~~~~~~~~~~~~~~~~~~~~
/tmp/B.uL3daO/BUILD/php80-pecl-ssh2-1.2/ssh2_sftp.c:309:2: note: (near initialization for 'php_ssh2_sftp_dirstream_ops.read')
/bin/sh /tmp/B.uL3daO/BUILD/php80-pecl-ssh2-1.2/libtool --mode=compile x86_64-pld-linux-gnux32-gcc -I. -I/tmp/B.uL3daO/BUILD/php80-pecl-ssh2-1.2 -I/tmp/B.uL3daO/BUILD/php80-pecl-ssh2-1.2/include -I/tmp/B.uL3daO/BUILD/php80-pecl-ssh2-1.2/main -I/tmp/B.uL3daO/BUILD/php80-pecl-ssh2-1.2 -I/usr/include/php -I/usr/include/php/main -I/usr/include/php/TSRM -I/usr/include/php/Zend -I/usr/include/php/ext -I/usr/include/php/ext/date/lib  -DHAVE_CONFIG_H  -O2 -fwrapv -pipe -Wformat -Werror=format-security -gdwarf-4 -fno-debug-types-section -fvar-tracking-assignments -g2 -Wp,-D_FORTIFY_SOURCE=2 -fstack-protector-strong --param=ssp-buffer-size=4 -Werror=trampolines -fPIC -mtune=generic -march=x86-64 -gdwarf-4 -fno-debug-types-section -fvar-tracking-assignments -g2    -c /tmp/B.uL3daO/BUILD/php80-pecl-ssh2-1.2/ssh2_fopen_wrappers.c -o ssh2_fopen_wrappers.lo 
libtool: compile:  x86_64-pld-linux-gnux32-gcc -I. -I/tmp/B.uL3daO/BUILD/php80-pecl-ssh2-1.2 -I/tmp/B.uL3daO/BUILD/php80-pecl-ssh2-1.2/include -I/tmp/B.uL3daO/BUILD/php80-pecl-ssh2-1.2/main -I/tmp/B.uL3daO/BUILD/php80-pecl-ssh2-1.2 -I/usr/include/php -I/usr/include/php/main -I/usr/include/php/TSRM -I/usr/include/php/Zend -I/usr/include/php/ext -I/usr/include/php/ext/date/lib -DHAVE_CONFIG_H -O2 -fwrapv -pipe -Wformat -Werror=format-security -gdwarf-4 -fno-debug-types-section -fvar-tracking-assignments -g2 -Wp,-D_FORTIFY_SOURCE=2 -fstack-protector-strong --param=ssp-buffer-size=4 -Werror=trampolines -fPIC -mtune=generic -march=x86-64 -gdwarf-4 -fno-debug-types-section -fvar-tracking-assignments -g2 -c /tmp/B.uL3daO/BUILD/php80-pecl-ssh2-1.2/ssh2_fopen_wrappers.c  -fPIC -DPIC -o .libs/ssh2_fopen_wrappers.o
/tmp/B.uL3daO/BUILD/php80-pecl-ssh2-1.2/ssh2_fopen_wrappers.c: In function 'php_ssh2_channel_stream_write':
/tmp/B.uL3daO/BUILD/php80-pecl-ssh2-1.2/ssh2_fopen_wrappers.c:74:55: warning: format '%ld' expects argument of type 'long int', but argument 5 has type 'size_t' {aka 'unsigned int'} [-Wformat=]
   74 |    php_error_docref(NULL, E_WARNING, "Failure '%s' (%ld)", error_msg, writestate);
      |                                                     ~~^               ~~~~~~~~~~
      |                                                       |               |
      |                                                       long int        size_t {aka unsigned int}
      |                                                     %d
/tmp/B.uL3daO/BUILD/php80-pecl-ssh2-1.2/ssh2_fopen_wrappers.c: In function 'php_ssh2_channel_stream_read':
/tmp/B.uL3daO/BUILD/php80-pecl-ssh2-1.2/ssh2_fopen_wrappers.c:114:55: warning: format '%ld' expects argument of type 'long int', but argument 5 has type 'ssize_t' {aka 'int'} [-Wformat=]
  114 |    php_error_docref(NULL, E_WARNING, "Failure '%s' (%ld)", error_msg, readstate);
      |                                                     ~~^               ~~~~~~~~~
      |                                                       |               |
      |                                                       long int        ssize_t {aka int}
      |                                                     %d
/tmp/B.uL3daO/BUILD/php80-pecl-ssh2-1.2/ssh2_fopen_wrappers.c: At top level:
/tmp/B.uL3daO/BUILD/php80-pecl-ssh2-1.2/ssh2_fopen_wrappers.c:184:2: warning: initialization of 'ssize_t (*)(php_stream *, const char *, size_t)' {aka 'int (*)(struct _php_stream *, const char *, unsigned int)'} from incompatible pointer type 'size_t (*)(php_stream *, const char *, size_t)' {aka 'unsigned int (*)(struct _php_stream *, const char *, unsigned int)'} [-Wincompatible-pointer-types]
  184 |  php_ssh2_channel_stream_write,
      |  ^~~~~~~~~~~~~~~~~~~~~~~~~~~~~
/tmp/B.uL3daO/BUILD/php80-pecl-ssh2-1.2/ssh2_fopen_wrappers.c:184:2: note: (near initialization for 'php_ssh2_channel_stream_ops.write')
/tmp/B.uL3daO/BUILD/php80-pecl-ssh2-1.2/ssh2_fopen_wrappers.c:185:2: warning: initialization of 'ssize_t (*)(php_stream *, char *, size_t)' {aka 'int (*)(struct _php_stream *, char *, unsigned int)'} from incompatible pointer type 'size_t (*)(php_stream *, char *, size_t)' {aka 'unsigned int (*)(struct _php_stream *, char *, unsigned int)'} [-Wincompatible-pointer-types]
  185 |  php_ssh2_channel_stream_read,
      |  ^~~~~~~~~~~~~~~~~~~~~~~~~~~~
/tmp/B.uL3daO/BUILD/php80-pecl-ssh2-1.2/ssh2_fopen_wrappers.c:185:2: note: (near initialization for 'php_ssh2_channel_stream_ops.read')
error: Bad exit status from /tmp/B.uL3daO/BUILD/tmp/rpm-tmp.65912 (%build)


RPM build errors:
    Bad exit status from /tmp/B.uL3daO/BUILD/tmp/rpm-tmp.65912 (%build)
ended at: Thu Nov 19 15:18:29 2020, done in 0:00:05.265131
error: No files produced.
+ chmod -R u+rwX /tmp/B.uL3daO/BUILD
+ rm -rf /tmp/B.uL3daO/tmp /tmp/B.uL3daO/BUILD
+ rm -rf /tmp/B.uL3daO
Begin-PLD-Builder-Info
Build-Time: user:7.52s sys:1.75s real:8.16s (faults io:0 non-io:436097)

End-PLD-Builder-Info
[Back to list of logs] [View rpm -qa of builder]