FailedOk

th/SRPMS[OK]
th/x32[OK]
th/i686[OK]
th/x86_64[OK]

ac/SRPMS[OK]
ac/i386[OK]
ac/i586[OK]
ac/i686[OK]
ac/alpha[OK]
ac/amd64[OK]
ac/athlon[OK]
ac/ppc[OK]
ac/sparc[OK]
ac/sparc64[OK]

Advanced Search
main()
Powered by PLD Linux
(c) 2002-2020 PLD Team
$Revision: 1.37 $
Powered by The Right Thing.
Your IP: 3.231.167.166

protobuf 164abdd8-8bc6-4751-ab28-b6c0e97af472

Status:Failed
Source URL:https://buildlogs.pld-linux.org/pld/th/x32/FAIL/protobuf,164abdd8-8bc6-4751-ab28-b6c0e97af472.bz2
text/plain URL:View!
full text:View!
rpm -qa of builder:View!
Date:2020/09/09 20:41:14
Runtime:0:13:08.972785

Toc:

  • error 1
  • /usr/bin/ld: /usr/bin/ld: DWARF error: could not find variable specification at offset d46e
  • error 2
  • /usr/bin/ld: /usr/bin/ld: DWARF error: could not find variable specification at offset d46e
  • error 3
  • FAIL: protobuf-test
  • error 4
  • # XFAIL: 0
  • error 5
  • # FAIL: 1
  • error 6
  • # ERROR: 0
  • error 7
  • make[3]: *** [Makefile:7957: test-suite.log] Error 1
  • error 8
  • make[2]: *** [Makefile:8065: check-TESTS] Error 2
  • error 9
  • make[1]: *** [Makefile:8181: check-am] Error 2
  • error 10
  • error: Bad exit status from /tmp/B.hjpcE4/BUILD/tmp/rpm-tmp.53474 (%build)
  • error 11
  • RPM build errors:
  • error 12
  • error: No files produced.

Content:

./google/protobuf/parse_context.h:398:17: warning: comparison is always false due to limited range of data type [-Wtype-limits]
./google/protobuf/parse_context.h: In instantiation of 'bool google::protobuf::internal::ExpectTag(const char*) [with unsigned int tag = 402]':
google/protobuf/unittest.pb.cc:5950:73:   required from here
./google/protobuf/parse_context.h:398:17: warning: comparison is always false due to limited range of data type [-Wtype-limits]
./google/protobuf/parse_context.h: In instantiation of 'bool google::protobuf::internal::ExpectTag(const char*) [with unsigned int tag = 408]':
google/protobuf/unittest.pb.cc:5967:73:   required from here
./google/protobuf/parse_context.h:398:17: warning: comparison is always false due to limited range of data type [-Wtype-limits]
./google/protobuf/parse_context.h: In instantiation of 'bool google::protobuf::internal::ExpectTag(const char*) [with unsigned int tag = 416]':
google/protobuf/unittest.pb.cc:5987:73:   required from here
./google/protobuf/parse_context.h:398:17: warning: comparison is always false due to limited range of data type [-Wtype-limits]
./google/protobuf/parse_context.h: In instantiation of 'bool google::protobuf::internal::ExpectTag(const char*) [with unsigned int tag = 424]':
google/protobuf/unittest.pb.cc:6007:73:   required from here
./google/protobuf/parse_context.h:398:17: warning: comparison is always false due to limited range of data type [-Wtype-limits]
./google/protobuf/parse_context.h: In instantiation of 'bool google::protobuf::internal::ExpectTag(const char*) [with unsigned int tag = 434]':
google/protobuf/unittest.pb.cc:6026:73:   required from here
./google/protobuf/parse_context.h:398:17: warning: comparison is always false due to limited range of data type [-Wtype-limits]
./google/protobuf/parse_context.h: In instantiation of 'bool google::protobuf::internal::ExpectTag(const char*) [with unsigned int tag = 442]':
google/protobuf/unittest.pb.cc:6042:73:   required from here
./google/protobuf/parse_context.h:398:17: warning: comparison is always false due to limited range of data type [-Wtype-limits]
./google/protobuf/parse_context.h: In instantiation of 'bool google::protobuf::internal::ExpectTag(const char*) [with unsigned int tag = 458]':
google/protobuf/unittest.pb.cc:6054:73:   required from here
./google/protobuf/parse_context.h:398:17: warning: comparison is always false due to limited range of data type [-Wtype-limits]
./google/protobuf/parse_context.h: In instantiation of 'bool google::protobuf::internal::ExpectTag(const char*) [with unsigned int tag = 720]':
google/protobuf/unittest.pb.cc:26920:73:   required from here
./google/protobuf/parse_context.h:398:17: warning: comparison is always false due to limited range of data type [-Wtype-limits]
./google/protobuf/parse_context.h: In instantiation of 'bool google::protobuf::internal::ExpectTag(const char*) [with unsigned int tag = 728]':
google/protobuf/unittest.pb.cc:26935:73:   required from here
./google/protobuf/parse_context.h:398:17: warning: comparison is always false due to limited range of data type [-Wtype-limits]
./google/protobuf/parse_context.h: In instantiation of 'bool google::protobuf::internal::ExpectTag(const char*) [with unsigned int tag = 736]':
google/protobuf/unittest.pb.cc:26950:73:   required from here
./google/protobuf/parse_context.h:398:17: warning: comparison is always false due to limited range of data type [-Wtype-limits]
./google/protobuf/parse_context.h: In instantiation of 'bool google::protobuf::internal::ExpectTag(const char*) [with unsigned int tag = 744]':
google/protobuf/unittest.pb.cc:26965:73:   required from here
./google/protobuf/parse_context.h:398:17: warning: comparison is always false due to limited range of data type [-Wtype-limits]
./google/protobuf/parse_context.h: In instantiation of 'bool google::protobuf::internal::ExpectTag(const char*) [with unsigned int tag = 752]':
google/protobuf/unittest.pb.cc:26980:73:   required from here
./google/protobuf/parse_context.h:398:17: warning: comparison is always false due to limited range of data type [-Wtype-limits]
./google/protobuf/parse_context.h: In instantiation of 'bool google::protobuf::internal::ExpectTag(const char*) [with unsigned int tag = 760]':
google/protobuf/unittest.pb.cc:26995:73:   required from here
./google/protobuf/parse_context.h:398:17: warning: comparison is always false due to limited range of data type [-Wtype-limits]
./google/protobuf/parse_context.h: In instantiation of 'bool google::protobuf::internal::ExpectTag(const char*) [with unsigned int tag = 773]':
google/protobuf/unittest.pb.cc:27010:73:   required from here
./google/protobuf/parse_context.h:398:17: warning: comparison is always false due to limited range of data type [-Wtype-limits]
./google/protobuf/parse_context.h: In instantiation of 'bool google::protobuf::internal::ExpectTag(const char*) [with unsigned int tag = 777]':
google/protobuf/unittest.pb.cc:27025:73:   required from here
./google/protobuf/parse_context.h:398:17: warning: comparison is always false due to limited range of data type [-Wtype-limits]
./google/protobuf/parse_context.h: In instantiation of 'bool google::protobuf::internal::ExpectTag(const char*) [with unsigned int tag = 789]':
google/protobuf/unittest.pb.cc:27040:73:   required from here
./google/protobuf/parse_context.h:398:17: warning: comparison is always false due to limited range of data type [-Wtype-limits]
./google/protobuf/parse_context.h: In instantiation of 'bool google::protobuf::internal::ExpectTag(const char*) [with unsigned int tag = 793]':
google/protobuf/unittest.pb.cc:27055:73:   required from here
./google/protobuf/parse_context.h:398:17: warning: comparison is always false due to limited range of data type [-Wtype-limits]
./google/protobuf/parse_context.h: In instantiation of 'bool google::protobuf::internal::ExpectTag(const char*) [with unsigned int tag = 805]':
google/protobuf/unittest.pb.cc:27070:73:   required from here
./google/protobuf/parse_context.h:398:17: warning: comparison is always false due to limited range of data type [-Wtype-limits]
./google/protobuf/parse_context.h: In instantiation of 'bool google::protobuf::internal::ExpectTag(const char*) [with unsigned int tag = 809]':
google/protobuf/unittest.pb.cc:27085:73:   required from here
./google/protobuf/parse_context.h:398:17: warning: comparison is always false due to limited range of data type [-Wtype-limits]
./google/protobuf/parse_context.h: In instantiation of 'bool google::protobuf::internal::ExpectTag(const char*) [with unsigned int tag = 816]':
google/protobuf/unittest.pb.cc:27100:73:   required from here
./google/protobuf/parse_context.h:398:17: warning: comparison is always false due to limited range of data type [-Wtype-limits]
./google/protobuf/parse_context.h: In instantiation of 'bool google::protobuf::internal::ExpectTag(const char*) [with unsigned int tag = 824]':
google/protobuf/unittest.pb.cc:27120:73:   required from here
./google/protobuf/parse_context.h:398:17: warning: comparison is always false due to limited range of data type [-Wtype-limits]
./google/protobuf/parse_context.h: In instantiation of 'bool google::protobuf::internal::ExpectTag(const char*) [with unsigned int tag = 16042]':
google/protobuf/unittest.pb.cc:28252:75:   required from here
./google/protobuf/parse_context.h:398:17: warning: comparison is always false due to limited range of data type [-Wtype-limits]
./google/protobuf/parse_context.h: In instantiation of 'bool google::protobuf::internal::ExpectTag(const char*) [with unsigned int tag = 16369]':
google/protobuf/unittest.pb.cc:28638:75:   required from here
./google/protobuf/parse_context.h:398:17: warning: comparison is always false due to limited range of data type [-Wtype-limits]
./google/protobuf/parse_context.h: In instantiation of 'bool google::protobuf::internal::ExpectTag(const char*) [with unsigned int tag = 16376]':
google/protobuf/unittest.pb.cc:28653:75:   required from here
./google/protobuf/parse_context.h:398:17: warning: comparison is always false due to limited range of data type [-Wtype-limits]
./google/protobuf/parse_context.h: In instantiation of 'bool google::protobuf::internal::ExpectTag(const char*) [with unsigned int tag = 163]':
google/protobuf/unittest.pb.cc:29484:73:   required from here
./google/protobuf/parse_context.h:398:17: warning: comparison is always false due to limited range of data type [-Wtype-limits]
./google/protobuf/parse_context.h: In instantiation of 'bool google::protobuf::internal::ExpectTag(const char*) [with unsigned int tag = 8002]':
google/protobuf/unittest.pb.cc:29496:74:   required from here
./google/protobuf/parse_context.h:398:17: warning: comparison is always false due to limited range of data type [-Wtype-limits]
./google/protobuf/parse_context.h: In instantiation of 'bool google::protobuf::internal::ExpectTag(const char*) [with unsigned int tag = 8010]':
google/protobuf/unittest.pb.cc:29508:74:   required from here
./google/protobuf/parse_context.h:398:17: warning: comparison is always false due to limited range of data type [-Wtype-limits]
mv -f google/protobuf/.deps/no_warning_test-unittest.pb.Tpo google/protobuf/.deps/no_warning_test-unittest.pb.Po
make[2]: Leaving directory '/tmp/B.hjpcE4/BUILD/protobuf-3.13.0/src'
make[2]: Entering directory '/tmp/B.hjpcE4/BUILD/protobuf-3.13.0/src'
/bin/sh ../libtool  --tag=CXX   --mode=link x86_64-pld-linux-gnux32-g++ -pthread -DHAVE_PTHREAD=1 -DHAVE_ZLIB=1 -Wall -Wno-sign-compare -O2 -pipe -Wformat -Werror=format-security -gdwarf-4 -fno-debug-types-section -fvar-tracking-assignments -g2 -Wp,-D_FORTIFY_SOURCE=2 -fstack-protector-strong --param=ssp-buffer-size=4 -Werror=trampolines -fPIC -mtune=generic -march=x86-64 -gdwarf-4 -fno-debug-types-section -fvar-tracking-assignments -g2  -pthread -Wl,--as-needed -Wl,--no-copy-dt-needed-entries -Wl,-z,relro -Wl,-z,combreloc  -o protobuf-lite-test google/protobuf/protobuf_lite_test-lite_unittest.o google/protobuf/protobuf_lite_test-arena_test_util.o google/protobuf/protobuf_lite_test-map_lite_test_util.o google/protobuf/protobuf_lite_test-test_util_lite.o google/protobuf/protobuf_lite_test-map_lite_unittest.pb.o google/protobuf/protobuf_lite_test-unittest_lite.pb.o google/protobuf/protobuf_lite_test-unittest_import_lite.pb.o google/protobuf/protobuf_lite_test-unittest_import_public_lite.pb.o  libprotobuf-lite.la -lgtest -lgmock_main -lgmock -lz 
libtool: link: x86_64-pld-linux-gnux32-g++ -pthread -DHAVE_PTHREAD=1 -DHAVE_ZLIB=1 -Wall -Wno-sign-compare -O2 -pipe -Wformat -Werror=format-security -gdwarf-4 -fno-debug-types-section -fvar-tracking-assignments -g2 -Wp,-D_FORTIFY_SOURCE=2 -fstack-protector-strong --param=ssp-buffer-size=4 -Werror=trampolines -fPIC -mtune=generic -march=x86-64 -gdwarf-4 -fno-debug-types-section -fvar-tracking-assignments -g2 -pthread -Wl,--as-needed -Wl,--no-copy-dt-needed-entries -Wl,-z -Wl,relro -Wl,-z -Wl,combreloc -o .libs/protobuf-lite-test google/protobuf/protobuf_lite_test-lite_unittest.o google/protobuf/protobuf_lite_test-arena_test_util.o google/protobuf/protobuf_lite_test-map_lite_test_util.o google/protobuf/protobuf_lite_test-test_util_lite.o google/protobuf/protobuf_lite_test-map_lite_unittest.pb.o google/protobuf/protobuf_lite_test-unittest_lite.pb.o google/protobuf/protobuf_lite_test-unittest_import_lite.pb.o google/protobuf/protobuf_lite_test-unittest_import_public_lite.pb.o  ./.libs/libprotobuf-lite.so /usr/libx32/libstdc++.so -lm -lgtest -lgmock_main -lgmock -lz -pthread
make[2]: Leaving directory '/tmp/B.hjpcE4/BUILD/protobuf-3.13.0/src'
make[2]: Entering directory '/tmp/B.hjpcE4/BUILD/protobuf-3.13.0/src'
/bin/sh ../libtool  --tag=CXX   --mode=link x86_64-pld-linux-gnux32-g++ -pthread -DHAVE_PTHREAD=1 -DHAVE_ZLIB=1 -Wall -Wno-sign-compare -O2 -pipe -Wformat -Werror=format-security -gdwarf-4 -fno-debug-types-section -fvar-tracking-assignments -g2 -Wp,-D_FORTIFY_SOURCE=2 -fstack-protector-strong --param=ssp-buffer-size=4 -Werror=trampolines -fPIC -mtune=generic -march=x86-64 -gdwarf-4 -fno-debug-types-section -fvar-tracking-assignments -g2  -pthread -Wl,--as-needed -Wl,--no-copy-dt-needed-entries -Wl,-z,relro -Wl,-z,combreloc  -o protobuf-lite-arena-test google/protobuf/protobuf_lite_arena_test-lite_arena_unittest.o google/protobuf/protobuf_lite_arena_test-arena_test_util.o google/protobuf/protobuf_lite_arena_test-map_lite_test_util.o google/protobuf/protobuf_lite_arena_test-test_util_lite.o google/protobuf/protobuf_lite_arena_test-map_lite_unittest.pb.o google/protobuf/protobuf_lite_arena_test-unittest_lite.pb.o google/protobuf/protobuf_lite_arena_test-unittest_import_lite.pb.o google/protobuf/protobuf_lite_arena_test-unittest_import_public_lite.pb.o  libprotobuf-lite.la -lgtest -lgmock_main -lgmock -lz 
libtool: link: x86_64-pld-linux-gnux32-g++ -pthread -DHAVE_PTHREAD=1 -DHAVE_ZLIB=1 -Wall -Wno-sign-compare -O2 -pipe -Wformat -Werror=format-security -gdwarf-4 -fno-debug-types-section -fvar-tracking-assignments -g2 -Wp,-D_FORTIFY_SOURCE=2 -fstack-protector-strong --param=ssp-buffer-size=4 -Werror=trampolines -fPIC -mtune=generic -march=x86-64 -gdwarf-4 -fno-debug-types-section -fvar-tracking-assignments -g2 -pthread -Wl,--as-needed -Wl,--no-copy-dt-needed-entries -Wl,-z -Wl,relro -Wl,-z -Wl,combreloc -o .libs/protobuf-lite-arena-test google/protobuf/protobuf_lite_arena_test-lite_arena_unittest.o google/protobuf/protobuf_lite_arena_test-arena_test_util.o google/protobuf/protobuf_lite_arena_test-map_lite_test_util.o google/protobuf/protobuf_lite_arena_test-test_util_lite.o google/protobuf/protobuf_lite_arena_test-map_lite_unittest.pb.o google/protobuf/protobuf_lite_arena_test-unittest_lite.pb.o google/protobuf/protobuf_lite_arena_test-unittest_import_lite.pb.o google/protobuf/protobuf_lite_arena_test-unittest_import_public_lite.pb.o  ./.libs/libprotobuf-lite.so /usr/libx32/libstdc++.so -lm -lgtest -lgmock_main -lgmock -lz -pthread
make[2]: Leaving directory '/tmp/B.hjpcE4/BUILD/protobuf-3.13.0/src'
make[2]: Entering directory '/tmp/B.hjpcE4/BUILD/protobuf-3.13.0/src'
x86_64-pld-linux-gnux32-g++ -DHAVE_CONFIG_H -I. -I..   -DGOOGLE_PROTOBUF_NO_RTTI -pthread -DHAVE_PTHREAD=1 -DHAVE_ZLIB=1 -Wall -Wextra -Wno-unused-parameter -O2 -pipe -Wformat -Werror=format-security -gdwarf-4 -fno-debug-types-section -fvar-tracking-assignments -g2 -Wp,-D_FORTIFY_SOURCE=2 -fstack-protector-strong --param=ssp-buffer-size=4 -Werror=trampolines -fPIC -mtune=generic -march=x86-64 -gdwarf-4 -fno-debug-types-section -fvar-tracking-assignments -g2  -MT google/protobuf/util/no_warning_test-json_format.pb.o -MD -MP -MF google/protobuf/util/.deps/no_warning_test-json_format.pb.Tpo -c -o google/protobuf/util/no_warning_test-json_format.pb.o `test -f 'google/protobuf/util/json_format.pb.cc' || echo './'`google/protobuf/util/json_format.pb.cc
mv -f google/protobuf/util/.deps/no_warning_test-json_format.pb.Tpo google/protobuf/util/.deps/no_warning_test-json_format.pb.Po
make[2]: Leaving directory '/tmp/B.hjpcE4/BUILD/protobuf-3.13.0/src'
make[2]: Entering directory '/tmp/B.hjpcE4/BUILD/protobuf-3.13.0/src'
/bin/sh ../libtool  --tag=CXX   --mode=link x86_64-pld-linux-gnux32-g++ -pthread -DHAVE_PTHREAD=1 -DHAVE_ZLIB=1 -Wall -Wno-sign-compare -O2 -pipe -Wformat -Werror=format-security -gdwarf-4 -fno-debug-types-section -fvar-tracking-assignments -g2 -Wp,-D_FORTIFY_SOURCE=2 -fstack-protector-strong --param=ssp-buffer-size=4 -Werror=trampolines -fPIC -mtune=generic -march=x86-64 -gdwarf-4 -fno-debug-types-section -fvar-tracking-assignments -g2  -pthread -Wl,--as-needed -Wl,--no-copy-dt-needed-entries -Wl,-z,relro -Wl,-z,combreloc  -o protobuf-test google/protobuf/stubs/protobuf_test-bytestream_unittest.o google/protobuf/stubs/protobuf_test-common_unittest.o google/protobuf/stubs/protobuf_test-int128_unittest.o google/protobuf/io/protobuf_test-io_win32_unittest.o google/protobuf/stubs/protobuf_test-statusor_test.o google/protobuf/stubs/protobuf_test-status_test.o google/protobuf/stubs/protobuf_test-stringpiece_unittest.o google/protobuf/stubs/protobuf_test-stringprintf_unittest.o google/protobuf/stubs/protobuf_test-structurally_valid_unittest.o google/protobuf/stubs/protobuf_test-strutil_unittest.o google/protobuf/stubs/protobuf_test-template_util_unittest.o google/protobuf/stubs/protobuf_test-time_test.o google/protobuf/protobuf_test-any_test.o google/protobuf/protobuf_test-arenastring_unittest.o google/protobuf/protobuf_test-arena_unittest.o google/protobuf/protobuf_test-descriptor_database_unittest.o google/protobuf/protobuf_test-descriptor_unittest.o google/protobuf/protobuf_test-drop_unknown_fields_test.o google/protobuf/protobuf_test-dynamic_message_unittest.o google/protobuf/protobuf_test-extension_set_unittest.o google/protobuf/protobuf_test-generated_message_reflection_unittest.o google/protobuf/protobuf_test-map_field_test.o google/protobuf/protobuf_test-map_test.o google/protobuf/protobuf_test-message_unittest.o google/protobuf/protobuf_test-no_field_presence_test.o google/protobuf/protobuf_test-preserve_unknown_enum_test.o google/protobuf/protobuf_test-proto3_arena_lite_unittest.o google/protobuf/protobuf_test-proto3_arena_unittest.o google/protobuf/protobuf_test-proto3_lite_unittest.o google/protobuf/protobuf_test-reflection_ops_unittest.o google/protobuf/protobuf_test-repeated_field_reflection_unittest.o google/protobuf/protobuf_test-repeated_field_unittest.o google/protobuf/protobuf_test-text_format_unittest.o google/protobuf/protobuf_test-unknown_field_set_unittest.o google/protobuf/protobuf_test-well_known_types_unittest.o google/protobuf/protobuf_test-wire_format_unittest.o google/protobuf/io/protobuf_test-coded_stream_unittest.o google/protobuf/io/protobuf_test-printer_unittest.o google/protobuf/io/protobuf_test-tokenizer_unittest.o google/protobuf/io/protobuf_test-zero_copy_stream_unittest.o google/protobuf/compiler/protobuf_test-annotation_test_util.o google/protobuf/compiler/protobuf_test-importer_unittest.o google/protobuf/compiler/protobuf_test-mock_code_generator.o google/protobuf/compiler/protobuf_test-parser_unittest.o google/protobuf/compiler/cpp/protobuf_test-cpp_bootstrap_unittest.o google/protobuf/compiler/cpp/protobuf_test-cpp_move_unittest.o google/protobuf/compiler/cpp/protobuf_test-cpp_unittest.o google/protobuf/compiler/cpp/protobuf_test-cpp_plugin_unittest.o google/protobuf/compiler/cpp/protobuf_test-metadata_test.o google/protobuf/compiler/java/protobuf_test-java_plugin_unittest.o google/protobuf/compiler/java/protobuf_test-java_doc_comment_unittest.o google/protobuf/compiler/objectivec/protobuf_test-objectivec_helpers_unittest.o google/protobuf/compiler/python/protobuf_test-python_plugin_unittest.o google/protobuf/compiler/ruby/protobuf_test-ruby_generator_unittest.o google/protobuf/compiler/csharp/protobuf_test-csharp_bootstrap_unittest.o google/protobuf/compiler/csharp/protobuf_test-csharp_generator_unittest.o google/protobuf/util/protobuf_test-delimited_message_util_test.o google/protobuf/util/protobuf_test-field_comparator_test.o google/protobuf/util/protobuf_test-field_mask_util_test.o google/protobuf/util/internal/protobuf_test-default_value_objectwriter_test.o google/protobuf/util/internal/protobuf_test-json_objectwriter_test.o google/protobuf/util/internal/protobuf_test-json_stream_parser_test.o google/protobuf/util/internal/protobuf_test-protostream_objectsource_test.o google/protobuf/util/internal/protobuf_test-protostream_objectwriter_test.o google/protobuf/util/internal/protobuf_test-type_info_test_helper.o google/protobuf/util/protobuf_test-json_util_test.o google/protobuf/util/protobuf_test-message_differencer_unittest.o google/protobuf/util/protobuf_test-time_util_test.o google/protobuf/util/protobuf_test-type_resolver_util_test.o google/protobuf/compiler/protobuf_test-command_line_interface_unittest.o google/protobuf/protobuf_test-arena_test_util.o google/protobuf/protobuf_test-test_util.o google/protobuf/testing/protobuf_test-googletest.o google/protobuf/testing/protobuf_test-file.o google/protobuf/protobuf_test-map_lite_unittest.pb.o google/protobuf/protobuf_test-unittest_lite.pb.o google/protobuf/protobuf_test-unittest_import_lite.pb.o google/protobuf/protobuf_test-unittest_import_public_lite.pb.o google/protobuf/protobuf_test-any_test.pb.o google/protobuf/compiler/cpp/protobuf_test-cpp_test_bad_identifiers.pb.o google/protobuf/compiler/cpp/protobuf_test-cpp_test_large_enum_value.pb.o google/protobuf/protobuf_test-map_proto2_unittest.pb.o google/protobuf/protobuf_test-map_unittest.pb.o google/protobuf/protobuf_test-unittest_arena.pb.o google/protobuf/protobuf_test-unittest_custom_options.pb.o google/protobuf/protobuf_test-unittest_drop_unknown_fields.pb.o google/protobuf/protobuf_test-unittest_embed_optimize_for.pb.o google/protobuf/protobuf_test-unittest_empty.pb.o google/protobuf/protobuf_test-unittest_enormous_descriptor.pb.o google/protobuf/protobuf_test-unittest_import.pb.o google/protobuf/protobuf_test-unittest_import_public.pb.o google/protobuf/protobuf_test-unittest_lazy_dependencies.pb.o google/protobuf/protobuf_test-unittest_lazy_dependencies_custom_option.pb.o google/protobuf/protobuf_test-unittest_lazy_dependencies_enum.pb.o google/protobuf/protobuf_test-unittest_lite_imports_nonlite.pb.o google/protobuf/protobuf_test-unittest_mset.pb.o google/protobuf/protobuf_test-unittest_mset_wire_format.pb.o google/protobuf/protobuf_test-unittest_no_field_presence.pb.o google/protobuf/protobuf_test-unittest_no_generic_services.pb.o google/protobuf/protobuf_test-unittest_optimize_for.pb.o google/protobuf/protobuf_test-unittest.pb.o google/protobuf/protobuf_test-unittest_preserve_unknown_enum2.pb.o google/protobuf/protobuf_test-unittest_preserve_unknown_enum.pb.o google/protobuf/protobuf_test-unittest_proto3.pb.o google/protobuf/protobuf_test-unittest_proto3_arena.pb.o google/protobuf/protobuf_test-unittest_proto3_arena_lite.pb.o google/protobuf/protobuf_test-unittest_proto3_lite.pb.o google/protobuf/protobuf_test-unittest_proto3_optional.pb.o google/protobuf/protobuf_test-unittest_well_known_types.pb.o google/protobuf/util/internal/testdata/protobuf_test-anys.pb.o google/protobuf/util/internal/testdata/protobuf_test-books.pb.o google/protobuf/util/internal/testdata/protobuf_test-default_value.pb.o google/protobuf/util/internal/testdata/protobuf_test-default_value_test.pb.o google/protobuf/util/internal/testdata/protobuf_test-field_mask.pb.o google/protobuf/util/internal/testdata/protobuf_test-maps.pb.o google/protobuf/util/internal/testdata/protobuf_test-oneofs.pb.o google/protobuf/util/internal/testdata/protobuf_test-proto3.pb.o google/protobuf/util/internal/testdata/protobuf_test-struct.pb.o google/protobuf/util/internal/testdata/protobuf_test-timestamp_duration.pb.o google/protobuf/util/internal/testdata/protobuf_test-wrappers.pb.o google/protobuf/util/protobuf_test-json_format.pb.o google/protobuf/util/protobuf_test-json_format_proto3.pb.o google/protobuf/util/protobuf_test-message_differencer_unittest.pb.o  libprotobuf.la libprotoc.la -lgtest -lgmock_main -lgmock -lz 
libtool: link: x86_64-pld-linux-gnux32-g++ -pthread -DHAVE_PTHREAD=1 -DHAVE_ZLIB=1 -Wall -Wno-sign-compare -O2 -pipe -Wformat -Werror=format-security -gdwarf-4 -fno-debug-types-section -fvar-tracking-assignments -g2 -Wp,-D_FORTIFY_SOURCE=2 -fstack-protector-strong --param=ssp-buffer-size=4 -Werror=trampolines -fPIC -mtune=generic -march=x86-64 -gdwarf-4 -fno-debug-types-section -fvar-tracking-assignments -g2 -pthread -Wl,--as-needed -Wl,--no-copy-dt-needed-entries -Wl,-z -Wl,relro -Wl,-z -Wl,combreloc -o .libs/protobuf-test google/protobuf/stubs/protobuf_test-bytestream_unittest.o google/protobuf/stubs/protobuf_test-common_unittest.o google/protobuf/stubs/protobuf_test-int128_unittest.o google/protobuf/io/protobuf_test-io_win32_unittest.o google/protobuf/stubs/protobuf_test-statusor_test.o google/protobuf/stubs/protobuf_test-status_test.o google/protobuf/stubs/protobuf_test-stringpiece_unittest.o google/protobuf/stubs/protobuf_test-stringprintf_unittest.o google/protobuf/stubs/protobuf_test-structurally_valid_unittest.o google/protobuf/stubs/protobuf_test-strutil_unittest.o google/protobuf/stubs/protobuf_test-template_util_unittest.o google/protobuf/stubs/protobuf_test-time_test.o google/protobuf/protobuf_test-any_test.o google/protobuf/protobuf_test-arenastring_unittest.o google/protobuf/protobuf_test-arena_unittest.o google/protobuf/protobuf_test-descriptor_database_unittest.o google/protobuf/protobuf_test-descriptor_unittest.o google/protobuf/protobuf_test-drop_unknown_fields_test.o google/protobuf/protobuf_test-dynamic_message_unittest.o google/protobuf/protobuf_test-extension_set_unittest.o google/protobuf/protobuf_test-generated_message_reflection_unittest.o google/protobuf/protobuf_test-map_field_test.o google/protobuf/protobuf_test-map_test.o google/protobuf/protobuf_test-message_unittest.o google/protobuf/protobuf_test-no_field_presence_test.o google/protobuf/protobuf_test-preserve_unknown_enum_test.o google/protobuf/protobuf_test-proto3_arena_lite_unittest.o google/protobuf/protobuf_test-proto3_arena_unittest.o google/protobuf/protobuf_test-proto3_lite_unittest.o google/protobuf/protobuf_test-reflection_ops_unittest.o google/protobuf/protobuf_test-repeated_field_reflection_unittest.o google/protobuf/protobuf_test-repeated_field_unittest.o google/protobuf/protobuf_test-text_format_unittest.o google/protobuf/protobuf_test-unknown_field_set_unittest.o google/protobuf/protobuf_test-well_known_types_unittest.o google/protobuf/protobuf_test-wire_format_unittest.o google/protobuf/io/protobuf_test-coded_stream_unittest.o google/protobuf/io/protobuf_test-printer_unittest.o google/protobuf/io/protobuf_test-tokenizer_unittest.o google/protobuf/io/protobuf_test-zero_copy_stream_unittest.o google/protobuf/compiler/protobuf_test-annotation_test_util.o google/protobuf/compiler/protobuf_test-importer_unittest.o google/protobuf/compiler/protobuf_test-mock_code_generator.o google/protobuf/compiler/protobuf_test-parser_unittest.o google/protobuf/compiler/cpp/protobuf_test-cpp_bootstrap_unittest.o google/protobuf/compiler/cpp/protobuf_test-cpp_move_unittest.o google/protobuf/compiler/cpp/protobuf_test-cpp_unittest.o google/protobuf/compiler/cpp/protobuf_test-cpp_plugin_unittest.o google/protobuf/compiler/cpp/protobuf_test-metadata_test.o google/protobuf/compiler/java/protobuf_test-java_plugin_unittest.o google/protobuf/compiler/java/protobuf_test-java_doc_comment_unittest.o google/protobuf/compiler/objectivec/protobuf_test-objectivec_helpers_unittest.o google/protobuf/compiler/python/protobuf_test-python_plugin_unittest.o google/protobuf/compiler/ruby/protobuf_test-ruby_generator_unittest.o google/protobuf/compiler/csharp/protobuf_test-csharp_bootstrap_unittest.o google/protobuf/compiler/csharp/protobuf_test-csharp_generator_unittest.o google/protobuf/util/protobuf_test-delimited_message_util_test.o google/protobuf/util/protobuf_test-field_comparator_test.o google/protobuf/util/protobuf_test-field_mask_util_test.o google/protobuf/util/internal/protobuf_test-default_value_objectwriter_test.o google/protobuf/util/internal/protobuf_test-json_objectwriter_test.o google/protobuf/util/internal/protobuf_test-json_stream_parser_test.o google/protobuf/util/internal/protobuf_test-protostream_objectsource_test.o google/protobuf/util/internal/protobuf_test-protostream_objectwriter_test.o google/protobuf/util/internal/protobuf_test-type_info_test_helper.o google/protobuf/util/protobuf_test-json_util_test.o google/protobuf/util/protobuf_test-message_differencer_unittest.o google/protobuf/util/protobuf_test-time_util_test.o google/protobuf/util/protobuf_test-type_resolver_util_test.o google/protobuf/compiler/protobuf_test-command_line_interface_unittest.o google/protobuf/protobuf_test-arena_test_util.o google/protobuf/protobuf_test-test_util.o google/protobuf/testing/protobuf_test-googletest.o google/protobuf/testing/protobuf_test-file.o google/protobuf/protobuf_test-map_lite_unittest.pb.o google/protobuf/protobuf_test-unittest_lite.pb.o google/protobuf/protobuf_test-unittest_import_lite.pb.o google/protobuf/protobuf_test-unittest_import_public_lite.pb.o google/protobuf/protobuf_test-any_test.pb.o google/protobuf/compiler/cpp/protobuf_test-cpp_test_bad_identifiers.pb.o google/protobuf/compiler/cpp/protobuf_test-cpp_test_large_enum_value.pb.o google/protobuf/protobuf_test-map_proto2_unittest.pb.o google/protobuf/protobuf_test-map_unittest.pb.o google/protobuf/protobuf_test-unittest_arena.pb.o google/protobuf/protobuf_test-unittest_custom_options.pb.o google/protobuf/protobuf_test-unittest_drop_unknown_fields.pb.o google/protobuf/protobuf_test-unittest_embed_optimize_for.pb.o google/protobuf/protobuf_test-unittest_empty.pb.o google/protobuf/protobuf_test-unittest_enormous_descriptor.pb.o google/protobuf/protobuf_test-unittest_import.pb.o google/protobuf/protobuf_test-unittest_import_public.pb.o google/protobuf/protobuf_test-unittest_lazy_dependencies.pb.o google/protobuf/protobuf_test-unittest_lazy_dependencies_custom_option.pb.o google/protobuf/protobuf_test-unittest_lazy_dependencies_enum.pb.o google/protobuf/protobuf_test-unittest_lite_imports_nonlite.pb.o google/protobuf/protobuf_test-unittest_mset.pb.o google/protobuf/protobuf_test-unittest_mset_wire_format.pb.o google/protobuf/protobuf_test-unittest_no_field_presence.pb.o google/protobuf/protobuf_test-unittest_no_generic_services.pb.o google/protobuf/protobuf_test-unittest_optimize_for.pb.o google/protobuf/protobuf_test-unittest.pb.o google/protobuf/protobuf_test-unittest_preserve_unknown_enum2.pb.o google/protobuf/protobuf_test-unittest_preserve_unknown_enum.pb.o google/protobuf/protobuf_test-unittest_proto3.pb.o google/protobuf/protobuf_test-unittest_proto3_arena.pb.o google/protobuf/protobuf_test-unittest_proto3_arena_lite.pb.o google/protobuf/protobuf_test-unittest_proto3_lite.pb.o google/protobuf/protobuf_test-unittest_proto3_optional.pb.o google/protobuf/protobuf_test-unittest_well_known_types.pb.o google/protobuf/util/internal/testdata/protobuf_test-anys.pb.o google/protobuf/util/internal/testdata/protobuf_test-books.pb.o google/protobuf/util/internal/testdata/protobuf_test-default_value.pb.o google/protobuf/util/internal/testdata/protobuf_test-default_value_test.pb.o google/protobuf/util/internal/testdata/protobuf_test-field_mask.pb.o google/protobuf/util/internal/testdata/protobuf_test-maps.pb.o google/protobuf/util/internal/testdata/protobuf_test-oneofs.pb.o google/protobuf/util/internal/testdata/protobuf_test-proto3.pb.o google/protobuf/util/internal/testdata/protobuf_test-struct.pb.o google/protobuf/util/internal/testdata/protobuf_test-timestamp_duration.pb.o google/protobuf/util/internal/testdata/protobuf_test-wrappers.pb.o google/protobuf/util/protobuf_test-json_format.pb.o google/protobuf/util/protobuf_test-json_format_proto3.pb.o google/protobuf/util/protobuf_test-message_differencer_unittest.pb.o  ./.libs/libprotobuf.so ./.libs/libprotoc.so /tmp/B.hjpcE4/BUILD/protobuf-3.13.0/src/.libs/libprotobuf.so /usr/libx32/libstdc++.so -lm -lgtest -lgmock_main -lgmock -lz -pthread
/usr/bin/ld: /usr/bin/ld: DWARF error: could not find variable specification at offset d46e
google/protobuf/testing/protobuf_test-googletest.o: in function `google::protobuf::TestTempDir[abi:cxx11]()':
/tmp/B.hjpcE4/BUILD/protobuf-3.13.0/src/google/protobuf/testing/googletest.cc:124: warning: the use of `tmpnam' is dangerous, better use `mkstemp'
make[2]: Leaving directory '/tmp/B.hjpcE4/BUILD/protobuf-3.13.0/src'
make[2]: Entering directory '/tmp/B.hjpcE4/BUILD/protobuf-3.13.0/src'
x86_64-pld-linux-gnux32-g++ -DHAVE_CONFIG_H -I. -I..   -DGOOGLE_PROTOBUF_NO_RTTI -pthread -DHAVE_PTHREAD=1 -DHAVE_ZLIB=1 -Wall -Wextra -Wno-unused-parameter -O2 -pipe -Wformat -Werror=format-security -gdwarf-4 -fno-debug-types-section -fvar-tracking-assignments -g2 -Wp,-D_FORTIFY_SOURCE=2 -fstack-protector-strong --param=ssp-buffer-size=4 -Werror=trampolines -fPIC -mtune=generic -march=x86-64 -gdwarf-4 -fno-debug-types-section -fvar-tracking-assignments -g2  -MT google/protobuf/util/internal/testdata/no_warning_test-maps.pb.o -MD -MP -MF google/protobuf/util/internal/testdata/.deps/no_warning_test-maps.pb.Tpo -c -o google/protobuf/util/internal/testdata/no_warning_test-maps.pb.o `test -f 'google/protobuf/util/internal/testdata/maps.pb.cc' || echo './'`google/protobuf/util/internal/testdata/maps.pb.cc
mv -f google/protobuf/util/internal/testdata/.deps/no_warning_test-maps.pb.Tpo google/protobuf/util/internal/testdata/.deps/no_warning_test-maps.pb.Po
make[2]: Leaving directory '/tmp/B.hjpcE4/BUILD/protobuf-3.13.0/src'
make[2]: Entering directory '/tmp/B.hjpcE4/BUILD/protobuf-3.13.0/src'
x86_64-pld-linux-gnux32-g++ -DHAVE_CONFIG_H -I. -I..   -DGOOGLE_PROTOBUF_NO_RTTI -pthread -DHAVE_PTHREAD=1 -DHAVE_ZLIB=1 -Wall -Wextra -Wno-unused-parameter -O2 -pipe -Wformat -Werror=format-security -gdwarf-4 -fno-debug-types-section -fvar-tracking-assignments -g2 -Wp,-D_FORTIFY_SOURCE=2 -fstack-protector-strong --param=ssp-buffer-size=4 -Werror=trampolines -fPIC -mtune=generic -march=x86-64 -gdwarf-4 -fno-debug-types-section -fvar-tracking-assignments -g2  -MT google/protobuf/no_warning_test-unittest_well_known_types.pb.o -MD -MP -MF google/protobuf/.deps/no_warning_test-unittest_well_known_types.pb.Tpo -c -o google/protobuf/no_warning_test-unittest_well_known_types.pb.o `test -f 'google/protobuf/unittest_well_known_types.pb.cc' || echo './'`google/protobuf/unittest_well_known_types.pb.cc
In file included from ./google/protobuf/map_type_handler.h:34,
                 from ./google/protobuf/map.h:56,
                 from ./google/protobuf/generated_message_table_driven.h:34,
                 from ./google/protobuf/unittest_well_known_types.pb.h:26,
                 from google/protobuf/unittest_well_known_types.pb.cc:4:
./google/protobuf/parse_context.h: In instantiation of 'bool google::protobuf::internal::ExpectTag(const char*) [with unsigned int tag = 130]':
google/protobuf/unittest_well_known_types.pb.cc:2512:73:   required from here
./google/protobuf/parse_context.h:398:17: warning: comparison is always false due to limited range of data type [-Wtype-limits]
  398 |     return *ptr == tag;
      |            ~~~~~^~~~~~
./google/protobuf/parse_context.h: In instantiation of 'bool google::protobuf::internal::ExpectTag(const char*) [with unsigned int tag = 138]':
google/protobuf/unittest_well_known_types.pb.cc:2524:73:   required from here
./google/protobuf/parse_context.h:398:17: warning: comparison is always false due to limited range of data type [-Wtype-limits]
./google/protobuf/parse_context.h: In instantiation of 'bool google::protobuf::internal::ExpectTag(const char*) [with unsigned int tag = 146]':
google/protobuf/unittest_well_known_types.pb.cc:2536:73:   required from here
./google/protobuf/parse_context.h:398:17: warning: comparison is always false due to limited range of data type [-Wtype-limits]
mv -f google/protobuf/.deps/no_warning_test-unittest_well_known_types.pb.Tpo google/protobuf/.deps/no_warning_test-unittest_well_known_types.pb.Po
make[2]: Leaving directory '/tmp/B.hjpcE4/BUILD/protobuf-3.13.0/src'
make[2]: Entering directory '/tmp/B.hjpcE4/BUILD/protobuf-3.13.0/src'
x86_64-pld-linux-gnux32-g++ -DHAVE_CONFIG_H -I. -I..   -DGOOGLE_PROTOBUF_NO_RTTI -pthread -DHAVE_PTHREAD=1 -DHAVE_ZLIB=1 -Wall -Wextra -Wno-unused-parameter -O2 -pipe -Wformat -Werror=format-security -gdwarf-4 -fno-debug-types-section -fvar-tracking-assignments -g2 -Wp,-D_FORTIFY_SOURCE=2 -fstack-protector-strong --param=ssp-buffer-size=4 -Werror=trampolines -fPIC -mtune=generic -march=x86-64 -gdwarf-4 -fno-debug-types-section -fvar-tracking-assignments -g2  -MT google/protobuf/util/no_warning_test-json_format_proto3.pb.o -MD -MP -MF google/protobuf/util/.deps/no_warning_test-json_format_proto3.pb.Tpo -c -o google/protobuf/util/no_warning_test-json_format_proto3.pb.o `test -f 'google/protobuf/util/json_format_proto3.pb.cc' || echo './'`google/protobuf/util/json_format_proto3.pb.cc
In file included from ./google/protobuf/map_type_handler.h:34,
                 from ./google/protobuf/map.h:56,
                 from ./google/protobuf/generated_message_table_driven.h:34,
                 from ./google/protobuf/util/json_format_proto3.pb.h:26,
                 from google/protobuf/util/json_format_proto3.pb.cc:4:
./google/protobuf/parse_context.h: In instantiation of 'bool google::protobuf::internal::ExpectTag(const char*) [with unsigned int tag = 226]':
google/protobuf/util/json_format_proto3.pb.cc:1736:73:   required from here
./google/protobuf/parse_context.h:398:17: warning: comparison is always false due to limited range of data type [-Wtype-limits]
  398 |     return *ptr == tag;
      |            ~~~~~^~~~~~
./google/protobuf/parse_context.h: In instantiation of 'bool google::protobuf::internal::ExpectTag(const char*) [with unsigned int tag = 234]':
google/protobuf/util/json_format_proto3.pb.cc:1749:73:   required from here
./google/protobuf/parse_context.h:398:17: warning: comparison is always false due to limited range of data type [-Wtype-limits]
./google/protobuf/parse_context.h: In instantiation of 'bool google::protobuf::internal::ExpectTag(const char*) [with unsigned int tag = 250]':
google/protobuf/util/json_format_proto3.pb.cc:1772:73:   required from here
./google/protobuf/parse_context.h:398:17: warning: comparison is always false due to limited range of data type [-Wtype-limits]
./google/protobuf/parse_context.h: In instantiation of 'bool google::protobuf::internal::ExpectTag(const char*) [with unsigned int tag = 130]':
google/protobuf/util/json_format_proto3.pb.cc:4776:73:   required from here
./google/protobuf/parse_context.h:398:17: warning: comparison is always false due to limited range of data type [-Wtype-limits]
./google/protobuf/parse_context.h: In instantiation of 'bool google::protobuf::internal::ExpectTag(const char*) [with unsigned int tag = 138]':
google/protobuf/util/json_format_proto3.pb.cc:4788:73:   required from here
./google/protobuf/parse_context.h:398:17: warning: comparison is always false due to limited range of data type [-Wtype-limits]
./google/protobuf/parse_context.h: In instantiation of 'bool google::protobuf::internal::ExpectTag(const char*) [with unsigned int tag = 146]':
google/protobuf/util/json_format_proto3.pb.cc:4800:73:   required from here
./google/protobuf/parse_context.h:398:17: warning: comparison is always false due to limited range of data type [-Wtype-limits]
./google/protobuf/parse_context.h: In instantiation of 'bool google::protobuf::internal::ExpectTag(const char*) [with unsigned int tag = 154]':
google/protobuf/util/json_format_proto3.pb.cc:4812:73:   required from here
./google/protobuf/parse_context.h:398:17: warning: comparison is always false due to limited range of data type [-Wtype-limits]
mv -f google/protobuf/util/.deps/no_warning_test-json_format_proto3.pb.Tpo google/protobuf/util/.deps/no_warning_test-json_format_proto3.pb.Po
make[2]: Leaving directory '/tmp/B.hjpcE4/BUILD/protobuf-3.13.0/src'
make[2]: Entering directory '/tmp/B.hjpcE4/BUILD/protobuf-3.13.0/src'
x86_64-pld-linux-gnux32-g++ -DHAVE_CONFIG_H -I. -I..  -I/usr/include/gmock -I/usr/include/gtest -DPROTOBUF_TEST_NO_DESCRIPTORS -DGOOGLE_PROTOBUF_NO_RTTI -pthread -DHAVE_PTHREAD=1 -DHAVE_ZLIB=1 -Wall -Wno-sign-compare -O2 -pipe -Wformat -Werror=format-security -gdwarf-4 -fno-debug-types-section -fvar-tracking-assignments -g2 -Wp,-D_FORTIFY_SOURCE=2 -fstack-protector-strong --param=ssp-buffer-size=4 -Werror=trampolines -fPIC -mtune=generic -march=x86-64 -gdwarf-4 -fno-debug-types-section -fvar-tracking-assignments -g2  -MT google/protobuf/protobuf_lazy_descriptor_test-unittest_enormous_descriptor.pb.o -MD -MP -MF google/protobuf/.deps/protobuf_lazy_descriptor_test-unittest_enormous_descriptor.pb.Tpo -c -o google/protobuf/protobuf_lazy_descriptor_test-unittest_enormous_descriptor.pb.o `test -f 'google/protobuf/unittest_enormous_descriptor.pb.cc' || echo './'`google/protobuf/unittest_enormous_descriptor.pb.cc
mv -f google/protobuf/.deps/protobuf_lazy_descriptor_test-unittest_enormous_descriptor.pb.Tpo google/protobuf/.deps/protobuf_lazy_descriptor_test-unittest_enormous_descriptor.pb.Po
make[2]: Leaving directory '/tmp/B.hjpcE4/BUILD/protobuf-3.13.0/src'
make[2]: Entering directory '/tmp/B.hjpcE4/BUILD/protobuf-3.13.0/src'
/bin/sh ../libtool  --tag=CXX   --mode=link x86_64-pld-linux-gnux32-g++ -pthread -DHAVE_PTHREAD=1 -DHAVE_ZLIB=1 -Wall -Wno-sign-compare -O2 -pipe -Wformat -Werror=format-security -gdwarf-4 -fno-debug-types-section -fvar-tracking-assignments -g2 -Wp,-D_FORTIFY_SOURCE=2 -fstack-protector-strong --param=ssp-buffer-size=4 -Werror=trampolines -fPIC -mtune=generic -march=x86-64 -gdwarf-4 -fno-debug-types-section -fvar-tracking-assignments -g2  -pthread -Wl,--as-needed -Wl,--no-copy-dt-needed-entries -Wl,-z,relro -Wl,-z,combreloc  -o protobuf-lazy-descriptor-test google/protobuf/compiler/cpp/protobuf_lazy_descriptor_test-cpp_unittest.o google/protobuf/protobuf_lazy_descriptor_test-arena_test_util.o google/protobuf/protobuf_lazy_descriptor_test-test_util.o google/protobuf/testing/protobuf_lazy_descriptor_test-googletest.o google/protobuf/testing/protobuf_lazy_descriptor_test-file.o google/protobuf/protobuf_lazy_descriptor_test-map_lite_unittest.pb.o google/protobuf/protobuf_lazy_descriptor_test-unittest_lite.pb.o google/protobuf/protobuf_lazy_descriptor_test-unittest_import_lite.pb.o google/protobuf/protobuf_lazy_descriptor_test-unittest_import_public_lite.pb.o google/protobuf/protobuf_lazy_descriptor_test-any_test.pb.o google/protobuf/compiler/cpp/protobuf_lazy_descriptor_test-cpp_test_bad_identifiers.pb.o google/protobuf/compiler/cpp/protobuf_lazy_descriptor_test-cpp_test_large_enum_value.pb.o google/protobuf/protobuf_lazy_descriptor_test-map_proto2_unittest.pb.o google/protobuf/protobuf_lazy_descriptor_test-map_unittest.pb.o google/protobuf/protobuf_lazy_descriptor_test-unittest_arena.pb.o google/protobuf/protobuf_lazy_descriptor_test-unittest_custom_options.pb.o google/protobuf/protobuf_lazy_descriptor_test-unittest_drop_unknown_fields.pb.o google/protobuf/protobuf_lazy_descriptor_test-unittest_embed_optimize_for.pb.o google/protobuf/protobuf_lazy_descriptor_test-unittest_empty.pb.o google/protobuf/protobuf_lazy_descriptor_test-unittest_enormous_descriptor.pb.o google/protobuf/protobuf_lazy_descriptor_test-unittest_import.pb.o google/protobuf/protobuf_lazy_descriptor_test-unittest_import_public.pb.o google/protobuf/protobuf_lazy_descriptor_test-unittest_lazy_dependencies.pb.o google/protobuf/protobuf_lazy_descriptor_test-unittest_lazy_dependencies_custom_option.pb.o google/protobuf/protobuf_lazy_descriptor_test-unittest_lazy_dependencies_enum.pb.o google/protobuf/protobuf_lazy_descriptor_test-unittest_lite_imports_nonlite.pb.o google/protobuf/protobuf_lazy_descriptor_test-unittest_mset.pb.o google/protobuf/protobuf_lazy_descriptor_test-unittest_mset_wire_format.pb.o google/protobuf/protobuf_lazy_descriptor_test-unittest_no_field_presence.pb.o google/protobuf/protobuf_lazy_descriptor_test-unittest_no_generic_services.pb.o google/protobuf/protobuf_lazy_descriptor_test-unittest_optimize_for.pb.o google/protobuf/protobuf_lazy_descriptor_test-unittest.pb.o google/protobuf/protobuf_lazy_descriptor_test-unittest_preserve_unknown_enum2.pb.o google/protobuf/protobuf_lazy_descriptor_test-unittest_preserve_unknown_enum.pb.o google/protobuf/protobuf_lazy_descriptor_test-unittest_proto3.pb.o google/protobuf/protobuf_lazy_descriptor_test-unittest_proto3_arena.pb.o google/protobuf/protobuf_lazy_descriptor_test-unittest_proto3_arena_lite.pb.o google/protobuf/protobuf_lazy_descriptor_test-unittest_proto3_lite.pb.o google/protobuf/protobuf_lazy_descriptor_test-unittest_proto3_optional.pb.o google/protobuf/protobuf_lazy_descriptor_test-unittest_well_known_types.pb.o google/protobuf/util/internal/testdata/protobuf_lazy_descriptor_test-anys.pb.o google/protobuf/util/internal/testdata/protobuf_lazy_descriptor_test-books.pb.o google/protobuf/util/internal/testdata/protobuf_lazy_descriptor_test-default_value.pb.o google/protobuf/util/internal/testdata/protobuf_lazy_descriptor_test-default_value_test.pb.o google/protobuf/util/internal/testdata/protobuf_lazy_descriptor_test-field_mask.pb.o google/protobuf/util/internal/testdata/protobuf_lazy_descriptor_test-maps.pb.o google/protobuf/util/internal/testdata/protobuf_lazy_descriptor_test-oneofs.pb.o google/protobuf/util/internal/testdata/protobuf_lazy_descriptor_test-proto3.pb.o google/protobuf/util/internal/testdata/protobuf_lazy_descriptor_test-struct.pb.o google/protobuf/util/internal/testdata/protobuf_lazy_descriptor_test-timestamp_duration.pb.o google/protobuf/util/internal/testdata/protobuf_lazy_descriptor_test-wrappers.pb.o google/protobuf/util/protobuf_lazy_descriptor_test-json_format.pb.o google/protobuf/util/protobuf_lazy_descriptor_test-json_format_proto3.pb.o google/protobuf/util/protobuf_lazy_descriptor_test-message_differencer_unittest.pb.o  libprotobuf.la libprotoc.la -lgtest -lgmock_main -lgmock -lz 
libtool: link: x86_64-pld-linux-gnux32-g++ -pthread -DHAVE_PTHREAD=1 -DHAVE_ZLIB=1 -Wall -Wno-sign-compare -O2 -pipe -Wformat -Werror=format-security -gdwarf-4 -fno-debug-types-section -fvar-tracking-assignments -g2 -Wp,-D_FORTIFY_SOURCE=2 -fstack-protector-strong --param=ssp-buffer-size=4 -Werror=trampolines -fPIC -mtune=generic -march=x86-64 -gdwarf-4 -fno-debug-types-section -fvar-tracking-assignments -g2 -pthread -Wl,--as-needed -Wl,--no-copy-dt-needed-entries -Wl,-z -Wl,relro -Wl,-z -Wl,combreloc -o .libs/protobuf-lazy-descriptor-test google/protobuf/compiler/cpp/protobuf_lazy_descriptor_test-cpp_unittest.o google/protobuf/protobuf_lazy_descriptor_test-arena_test_util.o google/protobuf/protobuf_lazy_descriptor_test-test_util.o google/protobuf/testing/protobuf_lazy_descriptor_test-googletest.o google/protobuf/testing/protobuf_lazy_descriptor_test-file.o google/protobuf/protobuf_lazy_descriptor_test-map_lite_unittest.pb.o google/protobuf/protobuf_lazy_descriptor_test-unittest_lite.pb.o google/protobuf/protobuf_lazy_descriptor_test-unittest_import_lite.pb.o google/protobuf/protobuf_lazy_descriptor_test-unittest_import_public_lite.pb.o google/protobuf/protobuf_lazy_descriptor_test-any_test.pb.o google/protobuf/compiler/cpp/protobuf_lazy_descriptor_test-cpp_test_bad_identifiers.pb.o google/protobuf/compiler/cpp/protobuf_lazy_descriptor_test-cpp_test_large_enum_value.pb.o google/protobuf/protobuf_lazy_descriptor_test-map_proto2_unittest.pb.o google/protobuf/protobuf_lazy_descriptor_test-map_unittest.pb.o google/protobuf/protobuf_lazy_descriptor_test-unittest_arena.pb.o google/protobuf/protobuf_lazy_descriptor_test-unittest_custom_options.pb.o google/protobuf/protobuf_lazy_descriptor_test-unittest_drop_unknown_fields.pb.o google/protobuf/protobuf_lazy_descriptor_test-unittest_embed_optimize_for.pb.o google/protobuf/protobuf_lazy_descriptor_test-unittest_empty.pb.o google/protobuf/protobuf_lazy_descriptor_test-unittest_enormous_descriptor.pb.o google/protobuf/protobuf_lazy_descriptor_test-unittest_import.pb.o google/protobuf/protobuf_lazy_descriptor_test-unittest_import_public.pb.o google/protobuf/protobuf_lazy_descriptor_test-unittest_lazy_dependencies.pb.o google/protobuf/protobuf_lazy_descriptor_test-unittest_lazy_dependencies_custom_option.pb.o google/protobuf/protobuf_lazy_descriptor_test-unittest_lazy_dependencies_enum.pb.o google/protobuf/protobuf_lazy_descriptor_test-unittest_lite_imports_nonlite.pb.o google/protobuf/protobuf_lazy_descriptor_test-unittest_mset.pb.o google/protobuf/protobuf_lazy_descriptor_test-unittest_mset_wire_format.pb.o google/protobuf/protobuf_lazy_descriptor_test-unittest_no_field_presence.pb.o google/protobuf/protobuf_lazy_descriptor_test-unittest_no_generic_services.pb.o google/protobuf/protobuf_lazy_descriptor_test-unittest_optimize_for.pb.o google/protobuf/protobuf_lazy_descriptor_test-unittest.pb.o google/protobuf/protobuf_lazy_descriptor_test-unittest_preserve_unknown_enum2.pb.o google/protobuf/protobuf_lazy_descriptor_test-unittest_preserve_unknown_enum.pb.o google/protobuf/protobuf_lazy_descriptor_test-unittest_proto3.pb.o google/protobuf/protobuf_lazy_descriptor_test-unittest_proto3_arena.pb.o google/protobuf/protobuf_lazy_descriptor_test-unittest_proto3_arena_lite.pb.o google/protobuf/protobuf_lazy_descriptor_test-unittest_proto3_lite.pb.o google/protobuf/protobuf_lazy_descriptor_test-unittest_proto3_optional.pb.o google/protobuf/protobuf_lazy_descriptor_test-unittest_well_known_types.pb.o google/protobuf/util/internal/testdata/protobuf_lazy_descriptor_test-anys.pb.o google/protobuf/util/internal/testdata/protobuf_lazy_descriptor_test-books.pb.o google/protobuf/util/internal/testdata/protobuf_lazy_descriptor_test-default_value.pb.o google/protobuf/util/internal/testdata/protobuf_lazy_descriptor_test-default_value_test.pb.o google/protobuf/util/internal/testdata/protobuf_lazy_descriptor_test-field_mask.pb.o google/protobuf/util/internal/testdata/protobuf_lazy_descriptor_test-maps.pb.o google/protobuf/util/internal/testdata/protobuf_lazy_descriptor_test-oneofs.pb.o google/protobuf/util/internal/testdata/protobuf_lazy_descriptor_test-proto3.pb.o google/protobuf/util/internal/testdata/protobuf_lazy_descriptor_test-struct.pb.o google/protobuf/util/internal/testdata/protobuf_lazy_descriptor_test-timestamp_duration.pb.o google/protobuf/util/internal/testdata/protobuf_lazy_descriptor_test-wrappers.pb.o google/protobuf/util/protobuf_lazy_descriptor_test-json_format.pb.o google/protobuf/util/protobuf_lazy_descriptor_test-json_format_proto3.pb.o google/protobuf/util/protobuf_lazy_descriptor_test-message_differencer_unittest.pb.o  ./.libs/libprotobuf.so ./.libs/libprotoc.so /tmp/B.hjpcE4/BUILD/protobuf-3.13.0/src/.libs/libprotobuf.so /usr/libx32/libstdc++.so -lm -lgtest -lgmock_main -lgmock -lz -pthread
/usr/bin/ld: /usr/bin/ld: DWARF error: could not find variable specification at offset d46e
google/protobuf/testing/protobuf_lazy_descriptor_test-googletest.o: in function `google::protobuf::TestTempDir[abi:cxx11]()':
/tmp/B.hjpcE4/BUILD/protobuf-3.13.0/src/google/protobuf/testing/googletest.cc:124: warning: the use of `tmpnam' is dangerous, better use `mkstemp'
make[2]: Leaving directory '/tmp/B.hjpcE4/BUILD/protobuf-3.13.0/src'
make[2]: Entering directory '/tmp/B.hjpcE4/BUILD/protobuf-3.13.0/src'
x86_64-pld-linux-gnux32-g++ -DHAVE_CONFIG_H -I. -I..   -DGOOGLE_PROTOBUF_NO_RTTI -pthread -DHAVE_PTHREAD=1 -DHAVE_ZLIB=1 -Wall -Wextra -Wno-unused-parameter -O2 -pipe -Wformat -Werror=format-security -gdwarf-4 -fno-debug-types-section -fvar-tracking-assignments -g2 -Wp,-D_FORTIFY_SOURCE=2 -fstack-protector-strong --param=ssp-buffer-size=4 -Werror=trampolines -fPIC -mtune=generic -march=x86-64 -gdwarf-4 -fno-debug-types-section -fvar-tracking-assignments -g2  -MT google/protobuf/no_warning_test-unittest_enormous_descriptor.pb.o -MD -MP -MF google/protobuf/.deps/no_warning_test-unittest_enormous_descriptor.pb.Tpo -c -o google/protobuf/no_warning_test-unittest_enormous_descriptor.pb.o `test -f 'google/protobuf/unittest_enormous_descriptor.pb.cc' || echo './'`google/protobuf/unittest_enormous_descriptor.pb.cc
mv -f google/protobuf/.deps/no_warning_test-unittest_enormous_descriptor.pb.Tpo google/protobuf/.deps/no_warning_test-unittest_enormous_descriptor.pb.Po
make[2]: Leaving directory '/tmp/B.hjpcE4/BUILD/protobuf-3.13.0/src'
make[2]: Entering directory '/tmp/B.hjpcE4/BUILD/protobuf-3.13.0/src'
/bin/sh ../libtool  --tag=CXX   --mode=link x86_64-pld-linux-gnux32-g++ -pthread -DHAVE_PTHREAD=1 -DHAVE_ZLIB=1 -Wall -Wextra -Wno-unused-parameter -O2 -pipe -Wformat -Werror=format-security -gdwarf-4 -fno-debug-types-section -fvar-tracking-assignments -g2 -Wp,-D_FORTIFY_SOURCE=2 -fstack-protector-strong --param=ssp-buffer-size=4 -Werror=trampolines -fPIC -mtune=generic -march=x86-64 -gdwarf-4 -fno-debug-types-section -fvar-tracking-assignments -g2  -pthread -Wl,--as-needed -Wl,--no-copy-dt-needed-entries -Wl,-z,relro -Wl,-z,combreloc  -o no-warning-test no_warning_test-no_warning_test.o google/protobuf/no_warning_test-map_lite_unittest.pb.o google/protobuf/no_warning_test-unittest_lite.pb.o google/protobuf/no_warning_test-unittest_import_lite.pb.o google/protobuf/no_warning_test-unittest_import_public_lite.pb.o google/protobuf/no_warning_test-any_test.pb.o google/protobuf/compiler/cpp/no_warning_test-cpp_test_bad_identifiers.pb.o google/protobuf/compiler/cpp/no_warning_test-cpp_test_large_enum_value.pb.o google/protobuf/no_warning_test-map_proto2_unittest.pb.o google/protobuf/no_warning_test-map_unittest.pb.o google/protobuf/no_warning_test-unittest_arena.pb.o google/protobuf/no_warning_test-unittest_custom_options.pb.o google/protobuf/no_warning_test-unittest_drop_unknown_fields.pb.o google/protobuf/no_warning_test-unittest_embed_optimize_for.pb.o google/protobuf/no_warning_test-unittest_empty.pb.o google/protobuf/no_warning_test-unittest_enormous_descriptor.pb.o google/protobuf/no_warning_test-unittest_import.pb.o google/protobuf/no_warning_test-unittest_import_public.pb.o google/protobuf/no_warning_test-unittest_lazy_dependencies.pb.o google/protobuf/no_warning_test-unittest_lazy_dependencies_custom_option.pb.o google/protobuf/no_warning_test-unittest_lazy_dependencies_enum.pb.o google/protobuf/no_warning_test-unittest_lite_imports_nonlite.pb.o google/protobuf/no_warning_test-unittest_mset.pb.o google/protobuf/no_warning_test-unittest_mset_wire_format.pb.o google/protobuf/no_warning_test-unittest_no_field_presence.pb.o google/protobuf/no_warning_test-unittest_no_generic_services.pb.o google/protobuf/no_warning_test-unittest_optimize_for.pb.o google/protobuf/no_warning_test-unittest.pb.o google/protobuf/no_warning_test-unittest_preserve_unknown_enum2.pb.o google/protobuf/no_warning_test-unittest_preserve_unknown_enum.pb.o google/protobuf/no_warning_test-unittest_proto3.pb.o google/protobuf/no_warning_test-unittest_proto3_arena.pb.o google/protobuf/no_warning_test-unittest_proto3_arena_lite.pb.o google/protobuf/no_warning_test-unittest_proto3_lite.pb.o google/protobuf/no_warning_test-unittest_proto3_optional.pb.o google/protobuf/no_warning_test-unittest_well_known_types.pb.o google/protobuf/util/internal/testdata/no_warning_test-anys.pb.o google/protobuf/util/internal/testdata/no_warning_test-books.pb.o google/protobuf/util/internal/testdata/no_warning_test-default_value.pb.o google/protobuf/util/internal/testdata/no_warning_test-default_value_test.pb.o google/protobuf/util/internal/testdata/no_warning_test-field_mask.pb.o google/protobuf/util/internal/testdata/no_warning_test-maps.pb.o google/protobuf/util/internal/testdata/no_warning_test-oneofs.pb.o google/protobuf/util/internal/testdata/no_warning_test-proto3.pb.o google/protobuf/util/internal/testdata/no_warning_test-struct.pb.o google/protobuf/util/internal/testdata/no_warning_test-timestamp_duration.pb.o google/protobuf/util/internal/testdata/no_warning_test-wrappers.pb.o google/protobuf/util/no_warning_test-json_format.pb.o google/protobuf/util/no_warning_test-json_format_proto3.pb.o google/protobuf/util/no_warning_test-message_differencer_unittest.pb.o  libprotobuf.la libprotoc.la -lz 
libtool: link: x86_64-pld-linux-gnux32-g++ -pthread -DHAVE_PTHREAD=1 -DHAVE_ZLIB=1 -Wall -Wextra -Wno-unused-parameter -O2 -pipe -Wformat -Werror=format-security -gdwarf-4 -fno-debug-types-section -fvar-tracking-assignments -g2 -Wp,-D_FORTIFY_SOURCE=2 -fstack-protector-strong --param=ssp-buffer-size=4 -Werror=trampolines -fPIC -mtune=generic -march=x86-64 -gdwarf-4 -fno-debug-types-section -fvar-tracking-assignments -g2 -pthread -Wl,--as-needed -Wl,--no-copy-dt-needed-entries -Wl,-z -Wl,relro -Wl,-z -Wl,combreloc -o .libs/no-warning-test no_warning_test-no_warning_test.o google/protobuf/no_warning_test-map_lite_unittest.pb.o google/protobuf/no_warning_test-unittest_lite.pb.o google/protobuf/no_warning_test-unittest_import_lite.pb.o google/protobuf/no_warning_test-unittest_import_public_lite.pb.o google/protobuf/no_warning_test-any_test.pb.o google/protobuf/compiler/cpp/no_warning_test-cpp_test_bad_identifiers.pb.o google/protobuf/compiler/cpp/no_warning_test-cpp_test_large_enum_value.pb.o google/protobuf/no_warning_test-map_proto2_unittest.pb.o google/protobuf/no_warning_test-map_unittest.pb.o google/protobuf/no_warning_test-unittest_arena.pb.o google/protobuf/no_warning_test-unittest_custom_options.pb.o google/protobuf/no_warning_test-unittest_drop_unknown_fields.pb.o google/protobuf/no_warning_test-unittest_embed_optimize_for.pb.o google/protobuf/no_warning_test-unittest_empty.pb.o google/protobuf/no_warning_test-unittest_enormous_descriptor.pb.o google/protobuf/no_warning_test-unittest_import.pb.o google/protobuf/no_warning_test-unittest_import_public.pb.o google/protobuf/no_warning_test-unittest_lazy_dependencies.pb.o google/protobuf/no_warning_test-unittest_lazy_dependencies_custom_option.pb.o google/protobuf/no_warning_test-unittest_lazy_dependencies_enum.pb.o google/protobuf/no_warning_test-unittest_lite_imports_nonlite.pb.o google/protobuf/no_warning_test-unittest_mset.pb.o google/protobuf/no_warning_test-unittest_mset_wire_format.pb.o google/protobuf/no_warning_test-unittest_no_field_presence.pb.o google/protobuf/no_warning_test-unittest_no_generic_services.pb.o google/protobuf/no_warning_test-unittest_optimize_for.pb.o google/protobuf/no_warning_test-unittest.pb.o google/protobuf/no_warning_test-unittest_preserve_unknown_enum2.pb.o google/protobuf/no_warning_test-unittest_preserve_unknown_enum.pb.o google/protobuf/no_warning_test-unittest_proto3.pb.o google/protobuf/no_warning_test-unittest_proto3_arena.pb.o google/protobuf/no_warning_test-unittest_proto3_arena_lite.pb.o google/protobuf/no_warning_test-unittest_proto3_lite.pb.o google/protobuf/no_warning_test-unittest_proto3_optional.pb.o google/protobuf/no_warning_test-unittest_well_known_types.pb.o google/protobuf/util/internal/testdata/no_warning_test-anys.pb.o google/protobuf/util/internal/testdata/no_warning_test-books.pb.o google/protobuf/util/internal/testdata/no_warning_test-default_value.pb.o google/protobuf/util/internal/testdata/no_warning_test-default_value_test.pb.o google/protobuf/util/internal/testdata/no_warning_test-field_mask.pb.o google/protobuf/util/internal/testdata/no_warning_test-maps.pb.o google/protobuf/util/internal/testdata/no_warning_test-oneofs.pb.o google/protobuf/util/internal/testdata/no_warning_test-proto3.pb.o google/protobuf/util/internal/testdata/no_warning_test-struct.pb.o google/protobuf/util/internal/testdata/no_warning_test-timestamp_duration.pb.o google/protobuf/util/internal/testdata/no_warning_test-wrappers.pb.o google/protobuf/util/no_warning_test-json_format.pb.o google/protobuf/util/no_warning_test-json_format_proto3.pb.o google/protobuf/util/no_warning_test-message_differencer_unittest.pb.o  ./.libs/libprotobuf.so ./.libs/libprotoc.so /tmp/B.hjpcE4/BUILD/protobuf-3.13.0/src/.libs/libprotobuf.so /usr/libx32/libstdc++.so -lm -lz -pthread
make[2]: Leaving directory '/tmp/B.hjpcE4/BUILD/protobuf-3.13.0/src'
/usr/bin/make  check-TESTS
make[3]: Entering directory '/tmp/B.hjpcE4/BUILD/protobuf-3.13.0/src'
PASS: google/protobuf/compiler/zip_output_unittest.sh
make[3]: Leaving directory '/tmp/B.hjpcE4/BUILD/protobuf-3.13.0/src'
make[3]: Entering directory '/tmp/B.hjpcE4/BUILD/protobuf-3.13.0/src'
PASS: google/protobuf/io/gzip_stream_unittest.sh
make[3]: Leaving directory '/tmp/B.hjpcE4/BUILD/protobuf-3.13.0/src'
make[3]: Entering directory '/tmp/B.hjpcE4/BUILD/protobuf-3.13.0/src'
PASS: protobuf-lite-test
make[3]: Leaving directory '/tmp/B.hjpcE4/BUILD/protobuf-3.13.0/src'
make[3]: Entering directory '/tmp/B.hjpcE4/BUILD/protobuf-3.13.0/src'
PASS: protobuf-lite-arena-test
make[3]: Leaving directory '/tmp/B.hjpcE4/BUILD/protobuf-3.13.0/src'
make[3]: Entering directory '/tmp/B.hjpcE4/BUILD/protobuf-3.13.0/src'
PASS: no-warning-test
make[3]: Leaving directory '/tmp/B.hjpcE4/BUILD/protobuf-3.13.0/src'
make[3]: Entering directory '/tmp/B.hjpcE4/BUILD/protobuf-3.13.0/src'
PASS: protobuf-lazy-descriptor-test
make[3]: Leaving directory '/tmp/B.hjpcE4/BUILD/protobuf-3.13.0/src'
make[3]: Entering directory '/tmp/B.hjpcE4/BUILD/protobuf-3.13.0/src'
FAIL: protobuf-test
make[3]: Leaving directory '/tmp/B.hjpcE4/BUILD/protobuf-3.13.0/src'
make[3]: Entering directory '/tmp/B.hjpcE4/BUILD/protobuf-3.13.0/src'
============================================================================
Testsuite summary for Protocol Buffers 3.13.0
============================================================================
# TOTAL: 7
# PASS:  6
# SKIP:  0
# XFAIL: 0
# FAIL:  1
# XPASS: 0
# ERROR: 0
============================================================================
See src/test-suite.log
Please report to protobuf@googlegroups.com
============================================================================
make[3]: *** [Makefile:7957: test-suite.log] Error 1
make[3]: Leaving directory '/tmp/B.hjpcE4/BUILD/protobuf-3.13.0/src'
make[2]: *** [Makefile:8065: check-TESTS] Error 2
make[1]: *** [Makefile:8181: check-am] Error 2
make: *** [Makefile:1866: check-recursive] Error 1
error: Bad exit status from /tmp/B.hjpcE4/BUILD/tmp/rpm-tmp.53474 (%build)


RPM build errors:
    Bad exit status from /tmp/B.hjpcE4/BUILD/tmp/rpm-tmp.53474 (%build)
ended at: Wed Sep  9 20:41:13 2020, done in 0:13:08.972785
error: No files produced.
+ chmod -R u+rwX /tmp/B.hjpcE4/BUILD
+ rm -rf /tmp/B.hjpcE4/tmp /tmp/B.hjpcE4/BUILD
+ rm -rf /tmp/B.hjpcE4
Begin-PLD-Builder-Info
Build-Time: user:4856.93s sys:165.79s real:797.21s (faults io:2 non-io:34158918)

End-PLD-Builder-Info
[Back to list of logs] [View rpm -qa of builder]