Advanced Search
Powered by PLD Linux
(c) 2002-2018 PLD Team
$Revision: 1.37 $
Powered by Neo.
Your IP:

pure-ftpd 84102a01-972a-4b93-962d-40b2295559d8

Source URL:,84102a01-972a-4b93-962d-40b2295559d8.bz2
text/plain URL:View!
full text:View!
rpm -qa of builder:View!
Date:2018/03/07 11:25:16


  • error 1
  • make[2]: *** No rule to make target '.deps/regression.Po'. Stop.
  • error 2
  • make[1]: *** [Makefile:328: install-recursive] Error 1
  • error 3
  • error: Bad exit status from /tmp/B.NpL_Va/BUILD/tmp/rpm-tmp.16462 (%install)
  • error 4
  • RPM build errors:
  • error 5
  • error: No files produced.


checking for setusershell... yes
checking for setgroups... yes
checking for snprintf... yes
checking for vsnprintf... yes
checking for vfprintf... yes
checking for gethostname... yes
checking for setlocale... (cached) yes
checking for timegm... yes
checking for tzset... yes
checking for utime... yes
checking for utimes... yes
checking for mknod... yes
checking for mkfifo... yes
checking for random... yes
checking for srandomdev... no
checking for arc4random... no
checking for arc4random_stir... no
checking for arc4random_addrandom... no
checking for closefrom... no
checking for explicit_bzero... yes
checking for getpwnam_shadow... no
checking whether statvfs64() is defined... yes
checking whether snprintf is C99 conformant... done
checking whether getgroups 0 is sane... yes
checking whether realpath likes unreadable directories... yes
checking whether you already have a standard MD5 implementation... no
checking whether you already have a standard SHA1 implementation... no
checking whether we are inside a Virtuozzo virtual host... no
checking default TCP send buffer size... 16384
checking default TCP receive buffer size... 87380
checking for res_query in -lresolv... no
checking for ber_init in -llber... yes
checking for ldap_init in -lldap... yes
checking for floor in -lm... yes
checking for gzclose in -lz... yes
checking for mysql_init... no
checking for mysql_init in -lmariadb... no
checking for mysql_init in -lmysqlclient... yes
checking whether mysql clients can run... yes
checking for floor in -lm... (cached) yes
checking for gzclose in -lz... (cached) yes
checking for PQconnectdb in -lpq... yes
checking whether postgresql clients can run... yes
checking for DH_new in -lcrypto... yes
checking for SSL_accept in -lssl... yes
checking for DH_get_2048_256... yes
configure: WARNING: No certificate is installed in /var/lib/openssl/certs/ftpd.pem yet
checking for iconv_open in -liconv... no
checking for libiconv_open in -liconv... no
configure: You have /dev/urandom - Great
configure: You have /dev/random - Great
checking that generated files are newer than configure... done
configure: creating ./config.status
config.status: creating Makefile
config.status: creating src/Makefile
config.status: creating pam/Makefile
config.status: creating man/Makefile
config.status: creating gui/Makefile
config.status: creating m4/Makefile
config.status: creating pure-ftpd.conf
config.status: creating puredb/Makefile
config.status: creating puredb/src/Makefile
config.status: creating man/pure-ftpd.8
config.status: creating man/pure-ftpwho.8
config.status: creating man/pure-mrtginfo.8
config.status: creating man/pure-uploadscript.8
config.status: creating man/pure-statsdecode.8
config.status: creating man/pure-quotacheck.8
config.status: creating man/pure-pw.8
config.status: creating man/pure-pwconvert.8
config.status: creating man/pure-authd.8
config.status: creating config.h
config.status: executing depfiles commands
configure: +--------------------------------------------------------+
configure: | You can subscribe to the Pure-FTPd users mailing-list  |
configure: | to ask for help and to stay informed of new releases.  |
configure: | Go to now!                 |
configure: +--------------------------------------------------------+
+ exit 0
Executing(%install): /bin/sh -e /tmp/B.NpL_Va/BUILD/tmp/rpm-tmp.16462
+ umask 022
+ cd /tmp/B.NpL_Va/BUILD
+ /bin/rm '--interactive=never' -rf /tmp/B.NpL_Va/BUILD/tmp/pure-ftpd-1.0.47-root-builder
+ /bin/mkdir -p /tmp/B.NpL_Va/BUILD/tmp/pure-ftpd-1.0.47-root-builder
+ cd pure-ftpd-1.0.47
+ rm -rf /tmp/B.NpL_Va/BUILD/tmp/pure-ftpd-1.0.47-root-builder
+ install -d /tmp/B.NpL_Va/BUILD/tmp/pure-ftpd-1.0.47-root-builder/etc/pam.d /tmp/B.NpL_Va/BUILD/tmp/pure-ftpd-1.0.47-root-builder/etc/sysconfig /tmp/B.NpL_Va/BUILD/tmp/pure-ftpd-1.0.47-root-builder/etc/security /tmp/B.NpL_Va/BUILD/tmp/pure-ftpd-1.0.47-root-builder/etc/rc.d/init.d /tmp/B.NpL_Va/BUILD/tmp/pure-ftpd-1.0.47-root-builder/etc/ftpd/vhosts /tmp/B.NpL_Va/BUILD/tmp/pure-ftpd-1.0.47-root-builder/home/services/ftp /tmp/B.NpL_Va/BUILD/tmp/pure-ftpd-1.0.47-root-builder/usr/share/openldap/schema
+ /usr/bin/make -Otarget -j9 install 'DESTDIR=/tmp/B.NpL_Va/BUILD/tmp/pure-ftpd-1.0.47-root-builder'
 cd . && /bin/sh /tmp/B.NpL_Va/BUILD/pure-ftpd-1.0.47/missing automake-1.16 --gnu
 cd . && /bin/sh ./config.status Makefile 
config.status: creating Makefile
Making install in puredb
 cd .. && /bin/sh ./config.status puredb/Makefile 
config.status: creating puredb/Makefile
Making install in src
Makefile:374: .deps/regression.Po: No such file or directory
make[2]: *** No rule to make target '.deps/regression.Po'.  Stop.
make[1]: *** [Makefile:328: install-recursive] Error 1
make: *** [Makefile:451: install-recursive] Error 1
error: Bad exit status from /tmp/B.NpL_Va/BUILD/tmp/rpm-tmp.16462 (%install)

RPM build errors:
    Bad exit status from /tmp/B.NpL_Va/BUILD/tmp/rpm-tmp.16462 (%install)
ended at: Wed Mar  7 11:25:15 2018, done in 0:00:27.246266
error: No files produced.
+ chmod -R u+rwX /tmp/B.NpL_Va/BUILD
+ rm -rf /tmp/B.NpL_Va/tmp /tmp/B.NpL_Va/BUILD
+ rm -rf /tmp/B.NpL_Va
Build-Time: user:17.08s sys:3.42s real:29.62s (faults io:0 non-io:1522343)

[Back to list of logs] [View rpm -qa of builder]