FailedOk

th/SRPMS[OK]
th/x32[OK]
th/i686[OK]
th/x86_64[OK]

ac/SRPMS[OK]
ac/i386[OK]
ac/i586[OK]
ac/i686[OK]
ac/alpha[OK]
ac/amd64[OK]
ac/athlon[OK]
ac/ppc[OK]
ac/sparc[OK]
ac/sparc64[OK]

Advanced Search
main()
Powered by PLD Linux
(c) 2002-2018 PLD Team
$Revision: 1.37 $
Powered by /dev/null.
Your IP: 54.158.199.217

pwdutils 089111a3-eddb-445f-8438-8ab05c0e9ec5

Status:Failed
Source URL:ftp://buildlogs.pld-linux.org/th/x32/FAIL/pwdutils,089111a3-eddb-445f-8438-8ab05c0e9ec5.bz2
text/plain URL:View!
full text:View!
rpm -qa of builder:View!
Date:2018/09/14 22:01:34
Runtime:0:00:18.295447

Toc:

  • error 1
  • passwd_nisplus.c:28:10: fatal error: rpc/des_crypt.h: No such file or directory
  • error 2
  • compilation terminated.
  • error 3
  • make[2]: *** [Makefile:499: passwd_nisplus.o] Error 1
  • error 4
  • make[1]: *** [Makefile:446: all-recursive] Error 1
  • error 5
  • error: Bad exit status from /tmp/B.CPtj6p/BUILD/tmp/rpm-tmp.34127 (%build)
  • error 6
  • RPM build errors:
  • error 7
  • error: No files produced.

Content:

checking for dlopen in -ldl... yes
checking for pam_start in -lpam... yes
checking for main in -lpam_misc... yes
checking for yp_get_default_domain in -lnsl... yes
checking for library containing crypt... -lxcrypt
checking xcrypt.h usability... yes
checking xcrypt.h presence... yes
checking for xcrypt.h... yes
checking for crypt... yes
checking for crypt_r... yes
checking for xcrypt_gensalt_r... yes
checking sys/xattr.h usability... yes
checking sys/xattr.h presence... yes
checking for sys/xattr.h... yes
checking for llistxattr... yes
checking for lgetxattr... yes
checking for lsetxattr... yes
checking for getline... yes
checking for string.h... (cached) yes
checking for working getline function... yes
checking for getline... (cached) yes
checking for SSL_connect in -lssl... yes
checking lber.h usability... yes
checking lber.h presence... yes
checking for lber.h... yes
checking ldap.h usability... yes
checking ldap.h presence... yes
checking for ldap.h... yes
checking ldap_ssl.h usability... no
checking ldap_ssl.h presence... no
checking for ldap_ssl.h... no
checking for main in -llber... yes
checking for main in -lldap... yes
checking for ldap_init... yes
checking for ldap_get_lderrno... no
checking for ldap_parse_result... yes
checking for ldap_memfree... yes
checking for ldap_controls_free... yes
checking for ldap_set_option... yes
checking for ldap_get_option... yes
checking for ldapssl_init... no
checking for ldap_start_tls_s... yes
checking for ldap_pvt_tls_set_option... yes
checking for ldap_initialize... yes
checking for ldap_set_rebind_proc... yes
checking whether ldap_set_rebind_proc takes 3 arguments... 3
checking libnscd.h usability... yes
checking libnscd.h presence... yes
checking for libnscd.h... yes
checking for nscd_flush_cache in -lnscd... yes
checking for nscd_flush_cache... yes
checking whether NLS is requested... yes
checking for msgfmt... /usr/bin/msgfmt
checking for gmsgfmt... /usr/bin/msgfmt
checking for xgettext... /usr/bin/xgettext
checking for msgmerge... /usr/bin/msgmerge
checking for ld used by x86_64-pld-linux-gnux32-gcc... /usr/bin/ld -m elf32_x86_64
checking if the linker (/usr/bin/ld -m elf32_x86_64) is GNU ld... yes
checking for shared library run path origin... done
checking for CFPreferencesCopyAppValue... no
checking for CFLocaleCopyCurrent... no
checking for GNU gettext in libc... yes
checking whether to use NLS... yes
checking where the gettext function comes from... libc
checking dirent.h usability... yes
checking dirent.h presence... yes
checking for dirent.h... yes
checking for getusershell... yes
checking for strftime... yes
checking for bioapi.h... (cached) no
checking bioapi_util.h usability... no
checking bioapi_util.h presence... no
checking for bioapi_util.h... no
checking for BioAPI_Init in -lbioapi100... (cached) no
checking that generated files are newer than configure... done
configure: creating ./config.status
config.status: creating Makefile
config.status: creating etc/Makefile
config.status: creating lib/Makefile
config.status: creating src/Makefile
config.status: creating plugins/Makefile
config.status: creating po/Makefile.in
config.status: creating m4/Makefile
config.status: creating config.h
config.status: executing depfiles commands
config.status: executing libtool commands
config.status: executing po-directories commands
config.status: creating po/POTFILES
config.status: creating po/Makefile
configure: WARNING: unrecognized options: --disable-gnutls
+ /usr/bin/make -Otarget -j9
/usr/bin/make  all-recursive
Making all in m4
make[2]: Nothing to be done for 'all'.
Making all in etc
make[2]: Nothing to be done for 'all'.
Making all in lib
make[2]: Entering directory '/tmp/B.CPtj6p/BUILD/pwdutils-3.2.19/lib'
x86_64-pld-linux-gnux32-gcc -DHAVE_CONFIG_H -I. -I.. -DLOCALEDIR=\"/usr/share/locale\" -DPLUGINDIR=\"/libx32/pwdutils\"   -fPIC  -W -Wall -Wbad-function-cast -Wcast-align -Wcast-qual -Winline -Wmissing-declarations -Wmissing-prototypes -Wnested-externs -Wshadow -Wstrict-prototypes -Wundef -Wpointer-arith -O2 -fwrapv -pipe -Wformat -Werror=format-security -gdwarf-4 -fno-debug-types-section -fvar-tracking-assignments -g2 -Wp,-D_FORTIFY_SOURCE=2 -fstack-protector-strong --param=ssp-buffer-size=4 -fPIC -mtune=generic -march=x86-64 -gdwarf-4 -fno-debug-types-section -fvar-tracking-assignments -g2  -MT passwd_nisplus.o -MD -MP -MF .deps/passwd_nisplus.Tpo -c -o passwd_nisplus.o passwd_nisplus.c
passwd_nisplus.c:28:10: fatal error: rpc/des_crypt.h: No such file or directory
 #include <rpc/des_crypt.h>
          ^~~~~~~~~~~~~~~~~
compilation terminated.
make[2]: *** [Makefile:499: passwd_nisplus.o] Error 1
make[2]: Leaving directory '/tmp/B.CPtj6p/BUILD/pwdutils-3.2.19/lib'
make[2]: *** Waiting for unfinished jobs....
make[2]: Entering directory '/tmp/B.CPtj6p/BUILD/pwdutils-3.2.19/lib'
x86_64-pld-linux-gnux32-gcc -DHAVE_CONFIG_H -I. -I.. -DLOCALEDIR=\"/usr/share/locale\" -DPLUGINDIR=\"/libx32/pwdutils\"   -fPIC  -W -Wall -Wbad-function-cast -Wcast-align -Wcast-qual -Winline -Wmissing-declarations -Wmissing-prototypes -Wnested-externs -Wshadow -Wstrict-prototypes -Wundef -Wpointer-arith -O2 -fwrapv -pipe -Wformat -Werror=format-security -gdwarf-4 -fno-debug-types-section -fvar-tracking-assignments -g2 -Wp,-D_FORTIFY_SOURCE=2 -fstack-protector-strong --param=ssp-buffer-size=4 -fPIC -mtune=generic -march=x86-64 -gdwarf-4 -fno-debug-types-section -fvar-tracking-assignments -g2  -MT get_value.o -MD -MP -MF .deps/get_value.Tpo -c -o get_value.o get_value.c
mv -f .deps/get_value.Tpo .deps/get_value.Po
make[2]: Leaving directory '/tmp/B.CPtj6p/BUILD/pwdutils-3.2.19/lib'
make[2]: Entering directory '/tmp/B.CPtj6p/BUILD/pwdutils-3.2.19/lib'
x86_64-pld-linux-gnux32-gcc -DHAVE_CONFIG_H -I. -I.. -DLOCALEDIR=\"/usr/share/locale\" -DPLUGINDIR=\"/libx32/pwdutils\"   -fPIC  -W -Wall -Wbad-function-cast -Wcast-align -Wcast-qual -Winline -Wmissing-declarations -Wmissing-prototypes -Wnested-externs -Wshadow -Wstrict-prototypes -Wundef -Wpointer-arith -O2 -fwrapv -pipe -Wformat -Werror=format-security -gdwarf-4 -fno-debug-types-section -fvar-tracking-assignments -g2 -Wp,-D_FORTIFY_SOURCE=2 -fstack-protector-strong --param=ssp-buffer-size=4 -fPIC -mtune=generic -march=x86-64 -gdwarf-4 -fno-debug-types-section -fvar-tracking-assignments -g2  -MT yppasswd_xdr.o -MD -MP -MF .deps/yppasswd_xdr.Tpo -c -o yppasswd_xdr.o yppasswd_xdr.c
mv -f .deps/yppasswd_xdr.Tpo .deps/yppasswd_xdr.Po
make[2]: Leaving directory '/tmp/B.CPtj6p/BUILD/pwdutils-3.2.19/lib'
make[2]: Entering directory '/tmp/B.CPtj6p/BUILD/pwdutils-3.2.19/lib'
x86_64-pld-linux-gnux32-gcc -DHAVE_CONFIG_H -I. -I.. -DLOCALEDIR=\"/usr/share/locale\" -DPLUGINDIR=\"/libx32/pwdutils\"   -fPIC  -W -Wall -Wbad-function-cast -Wcast-align -Wcast-qual -Winline -Wmissing-declarations -Wmissing-prototypes -Wnested-externs -Wshadow -Wstrict-prototypes -Wundef -Wpointer-arith -O2 -fwrapv -pipe -Wformat -Werror=format-security -gdwarf-4 -fno-debug-types-section -fvar-tracking-assignments -g2 -Wp,-D_FORTIFY_SOURCE=2 -fstack-protector-strong --param=ssp-buffer-size=4 -fPIC -mtune=generic -march=x86-64 -gdwarf-4 -fno-debug-types-section -fvar-tracking-assignments -g2  -MT authentication.o -MD -MP -MF .deps/authentication.Tpo -c -o authentication.o authentication.c
mv -f .deps/authentication.Tpo .deps/authentication.Po
make[2]: Leaving directory '/tmp/B.CPtj6p/BUILD/pwdutils-3.2.19/lib'
make[2]: Entering directory '/tmp/B.CPtj6p/BUILD/pwdutils-3.2.19/lib'
x86_64-pld-linux-gnux32-gcc -DHAVE_CONFIG_H -I. -I.. -DLOCALEDIR=\"/usr/share/locale\" -DPLUGINDIR=\"/libx32/pwdutils\"   -fPIC  -W -Wall -Wbad-function-cast -Wcast-align -Wcast-qual -Winline -Wmissing-declarations -Wmissing-prototypes -Wnested-externs -Wshadow -Wstrict-prototypes -Wundef -Wpointer-arith -O2 -fwrapv -pipe -Wformat -Werror=format-security -gdwarf-4 -fno-debug-types-section -fvar-tracking-assignments -g2 -Wp,-D_FORTIFY_SOURCE=2 -fstack-protector-strong --param=ssp-buffer-size=4 -fPIC -mtune=generic -march=x86-64 -gdwarf-4 -fno-debug-types-section -fvar-tracking-assignments -g2  -MT logindefs.o -MD -MP -MF .deps/logindefs.Tpo -c -o logindefs.o logindefs.c
mv -f .deps/logindefs.Tpo .deps/logindefs.Po
make[2]: Leaving directory '/tmp/B.CPtj6p/BUILD/pwdutils-3.2.19/lib'
make[2]: Entering directory '/tmp/B.CPtj6p/BUILD/pwdutils-3.2.19/lib'
x86_64-pld-linux-gnux32-gcc -DHAVE_CONFIG_H -I. -I.. -DLOCALEDIR=\"/usr/share/locale\" -DPLUGINDIR=\"/libx32/pwdutils\"   -fPIC  -W -Wall -Wbad-function-cast -Wcast-align -Wcast-qual -Winline -Wmissing-declarations -Wmissing-prototypes -Wnested-externs -Wshadow -Wstrict-prototypes -Wundef -Wpointer-arith -O2 -fwrapv -pipe -Wformat -Werror=format-security -gdwarf-4 -fno-debug-types-section -fvar-tracking-assignments -g2 -Wp,-D_FORTIFY_SOURCE=2 -fstack-protector-strong --param=ssp-buffer-size=4 -fPIC -mtune=generic -march=x86-64 -gdwarf-4 -fno-debug-types-section -fvar-tracking-assignments -g2  -MT nsw.o -MD -MP -MF .deps/nsw.Tpo -c -o nsw.o nsw.c
mv -f .deps/nsw.Tpo .deps/nsw.Po
make[2]: Leaving directory '/tmp/B.CPtj6p/BUILD/pwdutils-3.2.19/lib'
make[2]: Entering directory '/tmp/B.CPtj6p/BUILD/pwdutils-3.2.19/lib'
x86_64-pld-linux-gnux32-gcc -DHAVE_CONFIG_H -I. -I.. -DLOCALEDIR=\"/usr/share/locale\" -DPLUGINDIR=\"/libx32/pwdutils\"   -fPIC  -W -Wall -Wbad-function-cast -Wcast-align -Wcast-qual -Winline -Wmissing-declarations -Wmissing-prototypes -Wnested-externs -Wshadow -Wstrict-prototypes -Wundef -Wpointer-arith -O2 -fwrapv -pipe -Wformat -Werror=format-security -gdwarf-4 -fno-debug-types-section -fvar-tracking-assignments -g2 -Wp,-D_FORTIFY_SOURCE=2 -fstack-protector-strong --param=ssp-buffer-size=4 -fPIC -mtune=generic -march=x86-64 -gdwarf-4 -fno-debug-types-section -fvar-tracking-assignments -g2  -MT read-files.o -MD -MP -MF .deps/read-files.Tpo -c -o read-files.o read-files.c
mv -f .deps/read-files.Tpo .deps/read-files.Po
make[2]: Leaving directory '/tmp/B.CPtj6p/BUILD/pwdutils-3.2.19/lib'
make[2]: Entering directory '/tmp/B.CPtj6p/BUILD/pwdutils-3.2.19/lib'
x86_64-pld-linux-gnux32-gcc -DHAVE_CONFIG_H -I. -I.. -DLOCALEDIR=\"/usr/share/locale\" -DPLUGINDIR=\"/libx32/pwdutils\"   -fPIC  -W -Wall -Wbad-function-cast -Wcast-align -Wcast-qual -Winline -Wmissing-declarations -Wmissing-prototypes -Wnested-externs -Wshadow -Wstrict-prototypes -Wundef -Wpointer-arith -O2 -fwrapv -pipe -Wformat -Werror=format-security -gdwarf-4 -fno-debug-types-section -fvar-tracking-assignments -g2 -Wp,-D_FORTIFY_SOURCE=2 -fstack-protector-strong --param=ssp-buffer-size=4 -fPIC -mtune=generic -march=x86-64 -gdwarf-4 -fno-debug-types-section -fvar-tracking-assignments -g2  -MT user.o -MD -MP -MF .deps/user.Tpo -c -o user.o user.c
mv -f .deps/user.Tpo .deps/user.Po
make[2]: Leaving directory '/tmp/B.CPtj6p/BUILD/pwdutils-3.2.19/lib'
make[2]: Entering directory '/tmp/B.CPtj6p/BUILD/pwdutils-3.2.19/lib'
x86_64-pld-linux-gnux32-gcc -DHAVE_CONFIG_H -I. -I.. -DLOCALEDIR=\"/usr/share/locale\" -DPLUGINDIR=\"/libx32/pwdutils\"   -fPIC  -W -Wall -Wbad-function-cast -Wcast-align -Wcast-qual -Winline -Wmissing-declarations -Wmissing-prototypes -Wnested-externs -Wshadow -Wstrict-prototypes -Wundef -Wpointer-arith -O2 -fwrapv -pipe -Wformat -Werror=format-security -gdwarf-4 -fno-debug-types-section -fvar-tracking-assignments -g2 -Wp,-D_FORTIFY_SOURCE=2 -fstack-protector-strong --param=ssp-buffer-size=4 -fPIC -mtune=generic -march=x86-64 -gdwarf-4 -fno-debug-types-section -fvar-tracking-assignments -g2  -MT libldap.o -MD -MP -MF .deps/libldap.Tpo -c -o libldap.o libldap.c
mv -f .deps/libldap.Tpo .deps/libldap.Po
make[2]: Leaving directory '/tmp/B.CPtj6p/BUILD/pwdutils-3.2.19/lib'
make[1]: *** [Makefile:446: all-recursive] Error 1
make: *** [Makefile:378: all] Error 2
error: Bad exit status from /tmp/B.CPtj6p/BUILD/tmp/rpm-tmp.34127 (%build)


RPM build errors:
    Bad exit status from /tmp/B.CPtj6p/BUILD/tmp/rpm-tmp.34127 (%build)
ended at: Fri Sep 14 22:01:34 2018, done in 0:00:18.295447
error: No files produced.
+ chmod -R u+rwX /tmp/B.CPtj6p/BUILD
+ rm -rf /tmp/B.CPtj6p/tmp /tmp/B.CPtj6p/BUILD
+ rm -rf /tmp/B.CPtj6p
Begin-PLD-Builder-Info
Build-Time: user:16.36s sys:4.91s real:22.49s (faults io:0 non-io:872500)

End-PLD-Builder-Info
[Back to list of logs] [View rpm -qa of builder]