FailedOk

th/SRPMS[OK]
th/x32[OK]
th/i686[OK]
th/x86_64[OK]

ac/SRPMS[OK]
ac/i386[OK]
ac/i586[OK]
ac/i686[OK]
ac/alpha[OK]
ac/amd64[OK]
ac/athlon[OK]
ac/ppc[OK]
ac/sparc[OK]
ac/sparc64[OK]

Advanced Search
main()
Powered by PLD Linux
(c) 2002-2018 PLD Team
$Revision: 1.37 $
Powered by php.
Your IP: 54.198.205.153

python 4206e6ed-c4d8-42ed-bfc8-67270861b0c8

Status:Failed
Source URL:ftp://buildlogs.pld-linux.org/th/x32/FAIL/python,4206e6ed-c4d8-42ed-bfc8-67270861b0c8.bz2
text/plain URL:View!
full text:View!
rpm -qa of builder:View!
Date:2018/09/14 08:06:46
Runtime:0:55:11.874754

Toc:

  • error 1
  • error: [Errno 104] Connection reset by peer
  • error 2
  • error: [Errno 104] Connection reset by peer
  • error 3
  • error: [Errno 104] Connection reset by peer
  • error 4
  • SSLError: [SSL: TLSV1_ALERT_UNKNOWN_CA] tlsv1 alert unknown ca (_ssl.c:726)
  • error 5
  • error: [Errno 104] Connection reset by peer
  • error 6
  • ERROR: test_tls1_3 (test.test_ssl.ThreadedTests)
  • error 7
  • AttributeError: __exit__
  • error 8
  • FAIL: test_options (test.test_ssl.ContextTests)
  • error 9
  • AssertionError: -2113798060 != -2112749484L
  • error 10
  • FAIL: test_default_ciphers (test.test_ssl.ThreadedTests)
  • error 11
  • AssertionError: SSLError not raised
  • error 12
  • FAIL: test_default_ecdh_curve (test.test_ssl.ThreadedTests)
  • error 13
  • AssertionError: 'ECDH' not found in 'TLS_AES_256_GCM_SHA384'
  • error 14
  • error: [Errno 104] Connection reset by peer
  • error 15
  • error: [Errno 104] Connection reset by peer
  • error 16
  • error: [Errno 104] Connection reset by peer
  • error 17
  • SSLError: [SSL: TLSV1_ALERT_UNKNOWN_CA] tlsv1 alert unknown ca (_ssl.c:726)
  • error 18
  • error: [Errno 104] Connection reset by peer
  • error 19
  • ERROR: test_tls1_3 (test.test_ssl.ThreadedTests)
  • error 20
  • AttributeError: __exit__
  • error 21
  • FAIL: test_options (test.test_ssl.ContextTests)
  • error 22
  • AssertionError: -2113798060 != -2112749484L
  • error 23
  • FAIL: test_default_ciphers (test.test_ssl.ThreadedTests)
  • error 24
  • AssertionError: SSLError not raised
  • error 25
  • FAIL: test_default_ecdh_curve (test.test_ssl.ThreadedTests)
  • error 26
  • AssertionError: 'ECDH' not found in 'TLS_AES_256_GCM_SHA384'
  • error 27
  • error: Bad exit status from /tmp/B.qqCqvt/BUILD/tmp/rpm-tmp.76884 (%build)
  • error 28
  • RPM build errors:
  • error 29
  • error: No files produced.

Content:

0:00:45 load avg: 1.65 [ 93/391] test_cprofile
0:00:45 load avg: 1.65 [ 94/391] test_crypt
0:00:45 load avg: 1.65 [ 95/391] test_csv
0:00:46 load avg: 1.65 [ 96/391] test_ctypes
0:00:50 load avg: 1.60 [ 97/391] test_curses
test_curses skipped -- Use of the `curses' resource not enabled
0:00:50 load avg: 1.60 [ 98/391] test_datetime -- test_curses skipped (resource denied)
0:00:51 load avg: 1.60 [ 99/391] test_dbm
0:00:51 load avg: 1.60 [100/391] test_decimal
0:00:53 load avg: 1.60 [101/391] test_decorators
0:00:53 load avg: 1.60 [102/391] test_defaultdict
0:00:54 load avg: 1.60 [103/391] test_deque
0:01:03 load avg: 1.58 [104/391] test_descr
0:01:11 load avg: 1.48 [105/391] test_descrtut
0:01:11 load avg: 1.48 [106/391] test_dictcomps
0:01:11 load avg: 1.48 [107/391] test_dictviews
0:01:12 load avg: 1.48 [108/391] test_difflib
0:01:13 load avg: 1.48 [109/391] test_dircache
0:01:14 load avg: 1.48 [110/391] test_dis
0:01:14 load avg: 1.53 [111/391] test_dl
test_dl skipped -- Could not open any shared libraries
0:01:15 load avg: 1.53 [112/391] test_docxmlrpc -- test_dl skipped
0:01:18 load avg: 1.53 [113/391] test_dumbdbm
0:01:19 load avg: 1.53 [114/391] test_dummy_thread
0:01:19 load avg: 1.53 [115/391] test_dummy_threading
0:01:19 load avg: 1.57 [116/391] test_email
0:01:24 load avg: 1.60 [117/391] test_email_codecs
0:01:25 load avg: 1.60 [118/391] test_email_renamed
0:01:25 load avg: 1.60 [119/391] test_ensurepip
0:01:25 load avg: 1.60 [120/391] test_enumerate
0:01:26 load avg: 1.60 [121/391] test_eof
0:01:26 load avg: 1.60 [122/391] test_epoll
0:01:28 load avg: 1.60 [123/391] test_errno
0:01:29 load avg: 1.60 [124/391] test_exception_variations
0:01:29 load avg: 1.60 [125/391] test_extcall
0:01:29 load avg: 1.60 [126/391] test_fcntl
0:01:30 load avg: 1.60 [127/391] test_file
0:01:30 load avg: 1.55 [128/391] test_file2k
0:01:39 load avg: 1.49 [129/391] test_file_eintr
0:01:40 load avg: 1.49 [130/391] test_filecmp
0:01:40 load avg: 1.49 [131/391] test_fileinput
0:01:41 load avg: 1.49 [132/391] test_fileio
0:01:41 load avg: 1.45 [133/391] test_float
0:01:42 load avg: 1.45 [134/391] test_fnmatch
0:01:42 load avg: 1.45 [135/391] test_fork1
0:01:49 load avg: 1.32 [136/391] test_format
0:01:49 load avg: 1.32 [137/391] test_fpformat
0:01:50 load avg: 1.32 [138/391] test_fractions
0:01:50 load avg: 1.32 [139/391] test_frozen
0:01:51 load avg: 1.32 [140/391] test_ftplib
0:01:54 load avg: 1.21 [141/391] test_funcattrs
0:01:55 load avg: 1.21 [142/391] test_functools
0:01:55 load avg: 1.21 [143/391] test_future
0:01:55 load avg: 1.21 [144/391] test_future3
0:01:56 load avg: 1.21 [145/391] test_future4
0:01:56 load avg: 1.21 [146/391] test_future5
0:01:56 load avg: 1.21 [147/391] test_future_builtins
0:01:57 load avg: 1.21 [148/391] test_gc
0:02:09 load avg: 1.15 [149/391] test_gdbm
0:02:09 load avg: 1.15 [150/391] test_generators
0:02:09 load avg: 1.15 [151/391] test_genericpath
0:02:10 load avg: 1.15 [152/391] test_genexps
0:02:10 load avg: 1.15 [153/391] test_getargs
0:02:10 load avg: 1.15 [154/391] test_getargs2
0:02:11 load avg: 1.15 [155/391] test_getopt
0:02:11 load avg: 1.15 [156/391] test_gettext
0:02:11 load avg: 1.15 [157/391] test_gl
test_gl skipped -- No module named gl
0:02:12 load avg: 1.15 [158/391] test_glob -- test_gl skipped
0:02:12 load avg: 1.15 [159/391] test_global
0:02:12 load avg: 1.15 [160/391] test_grp
0:02:13 load avg: 1.15 [161/391] test_gzip
0:02:13 load avg: 1.15 [162/391] test_hash
0:02:15 load avg: 1.14 [163/391] test_hashlib
0:02:16 load avg: 1.14 [164/391] test_heapq
0:02:17 load avg: 1.14 [165/391] test_hmac
0:02:17 load avg: 1.14 [166/391] test_hotshot
0:02:18 load avg: 1.14 [167/391] test_htmllib
0:02:18 load avg: 1.14 [168/391] test_htmlparser
0:02:18 load avg: 1.14 [169/391] test_httplib
Traceback (most recent call last):
  File "/tmp/B.qqCqvt/BUILD/Python-2.7.15/Lib/SocketServer.py", line 290, in _handle_request_noblock
    self.process_request(request, client_address)
  File "/tmp/B.qqCqvt/BUILD/Python-2.7.15/Lib/SocketServer.py", line 318, in process_request
    self.finish_request(request, client_address)
  File "/tmp/B.qqCqvt/BUILD/Python-2.7.15/Lib/SocketServer.py", line 331, in finish_request
    self.RequestHandlerClass(request, client_address, self)
  File "/tmp/B.qqCqvt/BUILD/Python-2.7.15/Lib/SocketServer.py", line 652, in __init__
    self.handle()
  File "/tmp/B.qqCqvt/BUILD/Python-2.7.15/Lib/BaseHTTPServer.py", line 340, in handle
    self.handle_one_request()
  File "/tmp/B.qqCqvt/BUILD/Python-2.7.15/Lib/BaseHTTPServer.py", line 310, in handle_one_request
    self.raw_requestline = self.rfile.readline(65537)
  File "/tmp/B.qqCqvt/BUILD/Python-2.7.15/Lib/socket.py", line 480, in readline
    data = self._sock.recv(self._rbufsize)
  File "/tmp/B.qqCqvt/BUILD/Python-2.7.15/Lib/ssl.py", line 772, in recv
    return self.read(buflen)
  File "/tmp/B.qqCqvt/BUILD/Python-2.7.15/Lib/ssl.py", line 659, in read
    v = self._sslobj.read(len)
error: [Errno 104] Connection reset by peer
test test_httplib produced unexpected output:
**********************************************************************
----------------------------------------
Exception happened during processing of request from ('127.0.0.1', 35682)
----------------------------------------

**********************************************************************
0:02:19 load avg: 1.13 [170/391/1] test_httpservers -- test_httplib failed
0:02:23 load avg: 1.13 [171/391/1] test_idle
0:02:23 load avg: 1.13 [172/391/1] test_imageop
0:02:24 load avg: 1.12 [173/391/1] test_imaplib
0:02:24 load avg: 1.12 [174/391/1] test_imgfile
test_imgfile skipped -- No module named imgfile
0:02:24 load avg: 1.12 [175/391/1] test_imghdr -- test_imgfile skipped
0:02:25 load avg: 1.12 [176/391/1] test_imp
0:02:25 load avg: 1.12 [177/391/1] test_import
0:02:26 load avg: 1.12 [178/391/1] test_import_magic
0:02:26 load avg: 1.12 [179/391/1] test_importhooks
0:02:27 load avg: 1.12 [180/391/1] test_importlib
0:02:27 load avg: 1.12 [181/391/1] test_index
0:02:27 load avg: 1.12 [182/391/1] test_inspect
0:02:28 load avg: 1.12 [183/391/1] test_int
0:02:29 load avg: 1.11 [184/391/1] test_int_literal
0:02:29 load avg: 1.11 [185/391/1] test_io
0:03:18 load avg: 0.75 [186/391/1] test_ioctl -- test_io passed in 49 sec
test_ioctl skipped -- Unable to open /dev/tty
0:03:19 load avg: 0.77 [187/391/1] test_isinstance -- test_ioctl skipped
0:03:19 load avg: 0.77 [188/391/1] test_iter
0:03:20 load avg: 0.77 [189/391/1] test_iterlen
0:03:20 load avg: 0.77 [190/391/1] test_itertools
0:03:27 load avg: 0.79 [191/391/1] test_json
0:03:32 load avg: 0.81 [192/391/1] test_kqueue
test_kqueue skipped -- test works only on BSD
0:03:33 load avg: 0.81 [193/391/1] test_largefile -- test_kqueue skipped
0:03:33 load avg: 0.81 [194/391/1] test_lib2to3
0:04:03 load avg: 1.01 [195/391/1] test_linecache -- test_lib2to3 passed in 30 sec
0:04:04 load avg: 1.01 [196/391/1] test_linuxaudiodev
test_linuxaudiodev skipped -- Use of the `audio' resource not enabled
0:04:04 load avg: 1.01 [197/391/1] test_list -- test_linuxaudiodev skipped (resource denied)
0:04:05 load avg: 1.01 [198/391/1] test_logging
0:04:15 load avg: 0.85 [199/391/1] test_long
0:04:17 load avg: 0.85 [200/391/1] test_long_future
0:04:21 load avg: 0.86 [201/391/1] test_longexp
0:04:22 load avg: 0.86 [202/391/1] test_macos
test_macos skipped -- No module named MacOS
0:04:22 load avg: 0.86 [203/391/1] test_macostools -- test_macos skipped
test_macostools skipped -- No module named MacOS
0:04:23 load avg: 0.86 [204/391/1] test_macpath -- test_macostools skipped
0:04:23 load avg: 0.87 [205/391/1] test_macurl2path
0:04:24 load avg: 0.87 [206/391/1] test_mailbox
0:04:27 load avg: 0.87 [207/391/1] test_marshal
0:04:28 load avg: 0.88 [208/391/1] test_math
0:04:30 load avg: 0.88 [209/391/1] test_md5
0:04:30 load avg: 0.88 [210/391/1] test_memoryio
0:04:31 load avg: 0.88 [211/391/1] test_memoryview
0:04:32 load avg: 0.88 [212/391/1] test_mhlib
0:04:33 load avg: 0.88 [213/391/1] test_mimetools
0:04:33 load avg: 0.89 [214/391/1] test_mimetypes
0:04:34 load avg: 0.89 [215/391/1] test_minidom
0:04:34 load avg: 0.89 [216/391/1] test_mmap
0:04:35 load avg: 0.89 [217/391/1] test_module
0:04:36 load avg: 0.89 [218/391/1] test_modulefinder
0:04:37 load avg: 0.89 [219/391/1] test_msilib
test_msilib skipped -- No module named _msi
0:04:38 load avg: 0.89 [220/391/1] test_multibytecodec -- test_msilib skipped
0:04:39 load avg: 0.90 [221/391/1] test_multifile
0:04:39 load avg: 0.90 [222/391/1] test_multiprocessing
0:05:21 load avg: 1.16 [223/391/1] test_mutants -- test_multiprocessing passed in 41 sec
0:05:21 load avg: 1.16 [224/391/1] test_mutex
0:05:21 load avg: 1.16 [225/391/1] test_netrc
0:05:22 load avg: 1.16 [226/391/1] test_new
0:05:22 load avg: 1.16 [227/391/1] test_nntplib
0:05:23 load avg: 1.16 [228/391/1] test_normalization
0:05:23 load avg: 1.14 [229/391/1] test_ntpath
0:05:24 load avg: 1.14 [230/391/1] test_old_mailbox
0:05:24 load avg: 1.14 [231/391/1] test_operator
0:05:25 load avg: 1.14 [232/391/1] test_optparse
0:05:25 load avg: 1.14 [233/391/1] test_ordered_dict
0:05:28 load avg: 1.14 [234/391/1] test_os
0:05:30 load avg: 1.21 [235/391/1] test_ossaudiodev
test_ossaudiodev skipped -- Use of the `audio' resource not enabled
0:05:31 load avg: 1.21 [236/391/1] test_parser -- test_ossaudiodev skipped (resource denied)
0:05:31 load avg: 1.21 [237/391/1] test_pdb
0:05:32 load avg: 1.21 [238/391/1] test_peepholer
0:05:33 load avg: 1.21 [239/391/1] test_pep247
0:05:33 load avg: 1.21 [240/391/1] test_pep277
0:05:34 load avg: 1.20 [241/391/1] test_pep352
0:05:34 load avg: 1.20 [242/391/1] test_pickle
0:05:36 load avg: 1.20 [243/391/1] test_pickletools
0:05:37 load avg: 1.20 [244/391/1] test_pipes
0:05:38 load avg: 1.20 [245/391/1] test_pkg
0:05:38 load avg: 1.18 [246/391/1] test_pkgimport
0:05:39 load avg: 1.18 [247/391/1] test_pkgutil
0:05:39 load avg: 1.18 [248/391/1] test_platform
0:05:40 load avg: 1.18 [249/391/1] test_plistlib
0:05:41 load avg: 1.18 [250/391/1] test_poll
0:05:52 load avg: 0.99 [251/391/1] test_popen
0:05:53 load avg: 0.99 [252/391/1] test_popen2
0:05:55 load avg: 0.99 [253/391/1] test_poplib
0:05:58 load avg: 0.99 [254/391/1] test_posixpath
0:05:59 load avg: 0.99 [255/391/1] test_pow
0:05:59 load avg: 0.99 [256/391/1] test_pprint
0:06:00 load avg: 0.99 [257/391/1] test_print
0:06:00 load avg: 0.99 [258/391/1] test_profile
0:06:01 load avg: 0.99 [259/391/1] test_property
0:06:01 load avg: 0.99 [260/391/1] test_pstats
0:06:02 load avg: 0.99 [261/391/1] test_pwd
0:06:02 load avg: 0.99 [262/391/1] test_py3kwarn
test_py3kwarn skipped -- test.test_py3kwarn must be run with the -3 flag
0:06:02 load avg: 0.99 [263/391/1] test_py_compile -- test_py3kwarn skipped
0:06:03 load avg: 0.99 [264/391/1] test_pyclbr
0:06:04 load avg: 0.99 [265/391/1] test_pyexpat
0:06:05 load avg: 0.99 [266/391/1] test_queue
0:06:09 load avg: 1.08 [267/391/1] test_quopri
0:06:10 load avg: 1.08 [268/391/1] test_random
0:06:10 load avg: 1.08 [269/391/1] test_re
0:06:12 load avg: 1.08 [270/391/1] test_readline
0:06:12 load avg: 1.08 [271/391/1] test_regrtest
0:06:20 load avg: 1.14 [272/391/1] test_repr
0:06:21 load avg: 1.14 [273/391/1] test_rfc822
0:06:21 load avg: 1.14 [274/391/1] test_richcmp
0:06:22 load avg: 1.14 [275/391/1] test_rlcompleter
0:06:22 load avg: 1.14 [276/391/1] test_robotparser
0:06:23 load avg: 1.14 [277/391/1] test_runpy
0:06:27 load avg: 1.13 [278/391/1] test_sax
0:06:28 load avg: 1.13 [279/391/1] test_scope
0:06:28 load avg: 1.13 [280/391/1] test_scriptpackages
test_scriptpackages skipped -- No module named aetools
0:06:29 load avg: 1.12 [281/391/1] test_select -- test_scriptpackages skipped
0:06:41 load avg: 1.00 [282/391/1] test_set
0:06:45 load avg: 1.00 [283/391/1] test_setcomps
0:06:45 load avg: 1.00 [284/391/1] test_sets
0:06:46 load avg: 1.00 [285/391/1] test_sgmllib
0:06:46 load avg: 1.00 [286/391/1] test_sha
0:06:47 load avg: 1.00 [287/391/1] test_shelve
0:06:48 load avg: 1.00 [288/391/1] test_shlex
0:06:49 load avg: 1.00 [289/391/1] test_shutil
0:06:50 load avg: 1.00 [290/391/1] test_signal
0:07:00 load avg: 0.83 [291/391/1] test_site
0:07:02 load avg: 0.83 [292/391/1] test_slice
0:07:03 load avg: 0.84 [293/391/1] test_smtplib
0:07:03 load avg: 0.84 [294/391/1] test_smtpnet
test_smtpnet skipped -- Use of the `network' resource not enabled
0:07:04 load avg: 0.84 [295/391/1] test_socketserver -- test_smtpnet skipped (resource denied)
test_socketserver skipped -- Use of the `network' resource not enabled
0:07:04 load avg: 0.84 [296/391/1] test_softspace -- test_socketserver skipped (resource denied)
0:07:05 load avg: 0.84 [297/391/1] test_sort
0:07:05 load avg: 0.84 [298/391/1] test_source_encoding
0:07:08 load avg: 0.86 [299/391/1] test_spwd
0:07:09 load avg: 0.86 [300/391/1] test_sqlite
0:07:10 load avg: 0.86 [301/391/1] test_ssl
test test_ssl failed -- multiple errors occurred; run in verbose mode for details
0:07:14 load avg: 0.78 [302/391/2] test_startfile -- test_ssl failed
test_startfile skipped -- module 'os' has no attribute 'startfile'
0:07:14 load avg: 0.78 [303/391/2] test_stat -- test_startfile skipped
0:07:15 load avg: 0.78 [304/391/2] test_str
0:07:16 load avg: 0.78 [305/391/2] test_strftime
0:07:17 load avg: 0.78 [306/391/2] test_string
0:07:19 load avg: 0.80 [307/391/2] test_stringprep
0:07:19 load avg: 0.80 [308/391/2] test_strop
0:07:20 load avg: 0.80 [309/391/2] test_strptime
0:07:20 load avg: 0.80 [310/391/2] test_strtod
0:07:22 load avg: 0.80 [311/391/2] test_struct
0:07:24 load avg: 0.82 [312/391/2] test_structmembers
0:07:24 load avg: 0.82 [313/391/2] test_structseq
0:07:25 load avg: 0.82 [314/391/2] test_subprocess
0:16:18 load avg: 1.67 [315/391/2] test_sunau -- test_subprocess passed in 8 min 53 sec
0:16:19 load avg: 1.67 [316/391/2] test_sunaudiodev
test_sunaudiodev skipped -- No module named sunaudiodev
0:16:19 load avg: 1.67 [317/391/2] test_sundry -- test_sunaudiodev skipped
0:16:20 load avg: 1.67 [318/391/2] test_symtable
0:16:20 load avg: 1.67 [319/391/2] test_syntax
0:16:21 load avg: 1.67 [320/391/2] test_sys
0:16:24 load avg: 1.61 [321/391/2] test_sys_setprofile
0:16:25 load avg: 1.61 [322/391/2] test_sys_settrace
0:16:25 load avg: 1.61 [323/391/2] test_sysconfig
0:16:26 load avg: 1.61 [324/391/2] test_tarfile
0:16:32 load avg: 1.56 [325/391/2] test_tcl
0:16:33 load avg: 1.56 [326/391/2] test_telnetlib
0:16:38 load avg: 1.42 [327/391/2] test_tempfile
0:16:39 load avg: 1.47 [328/391/2] test_test_support
0:16:41 load avg: 1.47 [329/391/2] test_textwrap
0:16:41 load avg: 1.47 [330/391/2] test_thread
0:16:42 load avg: 1.47 [331/391/2] test_threaded_import
0:16:43 load avg: 1.47 [332/391/2] test_threadedtempfile
0:16:43 load avg: 1.47 [333/391/2] test_threading
0:16:56 load avg: 1.45 [334/391/2] test_threading_local
0:17:00 load avg: 1.41 [335/391/2] test_threadsignals
0:17:01 load avg: 1.41 [336/391/2] test_time
0:17:03 load avg: 1.41 [337/391/2] test_timeit
0:17:03 load avg: 1.41 [338/391/2] test_timeout
test_timeout skipped -- Use of the `network' resource not enabled
0:17:04 load avg: 1.41 [339/391/2] test_tk -- test_timeout skipped (resource denied)
test_tk skipped -- Use of the `gui' resource not enabled
0:17:04 load avg: 1.37 [340/391/2] test_tokenize -- test_tk skipped (resource denied)
0:17:05 load avg: 1.37 [341/391/2] test_tools
recursedown('@test_6772_tmp')
0:17:13 load avg: 1.43 [342/391/2] test_trace
0:17:16 load avg: 1.39 [343/391/2] test_traceback
0:17:21 load avg: 1.25 [344/391/2] test_transformer
0:17:22 load avg: 1.25 [345/391/2] test_ttk_guionly
test_ttk_guionly skipped -- Use of the `gui' resource not enabled
0:17:22 load avg: 1.25 [346/391/2] test_ttk_textonly -- test_ttk_guionly skipped (resource denied)
0:17:23 load avg: 1.25 [347/391/2] test_tuple
0:17:57 load avg: 1.14 [348/391/2] test_turtle -- test_tuple passed in 34 sec
0:17:58 load avg: 1.21 [349/391/2] test_typechecks
0:17:59 load avg: 1.21 [350/391/2] test_ucn
0:18:00 load avg: 1.21 [351/391/2] test_unary
0:18:00 load avg: 1.21 [352/391/2] test_undocumented_details
0:18:01 load avg: 1.21 [353/391/2] test_unicode
0:18:17 load avg: 1.16 [354/391/2] test_unicode_file
0:18:17 load avg: 1.16 [355/391/2] test_unicodedata
0:18:21 load avg: 1.15 [356/391/2] test_univnewlines
0:18:22 load avg: 1.15 [357/391/2] test_univnewlines2k
0:18:22 load avg: 1.15 [358/391/2] test_unpack
0:18:23 load avg: 1.15 [359/391/2] test_urllib
0:18:23 load avg: 1.15 [360/391/2] test_urllib2_localnet
Traceback (most recent call last):
  File "/tmp/B.qqCqvt/BUILD/Python-2.7.15/Lib/SocketServer.py", line 290, in _handle_request_noblock
    self.process_request(request, client_address)
  File "/tmp/B.qqCqvt/BUILD/Python-2.7.15/Lib/SocketServer.py", line 318, in process_request
    self.finish_request(request, client_address)
  File "/tmp/B.qqCqvt/BUILD/Python-2.7.15/Lib/SocketServer.py", line 331, in finish_request
    self.RequestHandlerClass(request, client_address, self)
  File "/tmp/B.qqCqvt/BUILD/Python-2.7.15/Lib/SocketServer.py", line 652, in __init__
    self.handle()
  File "/tmp/B.qqCqvt/BUILD/Python-2.7.15/Lib/BaseHTTPServer.py", line 340, in handle
    self.handle_one_request()
  File "/tmp/B.qqCqvt/BUILD/Python-2.7.15/Lib/BaseHTTPServer.py", line 310, in handle_one_request
    self.raw_requestline = self.rfile.readline(65537)
  File "/tmp/B.qqCqvt/BUILD/Python-2.7.15/Lib/socket.py", line 480, in readline
    data = self._sock.recv(self._rbufsize)
  File "/tmp/B.qqCqvt/BUILD/Python-2.7.15/Lib/ssl.py", line 772, in recv
    return self.read(buflen)
  File "/tmp/B.qqCqvt/BUILD/Python-2.7.15/Lib/ssl.py", line 659, in read
    v = self._sslobj.read(len)
error: [Errno 104] Connection reset by peer
test test_urllib2_localnet produced unexpected output:
**********************************************************************
----------------------------------------
Exception happened during processing of request from ('127.0.0.1', 59104)
----------------------------------------

**********************************************************************
0:18:25 load avg: 1.05 [361/391/3] test_urllib2net -- test_urllib2_localnet failed
test_urllib2net skipped -- Use of the `network' resource not enabled
0:18:25 load avg: 1.05 [362/391/3] test_urllibnet -- test_urllib2net skipped (resource denied)
test_urllibnet skipped -- Use of the `network' resource not enabled
0:18:26 load avg: 1.05 [363/391/3] test_urlparse -- test_urllibnet skipped (resource denied)
0:18:26 load avg: 1.05 [364/391/3] test_userdict
0:18:28 load avg: 1.05 [365/391/3] test_userlist
0:18:30 load avg: 1.05 [366/391/3] test_userstring
0:18:33 load avg: 1.05 [367/391/3] test_uu
0:18:34 load avg: 1.13 [368/391/3] test_uuid
0:18:35 load avg: 1.13 [369/391/3] test_wait3
0:18:41 load avg: 1.03 [370/391/3] test_wait4
0:18:47 load avg: 0.94 [371/391/3] test_warnings
0:18:50 load avg: 1.03 [372/391/3] test_wave
0:18:51 load avg: 1.03 [373/391/3] test_weakref
0:25:41 load avg: 1.35 [374/391/3] test_weakset -- test_weakref passed in 6 min 50 sec
0:25:44 load avg: 1.35 [375/391/3] test_whichdb
0:25:44 load avg: 1.40 [376/391/3] test_winreg
test_winreg skipped -- No module named _winreg
0:25:45 load avg: 1.40 [377/391/3] test_winsound -- test_winreg skipped
test_winsound skipped -- Use of the `audio' resource not enabled
0:25:46 load avg: 1.40 [378/391/3] test_with -- test_winsound skipped (resource denied)
0:25:46 load avg: 1.40 [379/391/3] test_wsgiref
0:25:47 load avg: 1.40 [380/391/3] test_xdrlib
0:25:47 load avg: 1.40 [381/391/3] test_xml_etree
0:25:49 load avg: 1.45 [382/391/3] test_xml_etree_c
0:25:50 load avg: 1.45 [383/391/3] test_xmllib
0:25:51 load avg: 1.45 [384/391/3] test_xmlrpc
0:25:54 load avg: 1.45 [385/391/3] test_xpickle
0:25:55 load avg: 1.45 [386/391/3] test_xrange
0:25:56 load avg: 1.40 [387/391/3] test_zipfile
0:26:01 load avg: 1.40 [388/391/3] test_zipfile64
test_zipfile64 skipped -- test requires loads of disk-space bytes and a long time to run
0:26:02 load avg: 1.40 [389/391/3] test_zipimport -- test_zipfile64 skipped (resource denied)
0:26:02 load avg: 1.36 [390/391/3] test_zipimport_support
0:26:04 load avg: 1.36 [391/391/3] test_zlib
351 tests OK.
3 tests failed:
    test_httplib test_ssl test_urllib2_localnet
37 tests skipped:
    test_aepack test_al test_applesingle test_bsddb185 test_bsddb3
    test_cd test_cl test_codecmaps_cn test_codecmaps_hk
    test_codecmaps_jp test_codecmaps_kr test_codecmaps_tw test_curses
    test_dl test_gl test_imgfile test_ioctl test_kqueue
    test_linuxaudiodev test_macos test_macostools test_msilib
    test_ossaudiodev test_py3kwarn test_scriptpackages test_smtpnet
    test_socketserver test_startfile test_sunaudiodev test_timeout
    test_tk test_ttk_guionly test_urllib2net test_urllibnet
    test_winreg test_winsound test_zipfile64
1 skip unexpected on linux2:
    test_ioctl
Re-running failed tests in verbose mode
Re-running test 'test_httplib' in verbose mode
test_auto_headers (test.test_httplib.HeaderTests) ... ok
test_blank_line_forms (test.test_httplib.HeaderTests) ... ok
test_content_length_0 (test.test_httplib.HeaderTests) ... ok
test_from_line (test.test_httplib.HeaderTests) ... ok
test_invalid_headers (test.test_httplib.HeaderTests) ... ok
test_ipv6host_header (test.test_httplib.HeaderTests) ... ok
test_malformed_headers_coped_with (test.test_httplib.HeaderTests) ... ok
test_malformed_truncation (test.test_httplib.HeaderTests) ... ok
test_parse_all_octets (test.test_httplib.HeaderTests) ... ok
test_putheader (test.test_httplib.HeaderTests) ... ok
test_responses (test.test_httplib.OfflineTest) ... ok
test_bad_status_repr (test.test_httplib.BasicTest) ... ok
test_chunked (test.test_httplib.BasicTest) ... ok
test_chunked_head (test.test_httplib.BasicTest) ... ok
test_early_eof (test.test_httplib.BasicTest) ... ok
test_epipe (test.test_httplib.BasicTest) ... ok
test_error_leak (test.test_httplib.BasicTest) ... ok
test_filenoattr (test.test_httplib.BasicTest) ... ok
test_host_port (test.test_httplib.BasicTest) ... ok
test_incomplete_read (test.test_httplib.BasicTest) ... ok
test_negative_content_length (test.test_httplib.BasicTest) ... ok
test_overflowing_chunked_line (test.test_httplib.BasicTest) ... ok
test_overflowing_header_line (test.test_httplib.BasicTest) ... ok
test_overflowing_status_line (test.test_httplib.BasicTest) ... skipped 'disabled for HTTP 0.9 support'
test_partial_reads (test.test_httplib.BasicTest) ... ok
test_partial_reads_incomplete_body (test.test_httplib.BasicTest) ... ok
test_partial_reads_no_content_length (test.test_httplib.BasicTest) ... ok
test_proxy_tunnel_without_status_line (test.test_httplib.BasicTest) ... ok
test_read_head (test.test_httplib.BasicTest) ... ok
test_response_headers (test.test_httplib.BasicTest) ... ok
test_send (test.test_httplib.BasicTest) ... ok
test_send_file (test.test_httplib.BasicTest) ... ok
test_send_tempfile (test.test_httplib.BasicTest) ... ok
test_status_lines (test.test_httplib.BasicTest) ... ok
test_too_many_headers (test.test_httplib.BasicTest) ... ok
testTimeoutAttribute (test.test_httplib.TimeoutTest)
This will prove that the timeout gets through ... ok
testHTTPConnection (test.test_httplib.HTTPTest) ... ok
testHTTPWithConnectHostPort (test.test_httplib.HTTPTest) ... ok
test_attributes (test.test_httplib.HTTPSTest) ... ok
test_host_port (test.test_httplib.HTTPSTest) ... ok
test_local_bad_hostname (test.test_httplib.HTTPSTest) ... Traceback (most recent call last):
  File "/tmp/B.qqCqvt/BUILD/Python-2.7.15/Lib/SocketServer.py", line 290, in _handle_request_noblock
    self.process_request(request, client_address)
  File "/tmp/B.qqCqvt/BUILD/Python-2.7.15/Lib/SocketServer.py", line 318, in process_request
    self.finish_request(request, client_address)
  File "/tmp/B.qqCqvt/BUILD/Python-2.7.15/Lib/SocketServer.py", line 331, in finish_request
    self.RequestHandlerClass(request, client_address, self)
  File "/tmp/B.qqCqvt/BUILD/Python-2.7.15/Lib/SocketServer.py", line 652, in __init__
    self.handle()
  File "/tmp/B.qqCqvt/BUILD/Python-2.7.15/Lib/BaseHTTPServer.py", line 340, in handle
    self.handle_one_request()
  File "/tmp/B.qqCqvt/BUILD/Python-2.7.15/Lib/BaseHTTPServer.py", line 310, in handle_one_request
    self.raw_requestline = self.rfile.readline(65537)
  File "/tmp/B.qqCqvt/BUILD/Python-2.7.15/Lib/socket.py", line 480, in readline
    data = self._sock.recv(self._rbufsize)
  File "/tmp/B.qqCqvt/BUILD/Python-2.7.15/Lib/ssl.py", line 772, in recv
    return self.read(buflen)
  File "/tmp/B.qqCqvt/BUILD/Python-2.7.15/Lib/ssl.py", line 659, in read
    v = self._sslobj.read(len)
error: [Errno 104] Connection reset by peer
----------------------------------------
Exception happened during processing of request from ('127.0.0.1', 42284)
----------------------------------------
 server (('127.0.0.1', 33335):33335 ('TLS_AES_256_GCM_SHA384', 'TLSv1.3', 256)):
   [14/Sep/2018 07:40:10] code 404, message File not found
 server (('127.0.0.1', 33335):33335 ('TLS_AES_256_GCM_SHA384', 'TLSv1.3', 256)):
   [14/Sep/2018 07:40:10] "GET /nonexistent HTTP/1.1" 404 -
stopping HTTPS server
joining HTTPS thread
ok
test_local_good_hostname (test.test_httplib.HTTPSTest) ...  server (('127.0.0.1', 38191):38191 ('TLS_AES_256_GCM_SHA384', 'TLSv1.3', 256)):
   [14/Sep/2018 07:40:10] code 404, message File not found
 server (('127.0.0.1', 38191):38191 ('TLS_AES_256_GCM_SHA384', 'TLSv1.3', 256)):
   [14/Sep/2018 07:40:10] "GET /nonexistent HTTP/1.1" 404 -
stopping HTTPS server
joining HTTPS thread
ok
test_local_unknown_cert (test.test_httplib.HTTPSTest) ... stopping HTTPS server
joining HTTPS thread
ok
test_networked (test.test_httplib.HTTPSTest) ... skipped "Use of the `network' resource not enabled"
test_networked_bad_cert (test.test_httplib.HTTPSTest) ... skipped "Use of the `network' resource not enabled"
test_networked_good_cert (test.test_httplib.HTTPSTest) ... skipped "Use of the `network' resource not enabled"
test_networked_noverification (test.test_httplib.HTTPSTest) ... skipped "Use of the `network' resource not enabled"
test_networked_trusted_by_default_cert (test.test_httplib.HTTPSTest) ... skipped "Use of the `network' resource not enabled"
testHTTPConnectionSourceAddress (test.test_httplib.SourceAddressTest) ... ok
testHTTPSConnectionSourceAddress (test.test_httplib.SourceAddressTest) ... ok
test_connect (test.test_httplib.TunnelTests) ... ok

----------------------------------------------------------------------
Ran 51 tests in 0.261s

OK (skipped=6)
Re-running test 'test_ssl' in verbose mode
test_ssl: testing with 'OpenSSL 1.1.1  11 Sep 2018' (1, 1, 1, 0, 15)
          under Linux ('PLD Linux (Th)', '3.0', '')
          HAS_SNI = True
          OP_ALL = 0x-7fffffac
          OP_NO_TLSv1_1 = 0x10000000
test__create_stdlib_context (test.test_ssl.ContextTests) ... ok
test__https_verify_certificates (test.test_ssl.ContextTests) ... ok
test__https_verify_envvar (test.test_ssl.ContextTests) ... ok
test_cert_store_stats (test.test_ssl.ContextTests) ... ok
test_check_hostname (test.test_ssl.ContextTests) ... ok
test_ciphers (test.test_ssl.ContextTests) ... ok
test_constructor (test.test_ssl.ContextTests) ... ok
test_create_default_context (test.test_ssl.ContextTests) ... ok
test_get_ca_certs (test.test_ssl.ContextTests) ... ok
test_load_cert_chain (test.test_ssl.ContextTests) ... ok
test_load_default_certs (test.test_ssl.ContextTests) ... ok
test_load_default_certs_env (test.test_ssl.ContextTests) ... ok
test_load_default_certs_env_windows (test.test_ssl.ContextTests) ... skipped 'Windows specific'
test_load_dh_params (test.test_ssl.ContextTests) ... ok
test_load_verify_cadata (test.test_ssl.ContextTests) ... ok
test_load_verify_locations (test.test_ssl.ContextTests) ... ok
test_options (test.test_ssl.ContextTests) ... FAIL
test_protocol (test.test_ssl.ContextTests) ... ok
test_session_stats (test.test_ssl.ContextTests) ... ok
test_set_default_verify_paths (test.test_ssl.ContextTests) ... ok
test_set_ecdh_curve (test.test_ssl.ContextTests) ... ok
test_sni_callback (test.test_ssl.ContextTests) ... ok
test_sni_callback_refcycle (test.test_ssl.ContextTests) ... ok
test_verify_flags (test.test_ssl.ContextTests) ... ok
test_verify_mode (test.test_ssl.ContextTests) ... ok
test_sslwrap_simple (test.test_ssl.BasicTests) ... ok
test_DER_to_PEM (test.test_ssl.BasicSocketTests) ... ok
test_asn1object (test.test_ssl.BasicSocketTests) ... ok
test_cert_time_to_seconds (test.test_ssl.BasicSocketTests) ... ok
test_cert_time_to_seconds_locale (test.test_ssl.BasicSocketTests) ... skipped 'locale-specific month name needs to be different from C locale'
test_cert_time_to_seconds_timezone (test.test_ssl.BasicSocketTests) ... ok
test_constants (test.test_ssl.BasicSocketTests) ... ok
test_empty_cert (test.test_ssl.BasicSocketTests)
Wrapping with an empty cert file ... ok
test_enum_certificates (test.test_ssl.BasicSocketTests) ... skipped 'Windows specific'
test_enum_crls (test.test_ssl.BasicSocketTests) ... skipped 'Windows specific'
test_errors (test.test_ssl.BasicSocketTests) ... ok
test_get_default_verify_paths (test.test_ssl.BasicSocketTests) ... ok
test_malformed_cert (test.test_ssl.BasicSocketTests)
Wrapping with a badly formatted certificate (syntax error) ... ok
test_malformed_key (test.test_ssl.BasicSocketTests)
Wrapping with a badly formatted key (syntax error) ... ok
test_match_hostname (test.test_ssl.BasicSocketTests) ... ok
test_openssl_version (test.test_ssl.BasicSocketTests) ... ok
test_parse_all_sans (test.test_ssl.BasicSocketTests) ... ok
test_parse_cert (test.test_ssl.BasicSocketTests) ... 
{'issuer': ((('countryName', u'XY'),),
            (('localityName', u'Castle Anthrax'),),
            (('organizationName', u'Python Software Foundation'),),
            (('commonName', u'localhost'),)),
 'notAfter': 'Oct  5 23:01:56 2020 GMT',
 'notBefore': u'Oct  8 23:01:56 2010 GMT',
 'serialNumber': u'D7C7381919AFC24E',
 'subject': ((('countryName', u'XY'),),
             (('localityName', u'Castle Anthrax'),),
             (('organizationName', u'Python Software Foundation'),),
             (('commonName', u'localhost'),)),
 'subjectAltName': (('DNS', 'localhost'),),
 'version': 3L}

{'OCSP': (u'http://ocsp.verisign.com',),
 'caIssuers': (u'http://SVRIntl-G3-aia.verisign.com/SVRIntlG3.cer',),
 'crlDistributionPoints': (u'http://SVRIntl-G3-crl.verisign.com/SVRIntlG3.crl',),
 'issuer': ((('countryName', u'US'),),
            (('organizationName', u'VeriSign, Inc.'),),
            (('organizationalUnitName', u'VeriSign Trust Network'),),
            (('organizationalUnitName',
              u'Terms of use at https://www.verisign.com/rpa (c)10'),),
            (('commonName',
              u'VeriSign Class 3 International Server CA - G3'),)),
 'notAfter': 'Sep 20 23:59:59 2012 GMT',
 'notBefore': u'Sep 21 00:00:00 2011 GMT',
 'serialNumber': u'2EE6EA7640A075CEE5005F4D7C79549A',
 'subject': ((('countryName', u'FI'),),
             (('stateOrProvinceName', u'Espoo'),),
             (('localityName', u'Espoo'),),
             (('organizationName', u'Nokia'),),
             (('organizationalUnitName', u'BI'),),
             (('commonName', u'projects.developer.nokia.com'),)),
 'subjectAltName': (('DNS', 'projects.developer.nokia.com'),
                    ('DNS', 'projects.forum.nokia.com')),
 'version': 3L}
ok
test_parse_cert_CVE_2013_4238 (test.test_ssl.BasicSocketTests) ... 
{'issuer': ((('countryName', u'US'),),
            (('stateOrProvinceName', u'Oregon'),),
            (('localityName', u'Beaverton'),),
            (('organizationName', u'Python Software Foundation'),),
            (('organizationalUnitName', u'Python Core Development'),),
            (('commonName', u'null.python.org\x00example.org'),),
            (('emailAddress', u'python-dev@python.org'),)),
 'notAfter': 'Aug  7 13:12:52 2013 GMT',
 'notBefore': u'Aug  7 13:11:52 2013 GMT',
 'serialNumber': u'00',
 'subject': ((('countryName', u'US'),),
             (('stateOrProvinceName', u'Oregon'),),
             (('localityName', u'Beaverton'),),
             (('organizationName', u'Python Software Foundation'),),
             (('organizationalUnitName', u'Python Core Development'),),
             (('commonName', u'null.python.org\x00example.org'),),
             (('emailAddress', u'python-dev@python.org'),)),
 'subjectAltName': (('DNS', 'altnull.python.org\x00example.com'),
                    ('email', 'null@python.org\x00user@example.org'),
                    ('URI', 'http://null.python.org\x00http://example.org'),
                    ('IP Address', '192.0.2.1'),
                    ('IP Address', '2001:DB8:0:0:0:0:0:1\n')),
 'version': 3L}
ok
test_purpose_enum (test.test_ssl.BasicSocketTests) ... ok
test_random (test.test_ssl.BasicSocketTests) ... 
 RAND_status is 1 (sufficient randomness)
ok
test_refcycle (test.test_ssl.BasicSocketTests) ... ok
test_server_side (test.test_ssl.BasicSocketTests) ... ok
test_timeout (test.test_ssl.BasicSocketTests) ... ok
test_tls_unique_channel_binding (test.test_ssl.BasicSocketTests) ... ok
test_unknown_channel_binding (test.test_ssl.BasicSocketTests) ... ok
test_unsupported_dtls (test.test_ssl.BasicSocketTests) ... ok
test_wrapped_unconnected (test.test_ssl.BasicSocketTests) ... ok
test_lib_reason (test.test_ssl.SSLErrorTests) ... ok
test_str (test.test_ssl.SSLErrorTests) ... ok
test_subclass (test.test_ssl.SSLErrorTests) ... ok
test_alpn_protocols (test.test_ssl.ThreadedTests) ...  server:  new connection from ('127.0.0.1', 58802)
 server: connection cipher is now ('ECDHE-RSA-AES256-GCM-SHA384', 'TLSv1.2', 256)
 server: selected protocol is now None
 client:  sending 'FOO\n'...
 client:  read 'foo\n'
 client:  sending 'FOO\n'...
 client:  read 'foo\n'
 client:  sending 'FOO\n'...
 client:  read 'foo\n'
 client:  closing connection.
 server:  new connection from ('127.0.0.1', 55648)
 server: connection cipher is now ('ECDHE-RSA-AES256-GCM-SHA384', 'TLSv1.2', 256)
 server: selected protocol is now None
 client:  sending 'FOO\n'...
 client:  read 'foo\n'
 client:  sending 'FOO\n'...
 client:  read 'foo\n'
 client:  sending 'FOO\n'...
 client:  read 'foo\n'
 client:  closing connection.
 server:  new connection from ('127.0.0.1', 36116)
 server: connection cipher is now ('ECDHE-RSA-AES256-GCM-SHA384', 'TLSv1.2', 256)
 server: selected protocol is now None
 client:  sending 'FOO\n'...
 client:  read 'foo\n'
 client:  sending 'FOO\n'...
 client:  read 'foo\n'
 client:  sending 'FOO\n'...
 client:  read 'foo\n'
 client:  closing connection.
 server:  new connection from ('127.0.0.1', 36210)
 server: connection cipher is now ('ECDHE-RSA-AES256-GCM-SHA384', 'TLSv1.2', 256)
 server: selected protocol is now None
 client:  sending 'FOO\n'...
 client:  read 'foo\n'
 client:  sending 'FOO\n'...
 client:  read 'foo\n'
 client:  sending 'FOO\n'...
 client:  read 'foo\n'
 client:  closing connection.
ok
test_asyncore_server (test.test_ssl.ThreadedTests)
Check the example asyncore integration. ... 
 server:  new connection from 127.0.0.1:33520
 client:  sending 'FOO\n'...
 server:  read 'FOO\n' from client
 client:  read 'foo\n'
 client:  closing connection.
 client:  connection closed.
 cleanup: stopping server.
 cleanup: joining server thread.
 server:  read 'over\n' from client
 server:  closed connection <ssl.SSLSocket object at 0xef862e70>
 server:  read '' from client
 cleanup: successfully joined.
ok
test_check_hostname (test.test_ssl.ThreadedTests) ... 
 server:  new connection from ('127.0.0.1', 59030)
 server: connection cipher is now ('ECDHE-RSA-AES256-SHA', 'TLSv1.0', 256)
 server: selected protocol is now None
 server:  new connection from ('127.0.0.1', 49682)
 server: connection cipher is now ('ECDHE-RSA-AES256-SHA', 'TLSv1.0', 256)
 server: selected protocol is now None
ok
test_compression (test.test_ssl.ThreadedTests) ...  server:  new connection from ('127.0.0.1', 43962)
 server: connection cipher is now ('ECDHE-RSA-AES256-SHA', 'TLSv1.0', 256)
 server: selected protocol is now None
 client:  sending 'FOO\n'...
 client:  read 'foo\n'
 client:  sending 'FOO\n'...
 client:  read 'foo\n'
 client:  sending 'FOO\n'...
 client:  read 'foo\n'
 client:  closing connection.
 got compression: None
ok
test_compression_disabled (test.test_ssl.ThreadedTests) ...  server:  new connection from ('127.0.0.1', 36728)
 server: connection cipher is now ('ECDHE-RSA-AES256-SHA', 'TLSv1.0', 256)
 server: selected protocol is now None
 client:  sending 'FOO\n'...
 client:  read 'foo\n'
 client:  sending 'FOO\n'...
 client:  read 'foo\n'
 client:  sending 'FOO\n'...
 client:  read 'foo\n'
 client:  closing connection.
ok
test_crl_check (test.test_ssl.ThreadedTests) ... 
 server:  new connection from ('127.0.0.1', 37368)
 server: connection cipher is now ('ECDHE-RSA-AES256-SHA', 'TLSv1.0', 256)
 server: selected protocol is now None
 server:  new connection from ('127.0.0.1', 54258)

 server:  bad connection attempt from ('127.0.0.1', 54258):
Traceback (most recent call last):
   File "/tmp/B.qqCqvt/BUILD/Python-2.7.15/Lib/test/test_ssl.py", line 1663, in wrap_conn
    self.sock, server_side=True)
   File "/tmp/B.qqCqvt/BUILD/Python-2.7.15/Lib/ssl.py", line 369, in wrap_socket
    _context=self)
   File "/tmp/B.qqCqvt/BUILD/Python-2.7.15/Lib/ssl.py", line 617, in __init__
    self.do_handshake()
   File "/tmp/B.qqCqvt/BUILD/Python-2.7.15/Lib/ssl.py", line 846, in do_handshake
    self._sslobj.do_handshake()
 SSLError: [SSL: TLSV1_ALERT_UNKNOWN_CA] tlsv1 alert unknown ca (_ssl.c:726)
 server:  new connection from ('127.0.0.1', 44008)
 server: connection cipher is now ('ECDHE-RSA-AES256-SHA', 'TLSv1.0', 256)
 server: selected protocol is now None
ok
test_default_ciphers (test.test_ssl.ThreadedTests) ... FAIL
test_default_ecdh_curve (test.test_ssl.ThreadedTests) ...  server:  new connection from ('127.0.0.1', 53404)
 server: connection cipher is now ('TLS_AES_256_GCM_SHA384', 'TLSv1.3', 256)
 server: selected protocol is now None
FAIL
test_dh_params (test.test_ssl.ThreadedTests) ...  server:  new connection from ('127.0.0.1', 56790)
 server: connection cipher is now ('DHE-RSA-AES256-SHA', 'SSLv3', 256)
 server: selected protocol is now None
 client:  sending 'FOO\n'...
 client:  read 'foo\n'
 client:  sending 'FOO\n'...
 client:  read 'foo\n'
 client:  sending 'FOO\n'...
 client:  read 'foo\n'
 client:  closing connection.
ok
test_do_handshake_enotconn (test.test_ssl.ThreadedTests) ... ok
test_echo (test.test_ssl.ThreadedTests)
Basic test of an SSL client connecting to a server ... 
 server:  new connection from ('127.0.0.1', 49342)
 client:  sending 'FOO\n'...
 server: connection cipher is now ('TLS_AES_256_GCM_SHA384', 'TLSv1.3', 256)
 server: selected protocol is now None
 client:  read 'foo\n'
 client:  sending 'FOO\n'...
 client:  read 'foo\n'
 client:  sending 'FOO\n'...
 client:  read 'foo\n'
 client:  closing connection.
 server:  new connection from ('127.0.0.1', 46746)
 server: connection cipher is now ('ECDHE-RSA-AES256-SHA', 'TLSv1.0', 256)
 server: selected protocol is now None
 client:  sending 'FOO\n'...
 client:  read 'foo\n'
 client:  sending 'FOO\n'...
 client:  read 'foo\n'
 client:  sending 'FOO\n'...
 client:  read 'foo\n'
 client:  closing connection.
 server:  new connection from ('127.0.0.1', 56202)
 server: connection cipher is now ('ECDHE-RSA-AES256-SHA', 'TLSv1.0', 256)
 server: selected protocol is now None
 client:  sending 'FOO\n'...
 client:  read 'foo\n'
 client:  sending 'FOO\n'...
 client:  read 'foo\n'
 client:  sending 'FOO\n'...
 client:  read 'foo\n'
 client:  closing connection.
 server:  new connection from ('127.0.0.1', 47574)
 server: connection cipher is now ('ECDHE-RSA-AES256-GCM-SHA384', 'TLSv1.2', 256)
 server: selected protocol is now None
 client:  sending 'FOO\n'...
 client:  read 'foo\n'
 client:  sending 'FOO\n'...
 client:  read 'foo\n'
 client:  sending 'FOO\n'...
 client:  read 'foo\n'
 client:  closing connection.
ok
test_getpeercert (test.test_ssl.ThreadedTests) ... Exception in thread Thread-1476:
Traceback (most recent call last):
  File "/tmp/B.qqCqvt/BUILD/Python-2.7.15/Lib/threading.py", line 801, in __bootstrap_inner
    self.run()
  File "/tmp/B.qqCqvt/BUILD/Python-2.7.15/Lib/test/test_ssl.py", line 1723, in run
    msg = self.read()
  File "/tmp/B.qqCqvt/BUILD/Python-2.7.15/Lib/test/test_ssl.py", line 1700, in read
    return self.sslconn.read()
  File "/tmp/B.qqCqvt/BUILD/Python-2.7.15/Lib/ssl.py", line 659, in read
    v = self._sslobj.read(len)
error: [Errno 104] Connection reset by peer


{'issuer': ((('countryName', u'XY'),),
            (('localityName', u'Castle Anthrax'),),
            (('organizationName', u'Python Software Foundation'),),
            (('commonName', u'localhost'),)),
 'notAfter': 'Oct  5 23:01:56 2020 GMT',
 'notBefore': u'Oct  8 23:01:56 2010 GMT',
 'serialNumber': u'D7C7381919AFC24E',
 'subject': ((('countryName', u'XY'),),
             (('localityName', u'Castle Anthrax'),),
             (('organizationName', u'Python Software Foundation'),),
             (('commonName', u'localhost'),)),
 'subjectAltName': (('DNS', 'localhost'),),
 'version': 3L}
Connection cipher is ('TLS_AES_256_GCM_SHA384', 'TLSv1.3', 256).
ok
test_getpeercert_enotconn (test.test_ssl.ThreadedTests) ... ok
test_handshake_timeout (test.test_ssl.ThreadedTests) ... ok
test_npn_protocols (test.test_ssl.ThreadedTests) ... skipped 'NPN support needed for this test'
test_protocol_sslv2 (test.test_ssl.ThreadedTests)
Connecting to an SSLv2 server with various client options ... skipped 'OpenSSL is compiled without SSLv2 support'
test_protocol_sslv23 (test.test_ssl.ThreadedTests)
Connecting to an SSLv23 server with various client options ... 
 PROTOCOL_TLS->PROTOCOL_TLS CERT_NONE
 PROTOCOL_TLSv1->PROTOCOL_TLS CERT_NONE
 PROTOCOL_TLS->PROTOCOL_TLS CERT_OPTIONAL
 PROTOCOL_TLSv1->PROTOCOL_TLS CERT_OPTIONAL
 PROTOCOL_TLS->PROTOCOL_TLS CERT_REQUIRED
 PROTOCOL_TLSv1->PROTOCOL_TLS CERT_REQUIRED
 PROTOCOL_TLS->PROTOCOL_TLS CERT_NONE
 {PROTOCOL_TLSv1->PROTOCOL_TLS} CERT_NONE
ok
test_protocol_sslv3 (test.test_ssl.ThreadedTests)
Connecting to an SSLv3 server with various client options ... skipped 'OpenSSL is compiled without SSLv3 support'
test_protocol_tlsv1 (test.test_ssl.ThreadedTests)
Connecting to a TLSv1 server with various client options ... 
 PROTOCOL_TLSv1->PROTOCOL_TLSv1 CERT_NONE
 PROTOCOL_TLSv1->PROTOCOL_TLSv1 CERT_OPTIONAL
 PROTOCOL_TLSv1->PROTOCOL_TLSv1 CERT_REQUIRED
 {PROTOCOL_TLS->PROTOCOL_TLSv1} CERT_NONE
ok
test_protocol_tlsv1_1 (test.test_ssl.ThreadedTests)
Connecting to a TLSv1.1 server with various client options. ... 
 PROTOCOL_TLSv1_1->PROTOCOL_TLSv1_1 CERT_NONE
 {PROTOCOL_TLS->PROTOCOL_TLSv1_1} CERT_NONE
 PROTOCOL_TLSv1_1->PROTOCOL_TLS CERT_NONE
 {PROTOCOL_TLSv1->PROTOCOL_TLSv1_1} CERT_NONE
 {PROTOCOL_TLSv1_1->PROTOCOL_TLSv1} CERT_NONE
ok
test_protocol_tlsv1_2 (test.test_ssl.ThreadedTests)
Connecting to a TLSv1.2 server with various client options. ... 
 PROTOCOL_TLSv1_2->PROTOCOL_TLSv1_2 CERT_NONE
 {PROTOCOL_TLS->PROTOCOL_TLSv1_2} CERT_NONE
 PROTOCOL_TLSv1_2->PROTOCOL_TLS CERT_NONE
 {PROTOCOL_TLSv1->PROTOCOL_TLSv1_2} CERT_NONE
 {PROTOCOL_TLSv1_2->PROTOCOL_TLSv1} CERT_NONE
 {PROTOCOL_TLSv1_1->PROTOCOL_TLSv1_2} CERT_NONE
 {PROTOCOL_TLSv1_2->PROTOCOL_TLSv1_1} CERT_NONE
ok
test_read_write_after_close_raises_valuerror (test.test_ssl.ThreadedTests) ... ok
test_recv_send (test.test_ssl.ThreadedTests)
Test recv(), send() and friends. ... 
 server:  new connection from ('127.0.0.1', 50696)
 server: connection cipher is now ('ECDHE-RSA-AES256-SHA', 'TLSv1.0', 256)
 server: selected protocol is now None
ok
test_recv_zero (test.test_ssl.ThreadedTests) ...  server:  new connection from ('127.0.0.1', 53442)
 server: connection cipher is now ('TLS_AES_256_GCM_SHA384', 'TLSv1.3', 256)
 server: selected protocol is now None
ok
test_rude_shutdown (test.test_ssl.ThreadedTests)
A brutal shutdown of an SSL server should raise an OSError ... ok
test_selected_alpn_protocol (test.test_ssl.ThreadedTests) ...  server:  new connection from ('127.0.0.1', 45604)
 server: connection cipher is now ('ECDHE-RSA-AES256-SHA', 'TLSv1.0', 256)
 server: selected protocol is now None
 client:  sending 'FOO\n'...
 client:  read 'foo\n'
 client:  sending 'FOO\n'...
 client:  read 'foo\n'
 client:  sending 'FOO\n'...
 client:  read 'foo\n'
 client:  closing connection.
ok
test_selected_alpn_protocol_if_server_uses_alpn (test.test_ssl.ThreadedTests) ...  server:  new connection from ('127.0.0.1', 51620)
 server: connection cipher is now ('ECDHE-RSA-AES256-SHA', 'TLSv1.0', 256)
 server: selected protocol is now None
 client:  sending 'FOO\n'...
 client:  read 'foo\n'
 client:  sending 'FOO\n'...
 client:  read 'foo\n'
 client:  sending 'FOO\n'...
 client:  read 'foo\n'
 client:  closing connection.
ok
test_selected_npn_protocol (test.test_ssl.ThreadedTests) ...  server:  new connection from ('127.0.0.1', 32928)
 server: connection cipher is now ('ECDHE-RSA-AES256-SHA', 'TLSv1.0', 256)
 server: selected protocol is now None
 client:  sending 'FOO\n'...
 client:  read 'foo\n'
 client:  sending 'FOO\n'...
 client:  read 'foo\n'
 client:  sending 'FOO\n'...
 client:  read 'foo\n'
 client:  closing connection.
ok
test_server_accept (test.test_ssl.ThreadedTests) ... ok
test_sni_callback (test.test_ssl.ThreadedTests) ...  server:  new connection from ('127.0.0.1', 45360)
 server: connection cipher is now ('ECDHE-RSA-AES256-SHA', 'TLSv1.0', 256)
 server: selected protocol is now None
 server:  new connection from ('127.0.0.1', 50526)
 server: connection cipher is now ('ECDHE-RSA-AES256-SHA', 'TLSv1.0', 256)
 server: selected protocol is now None
 server:  new connection from ('127.0.0.1', 43710)
 server: connection cipher is now ('ECDHE-RSA-AES256-SHA', 'TLSv1.0', 256)
 server: selected protocol is now None
ok
test_sni_callback_alert (test.test_ssl.ThreadedTests) ... ok
test_sni_callback_raising (test.test_ssl.ThreadedTests) ... ok
test_sni_callback_wrong_return_type (test.test_ssl.ThreadedTests) ... ok
test_socketserver (test.test_ssl.ThreadedTests)
Using a SocketServer to create and manage SSL connections. ... 
 server (('127.0.0.1', 37943):37943 ('TLS_AES_256_GCM_SHA384', 'TLSv1.3', 256)):
   [14/Sep/2018 07:40:14] "GET /keycert.pem HTTP/1.1" 200 -
 client: read 1783 bytes from remote server '<HTTPSServerThread <HTTPSServer localhost:37943>>'
stopping HTTPS server
joining HTTPS thread
ok
test_starttls (test.test_ssl.ThreadedTests)
Switching from clear text to encrypted and back again. ... 
 client:  sending 'msg 1'...
 server:  new connection from ('127.0.0.1', 38740)
 server: read 'msg 1' (unencrypted), sending back 'msg 1' (unencrypted)...
 client:  read 'msg 1' from server
 client:  sending 'MSG 2'...
 server: read 'MSG 2' (unencrypted), sending back 'msg 2' (unencrypted)...
 client:  read 'msg 2' from server
 client:  sending 'STARTTLS'...
 server: read STARTTLS from client, sending OK...
 client:  read 'ok' from server, starting TLS...
 server: connection cipher is now ('ECDHE-RSA-AES256-SHA', 'TLSv1.0', 256)
 server: selected protocol is now None
 client:  sending 'MSG 3'...
 server: read 'MSG 3' (encrypted), sending back 'msg 3' (encrypted)...
 client:  read 'msg 3' from server
 client:  sending 'msg 4'...
 server: read 'msg 4' (encrypted), sending back 'msg 4' (encrypted)...
 client:  read 'msg 4' from server
 client:  sending 'ENDTLS'...
 server: read ENDTLS from client, sending OK...
 client:  read 'ok' from server, ending TLS...
 server: connection is now unencrypted...
 client:  sending 'msg 5'...
 server: read 'msg 5' (unencrypted), sending back 'msg 5' (unencrypted)...
 client:  read 'msg 5' from server
 client:  sending 'msg 6'...
 server: read 'msg 6' (unencrypted), sending back 'msg 6' (unencrypted)...
 client:  read 'msg 6' from server
 client:  closing connection.
 server: client closed connection
ok
test_tls1_3 (test.test_ssl.ThreadedTests) ... ERROR
test_tls_unique_channel_binding (test.test_ssl.ThreadedTests)
Test tls-unique channel binding. ... 
 server:  new connection from ('127.0.0.1', 52040)
 server: connection cipher is now ('ECDHE-RSA-AES256-SHA', 'TLSv1.0', 256)
 server: selected protocol is now None
 got channel binding data: 'Fs3\xd7R\xa27j\xaaI\xc4\xe5'
 server:  new connection from ('127.0.0.1', 52042)
 server: connection cipher is now ('ECDHE-RSA-AES256-SHA', 'TLSv1.0', 256)
 server: selected protocol is now None
 got another channel binding data: '\x13\xeaGA\xe9\xf1?\xa4${\xb9\xc6'
ok
test_version_basic (test.test_ssl.ThreadedTests) ... ok
test_wrong_cert (test.test_ssl.ThreadedTests)
Connecting when the server rejects the client's certificate ... test test_ssl failed -- multiple errors occurred

SSLError is SSLError(1, u'[SSL: TLSV1_ALERT_UNKNOWN_CA] tlsv1 alert unknown ca (_ssl.c:726)')
ok

======================================================================
ERROR: test_tls1_3 (test.test_ssl.ThreadedTests)
----------------------------------------------------------------------
Traceback (most recent call last):
  File "/tmp/B.qqCqvt/BUILD/Python-2.7.15/Lib/test/test_ssl.py", line 2808, in test_tls1_3
    with context.wrap_socket(socket.socket()) as s:
AttributeError: __exit__

======================================================================
FAIL: test_options (test.test_ssl.ContextTests)
----------------------------------------------------------------------
Traceback (most recent call last):
  File "/tmp/B.qqCqvt/BUILD/Python-2.7.15/Lib/test/test_ssl.py", line 780, in test_options
    self.assertEqual(default, ctx.options)
AssertionError: -2113798060 != -2112749484L

======================================================================
FAIL: test_default_ciphers (test.test_ssl.ThreadedTests)
----------------------------------------------------------------------
Traceback (most recent call last):
  File "/tmp/B.qqCqvt/BUILD/Python-2.7.15/Lib/test/test_ssl.py", line 2780, in test_default_ciphers
    s.connect((HOST, server.port))
AssertionError: SSLError not raised

======================================================================
FAIL: test_default_ecdh_curve (test.test_ssl.ThreadedTests)
----------------------------------------------------------------------
Traceback (most recent call last):
  File "/tmp/B.qqCqvt/BUILD/Python-2.7.15/Lib/test/test_ssl.py", line 2831, in test_default_ecdh_curve
    self.assertIn("ECDH", s.cipher()[0])
AssertionError: 'ECDH' not found in 'TLS_AES_256_GCM_SHA384'

----------------------------------------------------------------------
Ran 95 tests in 3.312s

FAILED (failures=3, errors=1, skipped=7)
Re-running test 'test_urllib2_localnet' in verbose mode
test_basic_auth_httperror (test.test_urllib2_localnet.BasicAuthTests) ... ok
test_basic_auth_success (test.test_urllib2_localnet.BasicAuthTests) ... ok
test_proxy_qop_auth_int_works_or_throws_urlerror (test.test_urllib2_localnet.ProxyAuthTests) ... ok
test_proxy_qop_auth_works (test.test_urllib2_localnet.ProxyAuthTests) ... ok
test_proxy_with_bad_password_raises_httperror (test.test_urllib2_localnet.ProxyAuthTests) ... ok
test_proxy_with_no_password_raises_httperror (test.test_urllib2_localnet.ProxyAuthTests) ... ok
test_200 (test.test_urllib2_localnet.TestUrlopen) ... ok
test_200_with_parameters (test.test_urllib2_localnet.TestUrlopen) ... ok
test_404 (test.test_urllib2_localnet.TestUrlopen) ... ok
test_bad_address (test.test_urllib2_localnet.TestUrlopen) ... skipped "Use of the `network' resource not enabled"
test_basic (test.test_urllib2_localnet.TestUrlopen) ... ok
test_geturl (test.test_urllib2_localnet.TestUrlopen) ... ok
test_https (test.test_urllib2_localnet.TestUrlopen) ... stopping HTTPS server
joining HTTPS thread
ok
test_https_sni (test.test_urllib2_localnet.TestUrlopen) ... stopping HTTPS server
joining HTTPS thread
ok
test_https_with_cadefault (test.test_urllib2_localnet.TestUrlopen) ... stopping HTTPS server
joining HTTPS thread
ok
test_https_with_cafile (test.test_urllib2_localnet.TestUrlopen) ... Traceback (most recent call last):
  File "/tmp/B.qqCqvt/BUILD/Python-2.7.15/Lib/SocketServer.py", line 290, in _handle_request_noblock
    self.process_request(request, client_address)
  File "/tmp/B.qqCqvt/BUILD/Python-2.7.15/Lib/SocketServer.py", line 318, in process_request
    self.finish_request(request, client_address)
  File "/tmp/B.qqCqvt/BUILD/Python-2.7.15/Lib/SocketServer.py", line 331, in finish_request
    self.RequestHandlerClass(request, client_address, self)
  File "/tmp/B.qqCqvt/BUILD/Python-2.7.15/Lib/SocketServer.py", line 652, in __init__
    self.handle()
  File "/tmp/B.qqCqvt/BUILD/Python-2.7.15/Lib/BaseHTTPServer.py", line 340, in handle
    self.handle_one_request()
  File "/tmp/B.qqCqvt/BUILD/Python-2.7.15/Lib/BaseHTTPServer.py", line 310, in handle_one_request
    self.raw_requestline = self.rfile.readline(65537)
  File "/tmp/B.qqCqvt/BUILD/Python-2.7.15/Lib/socket.py", line 480, in readline
    data = self._sock.recv(self._rbufsize)
  File "/tmp/B.qqCqvt/BUILD/Python-2.7.15/Lib/ssl.py", line 772, in recv
    return self.read(buflen)
  File "/tmp/B.qqCqvt/BUILD/Python-2.7.15/Lib/ssl.py", line 659, in read
    v = self._sslobj.read(len)
error: [Errno 104] Connection reset by peer
stopping HTTPS server
----------------------------------------
Exception happened during processing of request from ('127.0.0.1', 48778)
----------------------------------------
joining HTTPS thread
stopping HTTPS server
joining HTTPS thread
ok
test_info (test.test_urllib2_localnet.TestUrlopen) ... ok
test_iteration (test.test_urllib2_localnet.TestUrlopen) ... ok
test_redirection (test.test_urllib2_localnet.TestUrlopen) ... ok
test_sending_headers (test.test_urllib2_localnet.TestUrlopen) ... ok

----------------------------------------------------------------------
Ran 20 tests in 0.641s

OK (skipped=1)
1 test failed again:
    test_ssl

Total duration: 26 min 12 sec
Tests result: FAILURE
make: [Makefile:879: test] Error 2 (ignored)
LD_LIBRARY_PATH=/tmp/B.qqCqvt/BUILD/Python-2.7.15 PYTHONHOME=/tmp/B.qqCqvt/BUILD/Python-2.7.15 PYTHONPATH=/tmp/B.qqCqvt/BUILD/Python-2.7.15/Lib:/tmp/B.qqCqvt/BUILD/Python-2.7.15/Lib/lib-tk:/tmp/B.qqCqvt/BUILD/Python-2.7.15/build/lib.linux-x86_64-2.7 ./python -tt ./Lib/test/regrtest.py -w -l -x test_resource test_openpty test_socket test_nis test_posix test_locale test_pty test_urllib2 test_doctest test_pydoc test_distutils test_gdb
== CPython 2.7.15 (default, Sep 14 2018, 07:12:53) [GCC 8.2.0 20180726 (release)]
==   Linux-4.9.119-1-x86_64-Intel-R-_Xeon-R-_CPU___________E5440__@_2.83GHz-with-pld-3.0 little-endian
==   /tmp/B.qqCqvt/BUILD/Python-2.7.15/build/test_python_14309
== CPU count: 8
Run tests sequentially
0:00:00 load avg: 1.30 [  1/391] test_grammar
0:00:00 load avg: 1.30 [  2/391] test_opcodes
0:00:00 load avg: 1.30 [  3/391] test_dict
0:00:00 load avg: 1.30 [  4/391] test_builtin
0:00:00 load avg: 1.30 [  5/391] test_exceptions
0:00:00 load avg: 1.30 [  6/391] test_types
0:00:00 load avg: 1.30 [  7/391] test_unittest
0:00:00 load avg: 1.30 [  8/391] test_doctest2
0:00:00 load avg: 1.30 [  9/391] test_MimeWriter
0:00:00 load avg: 1.30 [ 10/391] test_SimpleHTTPServer
0:00:00 load avg: 1.30 [ 11/391] test_StringIO
0:00:02 load avg: 1.30 [ 12/391] test___all__
0:00:02 load avg: 1.30 [ 13/391] test___future__
0:00:02 load avg: 1.30 [ 14/391] test__locale
0:00:03 load avg: 1.30 [ 15/391] test__osx_support
0:00:03 load avg: 1.30 [ 16/391] test_abc
0:00:03 load avg: 1.30 [ 17/391] test_abstract_numbers
0:00:03 load avg: 1.30 [ 18/391] test_aepack
test_aepack skipped -- No module named aetypes
0:00:03 load avg: 1.30 [ 19/391] test_aifc -- test_aepack skipped
0:00:03 load avg: 1.30 [ 20/391] test_al
test_al skipped -- No module named al
0:00:04 load avg: 1.30 [ 21/391] test_anydbm -- test_al skipped
0:00:04 load avg: 1.30 [ 22/391] test_applesingle
test_applesingle skipped -- No module named MacOS
0:00:04 load avg: 1.30 [ 23/391] test_argparse -- test_applesingle skipped
0:00:07 load avg: 1.27 [ 24/391] test_array
0:00:08 load avg: 1.27 [ 25/391] test_ascii_formatd
0:00:08 load avg: 1.27 [ 26/391] test_ast
0:00:08 load avg: 1.27 [ 27/391] test_asynchat
0:00:10 load avg: 1.27 [ 28/391] test_asyncore
0:00:11 load avg: 1.17 [ 29/391] test_atexit
0:00:11 load avg: 1.17 [ 30/391] test_audioop
0:00:11 load avg: 1.17 [ 31/391] test_augassign
0:00:12 load avg: 1.17 [ 32/391] test_base64
0:00:12 load avg: 1.17 [ 33/391] test_bastion
0:00:12 load avg: 1.17 [ 34/391] test_bigaddrspace
0:00:12 load avg: 1.17 [ 35/391] test_bigmem
0:00:12 load avg: 1.17 [ 36/391] test_binascii
0:00:12 load avg: 1.17 [ 37/391] test_binhex
0:00:13 load avg: 1.17 [ 38/391] test_binop
0:00:13 load avg: 1.17 [ 39/391] test_bisect
0:00:13 load avg: 1.17 [ 40/391] test_bool
0:00:13 load avg: 1.17 [ 41/391] test_bsddb
0:00:14 load avg: 1.17 [ 42/391] test_bsddb185
test_bsddb185 skipped -- No module named bsddb185
0:00:14 load avg: 1.17 [ 43/391] test_bsddb3 -- test_bsddb185 skipped
test_bsddb3 skipped -- Use of the `bsddb' resource not enabled
0:00:14 load avg: 1.17 [ 44/391] test_buffer -- test_bsddb3 skipped (resource denied)
0:00:14 load avg: 1.17 [ 45/391] test_bufio
0:00:16 load avg: 1.15 [ 46/391] test_bytes
0:00:17 load avg: 1.15 [ 47/391] test_bz2
0:00:19 load avg: 1.15 [ 48/391] test_calendar
0:00:22 load avg: 1.14 [ 49/391] test_call
0:00:22 load avg: 1.14 [ 50/391] test_capi
0:00:25 load avg: 1.14 [ 51/391] test_cd
test_cd skipped -- No module named cd
0:00:25 load avg: 1.14 [ 52/391] test_cfgparser -- test_cd skipped
0:00:26 load avg: 1.13 [ 53/391] test_cgi
0:00:26 load avg: 1.13 [ 54/391] test_charmapcodec
0:00:26 load avg: 1.13 [ 55/391] test_cl
test_cl skipped -- No module named cl
0:00:26 load avg: 1.13 [ 56/391] test_class -- test_cl skipped
0:00:26 load avg: 1.13 [ 57/391] test_cmath
0:00:27 load avg: 1.13 [ 58/391] test_cmd
0:00:27 load avg: 1.13 [ 59/391] test_cmd_line
0:00:29 load avg: 1.13 [ 60/391] test_cmd_line_script
0:00:31 load avg: 1.20 [ 61/391] test_code
0:00:31 load avg: 1.20 [ 62/391] test_codeccallbacks
0:00:31 load avg: 1.20 [ 63/391] test_codecencodings_cn
0:00:32 load avg: 1.20 [ 64/391] test_codecencodings_hk
0:00:32 load avg: 1.20 [ 65/391] test_codecencodings_iso2022
0:00:33 load avg: 1.20 [ 66/391] test_codecencodings_jp
0:00:34 load avg: 1.20 [ 67/391] test_codecencodings_kr
0:00:34 load avg: 1.20 [ 68/391] test_codecencodings_tw
0:00:35 load avg: 1.20 [ 69/391] test_codecmaps_cn
test_codecmaps_cn skipped -- Use of the `urlfetch' resource not enabled
0:00:35 load avg: 1.20 [ 70/391] test_codecmaps_hk -- test_codecmaps_cn skipped (resource denied)
test_codecmaps_hk skipped -- Use of the `urlfetch' resource not enabled
0:00:35 load avg: 1.20 [ 71/391] test_codecmaps_jp -- test_codecmaps_hk skipped (resource denied)
test_codecmaps_jp skipped -- Use of the `urlfetch' resource not enabled
0:00:35 load avg: 1.18 [ 72/391] test_codecmaps_kr -- test_codecmaps_jp skipped (resource denied)
test_codecmaps_kr skipped -- Use of the `urlfetch' resource not enabled
0:00:36 load avg: 1.18 [ 73/391] test_codecmaps_tw -- test_codecmaps_kr skipped (resource denied)
test_codecmaps_tw skipped -- Use of the `urlfetch' resource not enabled
0:00:36 load avg: 1.18 [ 74/391] test_codecs -- test_codecmaps_tw skipped (resource denied)
0:00:37 load avg: 1.18 [ 75/391] test_codeop
0:00:38 load avg: 1.18 [ 76/391] test_coercion
0:00:38 load avg: 1.18 [ 77/391] test_collections
0:00:39 load avg: 1.18 [ 78/391] test_colorsys
0:00:39 load avg: 1.18 [ 79/391] test_commands
0:00:39 load avg: 1.18 [ 80/391] test_compare
0:00:39 load avg: 1.18 [ 81/391] test_compile
0:00:40 load avg: 1.18 [ 82/391] test_compileall
0:00:40 load avg: 1.18 [ 83/391] test_compiler
0:00:40 load avg: 1.17 [ 84/391] test_complex
0:00:41 load avg: 1.17 [ 85/391] test_complex_args
0:00:41 load avg: 1.17 [ 86/391] test_contains
0:00:41 load avg: 1.17 [ 87/391] test_contextlib
0:00:42 load avg: 1.17 [ 88/391] test_cookie
0:00:42 load avg: 1.17 [ 89/391] test_cookielib
0:00:42 load avg: 1.17 [ 90/391] test_copy
0:00:42 load avg: 1.17 [ 91/391] test_copy_reg
0:00:43 load avg: 1.17 [ 92/391] test_cpickle
0:00:45 load avg: 1.17 [ 93/391] test_cprofile
0:00:45 load avg: 1.17 [ 94/391] test_crypt
0:00:46 load avg: 1.15 [ 95/391] test_csv
0:00:46 load avg: 1.15 [ 96/391] test_ctypes
0:00:50 load avg: 1.15 [ 97/391] test_curses
test_curses skipped -- Use of the `curses' resource not enabled
0:00:50 load avg: 1.15 [ 98/391] test_datetime -- test_curses skipped (resource denied)
0:00:51 load avg: 1.06 [ 99/391] test_dbm
0:00:51 load avg: 1.06 [100/391] test_decimal
0:00:53 load avg: 1.06 [101/391] test_decorators
0:00:53 load avg: 1.06 [102/391] test_defaultdict
0:00:54 load avg: 1.06 [103/391] test_deque
0:01:03 load avg: 1.13 [104/391] test_descr
0:01:10 load avg: 1.20 [105/391] test_descrtut
0:01:10 load avg: 1.20 [106/391] test_dictcomps
0:01:11 load avg: 1.20 [107/391] test_dictviews
0:01:11 load avg: 1.27 [108/391] test_difflib
0:01:12 load avg: 1.27 [109/391] test_dircache
0:01:13 load avg: 1.27 [110/391] test_dis
0:01:14 load avg: 1.27 [111/391] test_dl
test_dl skipped -- Could not open any shared libraries
0:01:14 load avg: 1.27 [112/391] test_docxmlrpc -- test_dl skipped
0:01:17 load avg: 1.15 [113/391] test_dumbdbm
0:01:18 load avg: 1.15 [114/391] test_dummy_thread
0:01:18 load avg: 1.15 [115/391] test_dummy_threading
0:01:18 load avg: 1.15 [116/391] test_email
0:01:23 load avg: 1.39 [117/391] test_email_codecs
0:01:23 load avg: 1.39 [118/391] test_email_renamed
0:01:24 load avg: 1.39 [119/391] test_ensurepip
0:01:24 load avg: 1.39 [120/391] test_enumerate
0:01:24 load avg: 1.39 [121/391] test_eof
0:01:25 load avg: 1.39 [122/391] test_epoll
0:01:27 load avg: 1.25 [123/391] test_errno
0:01:28 load avg: 1.25 [124/391] test_exception_variations
0:01:28 load avg: 1.25 [125/391] test_extcall
0:01:28 load avg: 1.25 [126/391] test_fcntl
0:01:28 load avg: 1.25 [127/391] test_file
0:01:29 load avg: 1.25 [128/391] test_file2k
0:01:37 load avg: 1.53 [129/391] test_file_eintr
0:01:39 load avg: 1.53 [130/391] test_filecmp
0:01:39 load avg: 1.53 [131/391] test_fileinput
0:01:40 load avg: 1.53 [132/391] test_fileio
0:01:40 load avg: 1.53 [133/391] test_float
0:01:41 load avg: 1.53 [134/391] test_fnmatch
0:01:41 load avg: 1.53 [135/391] test_fork1
0:01:48 load avg: 1.28 [136/391] test_format
0:01:48 load avg: 1.28 [137/391] test_fpformat
0:01:49 load avg: 1.28 [138/391] test_fractions
0:01:49 load avg: 1.28 [139/391] test_frozen
0:01:50 load avg: 1.28 [140/391] test_ftplib
0:01:53 load avg: 1.17 [141/391] test_funcattrs
0:01:54 load avg: 1.17 [142/391] test_functools
0:01:54 load avg: 1.17 [143/391] test_future
0:01:54 load avg: 1.17 [144/391] test_future3
0:01:54 load avg: 1.17 [145/391] test_future4
0:01:55 load avg: 1.17 [146/391] test_future5
0:01:55 load avg: 1.17 [147/391] test_future_builtins
0:01:56 load avg: 1.17 [148/391] test_gc
0:02:07 load avg: 1.14 [149/391] test_gdbm
0:02:07 load avg: 1.14 [150/391] test_generators
0:02:08 load avg: 1.14 [151/391] test_genericpath
0:02:08 load avg: 1.14 [152/391] test_genexps
0:02:08 load avg: 1.14 [153/391] test_getargs
0:02:09 load avg: 1.14 [154/391] test_getargs2
0:02:09 load avg: 1.14 [155/391] test_getopt
0:02:09 load avg: 1.14 [156/391] test_gettext
0:02:09 load avg: 1.14 [157/391] test_gl
test_gl skipped -- No module named gl
0:02:10 load avg: 1.12 [158/391] test_glob -- test_gl skipped
0:02:10 load avg: 1.12 [159/391] test_global
0:02:11 load avg: 1.12 [160/391] test_grp
0:02:11 load avg: 1.12 [161/391] test_gzip
0:02:11 load avg: 1.12 [162/391] test_hash
0:02:13 load avg: 1.12 [163/391] test_hashlib
0:02:14 load avg: 1.12 [164/391] test_heapq
0:02:15 load avg: 1.11 [165/391] test_hmac
0:02:15 load avg: 1.11 [166/391] test_hotshot
0:02:16 load avg: 1.11 [167/391] test_htmllib
0:02:16 load avg: 1.11 [168/391] test_htmlparser
0:02:17 load avg: 1.11 [169/391] test_httplib
Traceback (most recent call last):
  File "/tmp/B.qqCqvt/BUILD/Python-2.7.15/Lib/SocketServer.py", line 290, in _handle_request_noblock
    self.process_request(request, client_address)
  File "/tmp/B.qqCqvt/BUILD/Python-2.7.15/Lib/SocketServer.py", line 318, in process_request
    self.finish_request(request, client_address)
  File "/tmp/B.qqCqvt/BUILD/Python-2.7.15/Lib/SocketServer.py", line 331, in finish_request
    self.RequestHandlerClass(request, client_address, self)
  File "/tmp/B.qqCqvt/BUILD/Python-2.7.15/Lib/SocketServer.py", line 652, in __init__
    self.handle()
  File "/tmp/B.qqCqvt/BUILD/Python-2.7.15/Lib/BaseHTTPServer.py", line 340, in handle
    self.handle_one_request()
  File "/tmp/B.qqCqvt/BUILD/Python-2.7.15/Lib/BaseHTTPServer.py", line 310, in handle_one_request
    self.raw_requestline = self.rfile.readline(65537)
  File "/tmp/B.qqCqvt/BUILD/Python-2.7.15/Lib/socket.py", line 480, in readline
    data = self._sock.recv(self._rbufsize)
  File "/tmp/B.qqCqvt/BUILD/Python-2.7.15/Lib/ssl.py", line 772, in recv
    return self.read(buflen)
  File "/tmp/B.qqCqvt/BUILD/Python-2.7.15/Lib/ssl.py", line 659, in read
    v = self._sslobj.read(len)
error: [Errno 104] Connection reset by peer
test test_httplib produced unexpected output:
**********************************************************************
----------------------------------------
Exception happened during processing of request from ('127.0.0.1', 45170)
----------------------------------------

**********************************************************************
0:02:17 load avg: 1.11 [170/391/1] test_httpservers -- test_httplib failed
0:02:21 load avg: 1.10 [171/391/1] test_idle
0:02:21 load avg: 1.10 [172/391/1] test_imageop
0:02:21 load avg: 1.10 [173/391/1] test_imaplib
0:02:22 load avg: 1.10 [174/391/1] test_imgfile
test_imgfile skipped -- No module named imgfile
0:02:22 load avg: 1.10 [175/391/1] test_imghdr -- test_imgfile skipped
0:02:22 load avg: 1.10 [176/391/1] test_imp
0:02:23 load avg: 1.10 [177/391/1] test_import
0:02:24 load avg: 1.10 [178/391/1] test_import_magic
0:02:24 load avg: 1.10 [179/391/1] test_importhooks
0:02:24 load avg: 1.10 [180/391/1] test_importlib
0:02:25 load avg: 1.10 [181/391/1] test_index
0:02:25 load avg: 1.10 [182/391/1] test_inspect
0:02:26 load avg: 1.10 [183/391/1] test_int
0:02:27 load avg: 1.10 [184/391/1] test_int_literal
0:02:27 load avg: 1.10 [185/391/1] test_io
0:03:16 load avg: 0.68 [186/391/1] test_ioctl -- test_io passed in 49 sec
test_ioctl skipped -- Unable to open /dev/tty
0:03:16 load avg: 0.68 [187/391/1] test_isinstance -- test_ioctl skipped
0:03:17 load avg: 0.68 [188/391/1] test_iter
0:03:17 load avg: 0.68 [189/391/1] test_iterlen
0:03:18 load avg: 0.68 [190/391/1] test_itertools
0:03:25 load avg: 0.71 [191/391/1] test_json
0:03:30 load avg: 0.73 [192/391/1] test_kqueue
test_kqueue skipped -- test works only on BSD
0:03:30 load avg: 0.73 [193/391/1] test_largefile -- test_kqueue skipped
0:03:30 load avg: 0.76 [194/391/1] test_lib2to3
0:04:01 load avg: 1.05 [195/391/1] test_linecache -- test_lib2to3 passed in 30 sec
0:04:01 load avg: 1.05 [196/391/1] test_linuxaudiodev
test_linuxaudiodev skipped -- Use of the `audio' resource not enabled
0:04:02 load avg: 1.05 [197/391/1] test_list -- test_linuxaudiodev skipped (resource denied)
0:04:03 load avg: 1.05 [198/391/1] test_logging
0:04:14 load avg: 0.88 [199/391/1] test_long
0:04:16 load avg: 0.89 [200/391/1] test_long_future
0:04:20 load avg: 0.89 [201/391/1] test_longexp
0:04:20 load avg: 0.90 [202/391/1] test_macos
test_macos skipped -- No module named MacOS
0:04:21 load avg: 0.90 [203/391/1] test_macostools -- test_macos skipped
test_macostools skipped -- No module named MacOS
0:04:21 load avg: 0.90 [204/391/1] test_macpath -- test_macostools skipped
0:04:22 load avg: 0.90 [205/391/1] test_macurl2path
0:04:22 load avg: 0.90 [206/391/1] test_mailbox
0:04:26 load avg: 0.91 [207/391/1] test_marshal
0:04:27 load avg: 0.91 [208/391/1] test_math
0:04:28 load avg: 0.91 [209/391/1] test_md5
0:04:29 load avg: 0.91 [210/391/1] test_memoryio
0:04:29 load avg: 0.91 [211/391/1] test_memoryview
0:04:31 load avg: 0.91 [212/391/1] test_mhlib
0:04:31 load avg: 0.91 [213/391/1] test_mimetools
0:04:32 load avg: 0.91 [214/391/1] test_mimetypes
0:04:32 load avg: 0.91 [215/391/1] test_minidom
0:04:33 load avg: 0.91 [216/391/1] test_mmap
0:04:33 load avg: 0.91 [217/391/1] test_module
0:04:34 load avg: 0.91 [218/391/1] test_modulefinder
0:04:35 load avg: 0.92 [219/391/1] test_msilib
test_msilib skipped -- No module named _msi
0:04:36 load avg: 0.92 [220/391/1] test_multibytecodec -- test_msilib skipped
0:04:37 load avg: 0.92 [221/391/1] test_multifile
0:04:38 load avg: 0.92 [222/391/1] test_multiprocessing
0:05:21 load avg: 1.45 [223/391/1] test_mutants -- test_multiprocessing passed in 43 sec
0:05:22 load avg: 1.45 [224/391/1] test_mutex
0:05:22 load avg: 1.45 [225/391/1] test_netrc
0:05:22 load avg: 1.45 [226/391/1] test_new
0:05:23 load avg: 1.45 [227/391/1] test_nntplib
0:05:23 load avg: 1.45 [228/391/1] test_normalization
0:05:24 load avg: 1.45 [229/391/1] test_ntpath
0:05:24 load avg: 1.45 [230/391/1] test_old_mailbox
0:05:25 load avg: 1.45 [231/391/1] test_operator
0:05:25 load avg: 1.45 [232/391/1] test_optparse
0:05:26 load avg: 1.45 [233/391/1] test_ordered_dict
0:05:29 load avg: 1.41 [234/391/1] test_os
0:05:32 load avg: 1.38 [235/391/1] test_ossaudiodev
test_ossaudiodev skipped -- Use of the `audio' resource not enabled
0:05:32 load avg: 1.38 [236/391/1] test_parser -- test_ossaudiodev skipped (resource denied)
0:05:33 load avg: 1.38 [237/391/1] test_pdb
0:05:34 load avg: 1.38 [238/391/1] test_peepholer
0:05:34 load avg: 1.38 [239/391/1] test_pep247
0:05:35 load avg: 1.38 [240/391/1] test_pep277
0:05:35 load avg: 1.38 [241/391/1] test_pep352
0:05:36 load avg: 1.38 [242/391/1] test_pickle
0:05:38 load avg: 1.35 [243/391/1] test_pickletools
0:05:39 load avg: 1.35 [244/391/1] test_pipes
0:05:40 load avg: 1.35 [245/391/1] test_pkg
0:05:40 load avg: 1.35 [246/391/1] test_pkgimport
0:05:41 load avg: 1.35 [247/391/1] test_pkgutil
0:05:41 load avg: 1.32 [248/391/1] test_platform
0:05:42 load avg: 1.32 [249/391/1] test_plistlib
0:05:43 load avg: 1.32 [250/391/1] test_poll
0:05:54 load avg: 1.10 [251/391/1] test_popen
0:05:55 load avg: 1.10 [252/391/1] test_popen2
0:05:57 load avg: 1.18 [253/391/1] test_poplib
0:06:00 load avg: 1.18 [254/391/1] test_posixpath
0:06:01 load avg: 1.18 [255/391/1] test_pow
0:06:01 load avg: 1.25 [256/391/1] test_pprint
0:06:02 load avg: 1.25 [257/391/1] test_print
0:06:02 load avg: 1.25 [258/391/1] test_profile
0:06:03 load avg: 1.25 [259/391/1] test_property
0:06:03 load avg: 1.25 [260/391/1] test_pstats
0:06:04 load avg: 1.25 [261/391/1] test_pwd
0:06:04 load avg: 1.25 [262/391/1] test_py3kwarn
test_py3kwarn skipped -- test.test_py3kwarn must be run with the -3 flag
0:06:05 load avg: 1.25 [263/391/1] test_py_compile -- test_py3kwarn skipped
0:06:05 load avg: 1.25 [264/391/1] test_pyclbr
0:06:06 load avg: 1.22 [265/391/1] test_pyexpat
0:06:07 load avg: 1.22 [266/391/1] test_queue
0:06:11 load avg: 1.22 [267/391/1] test_quopri
0:06:12 load avg: 1.29 [268/391/1] test_random
0:06:13 load avg: 1.29 [269/391/1] test_re
0:06:14 load avg: 1.29 [270/391/1] test_readline
0:06:15 load avg: 1.29 [271/391/1] test_regrtest
0:06:23 load avg: 1.40 [272/391/1] test_repr
0:06:23 load avg: 1.40 [273/391/1] test_rfc822
0:06:24 load avg: 1.40 [274/391/1] test_richcmp
0:06:24 load avg: 1.40 [275/391/1] test_rlcompleter
0:06:24 load avg: 1.40 [276/391/1] test_robotparser
0:06:25 load avg: 1.40 [277/391/1] test_runpy
0:06:30 load avg: 1.36 [278/391/1] test_sax
0:06:30 load avg: 1.36 [279/391/1] test_scope
0:06:31 load avg: 1.36 [280/391/1] test_scriptpackages
test_scriptpackages skipped -- No module named aetools
0:06:31 load avg: 1.36 [281/391/1] test_select -- test_scriptpackages skipped
0:06:43 load avg: 1.04 [282/391/1] test_set
0:06:47 load avg: 1.04 [283/391/1] test_setcomps
0:06:48 load avg: 1.04 [284/391/1] test_sets
0:06:48 load avg: 1.04 [285/391/1] test_sgmllib
0:06:49 load avg: 1.04 [286/391/1] test_sha
0:06:49 load avg: 1.04 [287/391/1] test_shelve
0:06:51 load avg: 1.04 [288/391/1] test_shlex
0:06:51 load avg: 1.04 [289/391/1] test_shutil
0:06:52 load avg: 1.04 [290/391/1] test_signal
0:07:03 load avg: 0.86 [291/391/1] test_site
0:07:04 load avg: 0.86 [292/391/1] test_slice
0:07:05 load avg: 0.86 [293/391/1] test_smtplib
0:07:06 load avg: 0.87 [294/391/1] test_smtpnet
test_smtpnet skipped -- Use of the `network' resource not enabled
0:07:06 load avg: 0.87 [295/391/1] test_socketserver -- test_smtpnet skipped (resource denied)
test_socketserver skipped -- Use of the `network' resource not enabled
0:07:07 load avg: 0.87 [296/391/1] test_softspace -- test_socketserver skipped (resource denied)
0:07:07 load avg: 0.87 [297/391/1] test_sort
0:07:08 load avg: 0.87 [298/391/1] test_source_encoding
0:07:10 load avg: 0.87 [299/391/1] test_spwd
0:07:10 load avg: 0.88 [300/391/1] test_sqlite
0:07:12 load avg: 0.88 [301/391/1] test_ssl
test test_ssl failed -- multiple errors occurred; run in verbose mode for details
0:07:16 load avg: 0.89 [302/391/2] test_startfile -- test_ssl failed
test_startfile skipped -- module 'os' has no attribute 'startfile'
0:07:16 load avg: 0.89 [303/391/2] test_stat -- test_startfile skipped
0:07:17 load avg: 0.89 [304/391/2] test_str
0:07:18 load avg: 0.89 [305/391/2] test_strftime
0:07:19 load avg: 0.89 [306/391/2] test_string
0:07:20 load avg: 0.89 [307/391/2] test_stringprep
0:07:21 load avg: 0.90 [308/391/2] test_strop
0:07:21 load avg: 0.90 [309/391/2] test_strptime
0:07:22 load avg: 0.90 [310/391/2] test_strtod
0:07:24 load avg: 0.90 [311/391/2] test_struct
0:07:25 load avg: 0.90 [312/391/2] test_structmembers
0:07:26 load avg: 0.91 [313/391/2] test_structseq
0:07:26 load avg: 0.91 [314/391/2] test_subprocess
0:16:17 load avg: 1.26 [315/391/2] test_sunau -- test_subprocess passed in 8 min 51 sec
0:16:18 load avg: 1.26 [316/391/2] test_sunaudiodev
test_sunaudiodev skipped -- No module named sunaudiodev
0:16:18 load avg: 1.26 [317/391/2] test_sundry -- test_sunaudiodev skipped
0:16:19 load avg: 1.26 [318/391/2] test_symtable
0:16:19 load avg: 1.26 [319/391/2] test_syntax
0:16:20 load avg: 1.26 [320/391/2] test_sys
0:16:23 load avg: 1.33 [321/391/2] test_sys_setprofile
0:16:23 load avg: 1.33 [322/391/2] test_sys_settrace
0:16:24 load avg: 1.33 [323/391/2] test_sysconfig
0:16:25 load avg: 1.33 [324/391/2] test_tarfile
0:16:30 load avg: 1.30 [325/391/2] test_tcl
0:16:31 load avg: 1.27 [326/391/2] test_telnetlib
0:16:37 load avg: 1.17 [327/391/2] test_tempfile
0:16:38 load avg: 1.17 [328/391/2] test_test_support
0:16:39 load avg: 1.17 [329/391/2] test_textwrap
0:16:39 load avg: 1.17 [330/391/2] test_thread
0:16:40 load avg: 1.17 [331/391/2] test_threaded_import
0:16:41 load avg: 1.15 [332/391/2] test_threadedtempfile
0:16:42 load avg: 1.15 [333/391/2] test_threading
0:16:54 load avg: 1.36 [334/391/2] test_threading_local
0:16:57 load avg: 1.33 [335/391/2] test_threadsignals
0:16:58 load avg: 1.33 [336/391/2] test_time
0:16:59 load avg: 1.33 [337/391/2] test_timeit
0:17:00 load avg: 1.33 [338/391/2] test_timeout
test_timeout skipped -- Use of the `network' resource not enabled
0:17:01 load avg: 1.33 [339/391/2] test_tk -- test_timeout skipped (resource denied)
test_tk skipped -- Use of the `gui' resource not enabled
0:17:01 load avg: 1.33 [340/391/2] test_tokenize -- test_tk skipped (resource denied)
0:17:02 load avg: 1.30 [341/391/2] test_tools
recursedown('@test_14309_tmp')
0:17:09 load avg: 1.36 [342/391/2] test_trace
0:17:12 load avg: 1.41 [343/391/2] test_traceback
0:17:17 load avg: 1.55 [344/391/2] test_transformer
0:17:17 load avg: 1.55 [345/391/2] test_ttk_guionly
test_ttk_guionly skipped -- Use of the `gui' resource not enabled
0:17:18 load avg: 1.55 [346/391/2] test_ttk_textonly -- test_ttk_guionly skipped (resource denied)
0:17:19 load avg: 1.55 [347/391/2] test_tuple
0:17:53 load avg: 1.59 [348/391/2] test_turtle -- test_tuple passed in 35 sec
0:17:54 load avg: 1.59 [349/391/2] test_typechecks
0:17:54 load avg: 1.59 [350/391/2] test_ucn
0:17:55 load avg: 1.59 [351/391/2] test_unary
0:17:56 load avg: 1.54 [352/391/2] test_undocumented_details
0:17:56 load avg: 1.54 [353/391/2] test_unicode
0:18:12 load avg: 1.41 [354/391/2] test_unicode_file
0:18:12 load avg: 1.41 [355/391/2] test_unicodedata
0:18:16 load avg: 1.38 [356/391/2] test_univnewlines
0:18:16 load avg: 1.38 [357/391/2] test_univnewlines2k
0:18:17 load avg: 1.38 [358/391/2] test_unpack
0:18:18 load avg: 1.38 [359/391/2] test_urllib
0:18:18 load avg: 1.38 [360/391/2] test_urllib2_localnet
0:18:19 load avg: 1.38 [361/391/2] test_urllib2net
test_urllib2net skipped -- Use of the `network' resource not enabled
0:18:20 load avg: 1.38 [362/391/2] test_urllibnet -- test_urllib2net skipped (resource denied)
test_urllibnet skipped -- Use of the `network' resource not enabled
0:18:21 load avg: 1.35 [363/391/2] test_urlparse -- test_urllibnet skipped (resource denied)
0:18:21 load avg: 1.35 [364/391/2] test_userdict
0:18:23 load avg: 1.35 [365/391/2] test_userlist
0:18:24 load avg: 1.35 [366/391/2] test_userstring
0:18:28 load avg: 1.32 [367/391/2] test_uu
0:18:29 load avg: 1.32 [368/391/2] test_uuid
0:18:30 load avg: 1.32 [369/391/2] test_wait3
0:18:36 load avg: 1.11 [370/391/2] test_wait4
0:18:42 load avg: 1.01 [371/391/2] test_warnings
0:18:45 load avg: 1.01 [372/391/2] test_wave
0:18:46 load avg: 1.10 [373/391/2] test_weakref
0:25:58 load avg: 1.07 [374/391/2] test_weakset -- test_weakref passed in 7 min 12 sec
0:26:01 load avg: 1.07 [375/391/2] test_whichdb
0:26:02 load avg: 1.07 [376/391/2] test_winreg
test_winreg skipped -- No module named _winreg
0:26:02 load avg: 1.07 [377/391/2] test_winsound -- test_winreg skipped
test_winsound skipped -- Use of the `audio' resource not enabled
0:26:03 load avg: 1.07 [378/391/2] test_with -- test_winsound skipped (resource denied)
0:26:03 load avg: 1.07 [379/391/2] test_wsgiref
0:26:04 load avg: 1.07 [380/391/2] test_xdrlib
0:26:04 load avg: 1.07 [381/391/2] test_xml_etree
0:26:07 load avg: 1.06 [382/391/2] test_xml_etree_c
0:26:07 load avg: 1.06 [383/391/2] test_xmllib
0:26:08 load avg: 1.06 [384/391/2] test_xmlrpc
0:26:12 load avg: 1.06 [385/391/2] test_xpickle
0:26:13 load avg: 1.06 [386/391/2] test_xrange
0:26:13 load avg: 1.06 [387/391/2] test_zipfile
0:26:19 load avg: 1.13 [388/391/2] test_zipfile64
test_zipfile64 skipped -- test requires loads of disk-space bytes and a long time to run
0:26:19 load avg: 1.13 [389/391/2] test_zipimport -- test_zipfile64 skipped (resource denied)
0:26:20 load avg: 1.13 [390/391/2] test_zipimport_support
0:26:22 load avg: 1.12 [391/391/2] test_zlib
352 tests OK.
2 tests failed:
    test_httplib test_ssl
37 tests skipped:
    test_aepack test_al test_applesingle test_bsddb185 test_bsddb3
    test_cd test_cl test_codecmaps_cn test_codecmaps_hk
    test_codecmaps_jp test_codecmaps_kr test_codecmaps_tw test_curses
    test_dl test_gl test_imgfile test_ioctl test_kqueue
    test_linuxaudiodev test_macos test_macostools test_msilib
    test_ossaudiodev test_py3kwarn test_scriptpackages test_smtpnet
    test_socketserver test_startfile test_sunaudiodev test_timeout
    test_tk test_ttk_guionly test_urllib2net test_urllibnet
    test_winreg test_winsound test_zipfile64
1 skip unexpected on linux2:
    test_ioctl
Re-running failed tests in verbose mode
Re-running test 'test_httplib' in verbose mode
test_auto_headers (test.test_httplib.HeaderTests) ... ok
test_blank_line_forms (test.test_httplib.HeaderTests) ... ok
test_content_length_0 (test.test_httplib.HeaderTests) ... ok
test_from_line (test.test_httplib.HeaderTests) ... ok
test_invalid_headers (test.test_httplib.HeaderTests) ... ok
test_ipv6host_header (test.test_httplib.HeaderTests) ... ok
test_malformed_headers_coped_with (test.test_httplib.HeaderTests) ... ok
test_malformed_truncation (test.test_httplib.HeaderTests) ... ok
test_parse_all_octets (test.test_httplib.HeaderTests) ... ok
test_putheader (test.test_httplib.HeaderTests) ... ok
test_responses (test.test_httplib.OfflineTest) ... ok
test_bad_status_repr (test.test_httplib.BasicTest) ... ok
test_chunked (test.test_httplib.BasicTest) ... ok
test_chunked_head (test.test_httplib.BasicTest) ... ok
test_early_eof (test.test_httplib.BasicTest) ... ok
test_epipe (test.test_httplib.BasicTest) ... ok
test_error_leak (test.test_httplib.BasicTest) ... ok
test_filenoattr (test.test_httplib.BasicTest) ... ok
test_host_port (test.test_httplib.BasicTest) ... ok
test_incomplete_read (test.test_httplib.BasicTest) ... ok
test_negative_content_length (test.test_httplib.BasicTest) ... ok
test_overflowing_chunked_line (test.test_httplib.BasicTest) ... ok
test_overflowing_header_line (test.test_httplib.BasicTest) ... ok
test_overflowing_status_line (test.test_httplib.BasicTest) ... skipped 'disabled for HTTP 0.9 support'
test_partial_reads (test.test_httplib.BasicTest) ... ok
test_partial_reads_incomplete_body (test.test_httplib.BasicTest) ... ok
test_partial_reads_no_content_length (test.test_httplib.BasicTest) ... ok
test_proxy_tunnel_without_status_line (test.test_httplib.BasicTest) ... ok
test_read_head (test.test_httplib.BasicTest) ... ok
test_response_headers (test.test_httplib.BasicTest) ... ok
test_send (test.test_httplib.BasicTest) ... ok
test_send_file (test.test_httplib.BasicTest) ... ok
test_send_tempfile (test.test_httplib.BasicTest) ... ok
test_status_lines (test.test_httplib.BasicTest) ... ok
test_too_many_headers (test.test_httplib.BasicTest) ... ok
testTimeoutAttribute (test.test_httplib.TimeoutTest)
This will prove that the timeout gets through ... ok
testHTTPConnection (test.test_httplib.HTTPTest) ... ok
testHTTPWithConnectHostPort (test.test_httplib.HTTPTest) ... ok
test_attributes (test.test_httplib.HTTPSTest) ... ok
test_host_port (test.test_httplib.HTTPSTest) ... ok
test_local_bad_hostname (test.test_httplib.HTTPSTest) ... Traceback (most recent call last):
  File "/tmp/B.qqCqvt/BUILD/Python-2.7.15/Lib/SocketServer.py", line 290, in _handle_request_noblock
    self.process_request(request, client_address)
  File "/tmp/B.qqCqvt/BUILD/Python-2.7.15/Lib/SocketServer.py", line 318, in process_request
    self.finish_request(request, client_address)
  File "/tmp/B.qqCqvt/BUILD/Python-2.7.15/Lib/SocketServer.py", line 331, in finish_request
    self.RequestHandlerClass(request, client_address, self)
  File "/tmp/B.qqCqvt/BUILD/Python-2.7.15/Lib/SocketServer.py", line 652, in __init__
    self.handle()
  File "/tmp/B.qqCqvt/BUILD/Python-2.7.15/Lib/BaseHTTPServer.py", line 340, in handle
    self.handle_one_request()
  File "/tmp/B.qqCqvt/BUILD/Python-2.7.15/Lib/BaseHTTPServer.py", line 310, in handle_one_request
    self.raw_requestline = self.rfile.readline(65537)
  File "/tmp/B.qqCqvt/BUILD/Python-2.7.15/Lib/socket.py", line 480, in readline
    data = self._sock.recv(self._rbufsize)
  File "/tmp/B.qqCqvt/BUILD/Python-2.7.15/Lib/ssl.py", line 772, in recv
    return self.read(buflen)
  File "/tmp/B.qqCqvt/BUILD/Python-2.7.15/Lib/ssl.py", line 659, in read
    v = self._sslobj.read(len)
error: [Errno 104] Connection reset by peer
----------------------------------------
Exception happened during processing of request from ('127.0.0.1', 35536)
----------------------------------------
 server (('127.0.0.1', 43123):43123 ('TLS_AES_256_GCM_SHA384', 'TLSv1.3', 256)):
   [14/Sep/2018 08:06:41] code 404, message File not found
 server (('127.0.0.1', 43123):43123 ('TLS_AES_256_GCM_SHA384', 'TLSv1.3', 256)):
   [14/Sep/2018 08:06:41] "GET /nonexistent HTTP/1.1" 404 -
stopping HTTPS server
joining HTTPS thread
ok
test_local_good_hostname (test.test_httplib.HTTPSTest) ...  server (('127.0.0.1', 44549):44549 ('TLS_AES_256_GCM_SHA384', 'TLSv1.3', 256)):
   [14/Sep/2018 08:06:41] code 404, message File not found
 server (('127.0.0.1', 44549):44549 ('TLS_AES_256_GCM_SHA384', 'TLSv1.3', 256)):
   [14/Sep/2018 08:06:41] "GET /nonexistent HTTP/1.1" 404 -
stopping HTTPS server
joining HTTPS thread
ok
test_local_unknown_cert (test.test_httplib.HTTPSTest) ... stopping HTTPS server
joining HTTPS thread
ok
test_networked (test.test_httplib.HTTPSTest) ... skipped "Use of the `network' resource not enabled"
test_networked_bad_cert (test.test_httplib.HTTPSTest) ... skipped "Use of the `network' resource not enabled"
test_networked_good_cert (test.test_httplib.HTTPSTest) ... skipped "Use of the `network' resource not enabled"
test_networked_noverification (test.test_httplib.HTTPSTest) ... skipped "Use of the `network' resource not enabled"
test_networked_trusted_by_default_cert (test.test_httplib.HTTPSTest) ... skipped "Use of the `network' resource not enabled"
testHTTPConnectionSourceAddress (test.test_httplib.SourceAddressTest) ... ok
testHTTPSConnectionSourceAddress (test.test_httplib.SourceAddressTest) ... ok
test_connect (test.test_httplib.TunnelTests) ... ok

----------------------------------------------------------------------
Ran 51 tests in 0.320s

OK (skipped=6)
Re-running test 'test_ssl' in verbose mode
test_ssl: testing with 'OpenSSL 1.1.1  11 Sep 2018' (1, 1, 1, 0, 15)
          under Linux ('PLD Linux (Th)', '3.0', '')
          HAS_SNI = True
          OP_ALL = 0x-7fffffac
          OP_NO_TLSv1_1 = 0x10000000
test__create_stdlib_context (test.test_ssl.ContextTests) ... ok
test__https_verify_certificates (test.test_ssl.ContextTests) ... ok
test__https_verify_envvar (test.test_ssl.ContextTests) ... ok
test_cert_store_stats (test.test_ssl.ContextTests) ... ok
test_check_hostname (test.test_ssl.ContextTests) ... ok
test_ciphers (test.test_ssl.ContextTests) ... ok
test_constructor (test.test_ssl.ContextTests) ... ok
test_create_default_context (test.test_ssl.ContextTests) ... ok
test_get_ca_certs (test.test_ssl.ContextTests) ... ok
test_load_cert_chain (test.test_ssl.ContextTests) ... ok
test_load_default_certs (test.test_ssl.ContextTests) ... ok
test_load_default_certs_env (test.test_ssl.ContextTests) ... ok
test_load_default_certs_env_windows (test.test_ssl.ContextTests) ... skipped 'Windows specific'
test_load_dh_params (test.test_ssl.ContextTests) ... ok
test_load_verify_cadata (test.test_ssl.ContextTests) ... ok
test_load_verify_locations (test.test_ssl.ContextTests) ... ok
test_options (test.test_ssl.ContextTests) ... FAIL
test_protocol (test.test_ssl.ContextTests) ... ok
test_session_stats (test.test_ssl.ContextTests) ... ok
test_set_default_verify_paths (test.test_ssl.ContextTests) ... ok
test_set_ecdh_curve (test.test_ssl.ContextTests) ... ok
test_sni_callback (test.test_ssl.ContextTests) ... ok
test_sni_callback_refcycle (test.test_ssl.ContextTests) ... ok
test_verify_flags (test.test_ssl.ContextTests) ... ok
test_verify_mode (test.test_ssl.ContextTests) ... ok
test_sslwrap_simple (test.test_ssl.BasicTests) ... ok
test_DER_to_PEM (test.test_ssl.BasicSocketTests) ... ok
test_asn1object (test.test_ssl.BasicSocketTests) ... ok
test_cert_time_to_seconds (test.test_ssl.BasicSocketTests) ... ok
test_cert_time_to_seconds_locale (test.test_ssl.BasicSocketTests) ... skipped 'locale-specific month name needs to be different from C locale'
test_cert_time_to_seconds_timezone (test.test_ssl.BasicSocketTests) ... ok
test_constants (test.test_ssl.BasicSocketTests) ... ok
test_empty_cert (test.test_ssl.BasicSocketTests)
Wrapping with an empty cert file ... ok
test_enum_certificates (test.test_ssl.BasicSocketTests) ... skipped 'Windows specific'
test_enum_crls (test.test_ssl.BasicSocketTests) ... skipped 'Windows specific'
test_errors (test.test_ssl.BasicSocketTests) ... ok
test_get_default_verify_paths (test.test_ssl.BasicSocketTests) ... ok
test_malformed_cert (test.test_ssl.BasicSocketTests)
Wrapping with a badly formatted certificate (syntax error) ... ok
test_malformed_key (test.test_ssl.BasicSocketTests)
Wrapping with a badly formatted key (syntax error) ... ok
test_match_hostname (test.test_ssl.BasicSocketTests) ... ok
test_openssl_version (test.test_ssl.BasicSocketTests) ... ok
test_parse_all_sans (test.test_ssl.BasicSocketTests) ... ok
test_parse_cert (test.test_ssl.BasicSocketTests) ... 
{'issuer': ((('countryName', u'XY'),),
            (('localityName', u'Castle Anthrax'),),
            (('organizationName', u'Python Software Foundation'),),
            (('commonName', u'localhost'),)),
 'notAfter': 'Oct  5 23:01:56 2020 GMT',
 'notBefore': u'Oct  8 23:01:56 2010 GMT',
 'serialNumber': u'D7C7381919AFC24E',
 'subject': ((('countryName', u'XY'),),
             (('localityName', u'Castle Anthrax'),),
             (('organizationName', u'Python Software Foundation'),),
             (('commonName', u'localhost'),)),
 'subjectAltName': (('DNS', 'localhost'),),
 'version': 3L}

{'OCSP': (u'http://ocsp.verisign.com',),
 'caIssuers': (u'http://SVRIntl-G3-aia.verisign.com/SVRIntlG3.cer',),
 'crlDistributionPoints': (u'http://SVRIntl-G3-crl.verisign.com/SVRIntlG3.crl',),
 'issuer': ((('countryName', u'US'),),
            (('organizationName', u'VeriSign, Inc.'),),
            (('organizationalUnitName', u'VeriSign Trust Network'),),
            (('organizationalUnitName',
              u'Terms of use at https://www.verisign.com/rpa (c)10'),),
            (('commonName',
              u'VeriSign Class 3 International Server CA - G3'),)),
 'notAfter': 'Sep 20 23:59:59 2012 GMT',
 'notBefore': u'Sep 21 00:00:00 2011 GMT',
 'serialNumber': u'2EE6EA7640A075CEE5005F4D7C79549A',
 'subject': ((('countryName', u'FI'),),
             (('stateOrProvinceName', u'Espoo'),),
             (('localityName', u'Espoo'),),
             (('organizationName', u'Nokia'),),
             (('organizationalUnitName', u'BI'),),
             (('commonName', u'projects.developer.nokia.com'),)),
 'subjectAltName': (('DNS', 'projects.developer.nokia.com'),
                    ('DNS', 'projects.forum.nokia.com')),
 'version': 3L}
ok
test_parse_cert_CVE_2013_4238 (test.test_ssl.BasicSocketTests) ... 
{'issuer': ((('countryName', u'US'),),
            (('stateOrProvinceName', u'Oregon'),),
            (('localityName', u'Beaverton'),),
            (('organizationName', u'Python Software Foundation'),),
            (('organizationalUnitName', u'Python Core Development'),),
            (('commonName', u'null.python.org\x00example.org'),),
            (('emailAddress', u'python-dev@python.org'),)),
 'notAfter': 'Aug  7 13:12:52 2013 GMT',
 'notBefore': u'Aug  7 13:11:52 2013 GMT',
 'serialNumber': u'00',
 'subject': ((('countryName', u'US'),),
             (('stateOrProvinceName', u'Oregon'),),
             (('localityName', u'Beaverton'),),
             (('organizationName', u'Python Software Foundation'),),
             (('organizationalUnitName', u'Python Core Development'),),
             (('commonName', u'null.python.org\x00example.org'),),
             (('emailAddress', u'python-dev@python.org'),)),
 'subjectAltName': (('DNS', 'altnull.python.org\x00example.com'),
                    ('email', 'null@python.org\x00user@example.org'),
                    ('URI', 'http://null.python.org\x00http://example.org'),
                    ('IP Address', '192.0.2.1'),
                    ('IP Address', '2001:DB8:0:0:0:0:0:1\n')),
 'version': 3L}
ok
test_purpose_enum (test.test_ssl.BasicSocketTests) ... ok
test_random (test.test_ssl.BasicSocketTests) ... 
 RAND_status is 1 (sufficient randomness)
ok
test_refcycle (test.test_ssl.BasicSocketTests) ... ok
test_server_side (test.test_ssl.BasicSocketTests) ... ok
test_timeout (test.test_ssl.BasicSocketTests) ... ok
test_tls_unique_channel_binding (test.test_ssl.BasicSocketTests) ... ok
test_unknown_channel_binding (test.test_ssl.BasicSocketTests) ... ok
test_unsupported_dtls (test.test_ssl.BasicSocketTests) ... ok
test_wrapped_unconnected (test.test_ssl.BasicSocketTests) ... ok
test_lib_reason (test.test_ssl.SSLErrorTests) ... ok
test_str (test.test_ssl.SSLErrorTests) ... ok
test_subclass (test.test_ssl.SSLErrorTests) ... ok
test_alpn_protocols (test.test_ssl.ThreadedTests) ...  server:  new connection from ('127.0.0.1', 49946)
 server: connection cipher is now ('ECDHE-RSA-AES256-GCM-SHA384', 'TLSv1.2', 256)
 server: selected protocol is now None
 client:  sending 'FOO\n'...
 client:  read 'foo\n'
 client:  sending 'FOO\n'...
 client:  read 'foo\n'
 client:  sending 'FOO\n'...
 client:  read 'foo\n'
 client:  closing connection.
 server:  new connection from ('127.0.0.1', 60914)
 server: connection cipher is now ('ECDHE-RSA-AES256-GCM-SHA384', 'TLSv1.2', 256)
 server: selected protocol is now None
 client:  sending 'FOO\n'...
 client:  read 'foo\n'
 client:  sending 'FOO\n'...
 client:  read 'foo\n'
 client:  sending 'FOO\n'...
 client:  read 'foo\n'
 client:  closing connection.
 server:  new connection from ('127.0.0.1', 39264)
 server: connection cipher is now ('ECDHE-RSA-AES256-GCM-SHA384', 'TLSv1.2', 256)
 server: selected protocol is now None
 client:  sending 'FOO\n'...
 client:  read 'foo\n'
 client:  sending 'FOO\n'...
 client:  read 'foo\n'
 client:  sending 'FOO\n'...
 client:  read 'foo\n'
 client:  closing connection.
 server:  new connection from ('127.0.0.1', 56370)
 server: connection cipher is now ('ECDHE-RSA-AES256-GCM-SHA384', 'TLSv1.2', 256)
 server: selected protocol is now None
 client:  sending 'FOO\n'...
 client:  read 'foo\n'
 client:  sending 'FOO\n'...
 client:  read 'foo\n'
 client:  sending 'FOO\n'...
 client:  read 'foo\n'
 client:  closing connection.
ok
test_asyncore_server (test.test_ssl.ThreadedTests)
Check the example asyncore integration. ... 
 server:  new connection from 127.0.0.1:54664
 client:  sending 'FOO\n'...
 server:  read 'FOO\n' from client
 client:  read 'foo\n'
 client:  closing connection.
 client:  connection closed.
 cleanup: stopping server.
 cleanup: joining server thread.
 server:  read 'over\n' from client
 server:  closed connection <ssl.SSLSocket object at 0xf1880870>
 server:  read '' from client
 cleanup: successfully joined.
ok
test_check_hostname (test.test_ssl.ThreadedTests) ... 
 server:  new connection from ('127.0.0.1', 34600)
 server: connection cipher is now ('ECDHE-RSA-AES256-SHA', 'TLSv1.0', 256)
 server: selected protocol is now None
 server:  new connection from ('127.0.0.1', 44220)
 server: connection cipher is now ('ECDHE-RSA-AES256-SHA', 'TLSv1.0', 256)
 server: selected protocol is now None
ok
test_compression (test.test_ssl.ThreadedTests) ...  server:  new connection from ('127.0.0.1', 44690)
 server: connection cipher is now ('ECDHE-RSA-AES256-SHA', 'TLSv1.0', 256)
 server: selected protocol is now None
 client:  sending 'FOO\n'...
 client:  read 'foo\n'
 client:  sending 'FOO\n'...
 client:  read 'foo\n'
 client:  sending 'FOO\n'...
 client:  read 'foo\n'
 client:  closing connection.
 got compression: None
ok
test_compression_disabled (test.test_ssl.ThreadedTests) ...  server:  new connection from ('127.0.0.1', 33140)
 server: connection cipher is now ('ECDHE-RSA-AES256-SHA', 'TLSv1.0', 256)
 server: selected protocol is now None
 client:  sending 'FOO\n'...
 client:  read 'foo\n'
 client:  sending 'FOO\n'...
 client:  read 'foo\n'
 client:  sending 'FOO\n'...
 client:  read 'foo\n'
 client:  closing connection.
ok
test_crl_check (test.test_ssl.ThreadedTests) ... 
 server:  new connection from ('127.0.0.1', 53816)
 server: connection cipher is now ('ECDHE-RSA-AES256-SHA', 'TLSv1.0', 256)
 server: selected protocol is now None
 server:  new connection from ('127.0.0.1', 47758)

 server:  bad connection attempt from ('127.0.0.1', 47758):
Traceback (most recent call last):
   File "/tmp/B.qqCqvt/BUILD/Python-2.7.15/Lib/test/test_ssl.py", line 1663, in wrap_conn
    self.sock, server_side=True)
   File "/tmp/B.qqCqvt/BUILD/Python-2.7.15/Lib/ssl.py", line 369, in wrap_socket
    _context=self)
   File "/tmp/B.qqCqvt/BUILD/Python-2.7.15/Lib/ssl.py", line 617, in __init__
    self.do_handshake()
   File "/tmp/B.qqCqvt/BUILD/Python-2.7.15/Lib/ssl.py", line 846, in do_handshake
    self._sslobj.do_handshake()
 SSLError: [SSL: TLSV1_ALERT_UNKNOWN_CA] tlsv1 alert unknown ca (_ssl.c:726)
 server:  new connection from ('127.0.0.1', 50588)
 server: connection cipher is now ('ECDHE-RSA-AES256-SHA', 'TLSv1.0', 256)
 server: selected protocol is now None
ok
test_default_ciphers (test.test_ssl.ThreadedTests) ... FAIL
test_default_ecdh_curve (test.test_ssl.ThreadedTests) ...  server:  new connection from ('127.0.0.1', 56582)
 server: connection cipher is now ('TLS_AES_256_GCM_SHA384', 'TLSv1.3', 256)
 server: selected protocol is now None
FAIL
test_dh_params (test.test_ssl.ThreadedTests) ...  server:  new connection from ('127.0.0.1', 45348)
 server: connection cipher is now ('DHE-RSA-AES256-SHA', 'SSLv3', 256)
 server: selected protocol is now None
 client:  sending 'FOO\n'...
 client:  read 'foo\n'
 client:  sending 'FOO\n'...
 client:  read 'foo\n'
 client:  sending 'FOO\n'...
 client:  read 'foo\n'
 client:  closing connection.
ok
test_do_handshake_enotconn (test.test_ssl.ThreadedTests) ... ok
test_echo (test.test_ssl.ThreadedTests)
Basic test of an SSL client connecting to a server ... 
 server:  new connection from ('127.0.0.1', 43828)
 client:  sending 'FOO\n'...
 server: connection cipher is now ('TLS_AES_256_GCM_SHA384', 'TLSv1.3', 256)
 server: selected protocol is now None
 client:  read 'foo\n'
 client:  sending 'FOO\n'...
 client:  read 'foo\n'
 client:  sending 'FOO\n'...
 client:  read 'foo\n'
 client:  closing connection.
 server:  new connection from ('127.0.0.1', 48324)
 server: connection cipher is now ('ECDHE-RSA-AES256-SHA', 'TLSv1.0', 256)
 server: selected protocol is now None
 client:  sending 'FOO\n'...
 client:  read 'foo\n'
 client:  sending 'FOO\n'...
 client:  read 'foo\n'
 client:  sending 'FOO\n'...
 client:  read 'foo\n'
 client:  closing connection.
 server:  new connection from ('127.0.0.1', 36082)
 server: connection cipher is now ('ECDHE-RSA-AES256-SHA', 'TLSv1.0', 256)
 server: selected protocol is now None
 client:  sending 'FOO\n'...
 client:  read 'foo\n'
 client:  sending 'FOO\n'...
 client:  read 'foo\n'
 client:  sending 'FOO\n'...
 client:  read 'foo\n'
 client:  closing connection.
 server:  new connection from ('127.0.0.1', 49988)
 server: connection cipher is now ('ECDHE-RSA-AES256-GCM-SHA384', 'TLSv1.2', 256)
 server: selected protocol is now None
 client:  sending 'FOO\n'...
 client:  read 'foo\n'
 client:  sending 'FOO\n'...
 client:  read 'foo\n'
 client:  sending 'FOO\n'...
 client:  read 'foo\n'
 client:  closing connection.
ok
test_getpeercert (test.test_ssl.ThreadedTests) ... Exception in thread Thread-1476:
Traceback (most recent call last):
  File "/tmp/B.qqCqvt/BUILD/Python-2.7.15/Lib/threading.py", line 801, in __bootstrap_inner
    self.run()
  File "/tmp/B.qqCqvt/BUILD/Python-2.7.15/Lib/test/test_ssl.py", line 1723, in run
    msg = self.read()
  File "/tmp/B.qqCqvt/BUILD/Python-2.7.15/Lib/test/test_ssl.py", line 1700, in read
    return self.sslconn.read()
  File "/tmp/B.qqCqvt/BUILD/Python-2.7.15/Lib/ssl.py", line 659, in read
    v = self._sslobj.read(len)
error: [Errno 104] Connection reset by peer


{'issuer': ((('countryName', u'XY'),),
            (('localityName', u'Castle Anthrax'),),
            (('organizationName', u'Python Software Foundation'),),
            (('commonName', u'localhost'),)),
 'notAfter': 'Oct  5 23:01:56 2020 GMT',
 'notBefore': u'Oct  8 23:01:56 2010 GMT',
 'serialNumber': u'D7C7381919AFC24E',
 'subject': ((('countryName', u'XY'),),
             (('localityName', u'Castle Anthrax'),),
             (('organizationName', u'Python Software Foundation'),),
             (('commonName', u'localhost'),)),
 'subjectAltName': (('DNS', 'localhost'),),
 'version': 3L}
Connection cipher is ('TLS_AES_256_GCM_SHA384', 'TLSv1.3', 256).
ok
test_getpeercert_enotconn (test.test_ssl.ThreadedTests) ... ok
test_handshake_timeout (test.test_ssl.ThreadedTests) ... ok
test_npn_protocols (test.test_ssl.ThreadedTests) ... skipped 'NPN support needed for this test'
test_protocol_sslv2 (test.test_ssl.ThreadedTests)
Connecting to an SSLv2 server with various client options ... skipped 'OpenSSL is compiled without SSLv2 support'
test_protocol_sslv23 (test.test_ssl.ThreadedTests)
Connecting to an SSLv23 server with various client options ... 
 PROTOCOL_TLS->PROTOCOL_TLS CERT_NONE
 PROTOCOL_TLSv1->PROTOCOL_TLS CERT_NONE
 PROTOCOL_TLS->PROTOCOL_TLS CERT_OPTIONAL
 PROTOCOL_TLSv1->PROTOCOL_TLS CERT_OPTIONAL
 PROTOCOL_TLS->PROTOCOL_TLS CERT_REQUIRED
 PROTOCOL_TLSv1->PROTOCOL_TLS CERT_REQUIRED
 PROTOCOL_TLS->PROTOCOL_TLS CERT_NONE
 {PROTOCOL_TLSv1->PROTOCOL_TLS} CERT_NONE
ok
test_protocol_sslv3 (test.test_ssl.ThreadedTests)
Connecting to an SSLv3 server with various client options ... skipped 'OpenSSL is compiled without SSLv3 support'
test_protocol_tlsv1 (test.test_ssl.ThreadedTests)
Connecting to a TLSv1 server with various client options ... 
 PROTOCOL_TLSv1->PROTOCOL_TLSv1 CERT_NONE
 PROTOCOL_TLSv1->PROTOCOL_TLSv1 CERT_OPTIONAL
 PROTOCOL_TLSv1->PROTOCOL_TLSv1 CERT_REQUIRED
 {PROTOCOL_TLS->PROTOCOL_TLSv1} CERT_NONE
ok
test_protocol_tlsv1_1 (test.test_ssl.ThreadedTests)
Connecting to a TLSv1.1 server with various client options. ... 
 PROTOCOL_TLSv1_1->PROTOCOL_TLSv1_1 CERT_NONE
 {PROTOCOL_TLS->PROTOCOL_TLSv1_1} CERT_NONE
 PROTOCOL_TLSv1_1->PROTOCOL_TLS CERT_NONE
 {PROTOCOL_TLSv1->PROTOCOL_TLSv1_1} CERT_NONE
 {PROTOCOL_TLSv1_1->PROTOCOL_TLSv1} CERT_NONE
ok
test_protocol_tlsv1_2 (test.test_ssl.ThreadedTests)
Connecting to a TLSv1.2 server with various client options. ... 
 PROTOCOL_TLSv1_2->PROTOCOL_TLSv1_2 CERT_NONE
 {PROTOCOL_TLS->PROTOCOL_TLSv1_2} CERT_NONE
 PROTOCOL_TLSv1_2->PROTOCOL_TLS CERT_NONE
 {PROTOCOL_TLSv1->PROTOCOL_TLSv1_2} CERT_NONE
 {PROTOCOL_TLSv1_2->PROTOCOL_TLSv1} CERT_NONE
 {PROTOCOL_TLSv1_1->PROTOCOL_TLSv1_2} CERT_NONE
 {PROTOCOL_TLSv1_2->PROTOCOL_TLSv1_1} CERT_NONE
ok
test_read_write_after_close_raises_valuerror (test.test_ssl.ThreadedTests) ... ok
test_recv_send (test.test_ssl.ThreadedTests)
Test recv(), send() and friends. ... 
 server:  new connection from ('127.0.0.1', 59556)
 server: connection cipher is now ('ECDHE-RSA-AES256-SHA', 'TLSv1.0', 256)
 server: selected protocol is now None
ok
test_recv_zero (test.test_ssl.ThreadedTests) ...  server:  new connection from ('127.0.0.1', 45512)
 server: connection cipher is now ('TLS_AES_256_GCM_SHA384', 'TLSv1.3', 256)
 server: selected protocol is now None
ok
test_rude_shutdown (test.test_ssl.ThreadedTests)
A brutal shutdown of an SSL server should raise an OSError ... ok
test_selected_alpn_protocol (test.test_ssl.ThreadedTests) ...  server:  new connection from ('127.0.0.1', 51558)
 server: connection cipher is now ('ECDHE-RSA-AES256-SHA', 'TLSv1.0', 256)
 server: selected protocol is now None
 client:  sending 'FOO\n'...
 client:  read 'foo\n'
 client:  sending 'FOO\n'...
 client:  read 'foo\n'
 client:  sending 'FOO\n'...
 client:  read 'foo\n'
 client:  closing connection.
ok
test_selected_alpn_protocol_if_server_uses_alpn (test.test_ssl.ThreadedTests) ...  server:  new connection from ('127.0.0.1', 48864)
 server: connection cipher is now ('ECDHE-RSA-AES256-SHA', 'TLSv1.0', 256)
 server: selected protocol is now None
 client:  sending 'FOO\n'...
 client:  read 'foo\n'
 client:  sending 'FOO\n'...
 client:  read 'foo\n'
 client:  sending 'FOO\n'...
 client:  read 'foo\n'
 client:  closing connection.
ok
test_selected_npn_protocol (test.test_ssl.ThreadedTests) ...  server:  new connection from ('127.0.0.1', 39892)
 server: connection cipher is now ('ECDHE-RSA-AES256-SHA', 'TLSv1.0', 256)
 server: selected protocol is now None
 client:  sending 'FOO\n'...
 client:  read 'foo\n'
 client:  sending 'FOO\n'...
 client:  read 'foo\n'
 client:  sending 'FOO\n'...
 client:  read 'foo\n'
 client:  closing connection.
ok
test_server_accept (test.test_ssl.ThreadedTests) ... ok
test_sni_callback (test.test_ssl.ThreadedTests) ...  server:  new connection from ('127.0.0.1', 59326)
 server: connection cipher is now ('ECDHE-RSA-AES256-SHA', 'TLSv1.0', 256)
 server: selected protocol is now None
 server:  new connection from ('127.0.0.1', 43128)
 server: connection cipher is now ('ECDHE-RSA-AES256-SHA', 'TLSv1.0', 256)
 server: selected protocol is now None
 server:  new connection from ('127.0.0.1', 55954)
 server: connection cipher is now ('ECDHE-RSA-AES256-SHA', 'TLSv1.0', 256)
 server: selected protocol is now None
ok
test_sni_callback_alert (test.test_ssl.ThreadedTests) ... ok
test_sni_callback_raising (test.test_ssl.ThreadedTests) ... ok
test_sni_callback_wrong_return_type (test.test_ssl.ThreadedTests) ... ok
test_socketserver (test.test_ssl.ThreadedTests)
Using a SocketServer to create and manage SSL connections. ... 
 server (('127.0.0.1', 44111):44111 ('TLS_AES_256_GCM_SHA384', 'TLSv1.3', 256)):
   [14/Sep/2018 08:06:45] "GET /keycert.pem HTTP/1.1" 200 -
 client: read 1783 bytes from remote server '<HTTPSServerThread <HTTPSServer localhost:44111>>'
stopping HTTPS server
joining HTTPS thread
ok
test_starttls (test.test_ssl.ThreadedTests)
Switching from clear text to encrypted and back again. ... 
 client:  sending 'msg 1'...
 server:  new connection from ('127.0.0.1', 39056)
 server: read 'msg 1' (unencrypted), sending back 'msg 1' (unencrypted)...
 client:  read 'msg 1' from server
 client:  sending 'MSG 2'...
 server: read 'MSG 2' (unencrypted), sending back 'msg 2' (unencrypted)...
 client:  read 'msg 2' from server
 client:  sending 'STARTTLS'...
 server: read STARTTLS from client, sending OK...
 client:  read 'ok' from server, starting TLS...
 server: connection cipher is now ('ECDHE-RSA-AES256-SHA', 'TLSv1.0', 256)
 server: selected protocol is now None
 client:  sending 'MSG 3'...
 server: read 'MSG 3' (encrypted), sending back 'msg 3' (encrypted)...
 client:  read 'msg 3' from server
 client:  sending 'msg 4'...
 server: read 'msg 4' (encrypted), sending back 'msg 4' (encrypted)...
 client:  read 'msg 4' from server
 client:  sending 'ENDTLS'...
 server: read ENDTLS from client, sending OK...
 client:  read 'ok' from server, ending TLS...
 server: connection is now unencrypted...
 client:  sending 'msg 5'...
 server: read 'msg 5' (unencrypted), sending back 'msg 5' (unencrypted)...
 client:  read 'msg 5' from server
 client:  sending 'msg 6'...
 server: read 'msg 6' (unencrypted), sending back 'msg 6' (unencrypted)...
 client:  read 'msg 6' from server
 client:  closing connection.
 server: client closed connection
ok
test_tls1_3 (test.test_ssl.ThreadedTests) ... ERROR
test_tls_unique_channel_binding (test.test_ssl.ThreadedTests)
Test tls-unique channel binding. ... 
 server:  new connection from ('127.0.0.1', 47944)
 server: connection cipher is now ('ECDHE-RSA-AES256-SHA', 'TLSv1.0', 256)
 server: selected protocol is now None
 got channel binding data: '\xf4V\xbe\xd2C.O"?\xcb\xe4\xe7'
 server:  new connection from ('127.0.0.1', 47946)
 server: connection cipher is now ('ECDHE-RSA-AES256-SHA', 'TLSv1.0', 256)
 server: selected protocol is now None
 got another channel binding data: 'B\x85\x9e\xc1\x92\xe5\xde\xac\x88\xb8\xb1\xf5'
ok
test_version_basic (test.test_ssl.ThreadedTests) ... ok
test_wrong_cert (test.test_ssl.ThreadedTests)
Connecting when the server rejects the client's certificate ... test test_ssl failed -- multiple errors occurred

SSLError is SSLError(1, u'[SSL: TLSV1_ALERT_UNKNOWN_CA] tlsv1 alert unknown ca (_ssl.c:726)')
ok

======================================================================
ERROR: test_tls1_3 (test.test_ssl.ThreadedTests)
----------------------------------------------------------------------
Traceback (most recent call last):
  File "/tmp/B.qqCqvt/BUILD/Python-2.7.15/Lib/test/test_ssl.py", line 2808, in test_tls1_3
    with context.wrap_socket(socket.socket()) as s:
AttributeError: __exit__

======================================================================
FAIL: test_options (test.test_ssl.ContextTests)
----------------------------------------------------------------------
Traceback (most recent call last):
  File "/tmp/B.qqCqvt/BUILD/Python-2.7.15/Lib/test/test_ssl.py", line 780, in test_options
    self.assertEqual(default, ctx.options)
AssertionError: -2113798060 != -2112749484L

======================================================================
FAIL: test_default_ciphers (test.test_ssl.ThreadedTests)
----------------------------------------------------------------------
Traceback (most recent call last):
  File "/tmp/B.qqCqvt/BUILD/Python-2.7.15/Lib/test/test_ssl.py", line 2780, in test_default_ciphers
    s.connect((HOST, server.port))
AssertionError: SSLError not raised

======================================================================
FAIL: test_default_ecdh_curve (test.test_ssl.ThreadedTests)
----------------------------------------------------------------------
Traceback (most recent call last):
  File "/tmp/B.qqCqvt/BUILD/Python-2.7.15/Lib/test/test_ssl.py", line 2831, in test_default_ecdh_curve
    self.assertIn("ECDH", s.cipher()[0])
AssertionError: 'ECDH' not found in 'TLS_AES_256_GCM_SHA384'

----------------------------------------------------------------------
Ran 95 tests in 3.327s

FAILED (failures=3, errors=1, skipped=7)
1 test failed again:
    test_ssl

Total duration: 26 min 29 sec
Tests result: FAILURE
make: *** [Makefile:880: test] Error 2
error: Bad exit status from /tmp/B.qqCqvt/BUILD/tmp/rpm-tmp.76884 (%build)


RPM build errors:
    Bad exit status from /tmp/B.qqCqvt/BUILD/tmp/rpm-tmp.76884 (%build)
ended at: Fri Sep 14 08:06:45 2018, done in 0:55:11.874754
error: No files produced.
+ chmod -R u+rwX /tmp/B.qqCqvt/BUILD
+ rm -rf /tmp/B.qqCqvt/tmp /tmp/B.qqCqvt/BUILD
+ rm -rf /tmp/B.qqCqvt
Begin-PLD-Builder-Info
Build-Time: user:2064.14s sys:1850.08s real:3319.93s (faults io:156 non-io:8185394)

End-PLD-Builder-Info
[Back to list of logs] [View rpm -qa of builder]