FailedOk

th/SRPMS[OK]
th/x32[OK]
th/i686[OK]
th/x86_64[OK]

ac/SRPMS[OK]
ac/i386[OK]
ac/i586[OK]
ac/i686[OK]
ac/alpha[OK]
ac/amd64[OK]
ac/athlon[OK]
ac/ppc[OK]
ac/sparc[OK]
ac/sparc64[OK]

Advanced Search
main()
Powered by PLD Linux
(c) 2002-2018 PLD Team
$Revision: 1.37 $
Powered by brain.
Your IP: 34.235.127.68

python-pytest edb168fc-1066-4ff5-a1f1-d1a3eb0beaaa

Status:Failed
Source URL:ftp://buildlogs.pld-linux.org/th/x32/FAIL/python-pytest,edb168fc-1066-4ff5-a1f1-d1a3eb0beaaa.bz2
text/plain URL:View!
full text:View!
rpm -qa of builder:View!
Date:2018/11/30 16:46:38
Runtime:0:09:36.254737

Toc:

  • error 1
  • testing/test_skipping.py::TestXFail::test_xfail_simple[True] PASSED [ 56%]
  • error 2
  • testing/test_skipping.py::TestXFail::test_xfail_simple[False] PASSED [ 56%]
  • error 3
  • testing/test_skipping.py::TestXFail::test_xfail_xpassed PASSED [ 56%]
  • error 4
  • testing/test_skipping.py::TestXFail::test_xfail_using_platform PASSED [ 56%]
  • error 5
  • testing/test_skipping.py::TestXFail::test_xfail_xpassed_strict PASSED [ 56%]
  • error 6
  • testing/test_skipping.py::TestXFail::test_xfail_run_anyway PASSED [ 56%]
  • error 7
  • testing/test_skipping.py::TestXFail::test_xfail_evalfalse_but_fails PASSED [ 56%]
  • error 8
  • testing/test_skipping.py::TestXFail::test_xfail_not_report_default PASSED [ 56%]
  • error 9
  • testing/test_skipping.py::TestXFail::test_xfail_not_run_xfail_reporting PASSED [ 56%]
  • error 10
  • testing/test_skipping.py::TestXFail::test_xfail_not_run_no_setup_run PASSED [ 56%]
  • error 11
  • testing/test_skipping.py::TestXFail::test_xfail_xpass PASSED [ 57%]
  • error 12
  • testing/test_skipping.py::TestXFail::test_xfail_imperative PASSED [ 57%]
  • error 13
  • testing/test_skipping.py::TestXFail::test_xfail_imperative_in_setup_function PASSED [ 57%]
  • error 14
  • testing/test_skipping.py::TestXFail::test_dynamic_xfail_no_run PASSED [ 57%]
  • error 15
  • testing/test_skipping.py::TestXFail::test_dynamic_xfail_set_during_funcarg_setup PASSED [ 57%]
  • error 16
  • testing/test_skipping.py::TestXFail::test_xfail_raises[TypeError-TypeError-*1 xfailed*] PASSED [ 57%]
  • error 17
  • testing/test_skipping.py::TestXFail::test_xfail_raises[(AttributeError, TypeError)-TypeError-*1 xfailed*] PASSED [ 57%]
  • error 18
  • testing/test_skipping.py::TestXFail::test_xfail_raises[TypeError-IndexError-*1 failed*] PASSED [ 57%]
  • error 19
  • testing/test_skipping.py::TestXFail::test_xfail_raises[(AttributeError, TypeError)-IndexError-*1 failed*] PASSED [ 57%]
  • error 20
  • testing/test_skipping.py::TestXFail::test_strict_sanity PASSED [ 57%]
  • error 21
  • testing/test_skipping.py::TestXFail::test_strict_xfail[True] PASSED [ 57%]
  • error 22
  • testing/test_skipping.py::TestXFail::test_strict_xfail[False] PASSED [ 57%]
  • error 23
  • testing/test_skipping.py::TestXFail::test_strict_xfail_condition[True] PASSED [ 57%]
  • error 24
  • testing/test_skipping.py::TestXFail::test_strict_xfail_condition[False] PASSED [ 57%]
  • error 25
  • testing/test_skipping.py::TestXFail::test_xfail_condition_keyword[True] PASSED [ 57%]
  • error 26
  • testing/test_skipping.py::TestXFail::test_xfail_condition_keyword[False] PASSED [ 57%]
  • error 27
  • testing/test_skipping.py::TestXFail::test_strict_xfail_default_from_file[true] PASSED [ 57%]
  • error 28
  • testing/test_skipping.py::TestXFail::test_strict_xfail_default_from_file[false] PASSED [ 57%]
  • error 29
  • testing/python/fixture.py::TestErrors::test_subfactory_missing_funcarg PASSED [ 90%]
  • error 30
  • testing/python/fixture.py::TestErrors::test_issue498_fixture_finalizer_failing PASSED [ 90%]
  • error 31
  • testing/python/fixture.py::TestErrors::test_setupfunc_missing_funcarg PASSED [ 90%]
  • error 32
  • except ImportError:
  • error 33
  • error: Bad exit status from /tmp/B.FQJbBU/BUILD/tmp/rpm-tmp.710 (%build)
  • error 34
  • RPM build errors:
  • error 35
  • error: No files produced.

Content:

testing/test_runner.py::TestExecutionNonForked::test_failure_in_setup_function_ignores_custom_repr PASSED [ 52%]
testing/test_runner.py::TestExecutionNonForked::test_systemexit_does_not_bail_out PASSED [ 52%]
testing/test_runner.py::TestExecutionNonForked::test_exit_propagates PASSED [ 52%]
testing/test_runner.py::TestExecutionNonForked::test_keyboardinterrupt_propagates PASSED [ 52%]
testing/test_runner.py::TestExecutionForked::test_passfunction SKIPPED   [ 52%]
testing/test_runner.py::TestExecutionForked::test_failfunction SKIPPED   [ 52%]
testing/test_runner.py::TestExecutionForked::test_skipfunction SKIPPED   [ 52%]
testing/test_runner.py::TestExecutionForked::test_skip_in_setup_function SKIPPED [ 52%]
testing/test_runner.py::TestExecutionForked::test_failure_in_setup_function SKIPPED [ 52%]
testing/test_runner.py::TestExecutionForked::test_failure_in_teardown_function SKIPPED [ 52%]
testing/test_runner.py::TestExecutionForked::test_custom_failure_repr SKIPPED [ 52%]
testing/test_runner.py::TestExecutionForked::test_teardown_final_returncode PASSED [ 52%]
testing/test_runner.py::TestExecutionForked::test_logstart_logfinish_hooks PASSED [ 52%]
testing/test_runner.py::TestExecutionForked::test_exact_teardown_issue90 PASSED [ 52%]
testing/test_runner.py::TestExecutionForked::test_exact_teardown_issue1206 PASSED [ 52%]
testing/test_runner.py::TestExecutionForked::test_failure_in_setup_function_ignores_custom_repr SKIPPED [ 52%]
testing/test_runner.py::TestExecutionForked::test_systemexit_does_not_bail_out SKIPPED [ 52%]
testing/test_runner.py::TestExecutionForked::test_exit_propagates SKIPPED [ 52%]
testing/test_runner.py::TestExecutionForked::test_suicide SKIPPED        [ 52%]
testing/test_runner.py::TestSessionReports::test_collect_result PASSED   [ 52%]
testing/test_runner.py::test_report_extra_parameters[BaseReport] PASSED  [ 53%]
testing/test_runner.py::test_report_extra_parameters[TestReport] PASSED  [ 53%]
testing/test_runner.py::test_report_extra_parameters[TeardownErrorReport] PASSED [ 53%]
testing/test_runner.py::test_report_extra_parameters[CollectReport] PASSED [ 53%]
testing/test_runner.py::test_callinfo PASSED                             [ 53%]
testing/test_runner.py::test_runtest_in_module_ordering xfail            [ 53%]
testing/test_runner.py::test_outcomeexception_exceptionattributes PASSED [ 53%]
testing/test_runner.py::test_outcomeexception_passes_except_Exception PASSED [ 53%]
testing/test_runner.py::test_pytest_exit PASSED                          [ 53%]
testing/test_runner.py::test_pytest_fail PASSED                          [ 53%]
testing/test_runner.py::test_pytest_exit_msg PASSED                      [ 53%]
testing/test_runner.py::test_pytest_exit_returncode PASSED               [ 53%]
testing/test_runner.py::test_pytest_fail_notrace_runtest PASSED          [ 53%]
testing/test_runner.py::test_pytest_fail_notrace_collection PASSED       [ 53%]
testing/test_runner.py::test_pytest_fail_notrace_non_ascii[u] PASSED     [ 53%]
testing/test_runner.py::test_pytest_fail_notrace_non_ascii[] PASSED      [ 53%]
testing/test_runner.py::test_pytest_no_tests_collected_exit_status PASSED [ 53%]
testing/test_runner.py::test_exception_printing_skip PASSED              [ 53%]
testing/test_runner.py::test_importorskip PASSED                         [ 53%]
testing/test_runner.py::test_importorskip_imports_last_module_part PASSED [ 53%]
testing/test_runner.py::test_importorskip_dev_module PASSED              [ 53%]
testing/test_runner.py::test_importorskip_module_level PASSED            [ 53%]
testing/test_runner.py::test_pytest_cmdline_main PASSED                  [ 54%]
testing/test_runner.py::test_unicode_in_longrepr PASSED                  [ 54%]
testing/test_runner.py::test_failure_in_setup PASSED                     [ 54%]
testing/test_runner.py::test_makereport_getsource PASSED                 [ 54%]
testing/test_runner.py::test_makereport_getsource_dynamic_code PASSED    [ 54%]
testing/test_runner.py::test_store_except_info_on_error PASSED           [ 54%]
testing/test_runner.py::test_current_test_env_var PASSED                 [ 54%]
testing/test_runner.py::TestReportContents::test_longreprtext_pass PASSED [ 54%]
testing/test_runner.py::TestReportContents::test_longreprtext_failure PASSED [ 54%]
testing/test_runner.py::TestReportContents::test_captured_text PASSED    [ 54%]
testing/test_runner.py::TestReportContents::test_no_captured_text PASSED [ 54%]
testing/test_runner_xunit.py::test_module_and_function_setup PASSED      [ 54%]
testing/test_runner_xunit.py::test_module_setup_failure_no_teardown PASSED [ 54%]
testing/test_runner_xunit.py::test_setup_function_failure_no_teardown PASSED [ 54%]
testing/test_runner_xunit.py::test_class_setup PASSED                    [ 54%]
testing/test_runner_xunit.py::test_class_setup_failure_no_teardown PASSED [ 54%]
testing/test_runner_xunit.py::test_method_setup PASSED                   [ 54%]
testing/test_runner_xunit.py::test_method_setup_failure_no_teardown PASSED [ 54%]
testing/test_runner_xunit.py::test_method_generator_setup PASSED         [ 54%]
testing/test_runner_xunit.py::test_func_generator_setup PASSED           [ 54%]
testing/test_runner_xunit.py::test_method_setup_uses_fresh_instances PASSED [ 54%]
testing/test_runner_xunit.py::test_setup_that_skips_calledagain PASSED   [ 54%]
testing/test_runner_xunit.py::test_setup_fails_again_on_all_tests PASSED [ 55%]
testing/test_runner_xunit.py::test_setup_funcarg_setup_when_outer_scope_fails PASSED [ 55%]
testing/test_runner_xunit.py::test_setup_teardown_function_level_with_optional_argument[] PASSED [ 55%]
testing/test_runner_xunit.py::test_setup_teardown_function_level_with_optional_argument[arg] PASSED [ 55%]
testing/test_session.py::TestNewSession::test_basic_testitem_events PASSED [ 55%]
testing/test_session.py::TestNewSession::test_nested_import_error PASSED [ 55%]
testing/test_session.py::TestNewSession::test_raises_output PASSED       [ 55%]
testing/test_session.py::TestNewSession::test_generator_yields_None PASSED [ 55%]
testing/test_session.py::TestNewSession::test_syntax_error_module PASSED [ 55%]
testing/test_session.py::TestNewSession::test_exit_first_problem PASSED  [ 55%]
testing/test_session.py::TestNewSession::test_maxfail PASSED             [ 55%]
testing/test_session.py::TestNewSession::test_broken_repr PASSED         [ 55%]
testing/test_session.py::TestNewSession::test_skip_file_by_conftest PASSED [ 55%]
testing/test_session.py::TestNewSession::test_order_of_execution PASSED  [ 55%]
testing/test_session.py::TestNewSession::test_collect_only_with_various_situations PASSED [ 55%]
testing/test_session.py::TestNewSession::test_minus_x_import_error PASSED [ 55%]
testing/test_session.py::TestNewSession::test_minus_x_overridden_by_maxfail PASSED [ 55%]
testing/test_session.py::test_plugin_specify PASSED                      [ 55%]
testing/test_session.py::test_plugin_already_exists PASSED               [ 55%]
testing/test_session.py::test_exclude PASSED                             [ 55%]
testing/test_session.py::test_deselect PASSED                            [ 55%]
testing/test_session.py::test_sessionfinish_with_start PASSED            [ 55%]
testing/test_session.py::test_rootdir_option_arg[root] PASSED            [ 55%]
testing/test_session.py::test_rootdir_option_arg[{relative}/root] PASSED [ 56%]
testing/test_session.py::test_rootdir_option_arg[{environment}/root] PASSED [ 56%]
testing/test_session.py::test_rootdir_wrong_option_arg PASSED            [ 56%]
testing/test_skipping.py::TestEvaluator::test_no_marker PASSED           [ 56%]
testing/test_skipping.py::TestEvaluator::test_marked_no_args PASSED      [ 56%]
testing/test_skipping.py::TestEvaluator::test_marked_one_arg PASSED      [ 56%]
testing/test_skipping.py::TestEvaluator::test_marked_one_arg_unicode SKIPPED [ 56%]
testing/test_skipping.py::TestEvaluator::test_marked_one_arg_with_reason PASSED [ 56%]
testing/test_skipping.py::TestEvaluator::test_marked_one_arg_twice PASSED [ 56%]
testing/test_skipping.py::TestEvaluator::test_marked_one_arg_twice2 PASSED [ 56%]
testing/test_skipping.py::TestEvaluator::test_marked_skip_with_not_string PASSED [ 56%]
testing/test_skipping.py::TestEvaluator::test_skipif_class PASSED        [ 56%]
testing/test_skipping.py::TestXFail::test_xfail_simple[True] PASSED      [ 56%]
testing/test_skipping.py::TestXFail::test_xfail_simple[False] PASSED     [ 56%]
testing/test_skipping.py::TestXFail::test_xfail_xpassed PASSED           [ 56%]
testing/test_skipping.py::TestXFail::test_xfail_using_platform PASSED    [ 56%]
testing/test_skipping.py::TestXFail::test_xfail_xpassed_strict PASSED    [ 56%]
testing/test_skipping.py::TestXFail::test_xfail_run_anyway PASSED        [ 56%]
testing/test_skipping.py::TestXFail::test_xfail_evalfalse_but_fails PASSED [ 56%]
testing/test_skipping.py::TestXFail::test_xfail_not_report_default PASSED [ 56%]
testing/test_skipping.py::TestXFail::test_xfail_not_run_xfail_reporting PASSED [ 56%]
testing/test_skipping.py::TestXFail::test_xfail_not_run_no_setup_run PASSED [ 56%]
testing/test_skipping.py::TestXFail::test_xfail_xpass PASSED             [ 57%]
testing/test_skipping.py::TestXFail::test_xfail_imperative PASSED        [ 57%]
testing/test_skipping.py::TestXFail::test_xfail_imperative_in_setup_function PASSED [ 57%]
testing/test_skipping.py::TestXFail::test_dynamic_xfail_no_run PASSED    [ 57%]
testing/test_skipping.py::TestXFail::test_dynamic_xfail_set_during_funcarg_setup PASSED [ 57%]
testing/test_skipping.py::TestXFail::test_xfail_raises[TypeError-TypeError-*1 xfailed*] PASSED [ 57%]
testing/test_skipping.py::TestXFail::test_xfail_raises[(AttributeError, TypeError)-TypeError-*1 xfailed*] PASSED [ 57%]
testing/test_skipping.py::TestXFail::test_xfail_raises[TypeError-IndexError-*1 failed*] PASSED [ 57%]
testing/test_skipping.py::TestXFail::test_xfail_raises[(AttributeError, TypeError)-IndexError-*1 failed*] PASSED [ 57%]
testing/test_skipping.py::TestXFail::test_strict_sanity PASSED           [ 57%]
testing/test_skipping.py::TestXFail::test_strict_xfail[True] PASSED      [ 57%]
testing/test_skipping.py::TestXFail::test_strict_xfail[False] PASSED     [ 57%]
testing/test_skipping.py::TestXFail::test_strict_xfail_condition[True] PASSED [ 57%]
testing/test_skipping.py::TestXFail::test_strict_xfail_condition[False] PASSED [ 57%]
testing/test_skipping.py::TestXFail::test_xfail_condition_keyword[True] PASSED [ 57%]
testing/test_skipping.py::TestXFail::test_xfail_condition_keyword[False] PASSED [ 57%]
testing/test_skipping.py::TestXFail::test_strict_xfail_default_from_file[true] PASSED [ 57%]
testing/test_skipping.py::TestXFail::test_strict_xfail_default_from_file[false] PASSED [ 57%]
testing/test_skipping.py::TestXFailwithSetupTeardown::test_failing_setup_issue9 PASSED [ 57%]
testing/test_skipping.py::TestXFailwithSetupTeardown::test_failing_teardown_issue9 PASSED [ 57%]
testing/test_skipping.py::TestSkip::test_skip_class PASSED               [ 57%]
testing/test_skipping.py::TestSkip::test_skips_on_false_string PASSED    [ 57%]
testing/test_skipping.py::TestSkip::test_arg_as_reason PASSED            [ 58%]
testing/test_skipping.py::TestSkip::test_skip_no_reason PASSED           [ 58%]
testing/test_skipping.py::TestSkip::test_skip_with_reason PASSED         [ 58%]
testing/test_skipping.py::TestSkip::test_only_skips_marked_test PASSED   [ 58%]
testing/test_skipping.py::TestSkip::test_strict_and_skip PASSED          [ 58%]
testing/test_skipping.py::TestSkipif::test_skipif_conditional PASSED     [ 58%]
testing/test_skipping.py::TestSkipif::test_skipif_reporting["hasattr(sys, 'platform')"] PASSED [ 58%]
testing/test_skipping.py::TestSkipif::test_skipif_reporting[True, reason="invalid platform"] PASSED [ 58%]
testing/test_skipping.py::TestSkipif::test_skipif_using_platform PASSED  [ 58%]
testing/test_skipping.py::TestSkipif::test_skipif_reporting_multiple[skipif-SKIP-skipped] PASSED [ 58%]
testing/test_skipping.py::TestSkipif::test_skipif_reporting_multiple[xfail-XPASS-xpassed] PASSED [ 58%]
testing/test_skipping.py::test_skip_not_report_default PASSED            [ 58%]
testing/test_skipping.py::test_skipif_class PASSED                       [ 58%]
testing/test_skipping.py::test_skip_reasons_folding PASSED               [ 58%]
testing/test_skipping.py::test_skipped_reasons_functional PASSED         [ 58%]
testing/test_skipping.py::test_skipped_folding PASSED                    [ 58%]
testing/test_skipping.py::test_reportchars PASSED                        [ 58%]
testing/test_skipping.py::test_reportchars_error PASSED                  [ 58%]
testing/test_skipping.py::test_reportchars_all PASSED                    [ 58%]
testing/test_skipping.py::test_reportchars_all_error PASSED              [ 58%]
testing/test_skipping.py::test_errors_in_xfail_skip_expressions PASSED   [ 58%]
testing/test_skipping.py::test_xfail_skipif_with_globals PASSED          [ 58%]
testing/test_skipping.py::test_direct_gives_error PASSED                 [ 58%]
testing/test_skipping.py::test_default_markers PASSED                    [ 59%]
testing/test_skipping.py::test_xfail_test_setup_exception PASSED         [ 59%]
testing/test_skipping.py::test_imperativeskip_on_xfail_test PASSED       [ 59%]
testing/test_skipping.py::TestBooleanCondition::test_skipif PASSED       [ 59%]
testing/test_skipping.py::TestBooleanCondition::test_skipif_noreason PASSED [ 59%]
testing/test_skipping.py::TestBooleanCondition::test_xfail PASSED        [ 59%]
testing/test_skipping.py::test_xfail_item PASSED                         [ 59%]
testing/test_skipping.py::test_module_level_skip_error PASSED            [ 59%]
testing/test_skipping.py::test_module_level_skip_with_allow_module_level PASSED [ 59%]
testing/test_skipping.py::test_invalid_skip_keyword_parameter PASSED     [ 59%]
testing/test_skipping.py::test_mark_xfail_item PASSED                    [ 59%]
testing/test_skipping.py::test_summary_list_after_errors PASSED          [ 59%]
testing/test_stepwise.py::test_run_without_stepwise PASSED               [ 59%]
testing/test_stepwise.py::test_fail_and_continue_with_stepwise PASSED    [ 59%]
testing/test_stepwise.py::test_run_with_skip_option PASSED               [ 59%]
testing/test_stepwise.py::test_fail_on_errors PASSED                     [ 59%]
testing/test_stepwise.py::test_change_testfile PASSED                    [ 59%]
testing/test_stepwise.py::test_stop_on_collection_errors PASSED          [ 59%]
testing/test_terminal.py::test_plugin_nameversion[normal] PASSED         [ 59%]
testing/test_terminal.py::test_plugin_nameversion[prefix-strip] PASSED   [ 59%]
testing/test_terminal.py::test_plugin_nameversion[deduplicate] PASSED    [ 59%]
testing/test_terminal.py::TestCollectonly::test_collectonly_basic PASSED [ 59%]
testing/test_terminal.py::TestCollectonly::test_collectonly_skipped_module PASSED [ 60%]
testing/test_terminal.py::TestCollectonly::test_collectonly_failed_module PASSED [ 60%]
testing/test_terminal.py::TestCollectonly::test_collectonly_fatal PASSED [ 60%]
testing/test_terminal.py::TestCollectonly::test_collectonly_simple PASSED [ 60%]
testing/test_terminal.py::TestCollectonly::test_collectonly_error PASSED [ 60%]
testing/test_terminal.py::TestCollectonly::test_collectonly_missing_path PASSED [ 60%]
testing/test_terminal.py::TestCollectonly::test_collectonly_quiet PASSED [ 60%]
testing/test_terminal.py::TestCollectonly::test_collectonly_more_quiet PASSED [ 60%]
testing/test_terminal.py::test_repr_python_version PASSED                [ 60%]
testing/test_terminal.py::TestFixtureReporting::test_setup_fixture_error PASSED [ 60%]
testing/test_terminal.py::TestFixtureReporting::test_teardown_fixture_error PASSED [ 60%]
testing/test_terminal.py::TestFixtureReporting::test_teardown_fixture_error_and_test_failure PASSED [ 60%]
testing/test_terminal.py::TestFixtureReporting::test_setup_teardown_output_and_test_failure PASSED [ 60%]
testing/test_terminal.py::test_fail_extra_reporting PASSED               [ 60%]
testing/test_terminal.py::test_fail_reporting_on_pass PASSED             [ 60%]
testing/test_terminal.py::test_pass_extra_reporting PASSED               [ 60%]
testing/test_terminal.py::test_pass_reporting_on_fail PASSED             [ 60%]
testing/test_terminal.py::test_pass_output_reporting PASSED              [ 60%]
testing/test_terminal.py::test_color_yes PASSED                          [ 60%]
testing/test_terminal.py::test_color_no PASSED                           [ 60%]
testing/test_terminal.py::test_color_yes_collection_on_non_atty[True] PASSED [ 60%]
testing/test_terminal.py::test_color_yes_collection_on_non_atty[False] PASSED [ 60%]
testing/test_terminal.py::test_getreportopt PASSED                       [ 61%]
testing/test_terminal.py::test_terminalreporter_reportopt_addopts PASSED [ 61%]
testing/test_terminal.py::test_tbstyle_short PASSED                      [ 61%]
testing/test_terminal.py::test_traceconfig PASSED                        [ 61%]
testing/test_terminal.py::TestGenericReporting::test_collect_fail[default] PASSED [ 61%]
testing/test_terminal.py::TestGenericReporting::test_collect_fail[verbose] PASSED [ 61%]
testing/test_terminal.py::TestGenericReporting::test_collect_fail[quiet] PASSED [ 61%]
testing/test_terminal.py::TestGenericReporting::test_collect_fail[fulltrace] PASSED [ 61%]
testing/test_terminal.py::TestGenericReporting::test_maxfailures[default] PASSED [ 61%]
testing/test_terminal.py::TestGenericReporting::test_maxfailures[verbose] PASSED [ 61%]
testing/test_terminal.py::TestGenericReporting::test_maxfailures[quiet] PASSED [ 61%]
testing/test_terminal.py::TestGenericReporting::test_maxfailures[fulltrace] PASSED [ 61%]
testing/test_terminal.py::TestGenericReporting::test_tb_option[default] PASSED [ 61%]
testing/test_terminal.py::TestGenericReporting::test_tb_option[verbose] PASSED [ 61%]
testing/test_terminal.py::TestGenericReporting::test_tb_option[quiet] PASSED [ 61%]
testing/test_terminal.py::TestGenericReporting::test_tb_option[fulltrace] PASSED [ 61%]
testing/test_terminal.py::TestGenericReporting::test_tb_crashline[default] PASSED [ 61%]
testing/test_terminal.py::TestGenericReporting::test_tb_crashline[verbose] PASSED [ 61%]
testing/test_terminal.py::TestGenericReporting::test_tb_crashline[quiet] PASSED [ 61%]
testing/test_terminal.py::TestGenericReporting::test_tb_crashline[fulltrace] PASSED [ 61%]
testing/test_terminal.py::TestGenericReporting::test_pytest_report_header[default] PASSED [ 61%]
testing/test_terminal.py::TestGenericReporting::test_pytest_report_header[verbose] PASSED [ 61%]
testing/test_terminal.py::TestGenericReporting::test_pytest_report_header[quiet] PASSED [ 61%]
testing/test_terminal.py::TestGenericReporting::test_pytest_report_header[fulltrace] PASSED [ 62%]
testing/test_terminal.py::TestGenericReporting::test_show_capture PASSED [ 62%]
testing/test_terminal.py::TestGenericReporting::test_show_capture_with_teardown_logs PASSED [ 62%]
testing/test_terminal.py::test_fdopen_kept_alive_issue124 PASSED         [ 62%]
testing/test_terminal.py::test_tbstyle_native_setup_error PASSED         [ 62%]
testing/test_terminal.py::test_terminal_summary PASSED                   [ 62%]
testing/test_terminal.py::test_terminal_summary_warnings_are_displayed PASSED [ 62%]
testing/test_terminal.py::test_summary_stats[red-1 failed-stats_arg0] PASSED [ 62%]
testing/test_terminal.py::test_summary_stats[red-1 failed, 1 passed-stats_arg1] PASSED [ 62%]
testing/test_terminal.py::test_summary_stats[red-1 error-stats_arg2] PASSED [ 62%]
testing/test_terminal.py::test_summary_stats[red-1 passed, 1 error-stats_arg3] PASSED [ 62%]
testing/test_terminal.py::test_summary_stats[yellow-1 weird-stats_arg4] PASSED [ 62%]
testing/test_terminal.py::test_summary_stats[yellow-1 passed, 1 weird-stats_arg5] PASSED [ 62%]
testing/test_terminal.py::test_summary_stats[yellow-1 warnings-stats_arg6] PASSED [ 62%]
testing/test_terminal.py::test_summary_stats[yellow-1 passed, 1 warnings-stats_arg7] PASSED [ 62%]
testing/test_terminal.py::test_summary_stats[green-5 passed-stats_arg8] PASSED [ 62%]
testing/test_terminal.py::test_summary_stats[yellow-1 skipped-stats_arg9] PASSED [ 62%]
testing/test_terminal.py::test_summary_stats[green-1 passed, 1 skipped-stats_arg10] PASSED [ 62%]
testing/test_terminal.py::test_summary_stats[yellow-1 deselected-stats_arg11] PASSED [ 62%]
testing/test_terminal.py::test_summary_stats[green-1 passed, 1 deselected-stats_arg12] PASSED [ 62%]
testing/test_terminal.py::test_summary_stats[yellow-1 xfailed-stats_arg13] PASSED [ 62%]
testing/test_terminal.py::test_summary_stats[green-1 passed, 1 xfailed-stats_arg14] PASSED [ 62%]
testing/test_terminal.py::test_summary_stats[yellow-1 xpassed-stats_arg15] PASSED [ 63%]
testing/test_terminal.py::test_summary_stats[green-1 passed, 1 xpassed-stats_arg16] PASSED [ 63%]
testing/test_terminal.py::test_summary_stats[yellow-no tests ran-stats_arg17] PASSED [ 63%]
testing/test_terminal.py::test_summary_stats[yellow-no tests ran-stats_arg18] PASSED [ 63%]
testing/test_terminal.py::test_summary_stats[green-1 passed-stats_arg19] PASSED [ 63%]
testing/test_terminal.py::test_summary_stats[red-1 failed, 2 passed, 3 xfailed-stats_arg20] PASSED [ 63%]
testing/test_terminal.py::test_summary_stats[green-1 passed, 2 skipped, 3 deselected, 2 xfailed-stats_arg21] PASSED [ 63%]
testing/test_terminal.py::test_no_trailing_whitespace_after_inifile_word PASSED [ 63%]
testing/test_terminal.py::TestClassicOutputStyle::test_normal_verbosity PASSED [ 63%]
testing/test_terminal.py::TestClassicOutputStyle::test_verbose PASSED    [ 63%]
testing/test_terminal.py::TestClassicOutputStyle::test_quiet PASSED      [ 63%]
testing/test_terminal.py::TestProgressOutputStyle::test_zero_tests_collected PASSED [ 63%]
testing/test_terminal.py::TestProgressOutputStyle::test_normal PASSED    [ 63%]
testing/test_terminal.py::TestProgressOutputStyle::test_count PASSED     [ 63%]
testing/test_terminal.py::TestProgressOutputStyle::test_verbose PASSED   [ 63%]
testing/test_terminal.py::TestProgressOutputStyle::test_verbose_count PASSED [ 63%]
testing/test_terminal.py::TestProgressOutputStyle::test_xdist_normal SKIPPED [ 63%]
testing/test_terminal.py::TestProgressOutputStyle::test_xdist_normal_count SKIPPED [ 63%]
testing/test_terminal.py::TestProgressOutputStyle::test_xdist_verbose SKIPPED [ 63%]
testing/test_terminal.py::TestProgressOutputStyle::test_capture_no PASSED [ 63%]
testing/test_terminal.py::TestProgressWithTeardown::test_teardown_simple PASSED [ 63%]
testing/test_terminal.py::TestProgressWithTeardown::test_teardown_with_test_also_failing PASSED [ 63%]
testing/test_terminal.py::TestProgressWithTeardown::test_teardown_many PASSED [ 63%]
testing/test_terminal.py::TestProgressWithTeardown::test_teardown_many_verbose PASSED [ 64%]
testing/test_terminal.py::TestProgressWithTeardown::test_xdist_normal SKIPPED [ 64%]
testing/test_tmpdir.py::test_tmpdir_fixture PASSED                       [ 64%]
testing/test_tmpdir.py::test_ensuretemp PASSED                           [ 64%]
testing/test_tmpdir.py::TestTempdirHandler::test_mktemp PASSED           [ 64%]
testing/test_tmpdir.py::TestConfigTmpdir::test_getbasetemp_custom_removes_old PASSED [ 64%]
testing/test_tmpdir.py::test_basetemp PASSED                             [ 64%]
testing/test_tmpdir.py::test_tmpdir_always_is_realpath PASSED            [ 64%]
testing/test_tmpdir.py::test_tmpdir_too_long_on_parametrization PASSED   [ 64%]
testing/test_tmpdir.py::test_tmpdir_factory PASSED                       [ 64%]
testing/test_tmpdir.py::test_tmpdir_fallback_tox_env PASSED              [ 64%]
testing/test_tmpdir.py::test_tmpdir_fallback_uid_not_found PASSED        [ 64%]
testing/test_tmpdir.py::test_get_user_uid_not_found PASSED               [ 64%]
testing/test_tmpdir.py::test_get_user SKIPPED                            [ 64%]
testing/test_tmpdir.py::TestNumberedDir::test_make PASSED                [ 64%]
testing/test_tmpdir.py::TestNumberedDir::test_cleanup_lock_create PASSED [ 64%]
testing/test_tmpdir.py::TestNumberedDir::test_lock_register_cleanup_removal PASSED [ 64%]
testing/test_tmpdir.py::TestNumberedDir::test_cleanup_keep PASSED        [ 64%]
testing/test_tmpdir.py::TestNumberedDir::test_cleanup_locked PASSED      [ 64%]
testing/test_tmpdir.py::TestNumberedDir::test_rmtree PASSED              [ 64%]
testing/test_tmpdir.py::TestNumberedDir::test_cleanup_ignores_symlink PASSED [ 64%]
testing/test_tmpdir.py::TestNumberedDir::test_removal_accepts_lock PASSED [ 64%]
testing/test_unittest.py::test_simple_unittest PASSED                    [ 65%]
testing/test_unittest.py::test_runTest_method PASSED                     [ 65%]
testing/test_unittest.py::test_isclasscheck_issue53 PASSED               [ 65%]
testing/test_unittest.py::test_setup PASSED                              [ 65%]
testing/test_unittest.py::test_setUpModule PASSED                        [ 65%]
testing/test_unittest.py::test_setUpModule_failing_no_teardown PASSED    [ 65%]
testing/test_unittest.py::test_new_instances PASSED                      [ 65%]
testing/test_unittest.py::test_teardown PASSED                           [ 65%]
testing/test_unittest.py::test_teardown_issue1649 PASSED                 [ 65%]
testing/test_unittest.py::test_unittest_skip_issue148 PASSED             [ 65%]
testing/test_unittest.py::test_method_and_teardown_failing_reporting PASSED [ 65%]
testing/test_unittest.py::test_setup_failure_is_shown PASSED             [ 65%]
testing/test_unittest.py::test_setup_setUpClass PASSED                   [ 65%]
testing/test_unittest.py::test_setup_class PASSED                        [ 65%]
testing/test_unittest.py::test_testcase_adderrorandfailure_defers[Error] PASSED [ 65%]
testing/test_unittest.py::test_testcase_adderrorandfailure_defers[Failure] PASSED [ 65%]
testing/test_unittest.py::test_testcase_custom_exception_info[Error] PASSED [ 65%]
testing/test_unittest.py::test_testcase_custom_exception_info[Failure] PASSED [ 65%]
testing/test_unittest.py::test_testcase_totally_incompatible_exception_info PASSED [ 65%]
testing/test_unittest.py::test_module_level_pytestmark PASSED            [ 65%]
testing/test_unittest.py::TestTrialUnittest::test_trial_testcase_runtest_not_collected SKIPPED [ 65%]
testing/test_unittest.py::TestTrialUnittest::test_trial_exceptions_with_skips SKIPPED [ 65%]
testing/test_unittest.py::TestTrialUnittest::test_trial_error SKIPPED    [ 66%]
testing/test_unittest.py::TestTrialUnittest::test_trial_pdb SKIPPED      [ 66%]
testing/test_unittest.py::TestTrialUnittest::test_trial_testcase_skip_property SKIPPED [ 66%]
testing/test_unittest.py::TestTrialUnittest::test_trial_testfunction_skip_property SKIPPED [ 66%]
testing/test_unittest.py::TestTrialUnittest::test_trial_testcase_todo_property SKIPPED [ 66%]
testing/test_unittest.py::TestTrialUnittest::test_trial_testfunction_todo_property SKIPPED [ 66%]
testing/test_unittest.py::test_djangolike_testcase PASSED                [ 66%]
testing/test_unittest.py::test_unittest_not_shown_in_traceback PASSED    [ 66%]
testing/test_unittest.py::test_unorderable_types PASSED                  [ 66%]
testing/test_unittest.py::test_unittest_typerror_traceback PASSED        [ 66%]
testing/test_unittest.py::test_unittest_expected_failure_for_failing_test_is_xfail[pytest] PASSED [ 66%]
testing/test_unittest.py::test_unittest_expected_failure_for_failing_test_is_xfail[unittest] PASSED [ 66%]
testing/test_unittest.py::test_unittest_expected_failure_for_passing_test_is_fail[pytest] PASSED [ 66%]
testing/test_unittest.py::test_unittest_expected_failure_for_passing_test_is_fail[unittest] PASSED [ 66%]
testing/test_unittest.py::test_unittest_setup_interaction[fixture-return] PASSED [ 66%]
testing/test_unittest.py::test_unittest_setup_interaction[yield_fixture-yield] PASSED [ 66%]
testing/test_unittest.py::test_non_unittest_no_setupclass_support PASSED [ 66%]
testing/test_unittest.py::test_no_teardown_if_setupclass_failed PASSED   [ 66%]
testing/test_unittest.py::test_issue333_result_clearing PASSED           [ 66%]
testing/test_unittest.py::test_unittest_raise_skip_issue748 PASSED       [ 66%]
testing/test_unittest.py::test_unittest_skip_issue1169 PASSED            [ 66%]
testing/test_unittest.py::test_class_method_containing_test_issue1558 PASSED [ 66%]
testing/test_unittest.py::test_usefixtures_marker_on_unittest[six.moves.builtins.object] PASSED [ 66%]
testing/test_unittest.py::test_usefixtures_marker_on_unittest[unittest.TestCase] PASSED [ 67%]
testing/test_unittest.py::test_usefixtures_marker_on_unittest[unittest2.TestCase] PASSED [ 67%]
testing/test_unittest.py::test_testcase_handles_init_exceptions PASSED   [ 67%]
testing/test_unittest.py::test_error_message_with_parametrized_fixtures PASSED [ 67%]
testing/test_warnings.py::test_normal_flow PASSED                        [ 67%]
testing/test_warnings.py::test_setup_teardown_warnings PASSED            [ 67%]
testing/test_warnings.py::test_as_errors[cmdline] PASSED                 [ 67%]
testing/test_warnings.py::test_as_errors[ini] PASSED                     [ 67%]
testing/test_warnings.py::test_ignore[cmdline] PASSED                    [ 67%]
testing/test_warnings.py::test_ignore[ini] PASSED                        [ 67%]
testing/test_warnings.py::test_unicode PASSED                            [ 67%]
testing/test_warnings.py::test_py2_unicode SKIPPED                       [ 67%]
testing/test_warnings.py::test_py2_unicode_ascii PASSED                  [ 67%]
testing/test_warnings.py::test_works_with_filterwarnings PASSED          [ 67%]
testing/test_warnings.py::test_filterwarnings_mark[ini] PASSED           [ 67%]
testing/test_warnings.py::test_filterwarnings_mark[cmdline] PASSED       [ 67%]
testing/test_warnings.py::test_non_string_warning_argument PASSED        [ 67%]
testing/test_warnings.py::test_filterwarnings_mark_registration PASSED   [ 67%]
testing/test_warnings.py::test_warning_captured_hook PASSED              [ 67%]
testing/test_warnings.py::test_collection_warnings PASSED                [ 67%]
testing/test_warnings.py::test_mark_regex_escape PASSED                  [ 67%]
testing/test_warnings.py::test_hide_pytest_internal_warnings[no] PASSED  [ 67%]
testing/test_warnings.py::test_hide_pytest_internal_warnings[ini] PASSED [ 68%]
testing/test_warnings.py::test_hide_pytest_internal_warnings[cmdline] PASSED [ 68%]
testing/test_warnings.py::test_option_precedence_cmdline_over_ini[True] PASSED [ 68%]
testing/test_warnings.py::test_option_precedence_cmdline_over_ini[False] PASSED [ 68%]
testing/test_warnings.py::test_option_precedence_mark PASSED             [ 68%]
testing/test_warnings.py::TestDeprecationWarningsByDefault::test_shown_by_default[True] PASSED [ 68%]
testing/test_warnings.py::TestDeprecationWarningsByDefault::test_shown_by_default[False] PASSED [ 68%]
testing/test_warnings.py::TestDeprecationWarningsByDefault::test_hidden_by_ini PASSED [ 68%]
testing/test_warnings.py::TestDeprecationWarningsByDefault::test_hidden_by_mark PASSED [ 68%]
testing/test_warnings.py::TestDeprecationWarningsByDefault::test_hidden_by_cmdline PASSED [ 68%]
testing/test_warnings.py::TestDeprecationWarningsByDefault::test_hidden_by_system PASSED [ 68%]
testing/test_warnings.py::test_infinite_loop_warning_against_unicode_usage_py2 SKIPPED [ 68%]
testing/code/test_code.py::test_ne PASSED                                [ 68%]
testing/code/test_code.py::test_code_gives_back_name_for_not_existing_file PASSED [ 68%]
testing/code/test_code.py::test_code_with_class PASSED                   [ 68%]
testing/code/test_code.py::test_code_fullsource PASSED                   [ 68%]
testing/code/test_code.py::test_code_source PASSED                       [ 68%]
testing/code/test_code.py::test_frame_getsourcelineno_myself PASSED      [ 68%]
testing/code/test_code.py::test_getstatement_empty_fullsource PASSED     [ 68%]
testing/code/test_code.py::test_code_from_func PASSED                    [ 68%]
testing/code/test_code.py::test_unicode_handling PASSED                  [ 68%]
testing/code/test_code.py::test_unicode_handling_syntax_error SKIPPED    [ 68%]
testing/code/test_code.py::test_code_getargs PASSED                      [ 69%]
testing/code/test_code.py::test_frame_getargs PASSED                     [ 69%]
testing/code/test_code.py::TestExceptionInfo::test_bad_getsource PASSED  [ 69%]
testing/code/test_code.py::TestTracebackEntry::test_getsource PASSED     [ 69%]
testing/code/test_code.py::TestReprFuncArgs::test_not_raise_exception_with_mixed_encoding PASSED [ 69%]
testing/code/test_excinfo.py::test_excinfo_simple PASSED                 [ 69%]
testing/code/test_excinfo.py::test_excinfo_getstatement PASSED           [ 69%]
testing/code/test_excinfo.py::TestTraceback_f_g_h::test_traceback_entries PASSED [ 69%]
testing/code/test_excinfo.py::TestTraceback_f_g_h::test_traceback_entry_getsource PASSED [ 69%]
testing/code/test_excinfo.py::TestTraceback_f_g_h::test_traceback_entry_getsource_in_construct PASSED [ 69%]
testing/code/test_excinfo.py::TestTraceback_f_g_h::test_traceback_cut PASSED [ 69%]
testing/code/test_excinfo.py::TestTraceback_f_g_h::test_traceback_cut_excludepath PASSED [ 69%]
testing/code/test_excinfo.py::TestTraceback_f_g_h::test_traceback_filter PASSED [ 69%]
testing/code/test_excinfo.py::TestTraceback_f_g_h::test_traceback_filter_selective[<lambda>-True] PASSED [ 69%]
testing/code/test_excinfo.py::TestTraceback_f_g_h::test_traceback_filter_selective[<lambda>-False] PASSED [ 69%]
testing/code/test_excinfo.py::TestTraceback_f_g_h::test_traceback_filter_selective[tracebackhide2-True] PASSED [ 69%]
testing/code/test_excinfo.py::TestTraceback_f_g_h::test_traceback_filter_selective[tracebackhide3-False] PASSED [ 69%]
testing/code/test_excinfo.py::TestTraceback_f_g_h::test_traceback_recursion_index PASSED [ 69%]
testing/code/test_excinfo.py::TestTraceback_f_g_h::test_traceback_only_specific_recursion_errors PASSED [ 69%]
testing/code/test_excinfo.py::TestTraceback_f_g_h::test_traceback_no_recursion_index PASSED [ 69%]
testing/code/test_excinfo.py::TestTraceback_f_g_h::test_traceback_messy_recursion PASSED [ 69%]
testing/code/test_excinfo.py::TestTraceback_f_g_h::test_traceback_getcrashentry PASSED [ 69%]
testing/code/test_excinfo.py::TestTraceback_f_g_h::test_traceback_getcrashentry_empty PASSED [ 69%]
testing/code/test_excinfo.py::test_excinfo_exconly PASSED                [ 70%]
testing/code/test_excinfo.py::test_excinfo_repr PASSED                   [ 70%]
testing/code/test_excinfo.py::test_excinfo_str PASSED                    [ 70%]
testing/code/test_excinfo.py::test_excinfo_errisinstance PASSED          [ 70%]
testing/code/test_excinfo.py::test_excinfo_no_sourcecode PASSED          [ 70%]
testing/code/test_excinfo.py::test_excinfo_no_python_sourcecode PASSED   [ 70%]
testing/code/test_excinfo.py::test_entrysource_Queue_example PASSED      [ 70%]
testing/code/test_excinfo.py::test_codepath_Queue_example PASSED         [ 70%]
testing/code/test_excinfo.py::test_match_succeeds PASSED                 [ 70%]
testing/code/test_excinfo.py::test_match_raises_error PASSED             [ 70%]
testing/code/test_excinfo.py::TestFormattedExcinfo::test_repr_source PASSED [ 70%]
testing/code/test_excinfo.py::TestFormattedExcinfo::test_repr_source_excinfo PASSED [ 70%]
testing/code/test_excinfo.py::TestFormattedExcinfo::test_repr_source_not_existing PASSED [ 70%]
testing/code/test_excinfo.py::TestFormattedExcinfo::test_repr_many_line_source_not_existing PASSED [ 70%]
testing/code/test_excinfo.py::TestFormattedExcinfo::test_repr_source_failing_fullsource PASSED [ 70%]
testing/code/test_excinfo.py::TestFormattedExcinfo::test_repr_local PASSED [ 70%]
testing/code/test_excinfo.py::TestFormattedExcinfo::test_repr_local_truncated PASSED [ 70%]
testing/code/test_excinfo.py::TestFormattedExcinfo::test_repr_tracebackentry_lines PASSED [ 70%]
testing/code/test_excinfo.py::TestFormattedExcinfo::test_repr_tracebackentry_lines2 PASSED [ 70%]
testing/code/test_excinfo.py::TestFormattedExcinfo::test_repr_tracebackentry_lines_var_kw_args PASSED [ 70%]
testing/code/test_excinfo.py::TestFormattedExcinfo::test_repr_tracebackentry_short PASSED [ 70%]
testing/code/test_excinfo.py::TestFormattedExcinfo::test_repr_tracebackentry_no PASSED [ 70%]
testing/code/test_excinfo.py::TestFormattedExcinfo::test_repr_traceback_tbfilter PASSED [ 71%]
testing/code/test_excinfo.py::TestFormattedExcinfo::test_traceback_short_no_source PASSED [ 71%]
testing/code/test_excinfo.py::TestFormattedExcinfo::test_repr_traceback_and_excinfo PASSED [ 71%]
testing/code/test_excinfo.py::TestFormattedExcinfo::test_repr_traceback_with_invalid_cwd PASSED [ 71%]
testing/code/test_excinfo.py::TestFormattedExcinfo::test_repr_excinfo_addouterr PASSED [ 71%]
testing/code/test_excinfo.py::TestFormattedExcinfo::test_repr_excinfo_reprcrash PASSED [ 71%]
testing/code/test_excinfo.py::TestFormattedExcinfo::test_repr_traceback_recursion PASSED [ 71%]
testing/code/test_excinfo.py::TestFormattedExcinfo::test_reprexcinfo_getrepr PASSED [ 71%]
testing/code/test_excinfo.py::TestFormattedExcinfo::test_reprexcinfo_unicode PASSED [ 71%]
testing/code/test_excinfo.py::TestFormattedExcinfo::test_toterminal_long PASSED [ 71%]
testing/code/test_excinfo.py::TestFormattedExcinfo::test_toterminal_long_missing_source PASSED [ 71%]
testing/code/test_excinfo.py::TestFormattedExcinfo::test_toterminal_long_incomplete_source PASSED [ 71%]
testing/code/test_excinfo.py::TestFormattedExcinfo::test_toterminal_long_filenames PASSED [ 71%]
testing/code/test_excinfo.py::TestFormattedExcinfo::test_format_excinfo[reproptions0] PASSED [ 71%]
testing/code/test_excinfo.py::TestFormattedExcinfo::test_format_excinfo[reproptions1] PASSED [ 71%]
testing/code/test_excinfo.py::TestFormattedExcinfo::test_format_excinfo[reproptions2] PASSED [ 71%]
testing/code/test_excinfo.py::TestFormattedExcinfo::test_format_excinfo[reproptions3] PASSED [ 71%]
testing/code/test_excinfo.py::TestFormattedExcinfo::test_format_excinfo[reproptions4] PASSED [ 71%]
testing/code/test_excinfo.py::TestFormattedExcinfo::test_format_excinfo[reproptions5] PASSED [ 71%]
testing/code/test_excinfo.py::TestFormattedExcinfo::test_format_excinfo[reproptions6] PASSED [ 71%]
testing/code/test_excinfo.py::TestFormattedExcinfo::test_format_excinfo[reproptions7] PASSED [ 71%]
testing/code/test_excinfo.py::TestFormattedExcinfo::test_format_excinfo[reproptions8] PASSED [ 71%]
testing/code/test_excinfo.py::TestFormattedExcinfo::test_format_excinfo[reproptions9] PASSED [ 72%]
testing/code/test_excinfo.py::TestFormattedExcinfo::test_format_excinfo[reproptions10] PASSED [ 72%]
testing/code/test_excinfo.py::TestFormattedExcinfo::test_format_excinfo[reproptions11] PASSED [ 72%]
testing/code/test_excinfo.py::TestFormattedExcinfo::test_format_excinfo[reproptions12] PASSED [ 72%]
testing/code/test_excinfo.py::TestFormattedExcinfo::test_format_excinfo[reproptions13] PASSED [ 72%]
testing/code/test_excinfo.py::TestFormattedExcinfo::test_format_excinfo[reproptions14] PASSED [ 72%]
testing/code/test_excinfo.py::TestFormattedExcinfo::test_format_excinfo[reproptions15] PASSED [ 72%]
testing/code/test_excinfo.py::TestFormattedExcinfo::test_format_excinfo[reproptions16] PASSED [ 72%]
testing/code/test_excinfo.py::TestFormattedExcinfo::test_format_excinfo[reproptions17] PASSED [ 72%]
testing/code/test_excinfo.py::TestFormattedExcinfo::test_format_excinfo[reproptions18] PASSED [ 72%]
testing/code/test_excinfo.py::TestFormattedExcinfo::test_format_excinfo[reproptions19] PASSED [ 72%]
testing/code/test_excinfo.py::TestFormattedExcinfo::test_format_excinfo[reproptions20] PASSED [ 72%]
testing/code/test_excinfo.py::TestFormattedExcinfo::test_format_excinfo[reproptions21] PASSED [ 72%]
testing/code/test_excinfo.py::TestFormattedExcinfo::test_format_excinfo[reproptions22] PASSED [ 72%]
testing/code/test_excinfo.py::TestFormattedExcinfo::test_format_excinfo[reproptions23] PASSED [ 72%]
testing/code/test_excinfo.py::TestFormattedExcinfo::test_traceback_repr_style PASSED [ 72%]
testing/code/test_excinfo.py::TestFormattedExcinfo::test_exc_chain_repr PASSED [ 72%]
testing/code/test_excinfo.py::TestFormattedExcinfo::test_exc_repr_chain_suppression[from_none] PASSED [ 72%]
testing/code/test_excinfo.py::TestFormattedExcinfo::test_exc_repr_chain_suppression[explicit_suppress] PASSED [ 72%]
testing/code/test_excinfo.py::TestFormattedExcinfo::test_exc_chain_repr_without_traceback[cause-The above exception was the direct cause of the following exception:] PASSED [ 72%]
testing/code/test_excinfo.py::TestFormattedExcinfo::test_exc_chain_repr_without_traceback[context-During handling of the above exception, another exception occurred:] PASSED [ 72%]
testing/code/test_excinfo.py::TestFormattedExcinfo::test_exc_chain_repr_cycle PASSED [ 72%]
testing/code/test_excinfo.py::test_repr_traceback_with_unicode[None-short] PASSED [ 72%]
testing/code/test_excinfo.py::test_repr_traceback_with_unicode[None-long] PASSED [ 73%]
testing/code/test_excinfo.py::test_repr_traceback_with_unicode[utf8-short] PASSED [ 73%]
testing/code/test_excinfo.py::test_repr_traceback_with_unicode[utf8-long] PASSED [ 73%]
testing/code/test_excinfo.py::test_repr_traceback_with_unicode[utf16-short] PASSED [ 73%]
testing/code/test_excinfo.py::test_repr_traceback_with_unicode[utf16-long] PASSED [ 73%]
testing/code/test_excinfo.py::test_cwd_deleted PASSED                    [ 73%]
testing/code/test_excinfo.py::test_exception_repr_extraction_error_on_recursion PASSED [ 73%]
testing/code/test_excinfo.py::test_no_recursion_index_on_recursion_error PASSED [ 73%]
testing/code/test_source.py::test_source_str_function PASSED             [ 73%]
testing/code/test_source.py::test_unicode PASSED                         [ 73%]
testing/code/test_source.py::test_source_from_function PASSED            [ 73%]
testing/code/test_source.py::test_source_from_method PASSED              [ 73%]
testing/code/test_source.py::test_source_from_lines PASSED               [ 73%]
testing/code/test_source.py::test_source_from_inner_function PASSED      [ 73%]
testing/code/test_source.py::test_source_putaround_simple PASSED         [ 73%]
testing/code/test_source.py::test_source_putaround PASSED                [ 73%]
testing/code/test_source.py::test_source_strips PASSED                   [ 73%]
testing/code/test_source.py::test_source_strip_multiline PASSED          [ 73%]
testing/code/test_source.py::test_syntaxerror_rerepresentation PASSED    [ 73%]
testing/code/test_source.py::test_isparseable PASSED                     [ 73%]
testing/code/test_source.py::TestAccesses::test_getrange PASSED          [ 73%]
testing/code/test_source.py::TestAccesses::test_getline PASSED           [ 73%]
testing/code/test_source.py::TestAccesses::test_len PASSED               [ 74%]
testing/code/test_source.py::TestAccesses::test_iter PASSED              [ 74%]
testing/code/test_source.py::TestSourceParsingAndCompiling::test_compile PASSED [ 74%]
testing/code/test_source.py::TestSourceParsingAndCompiling::test_compile_and_getsource_simple PASSED [ 74%]
testing/code/test_source.py::TestSourceParsingAndCompiling::test_compile_and_getsource_through_same_function PASSED [ 74%]
testing/code/test_source.py::TestSourceParsingAndCompiling::test_getstatement PASSED [ 74%]
testing/code/test_source.py::TestSourceParsingAndCompiling::test_getstatementrange_triple_quoted PASSED [ 74%]
testing/code/test_source.py::TestSourceParsingAndCompiling::test_getstatementrange_within_constructs PASSED [ 74%]
testing/code/test_source.py::TestSourceParsingAndCompiling::test_getstatementrange_bug PASSED [ 74%]
testing/code/test_source.py::TestSourceParsingAndCompiling::test_getstatementrange_bug2 PASSED [ 74%]
testing/code/test_source.py::TestSourceParsingAndCompiling::test_getstatementrange_ast_issue58 PASSED [ 74%]
testing/code/test_source.py::TestSourceParsingAndCompiling::test_getstatementrange_out_of_bounds_py3 PASSED [ 74%]
testing/code/test_source.py::TestSourceParsingAndCompiling::test_getstatementrange_with_syntaxerror_issue7 PASSED [ 74%]
testing/code/test_source.py::TestSourceParsingAndCompiling::test_compile_to_ast PASSED [ 74%]
testing/code/test_source.py::TestSourceParsingAndCompiling::test_compile_and_getsource PASSED [ 74%]
testing/code/test_source.py::TestSourceParsingAndCompiling::test_compilefuncs_and_path_sanity[] PASSED [ 74%]
testing/code/test_source.py::TestSourceParsingAndCompiling::test_compilefuncs_and_path_sanity[None] PASSED [ 74%]
testing/code/test_source.py::TestSourceParsingAndCompiling::test_compilefuncs_and_path_sanity[my] PASSED [ 74%]
testing/code/test_source.py::TestSourceParsingAndCompiling::test_offsetless_synerr PASSED [ 74%]
testing/code/test_source.py::test_getstartingblock_singleline PASSED     [ 74%]
testing/code/test_source.py::test_getline_finally PASSED                 [ 74%]
testing/code/test_source.py::test_getfuncsource_dynamic PASSED           [ 74%]
testing/code/test_source.py::test_getfuncsource_with_multine_string PASSED [ 75%]
testing/code/test_source.py::test_deindent PASSED                        [ 75%]
testing/code/test_source.py::test_source_of_class_at_eof_without_newline PASSED [ 75%]
testing/code/test_source.py::test_getsource_fallback PASSED              [ 75%]
testing/code/test_source.py::test_idem_compile_and_getsource PASSED      [ 75%]
testing/code/test_source.py::test_findsource_fallback PASSED             [ 75%]
testing/code/test_source.py::test_findsource PASSED                      [ 75%]
testing/code/test_source.py::test_getfslineno PASSED                     [ 75%]
testing/code/test_source.py::test_code_of_object_instance_with_call PASSED [ 75%]
testing/code/test_source.py::test_oneline PASSED                         [ 75%]
testing/code/test_source.py::test_comment_and_no_newline_at_end PASSED   [ 75%]
testing/code/test_source.py::test_oneline_and_comment PASSED             [ 75%]
testing/code/test_source.py::test_comments PASSED                        [ 75%]
testing/code/test_source.py::test_comment_in_statement PASSED            [ 75%]
testing/code/test_source.py::test_single_line_else PASSED                [ 75%]
testing/code/test_source.py::test_single_line_finally PASSED             [ 75%]
testing/code/test_source.py::test_issue55 PASSED                         [ 75%]
testing/code/test_source.py::test_multiline PASSED                       [ 75%]
testing/code/test_source.py::TestTry::test_body PASSED                   [ 75%]
testing/code/test_source.py::TestTry::test_except_line PASSED            [ 75%]
testing/code/test_source.py::TestTry::test_except_body PASSED            [ 75%]
testing/code/test_source.py::TestTry::test_else PASSED                   [ 75%]
testing/code/test_source.py::TestTryFinally::test_body PASSED            [ 75%]
testing/code/test_source.py::TestTryFinally::test_finally PASSED         [ 76%]
testing/code/test_source.py::TestIf::test_body PASSED                    [ 76%]
testing/code/test_source.py::TestIf::test_elif_clause PASSED             [ 76%]
testing/code/test_source.py::TestIf::test_elif PASSED                    [ 76%]
testing/code/test_source.py::TestIf::test_else PASSED                    [ 76%]
testing/code/test_source.py::test_semicolon PASSED                       [ 76%]
testing/code/test_source.py::test_def_online PASSED                      [ 76%]
testing/code/test_source.py::test_getstartingblock_multiline PASSED      [ 76%]
testing/examples/test_issue519.py::test_510 PASSED                       [ 76%]
testing/freeze/tests/test_doctest.txt::test_doctest.txt PASSED           [ 76%]
testing/freeze/tests/test_trivial.py::test_upper PASSED                  [ 76%]
testing/freeze/tests/test_trivial.py::test_lower PASSED                  [ 76%]
testing/logging/test_fixture.py::test_fixture_help PASSED                [ 76%]
testing/logging/test_fixture.py::test_change_level PASSED                [ 76%]
testing/logging/test_fixture.py::test_change_level_undo PASSED           [ 76%]
testing/logging/test_fixture.py::test_with_statement PASSED              [ 76%]
testing/logging/test_fixture.py::test_log_access PASSED                  [ 76%]
testing/logging/test_fixture.py::test_messages PASSED                    [ 76%]
testing/logging/test_fixture.py::test_record_tuples PASSED               [ 76%]
testing/logging/test_fixture.py::test_unicode PASSED                     [ 76%]
testing/logging/test_fixture.py::test_clear PASSED                       [ 76%]
testing/logging/test_fixture.py::test_caplog_captures_for_all_stages PASSED [ 76%]
testing/logging/test_formatter.py::test_coloredlogformatter PASSED       [ 77%]
testing/logging/test_reporting.py::test_nothing_logged PASSED            [ 77%]
testing/logging/test_reporting.py::test_messages_logged PASSED           [ 77%]
testing/logging/test_reporting.py::test_root_logger_affected PASSED      [ 77%]
testing/logging/test_reporting.py::test_log_cli_level_log_level_interaction PASSED [ 77%]
testing/logging/test_reporting.py::test_setup_logging PASSED             [ 77%]
testing/logging/test_reporting.py::test_teardown_logging PASSED          [ 77%]
testing/logging/test_reporting.py::test_disable_log_capturing PASSED     [ 77%]
testing/logging/test_reporting.py::test_disable_log_capturing_ini PASSED [ 77%]
testing/logging/test_reporting.py::test_log_cli_enabled_disabled[True] PASSED [ 77%]
testing/logging/test_reporting.py::test_log_cli_enabled_disabled[False] PASSED [ 77%]
testing/logging/test_reporting.py::test_log_cli_default_level PASSED     [ 77%]
testing/logging/test_reporting.py::test_log_cli_default_level_multiple_tests PASSED [ 77%]
testing/logging/test_reporting.py::test_log_cli_default_level_sections PASSED [ 77%]
testing/logging/test_reporting.py::test_live_logs_unknown_sections PASSED [ 77%]
testing/logging/test_reporting.py::test_sections_single_new_line_after_test_outcome PASSED [ 77%]
testing/logging/test_reporting.py::test_log_cli_level PASSED             [ 77%]
testing/logging/test_reporting.py::test_log_cli_ini_level PASSED         [ 77%]
testing/logging/test_reporting.py::test_log_cli_auto_enable[] PASSED     [ 77%]
testing/logging/test_reporting.py::test_log_cli_auto_enable[--log-level=WARNING] PASSED [ 77%]
testing/logging/test_reporting.py::test_log_cli_auto_enable[--log-file-level=WARNING] PASSED [ 77%]
testing/logging/test_reporting.py::test_log_cli_auto_enable[--log-cli-level=WARNING] PASSED [ 77%]
testing/logging/test_reporting.py::test_log_file_cli PASSED              [ 77%]
testing/logging/test_reporting.py::test_log_file_cli_level PASSED        [ 78%]
testing/logging/test_reporting.py::test_log_level_not_changed_by_default PASSED [ 78%]
testing/logging/test_reporting.py::test_log_file_ini PASSED              [ 78%]
testing/logging/test_reporting.py::test_log_file_ini_level PASSED        [ 78%]
testing/logging/test_reporting.py::test_log_file_unicode PASSED          [ 78%]
testing/logging/test_reporting.py::test_live_logging_suspends_capture[True] PASSED [ 78%]
testing/logging/test_reporting.py::test_live_logging_suspends_capture[False] PASSED [ 78%]
testing/logging/test_reporting.py::test_collection_live_logging PASSED   [ 78%]
testing/logging/test_reporting.py::test_collection_logging_to_file PASSED [ 78%]
testing/logging/test_reporting.py::test_log_in_hooks PASSED              [ 78%]
testing/python/approx.py::TestApprox::test_repr_string PASSED            [ 78%]
testing/python/approx.py::TestApprox::test_repr_nd_array[5.0-approx(5.0 {pm} 5.0e-06)] PASSED [ 78%]
testing/python/approx.py::TestApprox::test_repr_nd_array[value1-approx([5.0 {pm} 5.0e-06])] PASSED [ 78%]
testing/python/approx.py::TestApprox::test_repr_nd_array[value2-approx([[5.0 {pm} 5.0e-06]])] PASSED [ 78%]
testing/python/approx.py::TestApprox::test_repr_nd_array[value3-approx([[5.0 {pm} 5.0e-06, 6.0 {pm} 6.0e-06]])] PASSED [ 78%]
testing/python/approx.py::TestApprox::test_repr_nd_array[value4-approx([[5.0 {pm} 5.0e-06], [6.0 {pm} 6.0e-06]])] PASSED [ 78%]
testing/python/approx.py::TestApprox::test_operator_overloading PASSED   [ 78%]
testing/python/approx.py::TestApprox::test_exactly_equal PASSED          [ 78%]
testing/python/approx.py::TestApprox::test_opposite_sign PASSED          [ 78%]
testing/python/approx.py::TestApprox::test_zero_tolerance PASSED         [ 78%]
testing/python/approx.py::TestApprox::test_negative_tolerance PASSED     [ 78%]
testing/python/approx.py::TestApprox::test_inf_tolerance PASSED          [ 78%]
testing/python/approx.py::TestApprox::test_inf_tolerance_expecting_zero PASSED [ 79%]
testing/python/approx.py::TestApprox::test_nan_tolerance PASSED          [ 79%]
testing/python/approx.py::TestApprox::test_reasonable_defaults PASSED    [ 79%]
testing/python/approx.py::TestApprox::test_default_tolerances PASSED     [ 79%]
testing/python/approx.py::TestApprox::test_custom_tolerances PASSED      [ 79%]
testing/python/approx.py::TestApprox::test_relative_tolerance PASSED     [ 79%]
testing/python/approx.py::TestApprox::test_absolute_tolerance PASSED     [ 79%]
testing/python/approx.py::TestApprox::test_expecting_zero PASSED         [ 79%]
testing/python/approx.py::TestApprox::test_expecting_inf PASSED          [ 79%]
testing/python/approx.py::TestApprox::test_expecting_nan PASSED          [ 79%]
testing/python/approx.py::TestApprox::test_int PASSED                    [ 79%]
testing/python/approx.py::TestApprox::test_decimal PASSED                [ 79%]
testing/python/approx.py::TestApprox::test_fraction PASSED               [ 79%]
testing/python/approx.py::TestApprox::test_complex PASSED                [ 79%]
testing/python/approx.py::TestApprox::test_list PASSED                   [ 79%]
testing/python/approx.py::TestApprox::test_list_wrong_len PASSED         [ 79%]
testing/python/approx.py::TestApprox::test_tuple PASSED                  [ 79%]
testing/python/approx.py::TestApprox::test_tuple_wrong_len PASSED        [ 79%]
testing/python/approx.py::TestApprox::test_dict PASSED                   [ 79%]
testing/python/approx.py::TestApprox::test_dict_wrong_len PASSED         [ 79%]
testing/python/approx.py::TestApprox::test_numpy_array PASSED            [ 79%]
testing/python/approx.py::TestApprox::test_numpy_tolerance_args PASSED   [ 79%]
testing/python/approx.py::TestApprox::test_numpy_expecting_nan PASSED    [ 80%]
testing/python/approx.py::TestApprox::test_numpy_expecting_inf PASSED    [ 80%]
testing/python/approx.py::TestApprox::test_numpy_array_wrong_shape PASSED [ 80%]
testing/python/approx.py::TestApprox::test_doctests PASSED               [ 80%]
testing/python/approx.py::TestApprox::test_unicode_plus_minus PASSED     [ 80%]
testing/python/approx.py::TestApprox::test_expected_value_type_error[None] PASSED [ 80%]
testing/python/approx.py::TestApprox::test_expected_value_type_error[string] PASSED [ 80%]
testing/python/approx.py::TestApprox::test_expected_value_type_error[nested-str] PASSED [ 80%]
testing/python/approx.py::TestApprox::test_expected_value_type_error[nested-list] PASSED [ 80%]
testing/python/approx.py::TestApprox::test_expected_value_type_error[dict-with-string] PASSED [ 80%]
testing/python/approx.py::TestApprox::test_expected_value_type_error[nested-dict] PASSED [ 80%]
testing/python/approx.py::TestApprox::test_comparison_operator_type_error[<=] PASSED [ 80%]
testing/python/approx.py::TestApprox::test_comparison_operator_type_error[<] PASSED [ 80%]
testing/python/approx.py::TestApprox::test_comparison_operator_type_error[>=] PASSED [ 80%]
testing/python/approx.py::TestApprox::test_comparison_operator_type_error[>] PASSED [ 80%]
testing/python/approx.py::TestApprox::test_numpy_array_with_scalar PASSED [ 80%]
testing/python/approx.py::TestApprox::test_numpy_scalar_with_array PASSED [ 80%]
testing/python/collect.py::TestModule::test_failing_import PASSED        [ 80%]
testing/python/collect.py::TestModule::test_import_duplicate PASSED      [ 80%]
testing/python/collect.py::TestModule::test_import_prepend_append PASSED [ 80%]
testing/python/collect.py::TestModule::test_syntax_error_in_module PASSED [ 80%]
testing/python/collect.py::TestModule::test_module_considers_pluginmanager_at_import PASSED [ 80%]
testing/python/collect.py::TestModule::test_invalid_test_module_name PASSED [ 80%]
testing/python/collect.py::TestModule::test_show_traceback_import_error[0] PASSED [ 81%]
testing/python/collect.py::TestModule::test_show_traceback_import_error[1] PASSED [ 81%]
testing/python/collect.py::TestModule::test_show_traceback_import_error[2] PASSED [ 81%]
testing/python/collect.py::TestModule::test_show_traceback_import_error_unicode PASSED [ 81%]
testing/python/collect.py::TestClass::test_class_with_init_warning PASSED [ 81%]
testing/python/collect.py::TestClass::test_class_subclassobject PASSED   [ 81%]
testing/python/collect.py::TestClass::test_static_method PASSED          [ 81%]
testing/python/collect.py::TestClass::test_setup_teardown_class_as_classmethod PASSED [ 81%]
testing/python/collect.py::TestClass::test_issue1035_obj_has_getattr PASSED [ 81%]
testing/python/collect.py::TestClass::test_issue1579_namedtuple PASSED   [ 81%]
testing/python/collect.py::TestClass::test_issue2234_property PASSED     [ 81%]
testing/python/collect.py::TestGenerator::test_generative_functions PASSED [ 81%]
testing/python/collect.py::TestGenerator::test_generative_methods PASSED [ 81%]
testing/python/collect.py::TestGenerator::test_generative_functions_with_explicit_names PASSED [ 81%]
testing/python/collect.py::TestGenerator::test_generative_functions_unique_explicit_names PASSED [ 81%]
testing/python/collect.py::TestGenerator::test_generative_methods_with_explicit_names PASSED [ 81%]
testing/python/collect.py::TestGenerator::test_order_of_execution_generator_same_codeline PASSED [ 81%]
testing/python/collect.py::TestGenerator::test_order_of_execution_generator_different_codeline PASSED [ 81%]
testing/python/collect.py::TestGenerator::test_setupstate_is_preserved_134 PASSED [ 81%]
testing/python/collect.py::TestFunction::test_getmodulecollector PASSED  [ 81%]
testing/python/collect.py::TestFunction::test_function_as_object_instance_ignored PASSED [ 81%]
testing/python/collect.py::TestFunction::test_function_equality PASSED   [ 81%]
testing/python/collect.py::TestFunction::test_issue197_parametrize_emptyset PASSED [ 82%]
testing/python/collect.py::TestFunction::test_single_tuple_unwraps_values PASSED [ 82%]
testing/python/collect.py::TestFunction::test_issue213_parametrize_value_no_equal PASSED [ 82%]
testing/python/collect.py::TestFunction::test_parametrize_with_non_hashable_values PASSED [ 82%]
testing/python/collect.py::TestFunction::test_parametrize_with_non_hashable_values_indirect PASSED [ 82%]
testing/python/collect.py::TestFunction::test_parametrize_overrides_fixture PASSED [ 82%]
testing/python/collect.py::TestFunction::test_parametrize_overrides_parametrized_fixture PASSED [ 82%]
testing/python/collect.py::TestFunction::test_parametrize_overrides_indirect_dependency_fixture PASSED [ 82%]
testing/python/collect.py::TestFunction::test_parametrize_with_mark PASSED [ 82%]
testing/python/collect.py::TestFunction::test_function_equality_with_callspec PASSED [ 82%]
testing/python/collect.py::TestFunction::test_pyfunc_call PASSED         [ 82%]
testing/python/collect.py::TestFunction::test_multiple_parametrize PASSED [ 82%]
testing/python/collect.py::TestFunction::test_issue751_multiple_parametrize_with_ids PASSED [ 82%]
testing/python/collect.py::TestFunction::test_parametrize_skipif PASSED  [ 82%]
testing/python/collect.py::TestFunction::test_parametrize_skip PASSED    [ 82%]
testing/python/collect.py::TestFunction::test_parametrize_skipif_no_skip PASSED [ 82%]
testing/python/collect.py::TestFunction::test_parametrize_xfail PASSED   [ 82%]
testing/python/collect.py::TestFunction::test_parametrize_passed PASSED  [ 82%]
testing/python/collect.py::TestFunction::test_parametrize_xfail_passed PASSED [ 82%]
testing/python/collect.py::TestFunction::test_function_original_name PASSED [ 82%]
testing/python/collect.py::TestSorting::test_check_equality PASSED       [ 82%]
testing/python/collect.py::TestSorting::test_allow_sane_sorting_for_decorators PASSED [ 82%]
testing/python/collect.py::TestConftestCustomization::test_pytest_pycollect_module PASSED [ 83%]
testing/python/collect.py::TestConftestCustomization::test_customized_pymakemodule_issue205_subdir PASSED [ 83%]
testing/python/collect.py::TestConftestCustomization::test_customized_pymakeitem PASSED [ 83%]
testing/python/collect.py::TestConftestCustomization::test_pytest_pycollect_makeitem PASSED [ 83%]
testing/python/collect.py::TestConftestCustomization::test_makeitem_non_underscore PASSED [ 83%]
testing/python/collect.py::TestConftestCustomization::test_issue2369_collect_module_fileext PASSED [ 83%]
testing/python/collect.py::test_setup_only_available_in_subdir PASSED    [ 83%]
testing/python/collect.py::test_modulecol_roundtrip PASSED               [ 83%]
testing/python/collect.py::TestTracebackCutting::test_skip_simple PASSED [ 83%]
testing/python/collect.py::TestTracebackCutting::test_traceback_argsetup PASSED [ 83%]
testing/python/collect.py::TestTracebackCutting::test_traceback_error_during_import PASSED [ 83%]
testing/python/collect.py::TestTracebackCutting::test_traceback_filter_error_during_fixture_collection PASSED [ 83%]
testing/python/collect.py::TestTracebackCutting::test_filter_traceback_generated_code PASSED [ 83%]
testing/python/collect.py::TestTracebackCutting::test_filter_traceback_path_no_longer_valid PASSED [ 83%]
testing/python/collect.py::TestReportInfo::test_itemreport_reportinfo PASSED [ 83%]
testing/python/collect.py::TestReportInfo::test_func_reportinfo PASSED   [ 83%]
testing/python/collect.py::TestReportInfo::test_class_reportinfo PASSED  [ 83%]
testing/python/collect.py::TestReportInfo::test_generator_reportinfo PASSED [ 83%]
testing/python/collect.py::TestReportInfo::test_reportinfo_with_nasty_getattr PASSED [ 83%]
testing/python/collect.py::test_customized_python_discovery PASSED       [ 83%]
testing/python/collect.py::test_customized_python_discovery_functions PASSED [ 83%]
testing/python/collect.py::test_collector_attributes PASSED              [ 83%]
testing/python/collect.py::test_customize_through_attributes PASSED      [ 83%]
testing/python/collect.py::test_unorderable_types PASSED                 [ 84%]
testing/python/collect.py::test_collect_functools_partial PASSED         [ 84%]
testing/python/collect.py::test_dont_collect_non_function_callable PASSED [ 84%]
testing/python/collect.py::test_class_injection_does_not_break_collection PASSED [ 84%]
testing/python/collect.py::test_syntax_error_with_non_ascii_chars PASSED [ 84%]
testing/python/collect.py::test_skip_duplicates_by_default PASSED        [ 84%]
testing/python/collect.py::test_keep_duplicates PASSED                   [ 84%]
testing/python/collect.py::test_package_collection_infinite_recursion PASSED [ 84%]
testing/python/collect.py::test_package_collection_init_given_as_argument PASSED [ 84%]
testing/python/collect.py::test_package_with_modules PASSED              [ 84%]
testing/python/collect.py::test_package_ordering PASSED                  [ 84%]
testing/python/fixture.py::test_getfuncargnames PASSED                   [ 84%]
testing/python/fixture.py::TestFillFixtures::test_fillfuncargs_exposed PASSED [ 84%]
testing/python/fixture.py::TestFillFixtures::test_funcarg_lookupfails PASSED [ 84%]
testing/python/fixture.py::TestFillFixtures::test_detect_recursive_dependency_error PASSED [ 84%]
testing/python/fixture.py::TestFillFixtures::test_funcarg_basic PASSED   [ 84%]
testing/python/fixture.py::TestFillFixtures::test_funcarg_lookup_modulelevel PASSED [ 84%]
testing/python/fixture.py::TestFillFixtures::test_funcarg_lookup_classlevel PASSED [ 84%]
testing/python/fixture.py::TestFillFixtures::test_conftest_funcargs_only_available_in_subdir PASSED [ 84%]
testing/python/fixture.py::TestFillFixtures::test_extend_fixture_module_class PASSED [ 84%]
testing/python/fixture.py::TestFillFixtures::test_extend_fixture_conftest_module PASSED [ 84%]
testing/python/fixture.py::TestFillFixtures::test_extend_fixture_conftest_conftest PASSED [ 84%]
testing/python/fixture.py::TestFillFixtures::test_extend_fixture_conftest_plugin PASSED [ 85%]
testing/python/fixture.py::TestFillFixtures::test_extend_fixture_plugin_plugin PASSED [ 85%]
testing/python/fixture.py::TestFillFixtures::test_override_parametrized_fixture_conftest_module PASSED [ 85%]
testing/python/fixture.py::TestFillFixtures::test_override_parametrized_fixture_conftest_conftest PASSED [ 85%]
testing/python/fixture.py::TestFillFixtures::test_override_non_parametrized_fixture_conftest_module PASSED [ 85%]
testing/python/fixture.py::TestFillFixtures::test_override_non_parametrized_fixture_conftest_conftest PASSED [ 85%]
testing/python/fixture.py::TestFillFixtures::test_override_autouse_fixture_with_parametrized_fixture_conftest_conftest PASSED [ 85%]
testing/python/fixture.py::TestFillFixtures::test_autouse_fixture_plugin PASSED [ 85%]
testing/python/fixture.py::TestFillFixtures::test_funcarg_lookup_error PASSED [ 85%]
testing/python/fixture.py::TestFillFixtures::test_fixture_excinfo_leak PASSED [ 85%]
testing/python/fixture.py::TestRequestBasic::test_request_attributes PASSED [ 85%]
testing/python/fixture.py::TestRequestBasic::test_request_attributes_method PASSED [ 85%]
testing/python/fixture.py::TestRequestBasic::test_request_contains_funcarg_arg2fixturedefs PASSED [ 85%]
testing/python/fixture.py::TestRequestBasic::test_request_garbage FAILED [ 85%]
testing/python/fixture.py::TestRequestBasic::test_getfixturevalue_recursive PASSED [ 85%]
testing/python/fixture.py::TestRequestBasic::test_getfixturevalue[getfixturevalue] PASSED [ 85%]
testing/python/fixture.py::TestRequestBasic::test_getfixturevalue[getfuncargvalue] PASSED [ 85%]
testing/python/fixture.py::TestRequestBasic::test_request_addfinalizer PASSED [ 85%]
testing/python/fixture.py::TestRequestBasic::test_mark_as_fixture_with_prefix_and_decorator_fails PASSED [ 85%]
testing/python/fixture.py::TestRequestBasic::test_request_addfinalizer_failing_setup PASSED [ 85%]
testing/python/fixture.py::TestRequestBasic::test_request_addfinalizer_failing_setup_module PASSED [ 85%]
testing/python/fixture.py::TestRequestBasic::test_request_addfinalizer_partial_setup_failure PASSED [ 85%]
testing/python/fixture.py::TestRequestBasic::test_request_subrequest_addfinalizer_exceptions PASSED [ 86%]
testing/python/fixture.py::TestRequestBasic::test_request_getmodulepath PASSED [ 86%]
testing/python/fixture.py::TestRequestBasic::test_request_fixturenames PASSED [ 86%]
testing/python/fixture.py::TestRequestBasic::test_request_fixturenames_dynamic_fixture PASSED [ 86%]
testing/python/fixture.py::TestRequestBasic::test_funcargnames_compatattr PASSED [ 86%]
testing/python/fixture.py::TestRequestBasic::test_setupdecorator_and_xunit PASSED [ 86%]
testing/python/fixture.py::TestRequestBasic::test_fixtures_sub_subdir_normalize_sep PASSED [ 86%]
testing/python/fixture.py::TestRequestBasic::test_show_fixtures_color_yes PASSED [ 86%]
testing/python/fixture.py::TestRequestBasic::test_newstyle_with_request PASSED [ 86%]
testing/python/fixture.py::TestRequestBasic::test_setupcontext_no_param PASSED [ 86%]
testing/python/fixture.py::TestRequestMarking::test_applymarker PASSED   [ 86%]
testing/python/fixture.py::TestRequestMarking::test_accesskeywords PASSED [ 86%]
testing/python/fixture.py::TestRequestMarking::test_accessmarker_dynamic PASSED [ 86%]
testing/python/fixture.py::TestRequestCachedSetup::test_request_cachedsetup_defaultmodule PASSED [ 86%]
testing/python/fixture.py::TestRequestCachedSetup::test_request_cachedsetup_class PASSED [ 86%]
testing/python/fixture.py::TestRequestCachedSetup::test_request_cachedsetup_extrakey PASSED [ 86%]
testing/python/fixture.py::TestRequestCachedSetup::test_request_cachedsetup_cache_deletion PASSED [ 86%]
testing/python/fixture.py::TestRequestCachedSetup::test_request_cached_setup_two_args PASSED [ 86%]
testing/python/fixture.py::TestRequestCachedSetup::test_request_cached_setup_getfixturevalue PASSED [ 86%]
testing/python/fixture.py::TestRequestCachedSetup::test_request_cached_setup_functional PASSED [ 86%]
testing/python/fixture.py::TestRequestCachedSetup::test_issue117_sessionscopeteardown PASSED [ 86%]
testing/python/fixture.py::TestFixtureUsages::test_noargfixturedec PASSED [ 86%]
testing/python/fixture.py::TestFixtureUsages::test_receives_funcargs PASSED [ 86%]
testing/python/fixture.py::TestFixtureUsages::test_receives_funcargs_scope_mismatch PASSED [ 87%]
testing/python/fixture.py::TestFixtureUsages::test_receives_funcargs_scope_mismatch_issue660 PASSED [ 87%]
testing/python/fixture.py::TestFixtureUsages::test_invalid_scope PASSED  [ 87%]
testing/python/fixture.py::TestFixtureUsages::test_funcarg_parametrized_and_used_twice PASSED [ 87%]
testing/python/fixture.py::TestFixtureUsages::test_factory_uses_unknown_funcarg_as_dependency_error PASSED [ 87%]
testing/python/fixture.py::TestFixtureUsages::test_factory_setup_as_classes_fails PASSED [ 87%]
testing/python/fixture.py::TestFixtureUsages::test_request_can_be_overridden PASSED [ 87%]
testing/python/fixture.py::TestFixtureUsages::test_usefixtures_marker PASSED [ 87%]
testing/python/fixture.py::TestFixtureUsages::test_usefixtures_ini PASSED [ 87%]
testing/python/fixture.py::TestFixtureUsages::test_usefixtures_seen_in_showmarkers PASSED [ 87%]
testing/python/fixture.py::TestFixtureUsages::test_request_instance_issue203 PASSED [ 87%]
testing/python/fixture.py::TestFixtureUsages::test_fixture_parametrized_with_iterator PASSED [ 87%]
testing/python/fixture.py::TestFixtureManagerParseFactories::test_parsefactories_evil_objects_issue214 PASSED [ 87%]
testing/python/fixture.py::TestFixtureManagerParseFactories::test_parsefactories_conftest PASSED [ 87%]
testing/python/fixture.py::TestFixtureManagerParseFactories::test_parsefactories_conftest_and_module_and_class PASSED [ 87%]
testing/python/fixture.py::TestFixtureManagerParseFactories::test_parsefactories_relative_node_ids PASSED [ 87%]
testing/python/fixture.py::TestFixtureManagerParseFactories::test_package_xunit_fixture PASSED [ 87%]
testing/python/fixture.py::TestFixtureManagerParseFactories::test_package_fixture_complex PASSED [ 87%]
testing/python/fixture.py::TestFixtureManagerParseFactories::test_collect_custom_items PASSED [ 87%]
testing/python/fixture.py::TestAutouseDiscovery::test_parsefactories_conftest PASSED [ 87%]
testing/python/fixture.py::TestAutouseDiscovery::test_two_classes_separated_autouse PASSED [ 87%]
testing/python/fixture.py::TestAutouseDiscovery::test_setup_at_classlevel PASSED [ 87%]
testing/python/fixture.py::TestAutouseDiscovery::test_setup_enabled_functionnode xfail [ 88%]
testing/python/fixture.py::TestAutouseDiscovery::test_callables_nocode PASSED [ 88%]
testing/python/fixture.py::TestAutouseDiscovery::test_autouse_in_conftests PASSED [ 88%]
testing/python/fixture.py::TestAutouseDiscovery::test_autouse_in_module_and_two_classes PASSED [ 88%]
testing/python/fixture.py::TestAutouseManagement::test_autouse_conftest_mid_directory PASSED [ 88%]
testing/python/fixture.py::TestAutouseManagement::test_autouse_honored_for_yield PASSED [ 88%]
testing/python/fixture.py::TestAutouseManagement::test_funcarg_and_setup PASSED [ 88%]
testing/python/fixture.py::TestAutouseManagement::test_uses_parametrized_resource PASSED [ 88%]
testing/python/fixture.py::TestAutouseManagement::test_session_parametrized_function PASSED [ 88%]
testing/python/fixture.py::TestAutouseManagement::test_class_function_parametrization_finalization PASSED [ 88%]
testing/python/fixture.py::TestAutouseManagement::test_scope_ordering PASSED [ 88%]
testing/python/fixture.py::TestAutouseManagement::test_parametrization_setup_teardown_ordering PASSED [ 88%]
testing/python/fixture.py::TestAutouseManagement::test_ordering_autouse_before_explicit PASSED [ 88%]
testing/python/fixture.py::TestAutouseManagement::test_ordering_dependencies_torndown_first[p10-p00] PASSED [ 88%]
testing/python/fixture.py::TestAutouseManagement::test_ordering_dependencies_torndown_first[p10-p01] PASSED [ 88%]
testing/python/fixture.py::TestAutouseManagement::test_ordering_dependencies_torndown_first[p11-p00] PASSED [ 88%]
testing/python/fixture.py::TestAutouseManagement::test_ordering_dependencies_torndown_first[p11-p01] PASSED [ 88%]
testing/python/fixture.py::TestFixtureMarker::test_parametrize PASSED    [ 88%]
testing/python/fixture.py::TestFixtureMarker::test_multiple_parametrization_issue_736 PASSED [ 88%]
testing/python/fixture.py::TestFixtureMarker::test_override_parametrized_fixture_issue_979['fixt, val'] PASSED [ 88%]
testing/python/fixture.py::TestFixtureMarker::test_override_parametrized_fixture_issue_979['fixt,val'] PASSED [ 88%]
testing/python/fixture.py::TestFixtureMarker::test_override_parametrized_fixture_issue_979[['fixt', 'val']] PASSED [ 88%]
testing/python/fixture.py::TestFixtureMarker::test_override_parametrized_fixture_issue_979[('fixt', 'val')] PASSED [ 88%]
testing/python/fixture.py::TestFixtureMarker::test_scope_session PASSED  [ 89%]
testing/python/fixture.py::TestFixtureMarker::test_scope_session_exc PASSED [ 89%]
testing/python/fixture.py::TestFixtureMarker::test_scope_session_exc_two_fix PASSED [ 89%]
testing/python/fixture.py::TestFixtureMarker::test_scope_exc PASSED      [ 89%]
testing/python/fixture.py::TestFixtureMarker::test_scope_module_uses_session PASSED [ 89%]
testing/python/fixture.py::TestFixtureMarker::test_scope_module_and_finalizer PASSED [ 89%]
testing/python/fixture.py::TestFixtureMarker::test_scope_mismatch_various[getfixturevalue] PASSED [ 89%]
testing/python/fixture.py::TestFixtureMarker::test_scope_mismatch_various[cached_setup] PASSED [ 89%]
testing/python/fixture.py::TestFixtureMarker::test_register_only_with_mark PASSED [ 89%]
testing/python/fixture.py::TestFixtureMarker::test_parametrize_and_scope PASSED [ 89%]
testing/python/fixture.py::TestFixtureMarker::test_scope_mismatch PASSED [ 89%]
testing/python/fixture.py::TestFixtureMarker::test_parametrize_separated_order PASSED [ 89%]
testing/python/fixture.py::TestFixtureMarker::test_module_parametrized_ordering PASSED [ 89%]
testing/python/fixture.py::TestFixtureMarker::test_dynamic_parametrized_ordering PASSED [ 89%]
testing/python/fixture.py::TestFixtureMarker::test_class_ordering PASSED [ 89%]
testing/python/fixture.py::TestFixtureMarker::test_parametrize_separated_order_higher_scope_first PASSED [ 89%]
testing/python/fixture.py::TestFixtureMarker::test_parametrized_fixture_teardown_order PASSED [ 89%]
testing/python/fixture.py::TestFixtureMarker::test_fixture_finalizer PASSED [ 89%]
testing/python/fixture.py::TestFixtureMarker::test_class_scope_with_normal_tests PASSED [ 89%]
testing/python/fixture.py::TestFixtureMarker::test_request_is_clean PASSED [ 89%]
testing/python/fixture.py::TestFixtureMarker::test_parametrize_separated_lifecycle PASSED [ 89%]
testing/python/fixture.py::TestFixtureMarker::test_parametrize_function_scoped_finalizers_called PASSED [ 89%]
testing/python/fixture.py::TestFixtureMarker::test_finalizer_order_on_parametrization[session] PASSED [ 90%]
testing/python/fixture.py::TestFixtureMarker::test_finalizer_order_on_parametrization[function] PASSED [ 90%]
testing/python/fixture.py::TestFixtureMarker::test_finalizer_order_on_parametrization[module] PASSED [ 90%]
testing/python/fixture.py::TestFixtureMarker::test_class_scope_parametrization_ordering PASSED [ 90%]
testing/python/fixture.py::TestFixtureMarker::test_parametrize_setup_function PASSED [ 90%]
testing/python/fixture.py::TestFixtureMarker::test_fixture_marked_function_not_collected_as_test PASSED [ 90%]
testing/python/fixture.py::TestFixtureMarker::test_params_and_ids PASSED [ 90%]
testing/python/fixture.py::TestFixtureMarker::test_params_and_ids_yieldfixture PASSED [ 90%]
testing/python/fixture.py::TestFixtureMarker::test_deterministic_fixture_collection PASSED [ 90%]
testing/python/fixture.py::TestRequestScopeAccess::test_setup[session--fspath class function module] PASSED [ 90%]
testing/python/fixture.py::TestRequestScopeAccess::test_setup[module-module fspath-cls function] PASSED [ 90%]
testing/python/fixture.py::TestRequestScopeAccess::test_setup[class-module fspath cls-function] PASSED [ 90%]
testing/python/fixture.py::TestRequestScopeAccess::test_setup[function-module fspath cls function-] PASSED [ 90%]
testing/python/fixture.py::TestRequestScopeAccess::test_funcarg[session--fspath class function module] PASSED [ 90%]
testing/python/fixture.py::TestRequestScopeAccess::test_funcarg[module-module fspath-cls function] PASSED [ 90%]
testing/python/fixture.py::TestRequestScopeAccess::test_funcarg[class-module fspath cls-function] PASSED [ 90%]
testing/python/fixture.py::TestRequestScopeAccess::test_funcarg[function-module fspath cls function-] PASSED [ 90%]
testing/python/fixture.py::TestErrors::test_subfactory_missing_funcarg PASSED [ 90%]
testing/python/fixture.py::TestErrors::test_issue498_fixture_finalizer_failing PASSED [ 90%]
testing/python/fixture.py::TestErrors::test_setupfunc_missing_funcarg PASSED [ 90%]
testing/python/fixture.py::TestShowFixtures::test_funcarg_compat PASSED  [ 90%]
testing/python/fixture.py::TestShowFixtures::test_show_fixtures PASSED   [ 90%]
testing/python/fixture.py::TestShowFixtures::test_show_fixtures_verbose PASSED [ 91%]
testing/python/fixture.py::TestShowFixtures::test_show_fixtures_testmodule PASSED [ 91%]
testing/python/fixture.py::TestShowFixtures::test_show_fixtures_conftest[True] PASSED [ 91%]
testing/python/fixture.py::TestShowFixtures::test_show_fixtures_conftest[False] PASSED [ 91%]
testing/python/fixture.py::TestShowFixtures::test_show_fixtures_trimmed_doc PASSED [ 91%]
testing/python/fixture.py::TestShowFixtures::test_show_fixtures_indented_doc PASSED [ 91%]
testing/python/fixture.py::TestShowFixtures::test_show_fixtures_indented_doc_first_line_unindented PASSED [ 91%]
testing/python/fixture.py::TestShowFixtures::test_show_fixtures_indented_in_class PASSED [ 91%]
testing/python/fixture.py::TestShowFixtures::test_show_fixtures_different_files PASSED [ 91%]
testing/python/fixture.py::TestShowFixtures::test_show_fixtures_with_same_name PASSED [ 91%]
testing/python/fixture.py::TestShowFixtures::test_fixture_disallow_twice PASSED [ 91%]
testing/python/fixture.py::TestContextManagerFixtureFuncs::test_simple[fixture] PASSED [ 91%]
testing/python/fixture.py::TestContextManagerFixtureFuncs::test_simple[yield_fixture] PASSED [ 91%]
testing/python/fixture.py::TestContextManagerFixtureFuncs::test_scoped[fixture] PASSED [ 91%]
testing/python/fixture.py::TestContextManagerFixtureFuncs::test_scoped[yield_fixture] PASSED [ 91%]
testing/python/fixture.py::TestContextManagerFixtureFuncs::test_setup_exception[fixture] PASSED [ 91%]
testing/python/fixture.py::TestContextManagerFixtureFuncs::test_setup_exception[yield_fixture] PASSED [ 91%]
testing/python/fixture.py::TestContextManagerFixtureFuncs::test_teardown_exception[fixture] PASSED [ 91%]
testing/python/fixture.py::TestContextManagerFixtureFuncs::test_teardown_exception[yield_fixture] PASSED [ 91%]
testing/python/fixture.py::TestContextManagerFixtureFuncs::test_yields_more_than_one[fixture] PASSED [ 91%]
testing/python/fixture.py::TestContextManagerFixtureFuncs::test_yields_more_than_one[yield_fixture] PASSED [ 91%]
testing/python/fixture.py::TestContextManagerFixtureFuncs::test_custom_name[fixture] PASSED [ 91%]
testing/python/fixture.py::TestContextManagerFixtureFuncs::test_custom_name[yield_fixture] PASSED [ 91%]
testing/python/fixture.py::TestParameterizedSubRequest::test_call_from_fixture PASSED [ 92%]
testing/python/fixture.py::TestParameterizedSubRequest::test_call_from_test PASSED [ 92%]
testing/python/fixture.py::TestParameterizedSubRequest::test_external_fixture PASSED [ 92%]
testing/python/fixture.py::TestParameterizedSubRequest::test_non_relative_path PASSED [ 92%]
testing/python/fixture.py::test_pytest_fixture_setup_and_post_finalizer_hook PASSED [ 92%]
testing/python/fixture.py::TestScopeOrdering::test_func_closure_module_auto[mark] PASSED [ 92%]
testing/python/fixture.py::TestScopeOrdering::test_func_closure_module_auto[autouse] PASSED [ 92%]
testing/python/fixture.py::TestScopeOrdering::test_func_closure_with_native_fixtures PASSED [ 92%]
testing/python/fixture.py::TestScopeOrdering::test_func_closure_module PASSED [ 92%]
testing/python/fixture.py::TestScopeOrdering::test_func_closure_scopes_reordered PASSED [ 92%]
testing/python/fixture.py::TestScopeOrdering::test_func_closure_same_scope_closer_root_first PASSED [ 92%]
testing/python/fixture.py::TestScopeOrdering::test_func_closure_all_scopes_complex PASSED [ 92%]
testing/python/fixture.py::TestScopeOrdering::test_multiple_packages PASSED [ 92%]
testing/python/integration.py::TestOEJSKITSpecials::test_funcarg_non_pycollectobj PASSED [ 92%]
testing/python/integration.py::TestOEJSKITSpecials::test_autouse_fixture PASSED [ 92%]
testing/python/integration.py::test_wrapped_getfslineno PASSED           [ 92%]
testing/python/integration.py::TestMockDecoration::test_wrapped_getfuncargnames PASSED [ 92%]
testing/python/integration.py::TestMockDecoration::test_wrapped_getfuncargnames_patching xfail [ 92%]
testing/python/integration.py::TestMockDecoration::test_unittest_mock PASSED [ 92%]
testing/python/integration.py::TestMockDecoration::test_unittest_mock_and_fixture PASSED [ 92%]
testing/python/integration.py::TestMockDecoration::test_unittest_mock_and_pypi_mock SKIPPED [ 92%]
testing/python/integration.py::TestMockDecoration::test_mock SKIPPED     [ 92%]
testing/python/integration.py::TestMockDecoration::test_mock_sorting SKIPPED [ 93%]
testing/python/integration.py::TestMockDecoration::test_mock_double_patch_issue473 SKIPPED [ 93%]
testing/python/integration.py::TestReRunTests::test_rerun PASSED         [ 93%]
testing/python/integration.py::test_pytestconfig_is_session_scoped PASSED [ 93%]
testing/python/integration.py::TestNoselikeTestAttribute::test_module_with_global_test PASSED [ 93%]
testing/python/integration.py::TestNoselikeTestAttribute::test_class_and_method PASSED [ 93%]
testing/python/integration.py::TestNoselikeTestAttribute::test_unittest_class PASSED [ 93%]
testing/python/integration.py::TestNoselikeTestAttribute::test_class_with_nasty_getattr PASSED [ 93%]
testing/python/integration.py::TestParameterize::test_idfn_marker PASSED [ 93%]
testing/python/integration.py::TestParameterize::test_idfn_fixture PASSED [ 93%]
testing/python/metafunc.py::TestMetafunc::test_no_funcargs PASSED        [ 93%]
testing/python/metafunc.py::TestMetafunc::test_function_basic PASSED     [ 93%]
testing/python/metafunc.py::TestMetafunc::test_addcall_no_args PASSED    [ 93%]
testing/python/metafunc.py::TestMetafunc::test_addcall_id PASSED         [ 93%]
testing/python/metafunc.py::TestMetafunc::test_addcall_param PASSED      [ 93%]
testing/python/metafunc.py::TestMetafunc::test_addcall_funcargs PASSED   [ 93%]
testing/python/metafunc.py::TestMetafunc::test_parametrize_error PASSED  [ 93%]
testing/python/metafunc.py::TestMetafunc::test_parametrize_bad_scope PASSED [ 93%]
testing/python/metafunc.py::TestMetafunc::test_find_parametrized_scope PASSED [ 93%]
testing/python/metafunc.py::TestMetafunc::test_parametrize_and_id PASSED [ 93%]
testing/python/metafunc.py::TestMetafunc::test_parametrize_and_id_unicode PASSED [ 93%]
testing/python/metafunc.py::TestMetafunc::test_parametrize_with_wrong_number_of_ids PASSED [ 93%]
testing/python/metafunc.py::TestMetafunc::test_parametrize_empty_list PASSED [ 94%]
testing/python/metafunc.py::TestMetafunc::test_parametrize_with_userobjects PASSED [ 94%]
testing/python/metafunc.py::TestMetafunc::test_idval_hypothesis PASSED   [ 94%]
testing/python/metafunc.py::TestMetafunc::test_unicode_idval PASSED      [ 94%]
testing/python/metafunc.py::TestMetafunc::test_bytes_idval PASSED        [ 94%]
testing/python/metafunc.py::TestMetafunc::test_class_or_function_idval PASSED [ 94%]
testing/python/metafunc.py::TestMetafunc::test_idmaker_autoname PASSED   [ 94%]
testing/python/metafunc.py::TestMetafunc::test_idmaker_with_bytes_regex PASSED [ 94%]
testing/python/metafunc.py::TestMetafunc::test_idmaker_native_strings PASSED [ 94%]
testing/python/metafunc.py::TestMetafunc::test_idmaker_enum PASSED       [ 94%]
testing/python/metafunc.py::TestMetafunc::test_idmaker_idfn PASSED       [ 94%]
testing/python/metafunc.py::TestMetafunc::test_idmaker_idfn_unique_names PASSED [ 94%]
testing/python/metafunc.py::TestMetafunc::test_parametrize_ids_exception PASSED [ 94%]
testing/python/metafunc.py::TestMetafunc::test_idmaker_with_ids PASSED   [ 94%]
testing/python/metafunc.py::TestMetafunc::test_idmaker_with_paramset_id PASSED [ 94%]
testing/python/metafunc.py::TestMetafunc::test_idmaker_with_ids_unique_names PASSED [ 94%]
testing/python/metafunc.py::TestMetafunc::test_addcall_and_parametrize PASSED [ 94%]
testing/python/metafunc.py::TestMetafunc::test_parametrize_indirect PASSED [ 94%]
testing/python/metafunc.py::TestMetafunc::test_parametrize_indirect_list PASSED [ 94%]
testing/python/metafunc.py::TestMetafunc::test_parametrize_indirect_list_all PASSED [ 94%]
testing/python/metafunc.py::TestMetafunc::test_parametrize_indirect_list_empty PASSED [ 94%]
testing/python/metafunc.py::TestMetafunc::test_parametrize_indirect_list_functional PASSED [ 94%]
testing/python/metafunc.py::TestMetafunc::test_parametrize_indirect_list_error PASSED [ 94%]
testing/python/metafunc.py::TestMetafunc::test_parametrize_uses_no_fixture_error_indirect_false PASSED [ 95%]
testing/python/metafunc.py::TestMetafunc::test_parametrize_uses_no_fixture_error_indirect_true PASSED [ 95%]
testing/python/metafunc.py::TestMetafunc::test_parametrize_indirect_uses_no_fixture_error_indirect_string PASSED [ 95%]
testing/python/metafunc.py::TestMetafunc::test_parametrize_indirect_uses_no_fixture_error_indirect_list PASSED [ 95%]
testing/python/metafunc.py::TestMetafunc::test_parametrize_argument_not_in_indirect_list PASSED [ 95%]
testing/python/metafunc.py::TestMetafunc::test_parametrize_gives_indicative_error_on_function_with_default_argument PASSED [ 95%]
testing/python/metafunc.py::TestMetafunc::test_addcalls_and_parametrize_indirect PASSED [ 95%]
testing/python/metafunc.py::TestMetafunc::test_parametrize_functional PASSED [ 95%]
testing/python/metafunc.py::TestMetafunc::test_parametrize_onearg PASSED [ 95%]
testing/python/metafunc.py::TestMetafunc::test_parametrize_onearg_indirect PASSED [ 95%]
testing/python/metafunc.py::TestMetafunc::test_parametrize_twoargs PASSED [ 95%]
testing/python/metafunc.py::TestMetafunc::test_parametrize_multiple_times PASSED [ 95%]
testing/python/metafunc.py::TestMetafunc::test_parametrize_CSV PASSED    [ 95%]
testing/python/metafunc.py::TestMetafunc::test_parametrize_class_scenarios PASSED [ 95%]
testing/python/metafunc.py::TestMetafunc::test_format_args PASSED        [ 95%]
testing/python/metafunc.py::TestMetafuncFunctional::test_attributes PASSED [ 95%]
testing/python/metafunc.py::TestMetafuncFunctional::test_addcall_with_two_funcargs_generators PASSED [ 95%]
testing/python/metafunc.py::TestMetafuncFunctional::test_two_functions PASSED [ 95%]
testing/python/metafunc.py::TestMetafuncFunctional::test_noself_in_method PASSED [ 95%]
testing/python/metafunc.py::TestMetafuncFunctional::test_generate_plugin_and_module PASSED [ 95%]
testing/python/metafunc.py::TestMetafuncFunctional::test_generate_tests_in_class PASSED [ 95%]
testing/python/metafunc.py::TestMetafuncFunctional::test_two_functions_not_same_instance PASSED [ 95%]
testing/python/metafunc.py::TestMetafuncFunctional::test_issue28_setup_method_in_generate_tests PASSED [ 96%]
testing/python/metafunc.py::TestMetafuncFunctional::test_parametrize_functional2 PASSED [ 96%]
testing/python/metafunc.py::TestMetafuncFunctional::test_parametrize_and_inner_getfixturevalue PASSED [ 96%]
testing/python/metafunc.py::TestMetafuncFunctional::test_parametrize_on_setup_arg PASSED [ 96%]
testing/python/metafunc.py::TestMetafuncFunctional::test_parametrize_with_ids PASSED [ 96%]
testing/python/metafunc.py::TestMetafuncFunctional::test_parametrize_without_ids PASSED [ 96%]
testing/python/metafunc.py::TestMetafuncFunctional::test_parametrize_with_None_in_ids PASSED [ 96%]
testing/python/metafunc.py::TestMetafuncFunctional::test_fixture_parametrized_empty_ids PASSED [ 96%]
testing/python/metafunc.py::TestMetafuncFunctional::test_parametrized_empty_ids PASSED [ 96%]
testing/python/metafunc.py::TestMetafuncFunctional::test_parametrized_ids_invalid_type PASSED [ 96%]
testing/python/metafunc.py::TestMetafuncFunctional::test_parametrize_with_identical_ids_get_unique_names PASSED [ 96%]
testing/python/metafunc.py::TestMetafuncFunctional::test_parametrize_scope_overrides[module-2] PASSED [ 96%]
testing/python/metafunc.py::TestMetafuncFunctional::test_parametrize_scope_overrides[function-4] PASSED [ 96%]
testing/python/metafunc.py::TestMetafuncFunctional::test_parametrize_issue323 PASSED [ 96%]
testing/python/metafunc.py::TestMetafuncFunctional::test_usefixtures_seen_in_generate_tests PASSED [ 96%]
testing/python/metafunc.py::TestMetafuncFunctional::test_generate_tests_only_done_in_subdir PASSED [ 96%]
testing/python/metafunc.py::TestMetafuncFunctional::test_generate_same_function_names_issue403 PASSED [ 96%]
testing/python/metafunc.py::TestMetafuncFunctional::test_parametrize_misspelling[parametrise] PASSED [ 96%]
testing/python/metafunc.py::TestMetafuncFunctional::test_parametrize_misspelling[parameterize] PASSED [ 96%]
testing/python/metafunc.py::TestMetafuncFunctional::test_parametrize_misspelling[parameterise] PASSED [ 96%]
testing/python/metafunc.py::TestMetafuncFunctionalAuto::test_parametrize_auto_scope PASSED [ 96%]
testing/python/metafunc.py::TestMetafuncFunctionalAuto::test_parametrize_auto_scope_indirect PASSED [ 96%]
testing/python/metafunc.py::TestMetafuncFunctionalAuto::test_parametrize_auto_scope_override_fixture PASSED [ 97%]
testing/python/metafunc.py::TestMetafuncFunctionalAuto::test_parametrize_all_indirects PASSED [ 97%]
testing/python/metafunc.py::TestMetafuncFunctionalAuto::test_parametrize_some_arguments_auto_scope PASSED [ 97%]
testing/python/metafunc.py::TestMetafuncFunctionalAuto::test_parametrize_issue634 PASSED [ 97%]
testing/python/metafunc.py::TestMarkersWithParametrization::test_simple_mark PASSED [ 97%]
testing/python/metafunc.py::TestMarkersWithParametrization::test_select_based_on_mark PASSED [ 97%]
testing/python/metafunc.py::TestMarkersWithParametrization::test_nested_marks xfail [ 97%]
testing/python/metafunc.py::TestMarkersWithParametrization::test_simple_xfail PASSED [ 97%]
testing/python/metafunc.py::TestMarkersWithParametrization::test_simple_xfail_single_argname PASSED [ 97%]
testing/python/metafunc.py::TestMarkersWithParametrization::test_xfail_with_arg PASSED [ 97%]
testing/python/metafunc.py::TestMarkersWithParametrization::test_xfail_with_kwarg PASSED [ 97%]
testing/python/metafunc.py::TestMarkersWithParametrization::test_xfail_with_arg_and_kwarg PASSED [ 97%]
testing/python/metafunc.py::TestMarkersWithParametrization::test_xfail_passing_is_xpass[True] PASSED [ 97%]
testing/python/metafunc.py::TestMarkersWithParametrization::test_xfail_passing_is_xpass[False] PASSED [ 97%]
testing/python/metafunc.py::TestMarkersWithParametrization::test_parametrize_called_in_generate_tests PASSED [ 97%]
testing/python/metafunc.py::TestMarkersWithParametrization::test_parametrize_ID_generation_string_int_works PASSED [ 97%]
testing/python/metafunc.py::TestMarkersWithParametrization::test_parametrize_marked_value[True] PASSED [ 97%]
testing/python/metafunc.py::TestMarkersWithParametrization::test_parametrize_marked_value[False] PASSED [ 97%]
testing/python/metafunc.py::TestMarkersWithParametrization::test_pytest_make_parametrize_id PASSED [ 97%]
testing/python/metafunc.py::TestMarkersWithParametrization::test_pytest_make_parametrize_id_with_argname PASSED [ 97%]
testing/python/raises.py::TestRaises::test_raises PASSED                 [ 97%]
testing/python/raises.py::TestRaises::test_raises_exec PASSED            [ 97%]
testing/python/raises.py::TestRaises::test_raises_syntax_error PASSED    [ 97%]
testing/python/raises.py::TestRaises::test_raises_function PASSED        [ 98%]
testing/python/raises.py::TestRaises::test_raises_callable_no_exception PASSED [ 98%]
testing/python/raises.py::TestRaises::test_raises_as_contextmanager PASSED [ 98%]
testing/python/raises.py::TestRaises::test_noclass PASSED                [ 98%]
testing/python/raises.py::TestRaises::test_invalid_arguments_to_raises PASSED [ 98%]
testing/python/raises.py::TestRaises::test_tuple PASSED                  [ 98%]
testing/python/raises.py::TestRaises::test_no_raise_message PASSED       [ 98%]
testing/python/raises.py::TestRaises::test_custom_raise_message PASSED   [ 98%]
testing/python/raises.py::TestRaises::test_raises_cyclic_reference[function] PASSED [ 98%]
testing/python/raises.py::TestRaises::test_raises_cyclic_reference[with] PASSED [ 98%]
testing/python/raises.py::TestRaises::test_raises_match PASSED           [ 98%]
testing/python/raises.py::TestRaises::test_raises_match_wrong_type PASSED [ 98%]
testing/python/raises.py::TestRaises::test_raises_exception_looks_iterable PASSED [ 98%]
testing/python/raises.py::TestRaises::test_raises_with_raising_dunder_class PASSED [ 98%]
testing/python/setup_only.py::test_show_only_active_fixtures[--setup-only] PASSED [ 98%]
testing/python/setup_only.py::test_show_different_scopes[--setup-only] PASSED [ 98%]
testing/python/setup_only.py::test_show_nested_fixtures[--setup-only] PASSED [ 98%]
testing/python/setup_only.py::test_show_fixtures_with_autouse[--setup-only] PASSED [ 98%]
testing/python/setup_only.py::test_show_fixtures_with_parameters[--setup-only] PASSED [ 98%]
testing/python/setup_only.py::test_show_fixtures_with_parameter_ids[--setup-only] PASSED [ 98%]
testing/python/setup_only.py::test_show_fixtures_with_parameter_ids_function[--setup-only] PASSED [ 98%]
testing/python/setup_only.py::test_show_only_active_fixtures[--setup-plan] PASSED [ 98%]
testing/python/setup_only.py::test_show_different_scopes[--setup-plan] PASSED [ 99%]
testing/python/setup_only.py::test_show_nested_fixtures[--setup-plan] PASSED [ 99%]
testing/python/setup_only.py::test_show_fixtures_with_autouse[--setup-plan] PASSED [ 99%]
testing/python/setup_only.py::test_show_fixtures_with_parameters[--setup-plan] PASSED [ 99%]
testing/python/setup_only.py::test_show_fixtures_with_parameter_ids[--setup-plan] PASSED [ 99%]
testing/python/setup_only.py::test_show_fixtures_with_parameter_ids_function[--setup-plan] PASSED [ 99%]
testing/python/setup_only.py::test_show_only_active_fixtures[--setup-show] PASSED [ 99%]
testing/python/setup_only.py::test_show_different_scopes[--setup-show] PASSED [ 99%]
testing/python/setup_only.py::test_show_nested_fixtures[--setup-show] PASSED [ 99%]
testing/python/setup_only.py::test_show_fixtures_with_autouse[--setup-show] PASSED [ 99%]
testing/python/setup_only.py::test_show_fixtures_with_parameters[--setup-show] PASSED [ 99%]
testing/python/setup_only.py::test_show_fixtures_with_parameter_ids[--setup-show] PASSED [ 99%]
testing/python/setup_only.py::test_show_fixtures_with_parameter_ids_function[--setup-show] PASSED [ 99%]
testing/python/setup_only.py::test_dynamic_fixture_request PASSED        [ 99%]
testing/python/setup_only.py::test_capturing PASSED                      [ 99%]
testing/python/setup_only.py::test_show_fixtures_and_execute_test PASSED [ 99%]
testing/python/setup_plan.py::test_show_fixtures_and_test PASSED         [ 99%]
testing/python/show_fixtures_per_test.py::test_no_items_should_not_show_output PASSED [ 99%]
testing/python/show_fixtures_per_test.py::test_fixtures_in_module PASSED [ 99%]
testing/python/show_fixtures_per_test.py::test_fixtures_in_conftest PASSED [ 99%]
testing/python/show_fixtures_per_test.py::test_should_show_fixtures_used_by_test PASSED [ 99%]
testing/python/show_fixtures_per_test.py::test_verbose_include_private_fixtures_and_loc PASSED [ 99%]
testing/python/show_fixtures_per_test.py::test_doctest_items PASSED      [100%]

=================================== FAILURES ===================================
____________________ TestRequestBasic.test_request_garbage _____________________

self = <fixture.TestRequestBasic object at 0xef2ceaf0>
testdir = <Testdir local('/tmp/B.FQJbBU/BUILD/tmp/pytest-of-builder/pytest-1/test_request_garbage0')>

    @pytest.mark.skipif(
        hasattr(sys, "pypy_version_info"),
        reason="this method of test doesn't work on pypy",
    )
    def test_request_garbage(self, testdir):
        try:
            import xdist  # noqa
        except ImportError:
            pass
        else:
            pytest.xfail("this test is flaky when executed with xdist")
        testdir.makepyfile(
            """
            import sys
            import pytest
            from _pytest.fixtures import PseudoFixtureDef
            import gc
    
            @pytest.fixture(autouse=True)
            def something(request):
                original = gc.get_debug()
                gc.set_debug(gc.DEBUG_SAVEALL)
                gc.collect()
    
                yield
    
                try:
                    gc.collect()
                    leaked_types = sum(1 for _ in gc.garbage
                                       if isinstance(_, PseudoFixtureDef))
    
                    # debug leaked types if the test fails
                    print(leaked_types)
    
                    gc.garbage[:] = []
    
                    assert leaked_types == 0
                finally:
                    gc.set_debug(original)
    
            def test_func():
                pass
        """
        )
        result = testdir.runpytest()
>       result.stdout.fnmatch_lines("* 1 passed in *")
E       Failed: nomatch: '* 1 passed in *'
E           and: '============================= test session starts =============================='
E           and: 'platform linux -- Python 3.7.1, pytest-3.10.1, py-1.7.0, pluggy-0.8.0'
E           and: "hypothesis profile 'default' -> database=DirectoryBasedExampleDatabase('/tmp/B.FQJbBU/BUILD/pytest-3.10.1/.hypothesis/examples')"
E           and: 'rootdir: /tmp/B.FQJbBU/BUILD/tmp/pytest-of-builder/pytest-1/test_request_garbage0, inifile:'
E           and: 'plugins: hypothesis-3.82.1'
E           and: 'collected 1 item'
E           and: ''
E           and: 'test_request_garbage.py .E                                               [100%]'
E           and: ''
E           and: '==================================== ERRORS ===================================='
E           and: '________________________ ERROR at teardown of test_func ________________________'
E           and: ''
E           and: "request = <SubRequest 'something' for <Function 'test_func'>>"
E           and: ''
E           and: '    @pytest.fixture(autouse=True)'
E           and: '    def something(request):'
E           and: '        original = gc.get_debug()'
E           and: '        gc.set_debug(gc.DEBUG_SAVEALL)'
E           and: '        gc.collect()'
E           and: '    '
E           and: '        yield'
E           and: '    '
E           and: '        try:'
E           and: '            gc.collect()'
E           and: '            leaked_types = sum(1 for _ in gc.garbage'
E           and: '                               if isinstance(_, PseudoFixtureDef))'
E           and: '    '
E           and: '            # debug leaked types if the test fails'
E           and: '            print(leaked_types)'
E           and: '    '
E           and: '            gc.garbage[:] = []'
E           and: '    '
E           and: '>           assert leaked_types == 0'
E           and: 'E           assert 4 == 0'
E           and: ''
E           and: 'test_request_garbage.py:24: AssertionError'
E           and: '--------------------------- Captured stdout teardown ---------------------------'
E           and: '4'
E           and: '====================== 1 passed, 1 error in 0.37 seconds ======================='
E           and: ''
E       remains unmatched: '* 1 passed in *'

../../../../pytest-3.10.1/testing/python/fixture.py:545: Failed
----------------------------- Captured stdout call -----------------------------
============================= test session starts ==============================
platform linux -- Python 3.7.1, pytest-3.10.1, py-1.7.0, pluggy-0.8.0
hypothesis profile 'default' -> database=DirectoryBasedExampleDatabase('/tmp/B.FQJbBU/BUILD/pytest-3.10.1/.hypothesis/examples')
rootdir: /tmp/B.FQJbBU/BUILD/tmp/pytest-of-builder/pytest-1/test_request_garbage0, inifile:
plugins: hypothesis-3.82.1
collected 1 item

test_request_garbage.py .E                                               [100%]

==================================== ERRORS ====================================
________________________ ERROR at teardown of test_func ________________________

request = <SubRequest 'something' for <Function 'test_func'>>

    @pytest.fixture(autouse=True)
    def something(request):
        original = gc.get_debug()
        gc.set_debug(gc.DEBUG_SAVEALL)
        gc.collect()
    
        yield
    
        try:
            gc.collect()
            leaked_types = sum(1 for _ in gc.garbage
                               if isinstance(_, PseudoFixtureDef))
    
            # debug leaked types if the test fails
            print(leaked_types)
    
            gc.garbage[:] = []
    
>           assert leaked_types == 0
E           assert 4 == 0

test_request_garbage.py:24: AssertionError
--------------------------- Captured stdout teardown ---------------------------
4
====================== 1 passed, 1 error in 0.37 seconds =======================
=========================== short test summary info ============================
FAIL testing/python/fixture.py::TestRequestBasic::()::test_request_garbage
SKIP [1] testing/test_assertion.py:1021: This bug does not exist on PY3
SKIP [1] testing/test_assertrewrite.py:853: python 2 only
SKIP [1] testing/test_assertrewrite.py:902: condition: sys.version_info[0] >= 3
SKIP [1] testing/test_assertrewrite.py:911: condition: sys.version_info[0] >= 3
SKIP [1] testing/test_assertrewrite.py:922: condition: sys.version_info[0] >= 3
SKIP [1] testing/test_assertrewrite.py:933: condition: sys.version_info[0] >= 3
SKIP [1] testing/test_capture.py:518: only have capsysbinary in python 3
SKIP [1] testing/test_capture.py:856: python2 has no buffer
SKIP [2] /tmp/B.FQJbBU/BUILD/pytest-3.10.1/testing/test_capture.py:925: could not run 'lsof'
SKIP [2] testing/test_capture.py:1080: text output different for bytes on python3
SKIP [1] testing/test_capture.py:1344: only py3.6+ on windows
SKIP [1] /tmp/B.FQJbBU/BUILD/pytest-3.10.1/testing/test_junitxml.py:1041: could not import 'xdist'
SKIP [1] testing/test_monkeypatch.py:211: Python 2 only test
SKIP [1] testing/test_monkeypatch.py:219: Python 2 only test
SKIP [1] /tmp/B.FQJbBU/BUILD/pytest-3.10.1/testing/test_parseopt.py:325: bash provided no output, argcomplete not available?
SKIP [11] /tmp/B.FQJbBU/BUILD/pytest-3.10.1/testing/test_runner.py:429: could not import 'xdist.boxed'
SKIP [1] testing/test_skipping.py:52: condition: sys.version_info[0] >= 3
SKIP [1] /tmp/B.FQJbBU/BUILD/pytest-3.10.1/testing/test_terminal.py:1293: could not import 'xdist'
SKIP [1] /tmp/B.FQJbBU/BUILD/pytest-3.10.1/testing/test_terminal.py:1298: could not import 'xdist'
SKIP [1] /tmp/B.FQJbBU/BUILD/pytest-3.10.1/testing/test_terminal.py:1309: could not import 'xdist'
SKIP [1] /tmp/B.FQJbBU/BUILD/pytest-3.10.1/testing/test_terminal.py:1404: could not import 'xdist'
SKIP [1] testing/test_tmpdir.py:179: win only
SKIP [8] /tmp/B.FQJbBU/BUILD/pytest-3.10.1/testing/test_unittest.py:398: could not import 'twisted.trial.unittest'
SKIP [1] testing/test_warnings.py:158: warnings message is broken as it is not str instance
SKIP [1] testing/test_warnings.py:570: Python 2 only issue
SKIP [1] testing/code/test_code.py:99: python 2 only issue
SKIP [1] /tmp/B.FQJbBU/BUILD/pytest-3.10.1/testing/python/integration.py:169: could not import 'mock'
SKIP [1] /tmp/B.FQJbBU/BUILD/pytest-3.10.1/testing/python/integration.py:192: could not import 'mock'
SKIP [1] /tmp/B.FQJbBU/BUILD/pytest-3.10.1/testing/python/integration.py:225: could not import 'mock'
SKIP [1] /tmp/B.FQJbBU/BUILD/pytest-3.10.1/testing/python/integration.py:249: could not import 'mock'
XFAIL testing/acceptance_test.py::TestInvocationVariants::()::test_noclass_discovery_if_not_testcase
  decide: feature or bug
XFAIL testing/test_capture.py::TestPerTestCapturing::()::test_capture_scope_cache
  unimplemented feature
XFAIL testing/test_collection.py::TestPrunetraceback::()::test_collect_report_postprocessing
  other mechanism for adding to reporting needed
XFAIL testing/test_config.py::TestParseIni::()::test_confcutdir
  probably not needed
XFAIL testing/test_junitxml.py::test_runs_twice_xdist
  reason: [NOTRUN] hangs
XFAIL testing/test_mark.py::TestKeywordSelection::()::test_keyword_extra_dash
XFAIL testing/test_pytester.py::test_make_hook_recorder
  reason: internal reportrecorder tests need refactoring
XFAIL testing/test_runner.py::test_runtest_in_module_ordering
XFAIL testing/python/fixture.py::TestAutouseDiscovery::()::test_setup_enabled_functionnode
  'enabled' feature not implemented
XFAIL testing/python/integration.py::TestMockDecoration::()::test_wrapped_getfuncargnames_patching
  getfuncargnames breaks if mock is imported
XFAIL testing/python/metafunc.py::TestMarkersWithParametrization::()::test_nested_marks
  is this important to support??
 1 failed, 2175 passed, 49 skipped, 71 deselected, 11 xfailed in 281.91 seconds 
error: Bad exit status from /tmp/B.FQJbBU/BUILD/tmp/rpm-tmp.710 (%build)


RPM build errors:
    Bad exit status from /tmp/B.FQJbBU/BUILD/tmp/rpm-tmp.710 (%build)
ended at: Fri Nov 30 16:46:36 2018, done in 0:09:36.254737
error: No files produced.
+ chmod -R u+rwX /tmp/B.FQJbBU/BUILD
+ rm -rf /tmp/B.FQJbBU/tmp /tmp/B.FQJbBU/BUILD
+ rm -rf /tmp/B.FQJbBU
Begin-PLD-Builder-Info
Build-Time: user:500.43s sys:38.94s real:582.07s (faults io:36 non-io:3522196)

End-PLD-Builder-Info
[Back to list of logs] [View rpm -qa of builder]