FailedOk

th/SRPMS[OK]
th/x32[OK]
th/i686[OK]
th/x86_64[OK]

ac/SRPMS[OK]
ac/i386[OK]
ac/i586[OK]
ac/i686[OK]
ac/alpha[OK]
ac/amd64[OK]
ac/athlon[OK]
ac/ppc[OK]
ac/sparc[OK]
ac/sparc64[OK]

Advanced Search
main()
Powered by PLD Linux
(c) 2002-2018 PLD Team
$Revision: 1.37 $
Powered by x-files.
Your IP: 54.221.75.115

python3 707E53F4-4FE2-4A7D-98B1-0DA28832A2F5

Status:Failed
Source URL:ftp://buildlogs.pld-linux.org/th/x32/FAIL/python3,707E53F4-4FE2-4A7D-98B1-0DA28832A2F5.bz2
text/plain URL:View!
full text:View!
rpm -qa of builder:View!
Date:2018/11/07 20:40:46
Runtime:0:04:31.900322

Toc:

  • error 1
  • FAIL: test_imap4_host_default_value (test.test_imaplib.TestImaplib)
  • error 2
  • AssertionError: 97 not found in [111, 99]
  • error 3
  • FAIL: test_imap4_host_default_value (test.test_imaplib.TestImaplib)
  • error 4
  • AssertionError: 97 not found in [111, 99]
  • error 5
  • error: Bad exit status from /tmp/B.Erzm73/BUILD/tmp/rpm-tmp.39693 (%build)
  • error 6
  • RPM build errors:
  • error 7
  • error: No files produced.

Content:

0:00:29 load avg: 5.83 [203/399] test_memoryio passed
0:00:30 load avg: 5.83 [204/399/1] test_imaplib failed
test_EOF_without_complete_welcome_message (test.test_imaplib.NewIMAPSSLTests) ... ok
test_aborted_authentication (test.test_imaplib.NewIMAPSSLTests) ... ok
test_bad_auth_name (test.test_imaplib.NewIMAPSSLTests) ... ok
test_certfile_arg_warn (test.test_imaplib.NewIMAPSSLTests) ... ok
test_enable_UTF8_True_append (test.test_imaplib.NewIMAPSSLTests) ... ok
test_enable_UTF8_raises_error_if_not_supported (test.test_imaplib.NewIMAPSSLTests) ... ok
test_enable_raises_error_if_no_capability (test.test_imaplib.NewIMAPSSLTests) ... ok
test_enable_raises_error_if_not_AUTH (test.test_imaplib.NewIMAPSSLTests) ... ok
test_invalid_authentication (test.test_imaplib.NewIMAPSSLTests) ... ok
test_line_termination (test.test_imaplib.NewIMAPSSLTests) ... ok
test_linetoolong (test.test_imaplib.NewIMAPSSLTests) ... ok
test_login (test.test_imaplib.NewIMAPSSLTests) ... ok
test_login_cram_md5_bytes (test.test_imaplib.NewIMAPSSLTests) ... ok
test_login_cram_md5_plain_text (test.test_imaplib.NewIMAPSSLTests) ... ok
test_logout (test.test_imaplib.NewIMAPSSLTests) ... ok
test_lsub (test.test_imaplib.NewIMAPSSLTests) ... ok
test_search_disallows_charset_in_utf8_mode (test.test_imaplib.NewIMAPSSLTests) ... ok
test_simple_with_statement (test.test_imaplib.NewIMAPSSLTests) ... ok
test_ssl_raises (test.test_imaplib.NewIMAPSSLTests) ... ok
test_ssl_verified (test.test_imaplib.NewIMAPSSLTests) ... ok
test_valid_authentication_bytes (test.test_imaplib.NewIMAPSSLTests) ... ok
test_valid_authentication_plain_text (test.test_imaplib.NewIMAPSSLTests) ... ok
test_with_statement (test.test_imaplib.NewIMAPSSLTests) ... ok
test_with_statement_logout (test.test_imaplib.NewIMAPSSLTests) ... ok
test_EOF_without_complete_welcome_message (test.test_imaplib.NewIMAPTests) ... ok
test_aborted_authentication (test.test_imaplib.NewIMAPTests) ... ok
test_bad_auth_name (test.test_imaplib.NewIMAPTests) ... ok
test_enable_UTF8_True_append (test.test_imaplib.NewIMAPTests) ... ok
test_enable_UTF8_raises_error_if_not_supported (test.test_imaplib.NewIMAPTests) ... ok
test_enable_raises_error_if_no_capability (test.test_imaplib.NewIMAPTests) ... ok
test_enable_raises_error_if_not_AUTH (test.test_imaplib.NewIMAPTests) ... ok
test_invalid_authentication (test.test_imaplib.NewIMAPTests) ... ok
test_line_termination (test.test_imaplib.NewIMAPTests) ... ok
test_linetoolong (test.test_imaplib.NewIMAPTests) ... ok
test_login (test.test_imaplib.NewIMAPTests) ... ok
test_login_cram_md5_bytes (test.test_imaplib.NewIMAPTests) ... ok
test_login_cram_md5_plain_text (test.test_imaplib.NewIMAPTests) ... ok
test_logout (test.test_imaplib.NewIMAPTests) ... ok
test_lsub (test.test_imaplib.NewIMAPTests) ... ok
test_search_disallows_charset_in_utf8_mode (test.test_imaplib.NewIMAPTests) ... ok
test_simple_with_statement (test.test_imaplib.NewIMAPTests) ... ok
test_valid_authentication_bytes (test.test_imaplib.NewIMAPTests) ... ok
test_valid_authentication_plain_text (test.test_imaplib.NewIMAPTests) ... ok
test_with_statement (test.test_imaplib.NewIMAPTests) ... ok
test_with_statement_logout (test.test_imaplib.NewIMAPTests) ... ok
test_logincapa (test.test_imaplib.RemoteIMAPTest) ... skipped "Resource 'cyrus.andrew.cmu.edu' is not available"
test_logout (test.test_imaplib.RemoteIMAPTest) ... skipped "Resource 'cyrus.andrew.cmu.edu' is not available"
test_logincapa (test.test_imaplib.RemoteIMAP_SSLTest) ... skipped "Resource 'cyrus.andrew.cmu.edu' is not available"
test_logout (test.test_imaplib.RemoteIMAP_SSLTest) ... skipped "Resource 'cyrus.andrew.cmu.edu' is not available"
test_ssl_context_certfile_exclusive (test.test_imaplib.RemoteIMAP_SSLTest) ... ok
test_ssl_context_keyfile_exclusive (test.test_imaplib.RemoteIMAP_SSLTest) ... ok
test_logincapa (test.test_imaplib.RemoteIMAP_STARTTLSTest) ... skipped "Resource 'cyrus.andrew.cmu.edu' is not available"
test_logout (test.test_imaplib.RemoteIMAP_STARTTLSTest) ... skipped "Resource 'cyrus.andrew.cmu.edu' is not available"
test_Internaldate2tuple (test.test_imaplib.TestImaplib) ... ok
test_Internaldate2tuple_issue10941 (test.test_imaplib.TestImaplib) ... ok
test_Time2Internaldate (test.test_imaplib.TestImaplib) ... ok
test_imap4_host_default_value (test.test_imaplib.TestImaplib) ... FAIL
test_that_Time2Internaldate_returns_a_result (test.test_imaplib.TestImaplib) ... ok
test_aborted_authentication (test.test_imaplib.ThreadedNetworkedTests) ... ok
test_bad_auth_name (test.test_imaplib.ThreadedNetworkedTests) ... ok
test_bracket_flags (test.test_imaplib.ThreadedNetworkedTests) ... ok
test_connect (test.test_imaplib.ThreadedNetworkedTests) ... ok
test_enable_UTF8_True_append (test.test_imaplib.ThreadedNetworkedTests) ... ok
test_enable_UTF8_raises_error_if_not_supported (test.test_imaplib.ThreadedNetworkedTests) ... ok
test_enable_raises_error_if_no_capability (test.test_imaplib.ThreadedNetworkedTests) ... ok
test_enable_raises_error_if_not_AUTH (test.test_imaplib.ThreadedNetworkedTests) ... ok
test_invalid_authentication (test.test_imaplib.ThreadedNetworkedTests) ... ok
test_issue5949 (test.test_imaplib.ThreadedNetworkedTests) ... ok
test_line_termination (test.test_imaplib.ThreadedNetworkedTests) ... ok
test_linetoolong (test.test_imaplib.ThreadedNetworkedTests) ... ok
test_login_cram_md5 (test.test_imaplib.ThreadedNetworkedTests) ... ok
test_search_disallows_charset_in_utf8_mode (test.test_imaplib.ThreadedNetworkedTests) ... ok
test_simple_with_statement (test.test_imaplib.ThreadedNetworkedTests) ... ok
test_valid_authentication (test.test_imaplib.ThreadedNetworkedTests) ... ok
test_with_statement (test.test_imaplib.ThreadedNetworkedTests) ... ok
test_with_statement_logout (test.test_imaplib.ThreadedNetworkedTests) ... ok
test_aborted_authentication (test.test_imaplib.ThreadedNetworkedTestsSSL) ... ok
test_bad_auth_name (test.test_imaplib.ThreadedNetworkedTestsSSL) ... ok
test_bracket_flags (test.test_imaplib.ThreadedNetworkedTestsSSL) ... ok
test_connect (test.test_imaplib.ThreadedNetworkedTestsSSL) ... ok
test_enable_UTF8_True_append (test.test_imaplib.ThreadedNetworkedTestsSSL) ... ok
test_enable_UTF8_raises_error_if_not_supported (test.test_imaplib.ThreadedNetworkedTestsSSL) ... ok
test_enable_raises_error_if_no_capability (test.test_imaplib.ThreadedNetworkedTestsSSL) ... ok
test_enable_raises_error_if_not_AUTH (test.test_imaplib.ThreadedNetworkedTestsSSL) ... ok
test_invalid_authentication (test.test_imaplib.ThreadedNetworkedTestsSSL) ... ok
test_issue5949 (test.test_imaplib.ThreadedNetworkedTestsSSL) ... ok
test_line_termination (test.test_imaplib.ThreadedNetworkedTestsSSL) ... ok
test_linetoolong (test.test_imaplib.ThreadedNetworkedTestsSSL) ... ok
test_login_cram_md5 (test.test_imaplib.ThreadedNetworkedTestsSSL) ... ok
test_search_disallows_charset_in_utf8_mode (test.test_imaplib.ThreadedNetworkedTestsSSL) ... ok
test_simple_with_statement (test.test_imaplib.ThreadedNetworkedTestsSSL) ... ok
test_ssl_verified (test.test_imaplib.ThreadedNetworkedTestsSSL) ... ok
test_valid_authentication (test.test_imaplib.ThreadedNetworkedTestsSSL) ... ok
test_with_statement (test.test_imaplib.ThreadedNetworkedTestsSSL) ... ok
test_with_statement_logout (test.test_imaplib.ThreadedNetworkedTestsSSL) ... ok

======================================================================
FAIL: test_imap4_host_default_value (test.test_imaplib.TestImaplib)
----------------------------------------------------------------------
Traceback (most recent call last):
  File "/tmp/B.Erzm73/BUILD/Python-3.7.1/Lib/test/test_imaplib.py", line 84, in test_imap4_host_default_value
    self.assertIn(cm.exception.errno, expected_errnos)
AssertionError: 97 not found in [111, 99]

----------------------------------------------------------------------

Ran 95 tests in 9.782s

FAILED (failures=1, skipped=6)
test test_imaplib failed
0:00:30 load avg: 5.83 [205/399/1] test_memoryview passed
0:00:30 load avg: 5.83 [206/399/1] test_mimetypes passed
0:00:30 load avg: 5.83 [207/399/1] test_metaclass passed
0:00:30 load avg: 5.83 [208/399/1] test_minidom passed
0:00:30 load avg: 5.83 [209/399/1] test_mmap passed
0:00:30 load avg: 5.83 [210/399/1] test_module passed
0:00:31 load avg: 5.83 [211/399/1] test_msilib skipped
test_msilib skipped -- No module named '_msi'
0:00:31 load avg: 5.83 [212/399/1] test_modulefinder passed
0:00:31 load avg: 5.83 [213/399/1] test_mailbox passed
0:00:32 load avg: 5.83 [214/399/1] test_math passed
0:00:32 load avg: 5.83 [215/399/1] test_faulthandler passed
0:00:32 load avg: 5.83 [216/399/1] test_lzma passed
0:00:32 load avg: 5.83 [217/399/1] test_netrc passed
0:00:33 load avg: 5.83 [218/399/1] test_ntpath passed
0:00:33 load avg: 5.76 [219/399/1] test_multibytecodec passed
0:00:33 load avg: 5.76 [220/399/1] test_numeric_tower passed
0:00:33 load avg: 5.76 [221/399/1] test_operator passed
0:00:33 load avg: 5.76 [222/399/1] test_optparse passed
0:00:34 load avg: 5.76 [223/399/1] test_ossaudiodev skipped (resource denied)
test_ossaudiodev skipped -- Use of the 'audio' resource not enabled
0:00:34 load avg: 5.76 [224/399/1] test_ordered_dict passed
0:00:34 load avg: 5.76 [225/399/1] test_osx_env passed
0:00:34 load avg: 5.76 [226/399/1] test_parser passed
0:00:34 load avg: 5.76 [227/399/1] test_pathlib passed
0:00:35 load avg: 5.76 [228/399/1] test_peepholer passed
0:00:35 load avg: 5.76 [229/399/1] test_pdb passed
0:00:38 load avg: 5.70 [230/399/1] test_pickletools passed -- running: test_concurrent_futures (30 sec 527 ms)
0:00:38 load avg: 5.70 [231/399/1] test_pipes passed -- running: test_concurrent_futures (30 sec 778 ms)
0:00:38 load avg: 5.70 [232/399/1] test_pkg passed -- running: test_concurrent_futures (31 sec 24 ms)
0:00:38 load avg: 5.70 [233/399/1] test_pkgimport passed -- running: test_concurrent_futures (31 sec 224 ms)
0:00:39 load avg: 5.70 [234/399/1] test_pkgutil passed -- running: test_concurrent_futures (31 sec 446 ms)
0:00:39 load avg: 5.70 [235/399/1] test_platform passed -- running: test_concurrent_futures (31 sec 894 ms)
0:00:39 load avg: 5.70 [236/399/1] test_plistlib passed -- running: test_concurrent_futures (32 sec 129 ms)
0:00:42 load avg: 5.70 [237/399/1] test_multiprocessing_main_handling passed -- running: test_concurrent_futures (35 sec 187 ms)
0:00:43 load avg: 5.70 [238/399/1] test_popen passed -- running: test_concurrent_futures (35 sec 501 ms)
0:00:44 load avg: 5.47 [239/399/1] test_logging passed -- running: test_concurrent_futures (36 sec 320 ms)
0:00:44 load avg: 5.47 [240/399/1] test_posixpath passed -- running: test_concurrent_futures (36 sec 608 ms)
0:00:44 load avg: 5.47 [241/399/1] test_pow passed -- running: test_concurrent_futures (36 sec 898 ms)
0:00:44 load avg: 5.47 [242/399/1] test_pprint passed -- running: test_concurrent_futures (37 sec 207 ms)
0:00:45 load avg: 5.47 [243/399/1] test_print passed -- running: test_concurrent_futures (37 sec 386 ms)
0:00:45 load avg: 5.47 [244/399/1] test_profile passed -- running: test_concurrent_futures (37 sec 565 ms)
0:00:45 load avg: 5.47 [245/399/1] test_property passed -- running: test_concurrent_futures (37 sec 741 ms)
0:00:45 load avg: 5.47 [246/399/1] test_pstats passed -- running: test_concurrent_futures (38 sec 35 ms)
0:00:46 load avg: 5.47 [247/399/1] test_pulldom passed -- running: test_concurrent_futures (38 sec 298 ms)
0:00:46 load avg: 5.47 [248/399/1] test_pwd passed -- running: test_concurrent_futures (38 sec 479 ms)
0:00:46 load avg: 5.47 [249/399/1] test_py_compile passed -- running: test_concurrent_futures (38 sec 661 ms)
0:00:47 load avg: 5.47 [250/399/1] test_pickle passed -- running: test_concurrent_futures (39 sec 546 ms)
0:00:49 load avg: 5.77 [251/399/1] test_poplib passed -- running: test_concurrent_futures (41 sec 377 ms)
0:00:49 load avg: 5.77 [252/399/1] test_pyexpat passed -- running: test_concurrent_futures (41 sec 585 ms)
0:00:50 load avg: 5.77 [253/399/1] test_pyclbr passed -- running: test_concurrent_futures (42 sec 335 ms)
0:00:50 load avg: 5.77 [254/399/1] test_quopri passed -- running: test_concurrent_futures (42 sec 630 ms)
0:00:50 load avg: 5.77 [255/399/1] test_raise passed -- running: test_concurrent_futures (42 sec 826 ms)
0:00:50 load avg: 5.77 [256/399/1] test_pydoc passed -- running: test_concurrent_futures (43 sec 197 ms)
0:00:51 load avg: 5.77 [257/399/1] test_poll passed -- running: test_concurrent_futures (43 sec 482 ms)
0:00:52 load avg: 5.77 [258/399/1] test_range passed -- running: test_concurrent_futures (44 sec 311 ms), test_io (30 sec 636 ms)
0:00:52 load avg: 5.77 [259/399/1] test_random passed -- running: test_concurrent_futures (44 sec 652 ms), test_io (30 sec 977 ms)
0:00:52 load avg: 5.77 [260/399/1] test_re passed -- running: test_concurrent_futures (44 sec 887 ms), test_io (31 sec 213 ms)
0:00:52 load avg: 5.77 [261/399/1] test_repl passed -- running: test_concurrent_futures (44 sec 902 ms), test_io (31 sec 227 ms)
0:00:52 load avg: 5.77 [262/399/1] test_richcmp passed -- running: test_concurrent_futures (45 sec 112 ms), test_lib2to3 (30 sec 173 ms), test_io (31 sec 438 ms)
0:00:52 load avg: 5.77 [263/399/1] test_reprlib passed -- running: test_concurrent_futures (45 sec 140 ms), test_lib2to3 (30 sec 201 ms), test_io (31 sec 466 ms)
0:00:53 load avg: 5.77 [264/399/1] test_rlcompleter passed -- running: test_concurrent_futures (45 sec 312 ms), test_lib2to3 (30 sec 373 ms), test_io (31 sec 638 ms)
0:00:53 load avg: 7.79 [265/399/1] test_robotparser passed -- running: test_concurrent_futures (45 sec 509 ms), test_lib2to3 (30 sec 570 ms), test_io (31 sec 835 ms)
0:00:53 load avg: 7.79 [266/399/1] test_sax passed -- running: test_concurrent_futures (45 sec 910 ms), test_lib2to3 (30 sec 971 ms), test_io (32 sec 236 ms)
0:00:54 load avg: 7.79 [267/399/1] test_sched passed -- running: test_concurrent_futures (46 sec 704 ms), test_lib2to3 (31 sec 765 ms), test_io (33 sec 30 ms)
0:00:54 load avg: 7.79 [268/399/1] test_runpy passed -- running: test_concurrent_futures (46 sec 732 ms), test_lib2to3 (31 sec 793 ms), test_io (33 sec 58 ms)
0:00:54 load avg: 7.79 [269/399/1] test_scope passed -- running: test_concurrent_futures (46 sec 935 ms), test_lib2to3 (31 sec 995 ms), test_io (33 sec 260 ms)
0:00:54 load avg: 7.79 [270/399/1] test_queue passed -- running: test_concurrent_futures (46 sec 964 ms), test_lib2to3 (32 sec 24 ms), test_io (33 sec 290 ms)
0:00:54 load avg: 7.79 [271/399/1] test_secrets passed -- running: test_concurrent_futures (47 sec 135 ms), test_lib2to3 (32 sec 195 ms), test_io (33 sec 461 ms)
0:00:54 load avg: 7.79 [272/399/1] test_script_helper passed -- running: test_concurrent_futures (47 sec 164 ms), test_lib2to3 (32 sec 224 ms), test_io (33 sec 490 ms)
0:00:56 load avg: 7.79 [273/399/1] test_set passed -- running: test_concurrent_futures (48 sec 847 ms), test_lib2to3 (33 sec 908 ms), test_io (35 sec 173 ms)
0:00:56 load avg: 7.79 [274/399/1] test_setcomps passed -- running: test_concurrent_futures (49 sec 32 ms), test_lib2to3 (34 sec 93 ms), test_io (35 sec 358 ms)
0:00:59 load avg: 7.47 [275/399/1] test_shelve passed -- running: test_concurrent_futures (51 sec 231 ms), test_lib2to3 (36 sec 291 ms), test_io (37 sec 557 ms)
0:00:59 load avg: 7.47 [276/399/1] test_shlex passed -- running: test_concurrent_futures (51 sec 447 ms), test_lib2to3 (36 sec 507 ms), test_io (37 sec 772 ms)
0:00:59 load avg: 7.47 [277/399/1] test_shutil passed -- running: test_concurrent_futures (52 sec 18 ms), test_lib2to3 (37 sec 78 ms), test_io (38 sec 343 ms)
0:01:01 load avg: 7.47 [278/399/1] test_regrtest passed -- running: test_concurrent_futures (53 sec 507 ms), test_lib2to3 (38 sec 568 ms), test_io (39 sec 833 ms)
0:01:01 load avg: 7.47 [279/399/1] test_io passed (39 sec 906 ms) -- running: test_multiprocessing_forkserver (30 sec 129 ms), test_multiprocessing_fork (30 sec 234 ms), test_concurrent_futures (53 sec 760 ms), test_lib2to3 (38 sec 820 ms)
0:01:01 load avg: 7.47 [280/399/1] test_slice passed -- running: test_multiprocessing_forkserver (30 sec 215 ms), test_multiprocessing_fork (30 sec 320 ms), test_concurrent_futures (53 sec 846 ms), test_lib2to3 (38 sec 906 ms)
0:01:01 load avg: 7.47 [281/399/1] test_smtpd passed -- running: test_multiprocessing_forkserver (30 sec 390 ms), test_multiprocessing_fork (30 sec 495 ms), test_concurrent_futures (54 sec 21 ms), test_lib2to3 (39 sec 81 ms)
0:01:02 load avg: 7.47 [282/399/1] test_smtpnet passed -- running: test_multiprocessing_forkserver (30 sec 608 ms), test_multiprocessing_fork (30 sec 714 ms), test_concurrent_futures (54 sec 239 ms), test_lib2to3 (39 sec 300 ms)
0:01:02 load avg: 7.47 [283/399/1] test_sndhdr passed -- running: test_multiprocessing_forkserver (30 sec 805 ms), test_multiprocessing_fork (30 sec 910 ms), test_concurrent_futures (54 sec 436 ms), test_lib2to3 (39 sec 496 ms)
0:01:02 load avg: 7.47 [284/399/1] test_smtplib passed -- running: test_multiprocessing_forkserver (31 sec 579 ms), test_multiprocessing_fork (31 sec 684 ms), test_concurrent_futures (55 sec 210 ms), test_lib2to3 (40 sec 270 ms), test_multiprocessing_spawn (30 sec 575 ms)
0:01:03 load avg: 7.47 [285/399/1] test_socketserver passed -- running: test_multiprocessing_forkserver (31 sec 617 ms), test_multiprocessing_fork (31 sec 722 ms), test_concurrent_futures (55 sec 248 ms), test_lib2to3 (40 sec 308 ms), test_multiprocessing_spawn (30 sec 613 ms)
0:01:03 load avg: 7.35 [286/399/1] test_sort passed -- running: test_multiprocessing_forkserver (31 sec 908 ms), test_multiprocessing_fork (32 sec 14 ms), test_concurrent_futures (55 sec 539 ms), test_lib2to3 (40 sec 600 ms), test_multiprocessing_spawn (30 sec 904 ms)
0:01:03 load avg: 7.35 [287/399/1] test_spwd passed -- running: test_multiprocessing_forkserver (32 sec 95 ms), test_multiprocessing_fork (32 sec 200 ms), test_concurrent_futures (55 sec 726 ms), test_lib2to3 (40 sec 787 ms), test_multiprocessing_spawn (31 sec 91 ms)
0:01:03 load avg: 7.35 [288/399/1] test_source_encoding passed -- running: test_multiprocessing_forkserver (32 sec 265 ms), test_multiprocessing_fork (32 sec 370 ms), test_concurrent_futures (55 sec 896 ms), test_lib2to3 (40 sec 956 ms), test_multiprocessing_spawn (31 sec 261 ms)
0:01:03 load avg: 7.35 [289/399/1] test_startfile skipped -- running: test_multiprocessing_forkserver (32 sec 445 ms), test_multiprocessing_fork (32 sec 550 ms), test_concurrent_futures (56 sec 76 ms), test_lib2to3 (41 sec 137 ms), test_multiprocessing_spawn (31 sec 441 ms)
test_startfile skipped -- object <module 'os' from '/tmp/B.Erzm73/BUILD/Python-3.7.1/Lib/os.py'> has no attribute 'startfile'
0:01:04 load avg: 7.35 [290/399/1] test_stat passed -- running: test_multiprocessing_forkserver (32 sec 637 ms), test_multiprocessing_fork (32 sec 742 ms), test_concurrent_futures (56 sec 268 ms), test_lib2to3 (41 sec 328 ms), test_multiprocessing_spawn (31 sec 633 ms)
0:01:04 load avg: 7.35 [291/399/1] test_sqlite passed -- running: test_multiprocessing_forkserver (32 sec 894 ms), test_multiprocessing_fork (33 sec), test_concurrent_futures (56 sec 525 ms), test_lib2to3 (41 sec 586 ms), test_multiprocessing_spawn (31 sec 890 ms)
0:01:04 load avg: 7.35 [292/399/1] test_strftime passed -- running: test_multiprocessing_forkserver (33 sec 452 ms), test_multiprocessing_fork (33 sec 557 ms), test_concurrent_futures (57 sec 83 ms), test_lib2to3 (42 sec 143 ms), test_multiprocessing_spawn (32 sec 448 ms)
0:01:05 load avg: 7.35 [293/399/1] test_string passed -- running: test_multiprocessing_forkserver (33 sec 663 ms), test_multiprocessing_fork (33 sec 768 ms), test_concurrent_futures (57 sec 294 ms), test_lib2to3 (42 sec 354 ms), test_multiprocessing_spawn (32 sec 659 ms)
0:01:05 load avg: 7.35 [294/399/1] test_statistics passed -- running: test_multiprocessing_forkserver (33 sec 802 ms), test_multiprocessing_fork (33 sec 907 ms), test_concurrent_futures (57 sec 433 ms), test_lib2to3 (42 sec 493 ms), test_multiprocessing_spawn (32 sec 798 ms)
0:01:05 load avg: 7.35 [295/399/1] test_string_literals passed -- running: test_multiprocessing_forkserver (33 sec 984 ms), test_multiprocessing_fork (34 sec 89 ms), test_concurrent_futures (57 sec 614 ms), test_lib2to3 (42 sec 675 ms), test_multiprocessing_spawn (32 sec 980 ms)
0:01:05 load avg: 7.35 [296/399/1] test_stringprep passed -- running: test_multiprocessing_forkserver (34 sec 80 ms), test_multiprocessing_fork (34 sec 185 ms), test_concurrent_futures (57 sec 711 ms), test_lib2to3 (42 sec 771 ms), test_multiprocessing_spawn (33 sec 76 ms)
0:01:05 load avg: 7.35 [297/399/1] test_strptime passed -- running: test_multiprocessing_forkserver (34 sec 277 ms), test_multiprocessing_fork (34 sec 383 ms), test_concurrent_futures (57 sec 908 ms), test_lib2to3 (42 sec 969 ms), test_multiprocessing_spawn (33 sec 273 ms)
0:01:05 load avg: 7.35 [298/399/1] test_select passed -- running: test_multiprocessing_forkserver (34 sec 564 ms), test_multiprocessing_fork (34 sec 669 ms), test_concurrent_futures (58 sec 194 ms), test_lib2to3 (43 sec 255 ms), test_multiprocessing_spawn (33 sec 560 ms)
0:01:06 load avg: 7.35 [299/399/1] test_structmembers passed -- running: test_multiprocessing_forkserver (34 sec 763 ms), test_multiprocessing_fork (34 sec 869 ms), test_concurrent_futures (58 sec 394 ms), test_lib2to3 (43 sec 455 ms), test_multiprocessing_spawn (33 sec 759 ms)
0:01:06 load avg: 7.35 [300/399/1] test_structseq passed -- running: test_multiprocessing_forkserver (34 sec 950 ms), test_multiprocessing_fork (35 sec 55 ms), test_concurrent_futures (58 sec 581 ms), test_lib2to3 (43 sec 641 ms), test_multiprocessing_spawn (33 sec 946 ms)
0:01:06 load avg: 7.35 [301/399/1] test_subclassinit passed -- running: test_multiprocessing_forkserver (35 sec 124 ms), test_multiprocessing_fork (35 sec 229 ms), test_concurrent_futures (58 sec 754 ms), test_lib2to3 (43 sec 815 ms), test_multiprocessing_spawn (34 sec 119 ms)
0:01:06 load avg: 7.35 [302/399/1] test_struct passed -- running: test_multiprocessing_forkserver (35 sec 317 ms), test_multiprocessing_fork (35 sec 422 ms), test_concurrent_futures (58 sec 948 ms), test_lib2to3 (44 sec 8 ms), test_multiprocessing_spawn (34 sec 313 ms)
0:01:06 load avg: 7.35 [303/399/1] test_sunau passed -- running: test_multiprocessing_forkserver (35 sec 560 ms), test_multiprocessing_fork (35 sec 665 ms), test_concurrent_futures (59 sec 191 ms), test_lib2to3 (44 sec 251 ms), test_multiprocessing_spawn (34 sec 556 ms)
0:01:07 load avg: 7.35 [304/399/1] test_sundry passed -- running: test_multiprocessing_forkserver (35 sec 788 ms), test_multiprocessing_fork (35 sec 893 ms), test_concurrent_futures (59 sec 419 ms), test_lib2to3 (44 sec 479 ms), test_multiprocessing_spawn (34 sec 784 ms)
0:01:07 load avg: 7.35 [305/399/1] test_strtod passed -- running: test_multiprocessing_forkserver (35 sec 813 ms), test_multiprocessing_fork (35 sec 918 ms), test_concurrent_futures (59 sec 444 ms), test_lib2to3 (44 sec 504 ms), test_multiprocessing_spawn (34 sec 809 ms)
0:01:07 load avg: 7.35 [306/399/1] test_super passed -- running: test_multiprocessing_forkserver (35 sec 995 ms), test_multiprocessing_fork (36 sec 100 ms), test_concurrent_futures (59 sec 626 ms), test_lib2to3 (44 sec 686 ms), test_multiprocessing_spawn (34 sec 991 ms)
0:01:07 load avg: 7.35 [307/399/1] test_symbol passed -- running: test_multiprocessing_forkserver (36 sec 48 ms), test_multiprocessing_fork (36 sec 153 ms), test_concurrent_futures (59 sec 679 ms), test_lib2to3 (44 sec 739 ms), test_multiprocessing_spawn (35 sec 44 ms)
0:01:07 load avg: 7.35 [308/399/1] test_symtable passed -- running: test_multiprocessing_forkserver (36 sec 191 ms), test_multiprocessing_fork (36 sec 296 ms), test_concurrent_futures (59 sec 821 ms), test_lib2to3 (44 sec 882 ms), test_multiprocessing_spawn (35 sec 187 ms)
0:01:07 load avg: 7.35 [309/399/1] test_syntax passed -- running: test_multiprocessing_forkserver (36 sec 283 ms), test_multiprocessing_fork (36 sec 388 ms), test_concurrent_futures (59 sec 913 ms), test_lib2to3 (44 sec 974 ms), test_multiprocessing_spawn (35 sec 279 ms)
0:01:07 load avg: 7.35 [310/399/1] test_sys_setprofile passed -- running: test_multiprocessing_forkserver (36 sec 471 ms), test_multiprocessing_fork (36 sec 576 ms), test_concurrent_futures (1 min 102 ms), test_lib2to3 (45 sec 162 ms), test_multiprocessing_spawn (35 sec 467 ms)
0:01:08 load avg: 7.35 [311/399/1] test_sys_settrace passed -- running: test_multiprocessing_forkserver (36 sec 786 ms), test_multiprocessing_fork (36 sec 891 ms), test_concurrent_futures (1 min 417 ms), test_lib2to3 (45 sec 478 ms), test_multiprocessing_spawn (35 sec 782 ms)
0:01:08 load avg: 7.07 [312/399/1] test_sysconfig passed -- running: test_multiprocessing_forkserver (37 sec 125 ms), test_multiprocessing_fork (37 sec 230 ms), test_concurrent_futures (1 min 756 ms), test_lib2to3 (45 sec 816 ms), test_multiprocessing_spawn (36 sec 121 ms)
0:01:08 load avg: 7.07 [313/399/1] test_syslog passed -- running: test_multiprocessing_forkserver (37 sec 313 ms), test_multiprocessing_fork (37 sec 418 ms), test_concurrent_futures (1 min 944 ms), test_lib2to3 (46 sec 4 ms), test_multiprocessing_spawn (36 sec 309 ms)
0:01:09 load avg: 7.07 [314/399/1] test_sys passed -- running: test_multiprocessing_forkserver (37 sec 905 ms), test_multiprocessing_fork (38 sec 10 ms), test_concurrent_futures (1 min 1 sec), test_lib2to3 (46 sec 596 ms), test_multiprocessing_spawn (36 sec 901 ms)
0:01:09 load avg: 7.07 [315/399/1] test_tcl passed -- running: test_multiprocessing_forkserver (38 sec 250 ms), test_multiprocessing_fork (38 sec 356 ms), test_concurrent_futures (1 min 1 sec), test_lib2to3 (46 sec 942 ms), test_multiprocessing_spawn (37 sec 247 ms)
0:01:10 load avg: 7.07 [316/399/1] test_telnetlib passed -- running: test_multiprocessing_forkserver (38 sec 595 ms), test_multiprocessing_fork (38 sec 700 ms), test_concurrent_futures (1 min 2 sec), test_lib2to3 (47 sec 287 ms), test_multiprocessing_spawn (37 sec 591 ms)
0:01:10 load avg: 7.07 [317/399/1] test_tempfile passed -- running: test_multiprocessing_forkserver (39 sec 511 ms), test_multiprocessing_fork (39 sec 616 ms), test_concurrent_futures (1 min 3 sec), test_lib2to3 (48 sec 202 ms), test_multiprocessing_spawn (38 sec 506 ms)
0:01:11 load avg: 7.07 [318/399/1] test_textwrap passed -- running: test_multiprocessing_forkserver (39 sec 717 ms), test_multiprocessing_fork (39 sec 822 ms), test_concurrent_futures (1 min 3 sec), test_lib2to3 (48 sec 408 ms), test_multiprocessing_spawn (38 sec 713 ms)
0:01:12 load avg: 7.07 [319/399/1] test_thread passed -- running: test_multiprocessing_forkserver (40 sec 606 ms), test_multiprocessing_fork (40 sec 711 ms), test_concurrent_futures (1 min 4 sec), test_lib2to3 (49 sec 297 ms), test_multiprocessing_spawn (39 sec 602 ms)
0:01:13 load avg: 7.07 [320/399/1] test_threaded_import passed -- running: test_multiprocessing_forkserver (41 sec 743 ms), test_multiprocessing_fork (41 sec 848 ms), test_concurrent_futures (1 min 5 sec), test_lib2to3 (50 sec 435 ms), test_multiprocessing_spawn (40 sec 739 ms)
0:01:13 load avg: 7.31 [321/399/1] test_threadedtempfile passed -- running: test_multiprocessing_forkserver (42 sec 45 ms), test_multiprocessing_fork (42 sec 150 ms), test_concurrent_futures (1 min 5 sec), test_lib2to3 (50 sec 736 ms), test_multiprocessing_spawn (41 sec 41 ms)
0:01:15 load avg: 7.31 [322/399/1] test_lib2to3 passed (52 sec 80 ms) -- running: test_multiprocessing_forkserver (43 sec 603 ms), test_multiprocessing_fork (43 sec 708 ms), test_concurrent_futures (1 min 7 sec), test_multiprocessing_spawn (42 sec 599 ms)
0:01:15 load avg: 7.31 [323/399/1] test_selectors passed -- running: test_multiprocessing_forkserver (43 sec 934 ms), test_multiprocessing_fork (44 sec 39 ms), test_concurrent_futures (1 min 7 sec), test_multiprocessing_spawn (42 sec 930 ms)
0:01:15 load avg: 7.31 [324/399/1] test_threading_local passed -- running: test_multiprocessing_forkserver (44 sec 44 ms), test_multiprocessing_fork (44 sec 150 ms), test_concurrent_futures (1 min 7 sec), test_multiprocessing_spawn (43 sec 40 ms)
0:01:15 load avg: 7.31 [325/399/1] test_timeit passed -- running: test_multiprocessing_forkserver (44 sec 296 ms), test_multiprocessing_fork (44 sec 401 ms), test_concurrent_futures (1 min 7 sec), test_multiprocessing_spawn (43 sec 292 ms)
0:01:16 load avg: 7.31 [326/399/1] test_tarfile passed -- running: test_multiprocessing_forkserver (45 sec 282 ms), test_multiprocessing_fork (45 sec 387 ms), test_concurrent_futures (1 min 8 sec), test_multiprocessing_spawn (44 sec 278 ms)
0:01:16 load avg: 7.31 [327/399/1] test_tix skipped (resource denied) -- running: test_multiprocessing_forkserver (45 sec 461 ms), test_multiprocessing_fork (45 sec 566 ms), test_concurrent_futures (1 min 9 sec), test_multiprocessing_spawn (44 sec 457 ms)
test_tix skipped -- Use of the 'gui' resource not enabled
0:01:17 load avg: 7.31 [328/399/1] test_tk skipped (resource denied) -- running: test_multiprocessing_forkserver (45 sec 632 ms), test_multiprocessing_fork (45 sec 737 ms), test_concurrent_futures (1 min 9 sec), test_multiprocessing_spawn (44 sec 628 ms)
test_tk skipped -- Use of the 'gui' resource not enabled
0:01:17 load avg: 7.31 [329/399/1] test_timeout passed -- running: test_multiprocessing_forkserver (45 sec 988 ms), test_multiprocessing_fork (46 sec 93 ms), test_concurrent_futures (1 min 9 sec), test_multiprocessing_spawn (44 sec 984 ms)
0:01:20 load avg: 6.95 [330/399/1] test_threadsignals passed -- running: test_multiprocessing_forkserver (48 sec 972 ms), test_multiprocessing_fork (49 sec 77 ms), test_concurrent_futures (1 min 12 sec), test_multiprocessing_spawn (47 sec 968 ms)
0:01:22 load avg: 6.95 [331/399/1] test_signal passed -- running: test_multiprocessing_forkserver (51 sec 259 ms), test_multiprocessing_fork (51 sec 364 ms), test_concurrent_futures (1 min 14 sec), test_multiprocessing_spawn (50 sec 255 ms)
0:01:23 load avg: 7.29 [332/399/1] test_traceback passed -- running: test_multiprocessing_forkserver (52 sec 421 ms), test_multiprocessing_fork (52 sec 526 ms), test_concurrent_futures (1 min 16 sec), test_multiprocessing_spawn (51 sec 417 ms)
0:01:24 load avg: 7.29 [333/399/1] test_threading passed -- running: test_multiprocessing_forkserver (53 sec 18 ms), test_multiprocessing_fork (53 sec 123 ms), test_concurrent_futures (1 min 16 sec), test_multiprocessing_spawn (52 sec 14 ms)
0:01:24 load avg: 7.29 [334/399/1] test_ttk_guionly skipped (resource denied) -- running: test_multiprocessing_forkserver (53 sec 207 ms), test_multiprocessing_fork (53 sec 312 ms), test_concurrent_futures (1 min 16 sec), test_multiprocessing_spawn (52 sec 202 ms)
test_ttk_guionly skipped -- Use of the 'gui' resource not enabled
0:01:24 load avg: 7.29 [335/399/1] test_tracemalloc passed -- running: test_multiprocessing_forkserver (53 sec 360 ms), test_multiprocessing_fork (53 sec 465 ms), test_concurrent_futures (1 min 16 sec), test_multiprocessing_spawn (52 sec 356 ms)
0:01:24 load avg: 7.29 [336/399/1] test_ttk_textonly passed -- running: test_multiprocessing_forkserver (53 sec 538 ms), test_multiprocessing_fork (53 sec 643 ms), test_concurrent_futures (1 min 17 sec), test_multiprocessing_spawn (52 sec 534 ms)
0:01:25 load avg: 7.29 [337/399/1] test_turtle passed -- running: test_multiprocessing_forkserver (53 sec 819 ms), test_multiprocessing_fork (53 sec 924 ms), test_concurrent_futures (1 min 17 sec), test_multiprocessing_spawn (52 sec 815 ms)
0:01:25 load avg: 7.29 [338/399/1] test_typechecks passed -- running: test_multiprocessing_forkserver (54 sec 219 ms), test_multiprocessing_fork (54 sec 324 ms), test_concurrent_futures (1 min 17 sec), test_multiprocessing_spawn (53 sec 215 ms)
0:01:25 load avg: 7.29 [339/399/1] test_tuple passed -- running: test_multiprocessing_forkserver (54 sec 394 ms), test_multiprocessing_fork (54 sec 499 ms), test_concurrent_futures (1 min 18 sec), test_multiprocessing_spawn (53 sec 390 ms)
0:01:25 load avg: 7.29 [340/399/1] test_typing passed -- running: test_multiprocessing_forkserver (54 sec 593 ms), test_multiprocessing_fork (54 sec 698 ms), test_concurrent_futures (1 min 18 sec), test_multiprocessing_spawn (53 sec 589 ms)
0:01:26 load avg: 7.29 [341/399/1] test_unary passed -- running: test_multiprocessing_forkserver (54 sec 780 ms), test_multiprocessing_fork (54 sec 885 ms), test_concurrent_futures (1 min 18 sec), test_multiprocessing_spawn (53 sec 776 ms)
0:01:26 load avg: 7.29 [342/399/1] test_ucn passed -- running: test_multiprocessing_forkserver (54 sec 999 ms), test_multiprocessing_fork (55 sec 104 ms), test_concurrent_futures (1 min 18 sec), test_multiprocessing_spawn (53 sec 995 ms)
fetching http://www.pythontest.net/unicode/11.0.0/NamedSequences.txt ...
0:01:26 load avg: 7.29 [343/399/1] test_unicode_file passed -- running: test_multiprocessing_forkserver (55 sec 202 ms), test_multiprocessing_fork (55 sec 307 ms), test_concurrent_futures (1 min 18 sec), test_multiprocessing_spawn (54 sec 198 ms)
0:01:27 load avg: 7.29 [344/399/1] test_unicode_file_functions passed -- running: test_multiprocessing_forkserver (55 sec 662 ms), test_multiprocessing_fork (55 sec 767 ms), test_concurrent_futures (1 min 19 sec), test_multiprocessing_spawn (54 sec 658 ms)
0:01:27 load avg: 7.29 [345/399/1] test_trace passed -- running: test_multiprocessing_forkserver (55 sec 804 ms), test_multiprocessing_fork (55 sec 909 ms), test_concurrent_futures (1 min 19 sec), test_multiprocessing_spawn (54 sec 800 ms)
0:01:27 load avg: 7.29 [346/399/1] test_unicode_identifiers passed -- running: test_multiprocessing_forkserver (55 sec 864 ms), test_multiprocessing_fork (55 sec 969 ms), test_concurrent_futures (1 min 19 sec), test_multiprocessing_spawn (54 sec 860 ms)
0:01:27 load avg: 7.29 [347/399/1] test_univnewlines passed -- running: test_multiprocessing_forkserver (56 sec 66 ms), test_multiprocessing_fork (56 sec 171 ms), test_concurrent_futures (1 min 19 sec), test_multiprocessing_spawn (55 sec 62 ms)
0:01:27 load avg: 7.29 [348/399/1] test_unpack passed -- running: test_multiprocessing_forkserver (56 sec 256 ms), test_multiprocessing_fork (56 sec 361 ms), test_concurrent_futures (1 min 19 sec), test_multiprocessing_spawn (55 sec 252 ms)
0:01:27 load avg: 7.29 [349/399/1] test_unpack_ex passed -- running: test_multiprocessing_forkserver (56 sec 468 ms), test_multiprocessing_fork (56 sec 573 ms), test_concurrent_futures (1 min 20 sec), test_multiprocessing_spawn (55 sec 464 ms)
0:01:28 load avg: 7.29 [350/399/1] test_urllib passed -- running: test_multiprocessing_forkserver (56 sec 807 ms), test_multiprocessing_fork (56 sec 912 ms), test_concurrent_futures (1 min 20 sec), test_multiprocessing_spawn (55 sec 803 ms)
0:01:28 load avg: 7.43 [351/399/1] test_unicode passed -- running: test_multiprocessing_forkserver (56 sec 915 ms), test_multiprocessing_fork (57 sec 20 ms), test_concurrent_futures (1 min 20 sec), test_multiprocessing_spawn (55 sec 911 ms)
0:01:28 load avg: 7.43 [352/399/1] test_urllib2 passed -- running: test_multiprocessing_forkserver (57 sec 239 ms), test_multiprocessing_fork (57 sec 344 ms), test_concurrent_futures (1 min 20 sec), test_multiprocessing_spawn (56 sec 235 ms)
0:01:28 load avg: 7.43 [353/399/1] test_urllib2_localnet passed -- running: test_multiprocessing_forkserver (57 sec 429 ms), test_multiprocessing_fork (57 sec 534 ms), test_concurrent_futures (1 min 21 sec), test_multiprocessing_spawn (56 sec 425 ms)
0:01:29 load avg: 7.43 [354/399/1] test_urllib_response passed -- running: test_multiprocessing_forkserver (57 sec 607 ms), test_multiprocessing_fork (57 sec 712 ms), test_concurrent_futures (1 min 21 sec), test_multiprocessing_spawn (56 sec 603 ms)
0:01:29 load avg: 7.43 [355/399/1] test_urllib2net passed -- running: test_multiprocessing_forkserver (57 sec 834 ms), test_multiprocessing_fork (57 sec 939 ms), test_concurrent_futures (1 min 21 sec), test_multiprocessing_spawn (56 sec 830 ms)
0:01:29 load avg: 7.43 [356/399/1] test_urllibnet passed -- running: test_multiprocessing_forkserver (57 sec 973 ms), test_multiprocessing_fork (58 sec 78 ms), test_concurrent_futures (1 min 21 sec), test_multiprocessing_spawn (56 sec 969 ms)
0:01:29 load avg: 7.43 [357/399/1] test_urlparse passed -- running: test_multiprocessing_forkserver (58 sec 395 ms), test_multiprocessing_fork (58 sec 501 ms), test_concurrent_futures (1 min 22 sec), test_multiprocessing_spawn (57 sec 391 ms)
0:01:29 load avg: 7.43 [358/399/1] test_userdict passed -- running: test_multiprocessing_forkserver (58 sec 555 ms), test_multiprocessing_fork (58 sec 660 ms), test_concurrent_futures (1 min 22 sec), test_multiprocessing_spawn (57 sec 551 ms)
0:01:30 load avg: 7.43 [359/399/1] test_userlist passed -- running: test_multiprocessing_forkserver (58 sec 828 ms), test_multiprocessing_fork (58 sec 933 ms), test_concurrent_futures (1 min 22 sec), test_multiprocessing_spawn (57 sec 824 ms)
0:01:32 load avg: 7.43 [360/399/1] test_utf8_mode passed -- running: test_multiprocessing_forkserver (1 min 622 ms), test_multiprocessing_fork (1 min 727 ms), test_concurrent_futures (1 min 24 sec), test_multiprocessing_spawn (59 sec 618 ms)
0:01:32 load avg: 7.43 [361/399/1] test_unicodedata passed -- running: test_multiprocessing_forkserver (1 min 638 ms), test_multiprocessing_fork (1 min 743 ms), test_concurrent_futures (1 min 24 sec), test_multiprocessing_spawn (59 sec 634 ms)
0:01:32 load avg: 7.43 [362/399/1] test_utf8source passed -- running: test_multiprocessing_forkserver (1 min 808 ms), test_multiprocessing_fork (1 min 913 ms), test_concurrent_futures (1 min 24 sec), test_multiprocessing_spawn (59 sec 804 ms)
0:01:32 load avg: 7.43 [363/399/1] test_uu passed -- running: test_multiprocessing_forkserver (1 min 825 ms), test_multiprocessing_fork (1 min 930 ms), test_concurrent_futures (1 min 24 sec), test_multiprocessing_spawn (59 sec 821 ms)
0:01:32 load avg: 7.43 [364/399/1] test_userstring passed -- running: test_multiprocessing_forkserver (1 min 919 ms), test_multiprocessing_fork (1 min 1 sec), test_concurrent_futures (1 min 24 sec), test_multiprocessing_spawn (59 sec 915 ms)
0:01:32 load avg: 7.43 [365/399/1] test_uuid passed -- running: test_multiprocessing_forkserver (1 min 1 sec), test_multiprocessing_fork (1 min 1 sec), test_concurrent_futures (1 min 24 sec), test_multiprocessing_spawn (1 min 171 ms)
0:01:38 load avg: 6.88 [366/399/1] test_wait3 passed -- running: test_multiprocessing_forkserver (1 min 7 sec), test_multiprocessing_fork (1 min 7 sec), test_concurrent_futures (1 min 30 sec), test_multiprocessing_spawn (1 min 6 sec), test_subprocess (32 sec 3 ms)
0:01:38 load avg: 6.88 [367/399/1] test_wait4 passed -- running: test_multiprocessing_forkserver (1 min 7 sec), test_multiprocessing_fork (1 min 7 sec), test_concurrent_futures (1 min 30 sec), test_multiprocessing_spawn (1 min 6 sec), test_subprocess (32 sec 244 ms)
0:01:39 load avg: 6.88 [368/399/1] test_wave passed -- running: test_multiprocessing_forkserver (1 min 7 sec), test_multiprocessing_fork (1 min 7 sec), test_concurrent_futures (1 min 31 sec), test_multiprocessing_spawn (1 min 6 sec), test_subprocess (32 sec 481 ms)
0:01:39 load avg: 6.88 [369/399/1] test_warnings passed -- running: test_multiprocessing_forkserver (1 min 7 sec), test_multiprocessing_fork (1 min 7 sec), test_concurrent_futures (1 min 31 sec), test_multiprocessing_spawn (1 min 6 sec), test_subprocess (32 sec 626 ms)
0:01:39 load avg: 6.88 [370/399/1] test_weakset passed -- running: test_multiprocessing_forkserver (1 min 7 sec), test_multiprocessing_fork (1 min 8 sec), test_concurrent_futures (1 min 31 sec), test_multiprocessing_spawn (1 min 6 sec), test_subprocess (32 sec 864 ms)
0:01:39 load avg: 6.88 [371/399/1] test_webbrowser passed -- running: test_multiprocessing_forkserver (1 min 8 sec), test_multiprocessing_fork (1 min 8 sec), test_concurrent_futures (1 min 31 sec), test_multiprocessing_spawn (1 min 7 sec), test_subprocess (33 sec 126 ms)
0:01:39 load avg: 6.88 [372/399/1] test_winconsoleio skipped -- running: test_multiprocessing_forkserver (1 min 8 sec), test_multiprocessing_fork (1 min 8 sec), test_concurrent_futures (1 min 32 sec), test_multiprocessing_spawn (1 min 7 sec), test_subprocess (33 sec 335 ms)
test_winconsoleio skipped -- test only relevant on win32
0:01:40 load avg: 6.88 [373/399/1] test_winreg skipped -- running: test_multiprocessing_forkserver (1 min 8 sec), test_multiprocessing_fork (1 min 8 sec), test_concurrent_futures (1 min 32 sec), test_multiprocessing_spawn (1 min 7 sec), test_subprocess (33 sec 549 ms)
test_winreg skipped -- No module named 'winreg'
0:01:40 load avg: 6.88 [374/399/1] test_winsound skipped (resource denied) -- running: test_multiprocessing_forkserver (1 min 8 sec), test_multiprocessing_fork (1 min 9 sec), test_concurrent_futures (1 min 32 sec), test_multiprocessing_spawn (1 min 7 sec), test_subprocess (33 sec 839 ms)
test_winsound skipped -- Use of the 'audio' resource not enabled
0:01:40 load avg: 6.88 [375/399/1] test_with passed -- running: test_multiprocessing_forkserver (1 min 9 sec), test_multiprocessing_fork (1 min 9 sec), test_concurrent_futures (1 min 32 sec), test_multiprocessing_spawn (1 min 8 sec), test_subprocess (34 sec 153 ms)
0:01:41 load avg: 6.88 [376/399/1] test_wsgiref passed -- running: test_multiprocessing_forkserver (1 min 9 sec), test_multiprocessing_fork (1 min 9 sec), test_concurrent_futures (1 min 33 sec), test_multiprocessing_spawn (1 min 8 sec), test_subprocess (34 sec 495 ms)
0:01:41 load avg: 6.88 [377/399/1] test_xdrlib passed -- running: test_multiprocessing_forkserver (1 min 9 sec), test_multiprocessing_fork (1 min 9 sec), test_concurrent_futures (1 min 33 sec), test_multiprocessing_spawn (1 min 8 sec), test_subprocess (34 sec 692 ms)
0:01:41 load avg: 6.88 [378/399/1] test_subprocess passed (34 sec 585 ms) -- running: test_multiprocessing_forkserver (1 min 9 sec), test_multiprocessing_fork (1 min 9 sec), test_concurrent_futures (1 min 33 sec), test_multiprocessing_spawn (1 min 8 sec)
0:01:41 load avg: 6.88 [379/399/1] test_xml_dom_minicompat passed -- running: test_multiprocessing_forkserver (1 min 10 sec), test_multiprocessing_fork (1 min 10 sec), test_concurrent_futures (1 min 33 sec), test_multiprocessing_spawn (1 min 9 sec)
0:01:41 load avg: 6.88 [380/399/1] test_multiprocessing_fork passed (1 min 10 sec) -- running: test_multiprocessing_forkserver (1 min 10 sec), test_concurrent_futures (1 min 33 sec), test_multiprocessing_spawn (1 min 9 sec)
0:01:41 load avg: 6.88 [381/399/1] test_xml_etree passed -- running: test_multiprocessing_forkserver (1 min 10 sec), test_concurrent_futures (1 min 34 sec), test_multiprocessing_spawn (1 min 9 sec)
0:01:42 load avg: 6.88 [382/399/1] test_xmlrpc_net passed -- running: test_multiprocessing_forkserver (1 min 10 sec), test_concurrent_futures (1 min 34 sec), test_multiprocessing_spawn (1 min 9 sec)
0:01:42 load avg: 6.88 [383/399/1] test_xml_etree_c passed -- running: test_multiprocessing_forkserver (1 min 11 sec), test_concurrent_futures (1 min 34 sec), test_multiprocessing_spawn (1 min 10 sec)
0:01:42 load avg: 6.88 [384/399/1] test_xxtestfuzz passed -- running: test_multiprocessing_forkserver (1 min 11 sec), test_concurrent_futures (1 min 34 sec), test_multiprocessing_spawn (1 min 10 sec)
0:01:42 load avg: 6.88 [385/399/1] test_yield_from passed -- running: test_multiprocessing_forkserver (1 min 11 sec), test_concurrent_futures (1 min 34 sec), test_multiprocessing_spawn (1 min 10 sec)
0:01:42 load avg: 6.88 [386/399/1] test_zipapp passed -- running: test_multiprocessing_forkserver (1 min 11 sec), test_concurrent_futures (1 min 34 sec), test_multiprocessing_spawn (1 min 10 sec)
0:01:42 load avg: 6.88 [387/399/1] test_zipfile64 skipped (resource denied) -- running: test_multiprocessing_forkserver (1 min 11 sec), test_concurrent_futures (1 min 35 sec), test_multiprocessing_spawn (1 min 10 sec)
test_zipfile64 skipped -- test requires loads of disk-space bytes and a long time to run
0:01:43 load avg: 6.88 [388/399/1] test_weakref passed -- running: test_multiprocessing_forkserver (1 min 11 sec), test_concurrent_futures (1 min 35 sec), test_multiprocessing_spawn (1 min 10 sec)
0:01:43 load avg: 6.88 [389/399/1] test_zipimport passed -- running: test_multiprocessing_forkserver (1 min 11 sec), test_concurrent_futures (1 min 35 sec), test_multiprocessing_spawn (1 min 10 sec)
0:01:44 load avg: 7.23 [390/399/1] test_venv passed -- running: test_multiprocessing_forkserver (1 min 12 sec), test_concurrent_futures (1 min 36 sec), test_multiprocessing_spawn (1 min 11 sec)
0:01:44 load avg: 7.23 [391/399/1] test_zipimport_support passed -- running: test_multiprocessing_forkserver (1 min 12 sec), test_concurrent_futures (1 min 36 sec), test_multiprocessing_spawn (1 min 11 sec)
0:01:45 load avg: 7.23 [392/399/1] test_zlib passed -- running: test_multiprocessing_forkserver (1 min 13 sec), test_concurrent_futures (1 min 37 sec), test_multiprocessing_spawn (1 min 12 sec)
0:01:45 load avg: 7.23 [393/399/1] test_xmlrpc passed -- running: test_multiprocessing_forkserver (1 min 14 sec), test_concurrent_futures (1 min 37 sec), test_multiprocessing_spawn (1 min 13 sec)
0:01:49 load avg: 7.21 [394/399/1] test_multiprocessing_forkserver passed (1 min 17 sec) -- running: test_concurrent_futures (1 min 41 sec), test_tools (32 sec 78 ms), test_multiprocessing_spawn (1 min 17 sec), test_tokenize (32 sec 434 ms)
0:01:56 load avg: 6.94 [395/399/1] test_zipfile passed -- running: test_concurrent_futures (1 min 48 sec), test_tools (38 sec 613 ms), test_multiprocessing_spawn (1 min 23 sec), test_tokenize (38 sec 969 ms)
0:02:08 load avg: 6.14 [396/399/1] test_multiprocessing_spawn passed (1 min 35 sec) -- running: test_concurrent_futures (2 min 376 ms), test_tools (50 sec 758 ms), test_tokenize (51 sec 114 ms)
0:02:15 load avg: 5.48 [397/399/1] test_tools passed (57 sec 470 ms) -- running: test_concurrent_futures (2 min 7 sec), test_tokenize (58 sec 11 ms)
0:02:32 load avg: 4.45 [398/399/1] test_concurrent_futures passed (2 min 24 sec) -- running: test_tokenize (1 min 15 sec)
0:02:32 load avg: 4.45 [399/399/1] test_tokenize passed (1 min 15 sec)

== Tests result: FAILURE ==

385 tests OK.

1 test failed:
    test_imaplib

13 tests skipped:
    test_devpoll test_ioctl test_kqueue test_msilib test_ossaudiodev
    test_startfile test_tix test_tk test_ttk_guionly test_winconsoleio
    test_winreg test_winsound test_zipfile64

Re-running failed tests in verbose mode
Re-running test 'test_imaplib' in verbose mode
test_EOF_without_complete_welcome_message (test.test_imaplib.NewIMAPSSLTests) ... ok
test_aborted_authentication (test.test_imaplib.NewIMAPSSLTests) ... ok
test_bad_auth_name (test.test_imaplib.NewIMAPSSLTests) ... ok
test_certfile_arg_warn (test.test_imaplib.NewIMAPSSLTests) ... ok
test_enable_UTF8_True_append (test.test_imaplib.NewIMAPSSLTests) ... ok
test_enable_UTF8_raises_error_if_not_supported (test.test_imaplib.NewIMAPSSLTests) ... ok
test_enable_raises_error_if_no_capability (test.test_imaplib.NewIMAPSSLTests) ... ok
test_enable_raises_error_if_not_AUTH (test.test_imaplib.NewIMAPSSLTests) ... ok
test_invalid_authentication (test.test_imaplib.NewIMAPSSLTests) ... ok
test_line_termination (test.test_imaplib.NewIMAPSSLTests) ... ok
test_linetoolong (test.test_imaplib.NewIMAPSSLTests) ... ok
test_login (test.test_imaplib.NewIMAPSSLTests) ... ok
test_login_cram_md5_bytes (test.test_imaplib.NewIMAPSSLTests) ... ok
test_login_cram_md5_plain_text (test.test_imaplib.NewIMAPSSLTests) ... ok
test_logout (test.test_imaplib.NewIMAPSSLTests) ... ok
test_lsub (test.test_imaplib.NewIMAPSSLTests) ... ok
test_search_disallows_charset_in_utf8_mode (test.test_imaplib.NewIMAPSSLTests) ... ok
test_simple_with_statement (test.test_imaplib.NewIMAPSSLTests) ... ok
test_ssl_raises (test.test_imaplib.NewIMAPSSLTests) ... ok
test_ssl_verified (test.test_imaplib.NewIMAPSSLTests) ... ok
test_valid_authentication_bytes (test.test_imaplib.NewIMAPSSLTests) ... ok
test_valid_authentication_plain_text (test.test_imaplib.NewIMAPSSLTests) ... ok
test_with_statement (test.test_imaplib.NewIMAPSSLTests) ... ok
test_with_statement_logout (test.test_imaplib.NewIMAPSSLTests) ... ok
test_EOF_without_complete_welcome_message (test.test_imaplib.NewIMAPTests) ... ok
test_aborted_authentication (test.test_imaplib.NewIMAPTests) ... ok
test_bad_auth_name (test.test_imaplib.NewIMAPTests) ... ok
test_enable_UTF8_True_append (test.test_imaplib.NewIMAPTests) ... ok
test_enable_UTF8_raises_error_if_not_supported (test.test_imaplib.NewIMAPTests) ... ok
test_enable_raises_error_if_no_capability (test.test_imaplib.NewIMAPTests) ... ok
test_enable_raises_error_if_not_AUTH (test.test_imaplib.NewIMAPTests) ... ok
test_invalid_authentication (test.test_imaplib.NewIMAPTests) ... ok
test_line_termination (test.test_imaplib.NewIMAPTests) ... ok
test_linetoolong (test.test_imaplib.NewIMAPTests) ... ok
test_login (test.test_imaplib.NewIMAPTests) ... ok
test_login_cram_md5_bytes (test.test_imaplib.NewIMAPTests) ... ok
test_login_cram_md5_plain_text (test.test_imaplib.NewIMAPTests) ... ok
test_logout (test.test_imaplib.NewIMAPTests) ... ok
test_lsub (test.test_imaplib.NewIMAPTests) ... ok
test_search_disallows_charset_in_utf8_mode (test.test_imaplib.NewIMAPTests) ... ok
test_simple_with_statement (test.test_imaplib.NewIMAPTests) ... ok
test_valid_authentication_bytes (test.test_imaplib.NewIMAPTests) ... ok
test_valid_authentication_plain_text (test.test_imaplib.NewIMAPTests) ... ok
test_with_statement (test.test_imaplib.NewIMAPTests) ... ok
test_with_statement_logout (test.test_imaplib.NewIMAPTests) ... ok
test_logincapa (test.test_imaplib.RemoteIMAPTest) ... skipped "Resource 'cyrus.andrew.cmu.edu' is not available"
test_logout (test.test_imaplib.RemoteIMAPTest) ... skipped "Resource 'cyrus.andrew.cmu.edu' is not available"
test_logincapa (test.test_imaplib.RemoteIMAP_SSLTest) ... skipped "Resource 'cyrus.andrew.cmu.edu' is not available"
test_logout (test.test_imaplib.RemoteIMAP_SSLTest) ... skipped "Resource 'cyrus.andrew.cmu.edu' is not available"
test_ssl_context_certfile_exclusive (test.test_imaplib.RemoteIMAP_SSLTest) ... ok
test_ssl_context_keyfile_exclusive (test.test_imaplib.RemoteIMAP_SSLTest) ... ok
test_logincapa (test.test_imaplib.RemoteIMAP_STARTTLSTest) ... skipped "Resource 'cyrus.andrew.cmu.edu' is not available"
test_logout (test.test_imaplib.RemoteIMAP_STARTTLSTest) ... skipped "Resource 'cyrus.andrew.cmu.edu' is not available"
test_Internaldate2tuple (test.test_imaplib.TestImaplib) ... ok
test_Internaldate2tuple_issue10941 (test.test_imaplib.TestImaplib) ... ok
test_Time2Internaldate (test.test_imaplib.TestImaplib) ... ok
test_imap4_host_default_value (test.test_imaplib.TestImaplib) ... FAIL
test_that_Time2Internaldate_returns_a_result (test.test_imaplib.TestImaplib) ... ok
test_aborted_authentication (test.test_imaplib.ThreadedNetworkedTests) ... ok
test_bad_auth_name (test.test_imaplib.ThreadedNetworkedTests) ... ok
test_bracket_flags (test.test_imaplib.ThreadedNetworkedTests) ... ok
test_connect (test.test_imaplib.ThreadedNetworkedTests) ... ok
test_enable_UTF8_True_append (test.test_imaplib.ThreadedNetworkedTests) ... ok
test_enable_UTF8_raises_error_if_not_supported (test.test_imaplib.ThreadedNetworkedTests) ... ok
test_enable_raises_error_if_no_capability (test.test_imaplib.ThreadedNetworkedTests) ... ok
test_enable_raises_error_if_not_AUTH (test.test_imaplib.ThreadedNetworkedTests) ... ok
test_invalid_authentication (test.test_imaplib.ThreadedNetworkedTests) ... ok
test_issue5949 (test.test_imaplib.ThreadedNetworkedTests) ... ok
test_line_termination (test.test_imaplib.ThreadedNetworkedTests) ... ok
test_linetoolong (test.test_imaplib.ThreadedNetworkedTests) ... ok
test_login_cram_md5 (test.test_imaplib.ThreadedNetworkedTests) ... ok
test_search_disallows_charset_in_utf8_mode (test.test_imaplib.ThreadedNetworkedTests) ... ok
test_simple_with_statement (test.test_imaplib.ThreadedNetworkedTests) ... ok
test_valid_authentication (test.test_imaplib.ThreadedNetworkedTests) ... ok
test_with_statement (test.test_imaplib.ThreadedNetworkedTests) ... ok
test_with_statement_logout (test.test_imaplib.ThreadedNetworkedTests) ... ok
test_aborted_authentication (test.test_imaplib.ThreadedNetworkedTestsSSL) ... ok
test_bad_auth_name (test.test_imaplib.ThreadedNetworkedTestsSSL) ... ok
test_bracket_flags (test.test_imaplib.ThreadedNetworkedTestsSSL) ... ok
test_connect (test.test_imaplib.ThreadedNetworkedTestsSSL) ... ok
test_enable_UTF8_True_append (test.test_imaplib.ThreadedNetworkedTestsSSL) ... ok
test_enable_UTF8_raises_error_if_not_supported (test.test_imaplib.ThreadedNetworkedTestsSSL) ... ok
test_enable_raises_error_if_no_capability (test.test_imaplib.ThreadedNetworkedTestsSSL) ... ok
test_enable_raises_error_if_not_AUTH (test.test_imaplib.ThreadedNetworkedTestsSSL) ... ok
test_invalid_authentication (test.test_imaplib.ThreadedNetworkedTestsSSL) ... ok
test_issue5949 (test.test_imaplib.ThreadedNetworkedTestsSSL) ... ok
test_line_termination (test.test_imaplib.ThreadedNetworkedTestsSSL) ... ok
test_linetoolong (test.test_imaplib.ThreadedNetworkedTestsSSL) ... ok
test_login_cram_md5 (test.test_imaplib.ThreadedNetworkedTestsSSL) ... ok
test_search_disallows_charset_in_utf8_mode (test.test_imaplib.ThreadedNetworkedTestsSSL) ... ok
test_simple_with_statement (test.test_imaplib.ThreadedNetworkedTestsSSL) ... ok
test_ssl_verified (test.test_imaplib.ThreadedNetworkedTestsSSL) ... ok
test_valid_authentication (test.test_imaplib.ThreadedNetworkedTestsSSL) ... ok
test_with_statement (test.test_imaplib.ThreadedNetworkedTestsSSL) ... ok
test_with_statement_logout (test.test_imaplib.ThreadedNetworkedTestsSSL) ... test test_imaplib failed
ok

======================================================================
FAIL: test_imap4_host_default_value (test.test_imaplib.TestImaplib)
----------------------------------------------------------------------
Traceback (most recent call last):
  File "/tmp/B.Erzm73/BUILD/Python-3.7.1/Lib/test/test_imaplib.py", line 84, in test_imap4_host_default_value
    self.assertIn(cm.exception.errno, expected_errnos)
AssertionError: 97 not found in [111, 99]

----------------------------------------------------------------------

Ran 95 tests in 9.737s

FAILED (failures=1, skipped=6)
1 test failed again:
    test_imaplib

== Tests result: FAILURE then FAILURE ==

385 tests OK.

1 test failed:
    test_imaplib

13 tests skipped:
    test_devpoll test_ioctl test_kqueue test_msilib test_ossaudiodev
    test_startfile test_tix test_tk test_ttk_guionly test_winconsoleio
    test_winreg test_winsound test_zipfile64

1 re-run test:
    test_imaplib

Total duration: 2 min 42 sec
Tests result: FAILURE then FAILURE
make: *** [Makefile:1068: test] Error 2
error: Bad exit status from /tmp/B.Erzm73/BUILD/tmp/rpm-tmp.39693 (%build)


RPM build errors:
    Bad exit status from /tmp/B.Erzm73/BUILD/tmp/rpm-tmp.39693 (%build)
ended at: Wed Nov  7 20:40:46 2018, done in 0:04:31.900322
error: No files produced.
+ chmod -R u+rwX /tmp/B.Erzm73/BUILD
+ rm -rf /tmp/B.Erzm73/tmp /tmp/B.Erzm73/BUILD
+ rm -rf /tmp/B.Erzm73
Begin-PLD-Builder-Info
Build-Time: user:806.71s sys:81.54s real:279.98s (faults io:3 non-io:11778382)

End-PLD-Builder-Info
[Back to list of logs] [View rpm -qa of builder]