FailedOk

th/SRPMS[OK]
th/x32[OK]
th/i686[OK]
th/x86_64[OK]

ac/SRPMS[OK]
ac/i386[OK]
ac/i586[OK]
ac/i686[OK]
ac/alpha[OK]
ac/amd64[OK]
ac/athlon[OK]
ac/ppc[OK]
ac/sparc[OK]
ac/sparc64[OK]

Advanced Search
main()
Powered by PLD Linux
(c) 2002-2019 PLD Team
$Revision: 1.37 $
Powered by ELF.
Your IP: 34.225.194.144

qalculate-gtk 315c8fb1-45f0-466e-bbcf-69abab1e33ac

Status:Failed
Source URL:ftp://buildlogs.pld-linux.org/th/x32/FAIL/qalculate-gtk,315c8fb1-45f0-466e-bbcf-69abab1e33ac.bz2
text/plain URL:View!
full text:View!
rpm -qa of builder:View!
Date:2019/02/10 12:02:03
Runtime:0:00:08.585821

Toc:

  • error 1
  • callbacks.cc:183:1: error: 'Sgi' does not name a type
  • error 2
  • callbacks.cc:184:1: error: 'Sgi' does not name a type
  • error 3
  • callbacks.cc:238:6: error: 'Sgi' has not been declared
  • error 4
  • callbacks.cc:238:20: error: expected primary-expression before 'int'
  • error 5
  • callbacks.cc:238:74: error: 'it' was not declared in this scope
  • error 6
  • callbacks.cc:238:80: error: 'left_par_pix' was not declared in this scope
  • error 7
  • callbacks.cc:241:2: error: 'left_par_pix' was not declared in this scope
  • error 8
  • callbacks.cc:242:6: error: 'Sgi' has not been declared
  • error 9
  • callbacks.cc:242:20: error: expected primary-expression before 'int'
  • error 10
  • callbacks.cc:242:75: error: 'it' was not declared in this scope
  • error 11
  • callbacks.cc:242:81: error: 'right_par_pix' was not declared in this scope
  • error 12
  • callbacks.cc:245:2: error: 'right_par_pix' was not declared in this scope
  • error 13
  • callbacks.cc:3179:5: error: 'left_par_pix' was not declared in this scope
  • error 14
  • callbacks.cc:3195:2: error: 'left_par_pix' was not declared in this scope
  • error 15
  • callbacks.cc:3199:5: error: 'right_par_pix' was not declared in this scope
  • error 16
  • callbacks.cc:3215:2: error: 'right_par_pix' was not declared in this scope
  • error 17
  • make[2]: *** [Makefile:346: callbacks.o] Error 1
  • error 18
  • make[1]: *** [Makefile:322: all-recursive] Error 1
  • error 19
  • error: Bad exit status from /tmp/B.MEe_i0/BUILD/tmp/rpm-tmp.34966 (%build)
  • error 20
  • RPM build errors:
  • error 21
  • error: No files produced.

Content:

checking for x86_64-pld-linux-gnux32-strip... no
checking for strip... strip
checking if x86_64-pld-linux-gnux32-gcc supports -fno-rtti -fno-exceptions... no
checking for x86_64-pld-linux-gnux32-gcc option to produce PIC... -fPIC
checking if x86_64-pld-linux-gnux32-gcc PIC flag -fPIC works... yes
checking if x86_64-pld-linux-gnux32-gcc static flag -static works... yes
checking if x86_64-pld-linux-gnux32-gcc supports -c -o file.o... yes
checking whether the x86_64-pld-linux-gnux32-gcc linker (/usr/bin/ld -m elf_i386) supports shared libraries... yes
checking whether -lc should be explicitly linked in... no
checking dynamic linker characteristics... GNU/Linux ld.so
checking how to hardcode library paths into programs... immediate
checking whether stripping libraries is possible... yes
checking if libtool supports shared libraries... yes
checking whether to build shared libraries... yes
checking whether to build static libraries... yes
configure: creating libtool
appending configuration tag "CXX" to libtool
checking for ld used by x86_64-pld-linux-gnux32-g++... /usr/bin/ld -m elf_i386
checking if the linker (/usr/bin/ld -m elf_i386) is GNU ld... yes
checking whether the x86_64-pld-linux-gnux32-g++ linker (/usr/bin/ld -m elf_i386) supports shared libraries... yes
checking for x86_64-pld-linux-gnux32-g++ option to produce PIC... -fPIC
checking if x86_64-pld-linux-gnux32-g++ PIC flag -fPIC works... yes
checking if x86_64-pld-linux-gnux32-g++ static flag -static works... yes
checking if x86_64-pld-linux-gnux32-g++ supports -c -o file.o... yes
checking whether the x86_64-pld-linux-gnux32-g++ linker (/usr/bin/ld -m elf_i386) supports shared libraries... yes
checking dynamic linker characteristics... GNU/Linux ld.so
(cached) (cached) checking how to hardcode library paths into programs... immediate
appending configuration tag "F77" to libtool
checking if libtool supports shared libraries... yes
checking whether to build shared libraries... yes
checking whether to build static libraries... yes
checking for x86_64-pld-linux-gnux32-gfortran option to produce PIC... -fPIC
checking if x86_64-pld-linux-gnux32-gfortran PIC flag -fPIC works... yes
checking if x86_64-pld-linux-gnux32-gfortran static flag -static works... no
checking if x86_64-pld-linux-gnux32-gfortran supports -c -o file.o... yes
checking whether the x86_64-pld-linux-gnux32-gfortran linker (/usr/bin/ld -m elf_i386) supports shared libraries... yes
checking dynamic linker characteristics... GNU/Linux ld.so
(cached) (cached) checking how to hardcode library paths into programs... immediate
checking for pthread_create in -lpthread... yes
checking for x86_64-pld-linux-gnux32-pkg-config... /usr/bin/x86_64-pld-linux-gnux32-pkg-config
checking pkg-config is at least version 0.9.0... yes
checking for GLIB... yes
checking for GTK... yes
checking for QALCULATE... yes
checking for CLN... yes
checking whether to use libgnome... auto
checking for LIBGNOME... yes
checking for scrollkeeper-config... /usr/bin/scrollkeeper-config
checking locale.h usability... yes
checking locale.h presence... yes
checking for locale.h... yes
checking for LC_MESSAGES... yes
checking libintl.h usability... yes
checking libintl.h presence... yes
checking for libintl.h... yes
checking for ngettext in libc... yes
checking for dgettext in libc... yes
checking for bind_textdomain_codeset... yes
checking for msgfmt... (cached) /usr/bin/msgfmt
checking for dcgettext... yes
checking if msgfmt accepts -c... yes
checking for gmsgfmt... /usr/bin/msgfmt
checking for xgettext... (cached) /usr/bin/xgettext
checking for catalogs to be installed...  nl sv
checking locale directory... "/usr/share/locale"
configure: creating ./config.status
config.status: creating Makefile
config.status: creating data/Makefile
config.status: creating doc/Makefile
config.status: creating doc/C/Makefile
config.status: creating src/Makefile
config.status: creating po/Makefile.in
config.status: creating config.h
config.status: executing depfiles commands
config.status: executing intltool commands
config.status: executing default-1 commands
config.status: executing po/stamp-it commands
+ /usr/bin/make -Otarget -j9
/usr/bin/make  all-recursive
Making all in data
make[2]: Entering directory '/tmp/B.MEe_i0/BUILD/qalculate-gtk-0.9.7/data'
LC_ALL=C ../intltool-merge -d -u -c ../po/.intltool-merge-cache ../po qalculate-gtk.desktop.in qalculate-gtk.desktop
Generating and caching the translation database
Merging translations into qalculate-gtk.desktop.
make[2]: Leaving directory '/tmp/B.MEe_i0/BUILD/qalculate-gtk-0.9.7/data'
Making all in src
make[2]: Entering directory '/tmp/B.MEe_i0/BUILD/qalculate-gtk-0.9.7/src'
x86_64-pld-linux-gnux32-g++ -DHAVE_CONFIG_H -I. -I.. -DPACKAGE_DATA_DIR=\""/usr/share"\" -DPACKAGE_LOCALE_DIR=\""/usr/share/locale"\" -D_REENTRANT -DORBIT2=1 -pthread -I/usr/include/libgnome-2.0 -I/usr/include/gnome-vfs-2.0 -I/usr/libx32/gnome-vfs-2.0/include -I/usr/include/gconf2 -I/usr/include/libmount -I/usr/include/blkid -I/usr/include/uuid -I/usr/include/libbonobo-2.0 -I/usr/include/bonobo-activation-2.0 -I/usr/include/orbit-2.0 -I/usr/include/glib-2.0 -I/usr/libx32/glib-2.0/include -pthread -I/usr/include/libglade-2.0 -I/usr/include/gtk-2.0 -I/usr/libx32/gtk-2.0/include -I/usr/include/pango-1.0 -I/usr/include/gio-unix-2.0/ -I/usr/include/cairo -I/usr/include/atk-1.0 -I/usr/include/cairo -I/usr/include/pixman-1 -I/usr/include/gdk-pixbuf-2.0 -I/usr/include/libmount -I/usr/include/blkid -I/usr/include/pango-1.0 -I/usr/include/fribidi -I/usr/include/uuid -I/usr/include/freetype2 -I/usr/include/libpng16 -I/usr/include/harfbuzz -I/usr/include/glib-2.0 -I/usr/libx32/glib-2.0/include -I/usr/include/libxml2 -I/usr/include/glib-2.0 -I/usr/libx32/glib-2.0/include -I/usr/include/libxml2     -O2 -fwrapv -pipe -Wformat -Werror=format-security -gdwarf-4 -fno-debug-types-section -fvar-tracking-assignments -g2 -Wp,-D_FORTIFY_SOURCE=2 -fstack-protector-strong --param=ssp-buffer-size=4 -fPIC -mtune=generic -march=x86-64 -gdwarf-4 -fno-debug-types-section -fvar-tracking-assignments -g2  -MT main.o -MD -MP -MF .deps/main.Tpo -c -o main.o main.cc
main.cc: In function 'int main(int, char**)':
main.cc:271:6: warning: ignoring return value of 'int pipe(int*)', declared with attribute warn_unused_result [-Wunused-result]
  pipe(pipe_wr);
  ~~~~^~~~~~~~~
main.cc:278:6: warning: ignoring return value of 'int pipe(int*)', declared with attribute warn_unused_result [-Wunused-result]
  pipe(pipe_wr2);
  ~~~~^~~~~~~~~~
mv -f .deps/main.Tpo .deps/main.Po
make[2]: Leaving directory '/tmp/B.MEe_i0/BUILD/qalculate-gtk-0.9.7/src'
make[2]: Entering directory '/tmp/B.MEe_i0/BUILD/qalculate-gtk-0.9.7/src'
x86_64-pld-linux-gnux32-g++ -DHAVE_CONFIG_H -I. -I.. -DPACKAGE_DATA_DIR=\""/usr/share"\" -DPACKAGE_LOCALE_DIR=\""/usr/share/locale"\" -D_REENTRANT -DORBIT2=1 -pthread -I/usr/include/libgnome-2.0 -I/usr/include/gnome-vfs-2.0 -I/usr/libx32/gnome-vfs-2.0/include -I/usr/include/gconf2 -I/usr/include/libmount -I/usr/include/blkid -I/usr/include/uuid -I/usr/include/libbonobo-2.0 -I/usr/include/bonobo-activation-2.0 -I/usr/include/orbit-2.0 -I/usr/include/glib-2.0 -I/usr/libx32/glib-2.0/include -pthread -I/usr/include/libglade-2.0 -I/usr/include/gtk-2.0 -I/usr/libx32/gtk-2.0/include -I/usr/include/pango-1.0 -I/usr/include/gio-unix-2.0/ -I/usr/include/cairo -I/usr/include/atk-1.0 -I/usr/include/cairo -I/usr/include/pixman-1 -I/usr/include/gdk-pixbuf-2.0 -I/usr/include/libmount -I/usr/include/blkid -I/usr/include/pango-1.0 -I/usr/include/fribidi -I/usr/include/uuid -I/usr/include/freetype2 -I/usr/include/libpng16 -I/usr/include/harfbuzz -I/usr/include/glib-2.0 -I/usr/libx32/glib-2.0/include -I/usr/include/libxml2 -I/usr/include/glib-2.0 -I/usr/libx32/glib-2.0/include -I/usr/include/libxml2     -O2 -fwrapv -pipe -Wformat -Werror=format-security -gdwarf-4 -fno-debug-types-section -fvar-tracking-assignments -g2 -Wp,-D_FORTIFY_SOURCE=2 -fstack-protector-strong --param=ssp-buffer-size=4 -fPIC -mtune=generic -march=x86-64 -gdwarf-4 -fno-debug-types-section -fvar-tracking-assignments -g2  -MT callbacks.o -MD -MP -MF .deps/callbacks.Tpo -c -o callbacks.o callbacks.cc
callbacks.cc:183:1: error: 'Sgi' does not name a type
 Sgi::hash_map<int, GdkPixbuf*> left_par_pix;
 ^~~
callbacks.cc:184:1: error: 'Sgi' does not name a type
 Sgi::hash_map<int, GdkPixbuf*> right_par_pix;
 ^~~
callbacks.cc: In function 'void clear_parenthesis_pix()':
callbacks.cc:231:35: warning: 'void gdk_pixbuf_unref(GdkPixbuf*)' is deprecated: Use 'g_object_unref' instead [-Wdeprecated-declarations]
   gdk_pixbuf_unref(pixbuf_left_par);
                                   ^
In file included from /usr/include/gdk-pixbuf-2.0/gdk-pixbuf/gdk-pixbuf.h:34,
                 from /usr/include/gtk-2.0/gdk/gdkpixbuf.h:37,
                 from /usr/include/gtk-2.0/gdk/gdkcairo.h:28,
                 from /usr/include/gtk-2.0/gdk/gdk.h:33,
                 from /usr/include/gtk-2.0/gtk/gtk.h:32,
                 from callbacks.cc:17:
/usr/include/gdk-pixbuf-2.0/gdk-pixbuf/gdk-pixbuf-core.h:232:12: note: declared here
 void       gdk_pixbuf_unref    (GdkPixbuf *pixbuf);
            ^~~~~~~~~~~~~~~~
callbacks.cc:231:35: warning: 'void gdk_pixbuf_unref(GdkPixbuf*)' is deprecated: Use 'g_object_unref' instead [-Wdeprecated-declarations]
   gdk_pixbuf_unref(pixbuf_left_par);
                                   ^
In file included from /usr/include/gdk-pixbuf-2.0/gdk-pixbuf/gdk-pixbuf.h:34,
                 from /usr/include/gtk-2.0/gdk/gdkpixbuf.h:37,
                 from /usr/include/gtk-2.0/gdk/gdkcairo.h:28,
                 from /usr/include/gtk-2.0/gdk/gdk.h:33,
                 from /usr/include/gtk-2.0/gtk/gtk.h:32,
                 from callbacks.cc:17:
/usr/include/gdk-pixbuf-2.0/gdk-pixbuf/gdk-pixbuf-core.h:232:12: note: declared here
 void       gdk_pixbuf_unref    (GdkPixbuf *pixbuf);
            ^~~~~~~~~~~~~~~~
callbacks.cc:235:36: warning: 'void gdk_pixbuf_unref(GdkPixbuf*)' is deprecated: Use 'g_object_unref' instead [-Wdeprecated-declarations]
   gdk_pixbuf_unref(pixbuf_right_par);
                                    ^
In file included from /usr/include/gdk-pixbuf-2.0/gdk-pixbuf/gdk-pixbuf.h:34,
                 from /usr/include/gtk-2.0/gdk/gdkpixbuf.h:37,
                 from /usr/include/gtk-2.0/gdk/gdkcairo.h:28,
                 from /usr/include/gtk-2.0/gdk/gdk.h:33,
                 from /usr/include/gtk-2.0/gtk/gtk.h:32,
                 from callbacks.cc:17:
/usr/include/gdk-pixbuf-2.0/gdk-pixbuf/gdk-pixbuf-core.h:232:12: note: declared here
 void       gdk_pixbuf_unref    (GdkPixbuf *pixbuf);
            ^~~~~~~~~~~~~~~~
callbacks.cc:235:36: warning: 'void gdk_pixbuf_unref(GdkPixbuf*)' is deprecated: Use 'g_object_unref' instead [-Wdeprecated-declarations]
   gdk_pixbuf_unref(pixbuf_right_par);
                                    ^
In file included from /usr/include/gdk-pixbuf-2.0/gdk-pixbuf/gdk-pixbuf.h:34,
                 from /usr/include/gtk-2.0/gdk/gdkpixbuf.h:37,
                 from /usr/include/gtk-2.0/gdk/gdkcairo.h:28,
                 from /usr/include/gtk-2.0/gdk/gdk.h:33,
                 from /usr/include/gtk-2.0/gtk/gtk.h:32,
                 from callbacks.cc:17:
/usr/include/gdk-pixbuf-2.0/gdk-pixbuf/gdk-pixbuf-core.h:232:12: note: declared here
 void       gdk_pixbuf_unref    (GdkPixbuf *pixbuf);
            ^~~~~~~~~~~~~~~~
callbacks.cc:238:6: error: 'Sgi' has not been declared
  for(Sgi::hash_map<int, GdkPixbuf*>::iterator it = left_par_pix.begin(); it != left_par_pix.end(); ++it) {
      ^~~
callbacks.cc:238:20: error: expected primary-expression before 'int'
  for(Sgi::hash_map<int, GdkPixbuf*>::iterator it = left_par_pix.begin(); it != left_par_pix.end(); ++it) {
                    ^~~
callbacks.cc:238:74: error: 'it' was not declared in this scope
  for(Sgi::hash_map<int, GdkPixbuf*>::iterator it = left_par_pix.begin(); it != left_par_pix.end(); ++it) {
                                                                          ^~
callbacks.cc:238:74: note: suggested alternative: 'int'
  for(Sgi::hash_map<int, GdkPixbuf*>::iterator it = left_par_pix.begin(); it != left_par_pix.end(); ++it) {
                                                                          ^~
                                                                          int
callbacks.cc:238:80: error: 'left_par_pix' was not declared in this scope
  for(Sgi::hash_map<int, GdkPixbuf*>::iterator it = left_par_pix.begin(); it != left_par_pix.end(); ++it) {
                                                                                ^~~~~~~~~~~~
callbacks.cc:238:80: note: suggested alternative: 'set_prefix'
  for(Sgi::hash_map<int, GdkPixbuf*>::iterator it = left_par_pix.begin(); it != left_par_pix.end(); ++it) {
                                                                                ^~~~~~~~~~~~
                                                                                set_prefix
callbacks.cc:241:2: error: 'left_par_pix' was not declared in this scope
  left_par_pix.clear();
  ^~~~~~~~~~~~
callbacks.cc:241:2: note: suggested alternative: 'set_prefix'
  left_par_pix.clear();
  ^~~~~~~~~~~~
  set_prefix
callbacks.cc:242:6: error: 'Sgi' has not been declared
  for(Sgi::hash_map<int, GdkPixbuf*>::iterator it = right_par_pix.begin(); it != right_par_pix.end(); ++it) {
      ^~~
callbacks.cc:242:20: error: expected primary-expression before 'int'
  for(Sgi::hash_map<int, GdkPixbuf*>::iterator it = right_par_pix.begin(); it != right_par_pix.end(); ++it) {
                    ^~~
callbacks.cc:242:75: error: 'it' was not declared in this scope
  for(Sgi::hash_map<int, GdkPixbuf*>::iterator it = right_par_pix.begin(); it != right_par_pix.end(); ++it) {
                                                                           ^~
callbacks.cc:242:75: note: suggested alternative: 'int'
  for(Sgi::hash_map<int, GdkPixbuf*>::iterator it = right_par_pix.begin(); it != right_par_pix.end(); ++it) {
                                                                           ^~
                                                                           int
callbacks.cc:242:81: error: 'right_par_pix' was not declared in this scope
  for(Sgi::hash_map<int, GdkPixbuf*>::iterator it = right_par_pix.begin(); it != right_par_pix.end(); ++it) {
                                                                                 ^~~~~~~~~~~~~
callbacks.cc:245:2: error: 'right_par_pix' was not declared in this scope
  right_par_pix.clear();
  ^~~~~~~~~~~~~
callbacks.cc: In function 'GdkPixbuf* get_left_parenthesis(gint, gint, int)':
callbacks.cc:3179:5: error: 'left_par_pix' was not declared in this scope
  if(left_par_pix.count(arc_w * 1000 + arc_h) > 0) {
     ^~~~~~~~~~~~
callbacks.cc:3179:5: note: suggested alternative: 'set_prefix'
  if(left_par_pix.count(arc_w * 1000 + arc_h) > 0) {
     ^~~~~~~~~~~~
     set_prefix
callbacks.cc:3195:2: error: 'left_par_pix' was not declared in this scope
  left_par_pix[arc_w * 1000 + arc_h] = pixbuf_parl;
  ^~~~~~~~~~~~
callbacks.cc:3195:2: note: suggested alternative: 'set_prefix'
  left_par_pix[arc_w * 1000 + arc_h] = pixbuf_parl;
  ^~~~~~~~~~~~
  set_prefix
callbacks.cc: In function 'GdkPixbuf* get_right_parenthesis(gint, gint, int)':
callbacks.cc:3199:5: error: 'right_par_pix' was not declared in this scope
  if(right_par_pix.count(arc_w * 1000 + arc_h) > 0) {
     ^~~~~~~~~~~~~
callbacks.cc:3215:2: error: 'right_par_pix' was not declared in this scope
  right_par_pix[arc_w * 1000 + arc_h] = pixbuf_parl;
  ^~~~~~~~~~~~~
callbacks.cc: In function 'void clearresult()':
callbacks.cc:4554:33: warning: 'void gdk_pixbuf_unref(GdkPixbuf*)' is deprecated: Use 'g_object_unref' instead [-Wdeprecated-declarations]
   gdk_pixbuf_unref(pixbuf_result);
                                 ^
In file included from /usr/include/gdk-pixbuf-2.0/gdk-pixbuf/gdk-pixbuf.h:34,
                 from /usr/include/gtk-2.0/gdk/gdkpixbuf.h:37,
                 from /usr/include/gtk-2.0/gdk/gdkcairo.h:28,
                 from /usr/include/gtk-2.0/gdk/gdk.h:33,
                 from /usr/include/gtk-2.0/gtk/gtk.h:32,
                 from callbacks.cc:17:
/usr/include/gdk-pixbuf-2.0/gdk-pixbuf/gdk-pixbuf-core.h:232:12: note: declared here
 void       gdk_pixbuf_unref    (GdkPixbuf *pixbuf);
            ^~~~~~~~~~~~~~~~
callbacks.cc:4554:33: warning: 'void gdk_pixbuf_unref(GdkPixbuf*)' is deprecated: Use 'g_object_unref' instead [-Wdeprecated-declarations]
   gdk_pixbuf_unref(pixbuf_result);
                                 ^
In file included from /usr/include/gdk-pixbuf-2.0/gdk-pixbuf/gdk-pixbuf.h:34,
                 from /usr/include/gtk-2.0/gdk/gdkpixbuf.h:37,
                 from /usr/include/gtk-2.0/gdk/gdkcairo.h:28,
                 from /usr/include/gtk-2.0/gdk/gdk.h:33,
                 from /usr/include/gtk-2.0/gtk/gtk.h:32,
                 from callbacks.cc:17:
/usr/include/gdk-pixbuf-2.0/gdk-pixbuf/gdk-pixbuf-core.h:232:12: note: declared here
 void       gdk_pixbuf_unref    (GdkPixbuf *pixbuf);
            ^~~~~~~~~~~~~~~~
callbacks.cc: In function 'void setResult(Prefix*, bool, bool, bool, std::__cxx11::string, size_t, bool)':
callbacks.cc:4789:35: warning: 'void gdk_pixbuf_unref(GdkPixbuf*)' is deprecated: Use 'g_object_unref' instead [-Wdeprecated-declarations]
     gdk_pixbuf_unref(pixbuf_result);
                                   ^
In file included from /usr/include/gdk-pixbuf-2.0/gdk-pixbuf/gdk-pixbuf.h:34,
                 from /usr/include/gtk-2.0/gdk/gdkpixbuf.h:37,
                 from /usr/include/gtk-2.0/gdk/gdkcairo.h:28,
                 from /usr/include/gtk-2.0/gdk/gdk.h:33,
                 from /usr/include/gtk-2.0/gtk/gtk.h:32,
                 from callbacks.cc:17:
/usr/include/gdk-pixbuf-2.0/gdk-pixbuf/gdk-pixbuf-core.h:232:12: note: declared here
 void       gdk_pixbuf_unref    (GdkPixbuf *pixbuf);
            ^~~~~~~~~~~~~~~~
callbacks.cc:4789:35: warning: 'void gdk_pixbuf_unref(GdkPixbuf*)' is deprecated: Use 'g_object_unref' instead [-Wdeprecated-declarations]
     gdk_pixbuf_unref(pixbuf_result);
                                   ^
In file included from /usr/include/gdk-pixbuf-2.0/gdk-pixbuf/gdk-pixbuf.h:34,
                 from /usr/include/gtk-2.0/gdk/gdkpixbuf.h:37,
                 from /usr/include/gtk-2.0/gdk/gdkcairo.h:28,
                 from /usr/include/gtk-2.0/gdk/gdk.h:33,
                 from /usr/include/gtk-2.0/gtk/gtk.h:32,
                 from callbacks.cc:17:
/usr/include/gdk-pixbuf-2.0/gdk-pixbuf/gdk-pixbuf-core.h:232:12: note: declared here
 void       gdk_pixbuf_unref    (GdkPixbuf *pixbuf);
            ^~~~~~~~~~~~~~~~
callbacks.cc:4906:38: warning: 'void gdk_pixbuf_unref(GdkPixbuf*)' is deprecated: Use 'g_object_unref' instead [-Wdeprecated-declarations]
    gdk_pixbuf_unref(pixbuf_result_tmp);
                                      ^
In file included from /usr/include/gdk-pixbuf-2.0/gdk-pixbuf/gdk-pixbuf.h:34,
                 from /usr/include/gtk-2.0/gdk/gdkpixbuf.h:37,
                 from /usr/include/gtk-2.0/gdk/gdkcairo.h:28,
                 from /usr/include/gtk-2.0/gdk/gdk.h:33,
                 from /usr/include/gtk-2.0/gtk/gtk.h:32,
                 from callbacks.cc:17:
/usr/include/gdk-pixbuf-2.0/gdk-pixbuf/gdk-pixbuf-core.h:232:12: note: declared here
 void       gdk_pixbuf_unref    (GdkPixbuf *pixbuf);
            ^~~~~~~~~~~~~~~~
callbacks.cc:4906:38: warning: 'void gdk_pixbuf_unref(GdkPixbuf*)' is deprecated: Use 'g_object_unref' instead [-Wdeprecated-declarations]
    gdk_pixbuf_unref(pixbuf_result_tmp);
                                      ^
In file included from /usr/include/gdk-pixbuf-2.0/gdk-pixbuf/gdk-pixbuf.h:34,
                 from /usr/include/gtk-2.0/gdk/gdkpixbuf.h:37,
                 from /usr/include/gtk-2.0/gdk/gdkcairo.h:28,
                 from /usr/include/gtk-2.0/gdk/gdk.h:33,
                 from /usr/include/gtk-2.0/gtk/gtk.h:32,
                 from callbacks.cc:17:
/usr/include/gdk-pixbuf-2.0/gdk-pixbuf/gdk-pixbuf-core.h:232:12: note: declared here
 void       gdk_pixbuf_unref    (GdkPixbuf *pixbuf);
            ^~~~~~~~~~~~~~~~
callbacks.cc: In function 'void* view_proc(void*)':
callbacks.cc:4579:8: warning: ignoring return value of 'size_t fread(void*, size_t, size_t, FILE*)', declared with attribute warn_unused_result [-Wunused-result]
   fread(&scale_n, sizeof(int), 1, view_pipe);
   ~~~~~^~~~~~~~~~~~~~~~~~~~~~~~~~~~~~~~~~~~~
callbacks.cc:4580:8: warning: ignoring return value of 'size_t fread(void*, size_t, size_t, FILE*)', declared with attribute warn_unused_result [-Wunused-result]
   fread(&x, sizeof(void*), 1, view_pipe);
   ~~~~~^~~~~~~~~~~~~~~~~~~~~~~~~~~~~~~~~
callbacks.cc:4583:8: warning: ignoring return value of 'size_t fread(void*, size_t, size_t, FILE*)', declared with attribute warn_unused_result [-Wunused-result]
   fread(&b_stack, sizeof(bool), 1, view_pipe);
   ~~~~~^~~~~~~~~~~~~~~~~~~~~~~~~~~~~~~~~~~~~~
callbacks.cc:4584:8: warning: ignoring return value of 'size_t fread(void*, size_t, size_t, FILE*)', declared with attribute warn_unused_result [-Wunused-result]
   fread(&x, sizeof(void*), 1, view_pipe);
   ~~~~~^~~~~~~~~~~~~~~~~~~~~~~~~~~~~~~~~
callbacks.cc:4587:9: warning: ignoring return value of 'size_t fread(void*, size_t, size_t, FILE*)', declared with attribute warn_unused_result [-Wunused-result]
    fread(&x, sizeof(void*), 1, view_pipe);
    ~~~~~^~~~~~~~~~~~~~~~~~~~~~~~~~~~~~~~~
callbacks.cc:4608:10: warning: ignoring return value of 'size_t fread(void*, size_t, size_t, FILE*)', declared with attribute warn_unused_result [-Wunused-result]
     fread(&po.is_approximate, sizeof(bool*), 1, view_pipe);
     ~~~~~^~~~~~~~~~~~~~~~~~~~~~~~~~~~~~~~~~~~~~~~~~~~~~~~~
callbacks.cc:4611:10: warning: ignoring return value of 'size_t fread(void*, size_t, size_t, FILE*)', declared with attribute warn_unused_result [-Wunused-result]
     fread(&x, sizeof(void*), 1, view_pipe);
     ~~~~~^~~~~~~~~~~~~~~~~~~~~~~~~~~~~~~~~
callbacks.cc: In function 'void* command_proc(void*)':
callbacks.cc:5028:8: warning: ignoring return value of 'size_t fread(void*, size_t, size_t, FILE*)', declared with attribute warn_unused_result [-Wunused-result]
   fread(&command_type, sizeof(int), 1, command_pipe);
   ~~~~~^~~~~~~~~~~~~~~~~~~~~~~~~~~~~~~~~~~~~~~~~~~~~
callbacks.cc:5029:8: warning: ignoring return value of 'size_t fread(void*, size_t, size_t, FILE*)', declared with attribute warn_unused_result [-Wunused-result]
   fread(&x, sizeof(void*), 1, command_pipe);
   ~~~~~^~~~~~~~~~~~~~~~~~~~~~~~~~~~~~~~~~~~
make[2]: *** [Makefile:346: callbacks.o] Error 1
make[2]: Leaving directory '/tmp/B.MEe_i0/BUILD/qalculate-gtk-0.9.7/src'
make[2]: *** Waiting for unfinished jobs....
make[2]: Entering directory '/tmp/B.MEe_i0/BUILD/qalculate-gtk-0.9.7/src'
x86_64-pld-linux-gnux32-g++ -DHAVE_CONFIG_H -I. -I.. -DPACKAGE_DATA_DIR=\""/usr/share"\" -DPACKAGE_LOCALE_DIR=\""/usr/share/locale"\" -D_REENTRANT -DORBIT2=1 -pthread -I/usr/include/libgnome-2.0 -I/usr/include/gnome-vfs-2.0 -I/usr/libx32/gnome-vfs-2.0/include -I/usr/include/gconf2 -I/usr/include/libmount -I/usr/include/blkid -I/usr/include/uuid -I/usr/include/libbonobo-2.0 -I/usr/include/bonobo-activation-2.0 -I/usr/include/orbit-2.0 -I/usr/include/glib-2.0 -I/usr/libx32/glib-2.0/include -pthread -I/usr/include/libglade-2.0 -I/usr/include/gtk-2.0 -I/usr/libx32/gtk-2.0/include -I/usr/include/pango-1.0 -I/usr/include/gio-unix-2.0/ -I/usr/include/cairo -I/usr/include/atk-1.0 -I/usr/include/cairo -I/usr/include/pixman-1 -I/usr/include/gdk-pixbuf-2.0 -I/usr/include/libmount -I/usr/include/blkid -I/usr/include/pango-1.0 -I/usr/include/fribidi -I/usr/include/uuid -I/usr/include/freetype2 -I/usr/include/libpng16 -I/usr/include/harfbuzz -I/usr/include/glib-2.0 -I/usr/libx32/glib-2.0/include -I/usr/include/libxml2 -I/usr/include/glib-2.0 -I/usr/libx32/glib-2.0/include -I/usr/include/libxml2     -O2 -fwrapv -pipe -Wformat -Werror=format-security -gdwarf-4 -fno-debug-types-section -fvar-tracking-assignments -g2 -Wp,-D_FORTIFY_SOURCE=2 -fstack-protector-strong --param=ssp-buffer-size=4 -fPIC -mtune=generic -march=x86-64 -gdwarf-4 -fno-debug-types-section -fvar-tracking-assignments -g2  -MT interface.o -MD -MP -MF .deps/interface.Tpo -c -o interface.o interface.cc
mv -f .deps/interface.Tpo .deps/interface.Po
make[2]: Leaving directory '/tmp/B.MEe_i0/BUILD/qalculate-gtk-0.9.7/src'
make[1]: *** [Makefile:322: all-recursive] Error 1
make: *** [Makefile:252: all] Error 2
error: Bad exit status from /tmp/B.MEe_i0/BUILD/tmp/rpm-tmp.34966 (%build)


RPM build errors:
    Bad exit status from /tmp/B.MEe_i0/BUILD/tmp/rpm-tmp.34966 (%build)
ended at: Sun Feb 10 12:02:03 2019, done in 0:00:08.585821
error: No files produced.
+ chmod -R u+rwX /tmp/B.MEe_i0/BUILD
+ rm -rf /tmp/B.MEe_i0/tmp /tmp/B.MEe_i0/BUILD
+ rm -rf /tmp/B.MEe_i0
Begin-PLD-Builder-Info
Build-Time: user:10.26s sys:1.58s real:11.65s (faults io:0 non-io:673029)

End-PLD-Builder-Info
[Back to list of logs] [View rpm -qa of builder]