FailedOk

th/SRPMS[OK]
th/x32[OK]
th/i686[OK]
th/x86_64[OK]

ac/SRPMS[OK]
ac/i386[OK]
ac/i586[OK]
ac/i686[OK]
ac/alpha[OK]
ac/amd64[OK]
ac/athlon[OK]
ac/ppc[OK]
ac/sparc[OK]
ac/sparc64[OK]

Advanced Search
main()
Powered by PLD Linux
(c) 2002-2017 PLD Team
$Revision: 1.37 $
Powered by sqlite3.
Your IP: 54.198.113.51

rtl8812au c5a9cb0a-351e-4e56-b16e-7c63934a6dd7

Status:Failed
Source URL:ftp://buildlogs.pld-linux.org/th/x32/FAIL/rtl8812au,c5a9cb0a-351e-4e56-b16e-7c63934a6dd7.bz2
text/plain URL:View!
full text:View!
rpm -qa of builder:View!
Date:2017/07/31 19:44:29
Runtime:0:00:10.015217

Toc:

  • error 1
  • /tmp/B.zVN1Bt/BUILD/rtl8812au_linux-master/os_dep/linux/ioctl_cfg80211.c:809:6: error: passing argument 2 of 'cfg80211_roamed' from incompatible pointer type [-Werror=incompatible-pointer-types]
  • error 2
  • /tmp/B.zVN1Bt/BUILD/rtl8812au_linux-master/os_dep/linux/ioctl_cfg80211.c:807:3: error: too many arguments to function 'cfg80211_roamed'
  • error 3
  • /tmp/B.zVN1Bt/BUILD/rtl8812au_linux-master/os_dep/linux/ioctl_cfg80211.c:5994:18: error: 'WIPHY_FLAG_SUPPORTS_SCHED_SCAN' undeclared (first use in this function)
  • error 4
  • /tmp/B.zVN1Bt/BUILD/rtl8812au_linux-master/os_dep/linux/ioctl_cfg80211.c:6024:25: error: initialization from incompatible pointer type [-Werror=incompatible-pointer-types]
  • error 5
  • /tmp/B.zVN1Bt/BUILD/rtl8812au_linux-master/os_dep/linux/ioctl_cfg80211.c:6044:22: error: initialization from incompatible pointer type [-Werror=incompatible-pointer-types]
  • error 6
  • error: Bad exit status from /tmp/B.zVN1Bt/BUILD/tmp/rpm-tmp.88788 (%build)
  • error 7
  • RPM build errors:
  • error 8
  • error: No files produced.

Content:

Patch #12 (linux-4.7.patch):
+ '[' -f /tmp/B.zVN1Bt/linux-4.7.patch ']'
+ /bin/cat /tmp/B.zVN1Bt/linux-4.7.patch
+ /usr/bin/patch -s -p1
+ echo 'Patch #13 (linux-4.8.patch):'
Patch #13 (linux-4.8.patch):
+ '[' -f /tmp/B.zVN1Bt/linux-4.8.patch ']'
+ /bin/cat /tmp/B.zVN1Bt/linux-4.8.patch
+ /usr/bin/patch -s -p1
+ echo 'Patch #14 (linux-4.11.patch):'
Patch #14 (linux-4.11.patch):
+ '[' -f /tmp/B.zVN1Bt/linux-4.11.patch ']'
+ /bin/cat /tmp/B.zVN1Bt/linux-4.11.patch
+ /usr/bin/patch -s -p1
+ echo 'Patch #15 (linux-4.11.9.patch):'
Patch #15 (linux-4.11.9.patch):
+ '[' -f /tmp/B.zVN1Bt/linux-4.11.9.patch ']'
+ /bin/cat /tmp/B.zVN1Bt/linux-4.11.9.patch
+ /usr/bin/patch -s -p1
+ exit 0
Executing(%build): /bin/sh -e /tmp/B.zVN1Bt/BUILD/tmp/rpm-tmp.88788
HOME=/home/users/builder
PATH=/home/users/builder/GNUstep/Tools:/usr/local/bin:/usr/bin:/bin
TMPDIR=/tmp/B.zVN1Bt/BUILD/tmp
+ umask 022
+ cd /tmp/B.zVN1Bt/BUILD
+ cd rtl8812au_linux-master
+ /usr/bin/make -Otarget -j9 clean 'KVER=4.12.4-1' 'KSRC=/usr/src/linux'
cd hal/OUTSRC/ ; rm -fr */*.mod.c */*.mod */*.o */.*.cmd */*.ko
cd hal/OUTSRC/ ; rm -fr *.mod.c *.mod *.o .*.cmd *.ko 
cd hal/led ; rm -fr *.mod.c *.mod *.o .*.cmd *.ko
cd hal ; rm -fr */*/*.mod.c */*/*.mod */*/*.o */*/.*.cmd */*/*.ko
cd hal ; rm -fr */*.mod.c */*.mod */*.o */.*.cmd */*.ko
cd hal ; rm -fr *.mod.c *.mod *.o .*.cmd *.ko
cd core/efuse ; rm -fr *.mod.c *.mod *.o .*.cmd *.ko
cd core ; rm -fr *.mod.c *.mod *.o .*.cmd *.ko
cd os_dep/linux ; rm -fr *.mod.c *.mod *.o .*.cmd *.ko
cd os_dep ; rm -fr *.mod.c *.mod *.o .*.cmd *.ko
cd platform ; rm -fr *.mod.c *.mod *.o .*.cmd *.ko
rm -fr Module.symvers ; rm -fr Module.markers ; rm -fr modules.order
rm -fr *.mod.c *.mod *.o .*.cmd *.ko *~
rm -fr .tmp_versions
+ /usr/bin/make -Otarget -j9 modules 'KVER=4.12.4-1' 'KSRC=/usr/src/linux'
/usr/bin/make ARCH=x86_64 CROSS_COMPILE= -C /usr/src/linux M=/tmp/B.zVN1Bt/BUILD/rtl8812au_linux-master  modules
  CC [M]  /tmp/B.zVN1Bt/BUILD/rtl8812au_linux-master/core/rtw_ioctl_query.o
  CC [M]  /tmp/B.zVN1Bt/BUILD/rtl8812au_linux-master/core/rtw_ioctl_set.o
  CC [M]  /tmp/B.zVN1Bt/BUILD/rtl8812au_linux-master/core/rtw_io.o
  CC [M]  /tmp/B.zVN1Bt/BUILD/rtl8812au_linux-master/core/rtw_debug.o
  CC [M]  /tmp/B.zVN1Bt/BUILD/rtl8812au_linux-master/core/rtw_cmd.o
  CC [M]  /tmp/B.zVN1Bt/BUILD/rtl8812au_linux-master/core/rtw_ieee80211.o
  CC [M]  /tmp/B.zVN1Bt/BUILD/rtl8812au_linux-master/core/rtw_mlme.o
/tmp/B.zVN1Bt/BUILD/rtl8812au_linux-master/core/rtw_mlme.c: In function 'rtw_restructure_ht_ie':
/tmp/B.zVN1Bt/BUILD/rtl8812au_linux-master/core/rtw_mlme.c:3925:3: warning: this 'if' clause does not guard... [-Wmisleading-indentation]
   if (stbc_rx_enable)
   ^~
/tmp/B.zVN1Bt/BUILD/rtl8812au_linux-master/core/rtw_mlme.c:3928:18: note: ...this statement, but the latter is misleadingly indented as if it is guarded by the 'if'
                  set_mcs_rate_by_mask(ht_capie.supp_mcs_set, MCS_RATE_1R);
                  ^~~~~~~~~~~~~~~~~~~~
  CC [M]  /tmp/B.zVN1Bt/BUILD/rtl8812au_linux-master/core/rtw_security.o
/tmp/B.zVN1Bt/BUILD/rtl8812au_linux-master/core/rtw_security.c: In function 'aes_cipher':
/tmp/B.zVN1Bt/BUILD/rtl8812au_linux-master/core/rtw_security.c:1540:5: warning: this 'for' clause does not guard... [-Wmisleading-indentation]
     for (j = 0; j < 8; j++)
     ^~~
/tmp/B.zVN1Bt/BUILD/rtl8812au_linux-master/core/rtw_security.c:1543:2: note: ...this statement, but the latter is misleadingly indented as if it is guarded by the 'for'
  payload_index = hdrlen + 8;
  ^~~~~~~~~~~~~
/tmp/B.zVN1Bt/BUILD/rtl8812au_linux-master/core/rtw_security.c: In function 'aes_decipher':
/tmp/B.zVN1Bt/BUILD/rtl8812au_linux-master/core/rtw_security.c:1925:5: warning: this 'for' clause does not guard... [-Wmisleading-indentation]
     for (j = 0; j < 8; j++)
     ^~~
/tmp/B.zVN1Bt/BUILD/rtl8812au_linux-master/core/rtw_security.c:1928:2: note: ...this statement, but the latter is misleadingly indented as if it is guarded by the 'for'
  payload_index = hdrlen + 8;
  ^~~~~~~~~~~~~
  CC [M]  /tmp/B.zVN1Bt/BUILD/rtl8812au_linux-master/core/rtw_rf.o
  CC [M]  /tmp/B.zVN1Bt/BUILD/rtl8812au_linux-master/core/rtw_vht.o
  CC [M]  /tmp/B.zVN1Bt/BUILD/rtl8812au_linux-master/core/rtw_pwrctrl.o
  CC [M]  /tmp/B.zVN1Bt/BUILD/rtl8812au_linux-master/core/rtw_sta_mgt.o
  CC [M]  /tmp/B.zVN1Bt/BUILD/rtl8812au_linux-master/core/rtw_wlan_util.o
  CC [M]  /tmp/B.zVN1Bt/BUILD/rtl8812au_linux-master/core/rtw_recv.o
  CC [M]  /tmp/B.zVN1Bt/BUILD/rtl8812au_linux-master/core/rtw_btcoex.o
  CC [M]  /tmp/B.zVN1Bt/BUILD/rtl8812au_linux-master/core/rtw_ap.o
  CC [M]  /tmp/B.zVN1Bt/BUILD/rtl8812au_linux-master/core/rtw_tdls.o
  CC [M]  /tmp/B.zVN1Bt/BUILD/rtl8812au_linux-master/core/rtw_mlme_ext.o
  CC [M]  /tmp/B.zVN1Bt/BUILD/rtl8812au_linux-master/core/rtw_xmit.o
  CC [M]  /tmp/B.zVN1Bt/BUILD/rtl8812au_linux-master/core/rtw_iol.o
  CC [M]  /tmp/B.zVN1Bt/BUILD/rtl8812au_linux-master/core/rtw_sreset.o
  CC [M]  /tmp/B.zVN1Bt/BUILD/rtl8812au_linux-master/core/rtw_br_ext.o
  CC [M]  /tmp/B.zVN1Bt/BUILD/rtl8812au_linux-master/core/rtw_p2p.o
  CC [M]  /tmp/B.zVN1Bt/BUILD/rtl8812au_linux-master/core/rtw_odm.o
  CC [M]  /tmp/B.zVN1Bt/BUILD/rtl8812au_linux-master/core/rtw_beamforming.o
  CC [M]  /tmp/B.zVN1Bt/BUILD/rtl8812au_linux-master/os_dep/osdep_service.o
  CC [M]  /tmp/B.zVN1Bt/BUILD/rtl8812au_linux-master/core/efuse/rtw_efuse.o
  CC [M]  /tmp/B.zVN1Bt/BUILD/rtl8812au_linux-master/os_dep/linux/usb_ops_linux.o
  CC [M]  /tmp/B.zVN1Bt/BUILD/rtl8812au_linux-master/os_dep/linux/usb_intf.o
  CC [M]  /tmp/B.zVN1Bt/BUILD/rtl8812au_linux-master/os_dep/linux/os_intfs.o
  CC [M]  /tmp/B.zVN1Bt/BUILD/rtl8812au_linux-master/os_dep/linux/xmit_linux.o
  CC [M]  /tmp/B.zVN1Bt/BUILD/rtl8812au_linux-master/os_dep/linux/mlme_linux.o
  CC [M]  /tmp/B.zVN1Bt/BUILD/rtl8812au_linux-master/os_dep/linux/ioctl_cfg80211.o
/tmp/B.zVN1Bt/BUILD/rtl8812au_linux-master/os_dep/linux/ioctl_cfg80211.c: In function 'rtw_cfg80211_indicate_connect':
/tmp/B.zVN1Bt/BUILD/rtl8812au_linux-master/os_dep/linux/ioctl_cfg80211.c:809:6: error: passing argument 2 of 'cfg80211_roamed' from incompatible pointer type [-Werror=incompatible-pointer-types]
    , notify_channel
      ^~~~~~~~~~~~~~
In file included from /tmp/B.zVN1Bt/BUILD/rtl8812au_linux-master/include/osdep_service_linux.h:78:0,
                 from /tmp/B.zVN1Bt/BUILD/rtl8812au_linux-master/include/osdep_service.h:41,
                 from /tmp/B.zVN1Bt/BUILD/rtl8812au_linux-master/include/drv_types.h:32,
                 from /tmp/B.zVN1Bt/BUILD/rtl8812au_linux-master/os_dep/linux/ioctl_cfg80211.c:22:
./include/net/cfg80211.h:5435:6: note: expected 'struct cfg80211_roam_info *' but argument is of type 'struct ieee80211_channel *'
 void cfg80211_roamed(struct net_device *dev, struct cfg80211_roam_info *info,
      ^~~~~~~~~~~~~~~
/tmp/B.zVN1Bt/BUILD/rtl8812au_linux-master/os_dep/linux/ioctl_cfg80211.c:811:6: warning: passing argument 3 of 'cfg80211_roamed' makes integer from pointer without a cast [-Wint-conversion]
    , cur_network->network.MacAddress
      ^~~~~~~~~~~
In file included from /tmp/B.zVN1Bt/BUILD/rtl8812au_linux-master/include/osdep_service_linux.h:78:0,
                 from /tmp/B.zVN1Bt/BUILD/rtl8812au_linux-master/include/osdep_service.h:41,
                 from /tmp/B.zVN1Bt/BUILD/rtl8812au_linux-master/include/drv_types.h:32,
                 from /tmp/B.zVN1Bt/BUILD/rtl8812au_linux-master/os_dep/linux/ioctl_cfg80211.c:22:
./include/net/cfg80211.h:5435:6: note: expected 'gfp_t {aka unsigned int}' but argument is of type 'unsigned char *'
 void cfg80211_roamed(struct net_device *dev, struct cfg80211_roam_info *info,
      ^~~~~~~~~~~~~~~
/tmp/B.zVN1Bt/BUILD/rtl8812au_linux-master/os_dep/linux/ioctl_cfg80211.c:807:3: error: too many arguments to function 'cfg80211_roamed'
   cfg80211_roamed(padapter->pnetdev
   ^~~~~~~~~~~~~~~
In file included from /tmp/B.zVN1Bt/BUILD/rtl8812au_linux-master/include/osdep_service_linux.h:78:0,
                 from /tmp/B.zVN1Bt/BUILD/rtl8812au_linux-master/include/osdep_service.h:41,
                 from /tmp/B.zVN1Bt/BUILD/rtl8812au_linux-master/include/drv_types.h:32,
                 from /tmp/B.zVN1Bt/BUILD/rtl8812au_linux-master/os_dep/linux/ioctl_cfg80211.c:22:
./include/net/cfg80211.h:5435:6: note: declared here
 void cfg80211_roamed(struct net_device *dev, struct cfg80211_roam_info *info,
      ^~~~~~~~~~~~~~~
/tmp/B.zVN1Bt/BUILD/rtl8812au_linux-master/os_dep/linux/ioctl_cfg80211.c: In function 'rtw_cfg80211_preinit_wiphy':
/tmp/B.zVN1Bt/BUILD/rtl8812au_linux-master/os_dep/linux/ioctl_cfg80211.c:5994:18: error: 'WIPHY_FLAG_SUPPORTS_SCHED_SCAN' undeclared (first use in this function)
  wiphy->flags |= WIPHY_FLAG_SUPPORTS_SCHED_SCAN;
                  ^~~~~~~~~~~~~~~~~~~~~~~~~~~~~~
/tmp/B.zVN1Bt/BUILD/rtl8812au_linux-master/os_dep/linux/ioctl_cfg80211.c:5994:18: note: each undeclared identifier is reported only once for each function it appears in
/tmp/B.zVN1Bt/BUILD/rtl8812au_linux-master/os_dep/linux/ioctl_cfg80211.c: At top level:
/tmp/B.zVN1Bt/BUILD/rtl8812au_linux-master/os_dep/linux/ioctl_cfg80211.c:6024:25: error: initialization from incompatible pointer type [-Werror=incompatible-pointer-types]
  .change_virtual_intf = cfg80211_rtw_change_iface,
                         ^~~~~~~~~~~~~~~~~~~~~~~~~
/tmp/B.zVN1Bt/BUILD/rtl8812au_linux-master/os_dep/linux/ioctl_cfg80211.c:6024:25: note: (near initialization for 'rtw_cfg80211_ops.change_virtual_intf')
/tmp/B.zVN1Bt/BUILD/rtl8812au_linux-master/os_dep/linux/ioctl_cfg80211.c:6044:22: error: initialization from incompatible pointer type [-Werror=incompatible-pointer-types]
  .add_virtual_intf = cfg80211_rtw_add_virtual_intf,
                      ^~~~~~~~~~~~~~~~~~~~~~~~~~~~~
/tmp/B.zVN1Bt/BUILD/rtl8812au_linux-master/os_dep/linux/ioctl_cfg80211.c:6044:22: note: (near initialization for 'rtw_cfg80211_ops.add_virtual_intf')
cc1: some warnings being treated as errors
make[2]: *** [scripts/Makefile.build:302: /tmp/B.zVN1Bt/BUILD/rtl8812au_linux-master/os_dep/linux/ioctl_cfg80211.o] Error 1
make[2]: *** Waiting for unfinished jobs....
  CC [M]  /tmp/B.zVN1Bt/BUILD/rtl8812au_linux-master/os_dep/linux/recv_linux.o
  CC [M]  /tmp/B.zVN1Bt/BUILD/rtl8812au_linux-master/os_dep/linux/wifi_regd.o
  CC [M]  /tmp/B.zVN1Bt/BUILD/rtl8812au_linux-master/os_dep/linux/rtw_android.o
  CC [M]  /tmp/B.zVN1Bt/BUILD/rtl8812au_linux-master/os_dep/linux/rtw_proc.o
  CC [M]  /tmp/B.zVN1Bt/BUILD/rtl8812au_linux-master/hal/hal_intf.o
  CC [M]  /tmp/B.zVN1Bt/BUILD/rtl8812au_linux-master/hal/hal_com.o
  CC [M]  /tmp/B.zVN1Bt/BUILD/rtl8812au_linux-master/os_dep/linux/ioctl_linux.o
/tmp/B.zVN1Bt/BUILD/rtl8812au_linux-master/os_dep/linux/ioctl_linux.c: In function 'rtw_mp_read_reg':
/tmp/B.zVN1Bt/BUILD/rtl8812au_linux-master/os_dep/linux/ioctl_linux.c:10643:8: warning: this 'if' clause does not guard... [-Wmisleading-indentation]
        if ( data[i] != '\0' )
        ^~
/tmp/B.zVN1Bt/BUILD/rtl8812au_linux-master/os_dep/linux/ioctl_linux.c:10646:10: note: ...this statement, but the latter is misleadingly indented as if it is guarded by the 'if'
          j++;
          ^
  CC [M]  /tmp/B.zVN1Bt/BUILD/rtl8812au_linux-master/hal/hal_com_phycfg.o
make[1]: *** [Makefile:1515: _module_/tmp/B.zVN1Bt/BUILD/rtl8812au_linux-master] Error 2
make: *** [Makefile:1350: modules] Error 2
error: Bad exit status from /tmp/B.zVN1Bt/BUILD/tmp/rpm-tmp.88788 (%build)


RPM build errors:
    Bad exit status from /tmp/B.zVN1Bt/BUILD/tmp/rpm-tmp.88788 (%build)
ended at: Mon Jul 31 19:44:29 2017, done in 0:00:10.015217
error: No files produced.
+ chmod -R u+rwX /tmp/B.zVN1Bt/BUILD
+ rm -rf /tmp/B.zVN1Bt/tmp /tmp/B.zVN1Bt/BUILD
+ rm -rf /tmp/B.zVN1Bt
Begin-PLD-Builder-Info
Build-Time: user:44.77s sys:4.02s real:18.13s (faults io:0 non-io:1013750)

End-PLD-Builder-Info
[Back to list of logs] [View rpm -qa of builder]