FailedOk

th/SRPMS[OK]
th/x32[OK]
th/i686[OK]
th/x86_64[OK]

ac/SRPMS[OK]
ac/i386[OK]
ac/i586[OK]
ac/i686[OK]
ac/alpha[OK]
ac/amd64[OK]
ac/athlon[OK]
ac/ppc[OK]
ac/sparc[OK]
ac/sparc64[OK]

Advanced Search
main()
Powered by PLD Linux
(c) 2002-2020 PLD Team
$Revision: 1.37 $
Powered by ufo.
Your IP: 18.207.102.38

rust 7294ddf4-17df-4531-9a95-18e6ac379767

Status:Failed
Source URL:https://buildlogs.pld-linux.org/pld/th/x32/FAIL/rust,7294ddf4-17df-4531-9a95-18e6ac379767.bz2
text/plain URL:View!
full text:View!
rpm -qa of builder:View!
Date:2020/10/15 13:26:31
Runtime:1:14:27.556167

Toc:

  • error 1
  • error: linking with `cc` failed: exit code: 1
  • error 2
  • collect2: error: ld returned 1 exit status
  • error 3
  • error: aborting due to previous error
  • error 4
  • error: could not compile `cargo`.
  • error 5
  • RuntimeError: failed to run: /tmp/B.TDgbLo/BUILD/rustc-1.47.0-src/build/bootstrap/debug/bootstrap dist -j 4 --verbose
  • error 6
  • error: Bad exit status from /tmp/B.TDgbLo/BUILD/tmp/rpm-tmp.92463 (%build)
  • error 7
  • RPM build errors:
  • error 8
  • error: No files produced.

Content:

        c Sysroot { compiler: Compiler { stage: 1, host: TargetSelection { triple: "x86_64-unknown-linux-gnu", file: None } } }
        c Sysroot { compiler: Compiler { stage: 1, host: TargetSelection { triple: "x86_64-unknown-linux-gnu", file: None } } }
        c Sysroot { compiler: Compiler { stage: 1, host: TargetSelection { triple: "x86_64-unknown-linux-gnu", file: None } } }
        c Sysroot { compiler: Compiler { stage: 1, host: TargetSelection { triple: "x86_64-unknown-linux-gnu", file: None } } }
        c Sysroot { compiler: Compiler { stage: 1, host: TargetSelection { triple: "x86_64-unknown-linux-gnu", file: None } } }
        c Llvm { target: TargetSelection { triple: "x86_64-unknown-linux-gnu", file: None } }
Building stage1 tool cargo (x86_64-unknown-linux-gnu)
running: "/tmp/B.TDgbLo/BUILD/rustc-1.47.0-src/rust-1.46.0-x86_64-unknown-linux-gnu/bin/cargo" "build" "--target" "x86_64-unknown-linux-gnu" "-Zbinary-dep-depinfo" "-j" "4" "--release" "--frozen" "--manifest-path" "/tmp/B.TDgbLo/BUILD/rustc-1.47.0-src/src/tools/cargo/Cargo.toml" "--message-format" "json-render-diagnostics"
   Compiling pkg-config v0.3.18
   Compiling syn v1.0.38
   Compiling memchr v2.3.3
   Compiling crc32fast v1.2.0
   Compiling log v0.4.11
   Compiling matches v0.1.8
   Compiling tinyvec v0.3.4
   Compiling cfg-if v0.1.10
   Compiling serde_json v1.0.57
   Compiling percent-encoding v2.1.0
   Compiling typenum v1.12.0
   Compiling anyhow v1.0.32
   Compiling unicode-xid v0.2.1
   Compiling curl v0.4.31
   Compiling regex-syntax v0.6.18
   Compiling openssl-probe v0.1.2
   Compiling openssl v0.10.30
   Compiling foreign-types-shared v0.1.1
   Compiling quick-error v1.2.3
   Compiling same-file v1.0.6
   Compiling fnv v1.0.7
   Compiling unicode-width v0.1.8
   Compiling utf8parse v0.1.1
   Compiling strsim v0.8.0
   Compiling vec_map v0.8.2
   Compiling hex v0.3.2
   Compiling termcolor v1.1.0
   Compiling smallvec v1.4.2
   Compiling ansi_term v0.11.0
   Compiling semver-parser v0.7.0
   Compiling hex v0.4.2
   Compiling opener v0.4.1
   Compiling lazycell v1.3.0
   Compiling humantime v2.0.1
   Compiling home v0.5.3
   Compiling glob v0.3.0
   Compiling bytesize v1.0.1
   Compiling shell-escape v0.1.5
   Compiling libc v0.2.74
   Compiling crossbeam-utils v0.7.2
   Compiling proc-macro2 v1.0.19
   Compiling thread_local v1.0.1
   Compiling unicode-bidi v0.3.4
   Compiling unicode-normalization v0.1.13
   Compiling im-rc v15.0.0
   Compiling foreign-types v0.3.2
   Compiling humantime v1.3.0
   Compiling walkdir v2.3.1
   Compiling textwrap v0.11.0
   Compiling vte v0.3.3
   Compiling idna v0.2.0
   Compiling strip-ansi-escapes v0.1.0
   Compiling jobserver v0.1.21
   Compiling filetime v0.2.12
   Compiling socket2 v0.3.12
   Compiling atty v0.2.14
   Compiling aho-corasick v0.7.13
   Compiling bstr v0.2.13
   Compiling quote v1.0.7
   Compiling smallvec v0.6.13
   Compiling bitmaps v2.1.0
   Compiling cc v1.0.58
   Compiling tar v0.4.29
   Compiling clap v2.33.3
   Compiling regex v1.3.9
   Compiling sized-chunks v0.6.2
   Compiling rand_xoshiro v0.4.0
   Compiling libz-sys v1.0.27
   Compiling openssl-sys v0.9.58
   Compiling libnghttp2-sys v0.1.4+1.41.0
   Compiling curl-sys v0.4.34+curl-7.71.1
   Compiling libssh2-sys v0.2.18
   Compiling libgit2-sys v0.12.9+1.0.1
   Compiling globset v0.4.5
   Compiling env_logger v0.7.1
   Compiling ignore v0.4.16
   Compiling flate2 v1.0.16
   Compiling serde_derive v1.0.115
   Compiling cargo v0.48.0 (/tmp/B.TDgbLo/BUILD/rustc-1.47.0-src/src/tools/cargo)
   Compiling crypto-hash v0.3.4
   Compiling serde v1.0.115
   Compiling url v2.1.1
   Compiling toml v0.5.6
   Compiling semver v0.10.0
   Compiling serde_ignored v0.1.2
   Compiling cargo-platform v0.1.1 (/tmp/B.TDgbLo/BUILD/rustc-1.47.0-src/src/tools/cargo/crates/cargo-platform)
   Compiling git2 v0.13.8
   Compiling rustc-workspace-hack v1.0.0 (/tmp/B.TDgbLo/BUILD/rustc-1.47.0-src/src/tools/rustc-workspace-hack)
   Compiling rustfix v0.5.1
   Compiling crates-io v0.31.1 (/tmp/B.TDgbLo/BUILD/rustc-1.47.0-src/src/tools/cargo/crates/crates-io)
   Compiling git2-curl v0.14.0
error: linking with `cc` failed: exit code: 1
  |
  = note: "cc" "-Wl,--as-needed" "-Wl,-z,noexecstack" "-m64" "-Wl,--eh-frame-hdr" "-L" "/tmp/B.TDgbLo/BUILD/rustc-1.47.0-src/build/x86_64-unknown-linux-gnu/stage1/lib/rustlib/x86_64-unknown-linux-gnu/lib" "/tmp/B.TDgbLo/BUILD/rustc-1.47.0-src/build/x86_64-unknown-linux-gnu/stage1-tools/x86_64-unknown-linux-gnu/release/deps/cargo-44a8ec1c4bb25658.cargo.6ubajesl-cgu.0.rcgu.o" "/tmp/B.TDgbLo/BUILD/rustc-1.47.0-src/build/x86_64-unknown-linux-gnu/stage1-tools/x86_64-unknown-linux-gnu/release/deps/cargo-44a8ec1c4bb25658.cargo.6ubajesl-cgu.1.rcgu.o" "/tmp/B.TDgbLo/BUILD/rustc-1.47.0-src/build/x86_64-unknown-linux-gnu/stage1-tools/x86_64-unknown-linux-gnu/release/deps/cargo-44a8ec1c4bb25658.cargo.6ubajesl-cgu.10.rcgu.o" "/tmp/B.TDgbLo/BUILD/rustc-1.47.0-src/build/x86_64-unknown-linux-gnu/stage1-tools/x86_64-unknown-linux-gnu/release/deps/cargo-44a8ec1c4bb25658.cargo.6ubajesl-cgu.11.rcgu.o" "/tmp/B.TDgbLo/BUILD/rustc-1.47.0-src/build/x86_64-unknown-linux-gnu/stage1-tools/x86_64-unknown-linux-gnu/release/deps/cargo-44a8ec1c4bb25658.cargo.6ubajesl-cgu.12.rcgu.o" "/tmp/B.TDgbLo/BUILD/rustc-1.47.0-src/build/x86_64-unknown-linux-gnu/stage1-tools/x86_64-unknown-linux-gnu/release/deps/cargo-44a8ec1c4bb25658.cargo.6ubajesl-cgu.13.rcgu.o" "/tmp/B.TDgbLo/BUILD/rustc-1.47.0-src/build/x86_64-unknown-linux-gnu/stage1-tools/x86_64-unknown-linux-gnu/release/deps/cargo-44a8ec1c4bb25658.cargo.6ubajesl-cgu.14.rcgu.o" "/tmp/B.TDgbLo/BUILD/rustc-1.47.0-src/build/x86_64-unknown-linux-gnu/stage1-tools/x86_64-unknown-linux-gnu/release/deps/cargo-44a8ec1c4bb25658.cargo.6ubajesl-cgu.15.rcgu.o" "/tmp/B.TDgbLo/BUILD/rustc-1.47.0-src/build/x86_64-unknown-linux-gnu/stage1-tools/x86_64-unknown-linux-gnu/release/deps/cargo-44a8ec1c4bb25658.cargo.6ubajesl-cgu.2.rcgu.o" "/tmp/B.TDgbLo/BUILD/rustc-1.47.0-src/build/x86_64-unknown-linux-gnu/stage1-tools/x86_64-unknown-linux-gnu/release/deps/cargo-44a8ec1c4bb25658.cargo.6ubajesl-cgu.3.rcgu.o" "/tmp/B.TDgbLo/BUILD/rustc-1.47.0-src/build/x86_64-unknown-linux-gnu/stage1-tools/x86_64-unknown-linux-gnu/release/deps/cargo-44a8ec1c4bb25658.cargo.6ubajesl-cgu.4.rcgu.o" "/tmp/B.TDgbLo/BUILD/rustc-1.47.0-src/build/x86_64-unknown-linux-gnu/stage1-tools/x86_64-unknown-linux-gnu/release/deps/cargo-44a8ec1c4bb25658.cargo.6ubajesl-cgu.5.rcgu.o" "/tmp/B.TDgbLo/BUILD/rustc-1.47.0-src/build/x86_64-unknown-linux-gnu/stage1-tools/x86_64-unknown-linux-gnu/release/deps/cargo-44a8ec1c4bb25658.cargo.6ubajesl-cgu.6.rcgu.o" "/tmp/B.TDgbLo/BUILD/rustc-1.47.0-src/build/x86_64-unknown-linux-gnu/stage1-tools/x86_64-unknown-linux-gnu/release/deps/cargo-44a8ec1c4bb25658.cargo.6ubajesl-cgu.7.rcgu.o" "/tmp/B.TDgbLo/BUILD/rustc-1.47.0-src/build/x86_64-unknown-linux-gnu/stage1-tools/x86_64-unknown-linux-gnu/release/deps/cargo-44a8ec1c4bb25658.cargo.6ubajesl-cgu.8.rcgu.o" "/tmp/B.TDgbLo/BUILD/rustc-1.47.0-src/build/x86_64-unknown-linux-gnu/stage1-tools/x86_64-unknown-linux-gnu/release/deps/cargo-44a8ec1c4bb25658.cargo.6ubajesl-cgu.9.rcgu.o" "-o" "/tmp/B.TDgbLo/BUILD/rustc-1.47.0-src/build/x86_64-unknown-linux-gnu/stage1-tools/x86_64-unknown-linux-gnu/release/deps/cargo-44a8ec1c4bb25658" "/tmp/B.TDgbLo/BUILD/rustc-1.47.0-src/build/x86_64-unknown-linux-gnu/stage1-tools/x86_64-unknown-linux-gnu/release/deps/cargo-44a8ec1c4bb25658.2p5ztr25c981ej6n.rcgu.o" "-Wl,--gc-sections" "-pie" "-Wl,-zrelro" "-Wl,-znow" "-Wl,-O1" "-nodefaultlibs" "-L" "/tmp/B.TDgbLo/BUILD/rustc-1.47.0-src/build/x86_64-unknown-linux-gnu/stage1-tools/x86_64-unknown-linux-gnu/release/deps" "-L" "/tmp/B.TDgbLo/BUILD/rustc-1.47.0-src/build/x86_64-unknown-linux-gnu/stage1-tools/release/deps" "-L" "/usr/libx32" "-L" "/tmp/B.TDgbLo/BUILD/rustc-1.47.0-src/build/x86_64-unknown-linux-gnu/stage1-tools/x86_64-unknown-linux-gnu/release/build/libnghttp2-sys-e3235ac820f61501/out/i/lib" "-L" "/usr/libx32" "-L" "/tmp/B.TDgbLo/BUILD/rustc-1.47.0-src/build/x86_64-unknown-linux-gnu/stage1-tools/x86_64-unknown-linux-gnu/release/build/libssh2-sys-63ad9d847c1d4d48/out/build" "-L" "/tmp/B.TDgbLo/BUILD/rustc-1.47.0-src/build/x86_64-unknown-linux-gnu/stage1/lib/rustlib/x86_64-unknown-linux-gnu/lib" "-Wl,-Bstatic" "/tmp/B.TDgbLo/BUILD/rustc-1.47.0-src/build/x86_64-unknown-linux-gnu/stage1-tools/x86_64-unknown-linux-gnu/release/deps/libgit2_curl-a85e8eb189f22e29.rlib" "/tmp/B.TDgbLo/BUILD/rustc-1.47.0-src/build/x86_64-unknown-linux-gnu/stage1-tools/x86_64-unknown-linux-gnu/release/deps/libenv_logger-d73c9fb072f2eb51.rlib" "/tmp/B.TDgbLo/BUILD/rustc-1.47.0-src/build/x86_64-unknown-linux-gnu/stage1-tools/x86_64-unknown-linux-gnu/release/deps/libhumantime-59773f49cb668970.rlib" "/tmp/B.TDgbLo/BUILD/rustc-1.47.0-src/build/x86_64-unknown-linux-gnu/stage1-tools/x86_64-unknown-linux-gnu/release/deps/libquick_error-203709487fe8e934.rlib" "/tmp/B.TDgbLo/BUILD/rustc-1.47.0-src/build/x86_64-unknown-linux-gnu/stage1-tools/x86_64-unknown-linux-gnu/release/deps/libcargo-0b5769e368e74791.rlib" "/tmp/B.TDgbLo/BUILD/rustc-1.47.0-src/build/x86_64-unknown-linux-gnu/stage1-tools/x86_64-unknown-linux-gnu/release/deps/libunicode_xid-45864fa21cb4c37d.rlib" "/tmp/B.TDgbLo/BUILD/rustc-1.47.0-src/build/x86_64-unknown-linux-gnu/stage1-tools/x86_64-unknown-linux-gnu/release/deps/libhex-8c77d5ae92d00bc4.rlib" "/tmp/B.TDgbLo/BUILD/rustc-1.47.0-src/build/x86_64-unknown-linux-gnu/stage1-tools/x86_64-unknown-linux-gnu/release/deps/libhome-2de5b433299ee662.rlib" "/tmp/B.TDgbLo/BUILD/rustc-1.47.0-src/build/x86_64-unknown-linux-gnu/stage1-tools/x86_64-unknown-linux-gnu/release/deps/libopener-d07bf6befd4a25ea.rlib" "/tmp/B.TDgbLo/BUILD/rustc-1.47.0-src/build/x86_64-unknown-linux-gnu/stage1-tools/x86_64-unknown-linux-gnu/release/deps/libim_rc-f64cfe61c3ff0595.rlib" "/tmp/B.TDgbLo/BUILD/rustc-1.47.0-src/build/x86_64-unknown-linux-gnu/stage1-tools/x86_64-unknown-linux-gnu/release/deps/librand_xoshiro-cff46c50651965e8.rlib" "/tmp/B.TDgbLo/BUILD/rustc-1.47.0-src/build/x86_64-unknown-linux-gnu/stage1-tools/x86_64-unknown-linux-gnu/release/deps/libsized_chunks-5a6dab93cabb7cab.rlib" "/tmp/B.TDgbLo/BUILD/rustc-1.47.0-src/build/x86_64-unknown-linux-gnu/stage1-tools/x86_64-unknown-linux-gnu/release/deps/libbitmaps-910b770d8e449449.rlib" "/tmp/B.TDgbLo/BUILD/rustc-1.47.0-src/build/x86_64-unknown-linux-gnu/stage1-tools/x86_64-unknown-linux-gnu/release/deps/libtypenum-4d1658310815fa9b.rlib" "/tmp/B.TDgbLo/BUILD/rustc-1.47.0-src/build/x86_64-unknown-linux-gnu/stage1-tools/x86_64-unknown-linux-gnu/release/deps/libtoml-da0f45bea612091c.rlib" "/tmp/B.TDgbLo/BUILD/rustc-1.47.0-src/build/x86_64-unknown-linux-gnu/stage1-tools/x86_64-unknown-linux-gnu/release/deps/libstrip_ansi_escapes-277d8fb4ebbebace.rlib" "/tmp/B.TDgbLo/BUILD/rustc-1.47.0-src/build/x86_64-unknown-linux-gnu/stage1-tools/x86_64-unknown-linux-gnu/release/deps/libvte-4d1a1c81e25ae969.rlib" "/tmp/B.TDgbLo/BUILD/rustc-1.47.0-src/build/x86_64-unknown-linux-gnu/stage1-tools/x86_64-unknown-linux-gnu/release/deps/libutf8parse-f5cb4a4a6ffd0187.rlib" "/tmp/B.TDgbLo/BUILD/rustc-1.47.0-src/build/x86_64-unknown-linux-gnu/stage1-tools/x86_64-unknown-linux-gnu/release/deps/libhumantime-1435582d39a057c3.rlib" "/tmp/B.TDgbLo/BUILD/rustc-1.47.0-src/build/x86_64-unknown-linux-gnu/stage1-tools/x86_64-unknown-linux-gnu/release/deps/libnum_cpus-3cefb7fc6f97fcd9.rlib" "/tmp/B.TDgbLo/BUILD/rustc-1.47.0-src/build/x86_64-unknown-linux-gnu/stage1-tools/x86_64-unknown-linux-gnu/release/deps/libserde_ignored-91e3eac630524f28.rlib" "/tmp/B.TDgbLo/BUILD/rustc-1.47.0-src/build/x86_64-unknown-linux-gnu/stage1-tools/x86_64-unknown-linux-gnu/release/deps/libcrypto_hash-a16a00c519541e3e.rlib" "/tmp/B.TDgbLo/BUILD/rustc-1.47.0-src/build/x86_64-unknown-linux-gnu/stage1-tools/x86_64-unknown-linux-gnu/release/deps/libopenssl-2efcb3e0dd40e059.rlib" "/tmp/B.TDgbLo/BUILD/rustc-1.47.0-src/build/x86_64-unknown-linux-gnu/stage1-tools/x86_64-unknown-linux-gnu/release/deps/libforeign_types-1d57957975aeb0fa.rlib" "/tmp/B.TDgbLo/BUILD/rustc-1.47.0-src/build/x86_64-unknown-linux-gnu/stage1-tools/x86_64-unknown-linux-gnu/release/deps/libforeign_types_shared-27bb659e2951ad4f.rlib" "/tmp/B.TDgbLo/BUILD/rustc-1.47.0-src/build/x86_64-unknown-linux-gnu/stage1-tools/x86_64-unknown-linux-gnu/release/deps/libhex-cd5c7d74750036e2.rlib" "/tmp/B.TDgbLo/BUILD/rustc-1.47.0-src/build/x86_64-unknown-linux-gnu/stage1-tools/x86_64-unknown-linux-gnu/release/deps/libshell_escape-6c24056ba6d9bd6c.rlib" "/tmp/B.TDgbLo/BUILD/rustc-1.47.0-src/build/x86_64-unknown-linux-gnu/stage1-tools/x86_64-unknown-linux-gnu/release/deps/libclap-42eac4cc3385cb16.rlib" "/tmp/B.TDgbLo/BUILD/rustc-1.47.0-src/build/x86_64-unknown-linux-gnu/stage1-tools/x86_64-unknown-linux-gnu/release/deps/libvec_map-2ca381441f3ba38b.rlib" "/tmp/B.TDgbLo/BUILD/rustc-1.47.0-src/build/x86_64-unknown-linux-gnu/stage1-tools/x86_64-unknown-linux-gnu/release/deps/libtextwrap-0caecc258f595d24.rlib" "/tmp/B.TDgbLo/BUILD/rustc-1.47.0-src/build/x86_64-unknown-linux-gnu/stage1-tools/x86_64-unknown-linux-gnu/release/deps/libunicode_width-ddd94c94ce90fdef.rlib" "/tmp/B.TDgbLo/BUILD/rustc-1.47.0-src/build/x86_64-unknown-linux-gnu/stage1-tools/x86_64-unknown-linux-gnu/release/deps/libstrsim-52b351c199a7e357.rlib" "/tmp/B.TDgbLo/BUILD/rustc-1.47.0-src/build/x86_64-unknown-linux-gnu/stage1-tools/x86_64-unknown-linux-gnu/release/deps/libatty-0589cc403e1c5d6a.rlib" "/tmp/B.TDgbLo/BUILD/rustc-1.47.0-src/build/x86_64-unknown-linux-gnu/stage1-tools/x86_64-unknown-linux-gnu/release/deps/libansi_term-e8b1775ad6691f26.rlib" "/tmp/B.TDgbLo/BUILD/rustc-1.47.0-src/build/x86_64-unknown-linux-gnu/stage1-tools/x86_64-unknown-linux-gnu/release/deps/libignore-0ebb57b5b1905b67.rlib" "/tmp/B.TDgbLo/BUILD/rustc-1.47.0-src/build/x86_64-unknown-linux-gnu/stage1-tools/x86_64-unknown-linux-gnu/release/deps/libwalkdir-8832c3d9c52ed13d.rlib" "/tmp/B.TDgbLo/BUILD/rustc-1.47.0-src/build/x86_64-unknown-linux-gnu/stage1-tools/x86_64-unknown-linux-gnu/release/deps/libsame_file-b22539109bfe461f.rlib" "/tmp/B.TDgbLo/BUILD/rustc-1.47.0-src/build/x86_64-unknown-linux-gnu/stage1-tools/x86_64-unknown-linux-gnu/release/deps/libglobset-fd9144b43bd76510.rlib" "/tmp/B.TDgbLo/BUILD/rustc-1.47.0-src/build/x86_64-unknown-linux-gnu/stage1-tools/x86_64-unknown-linux-gnu/release/deps/libregex-08d33bb21e0400d4.rlib" "/tmp/B.TDgbLo/BUILD/rustc-1.47.0-src/build/x86_64-unknown-linux-gnu/stage1-tools/x86_64-unknown-linux-gnu/release/deps/libthread_local-97eb6620f651b4f1.rlib" "/tmp/B.TDgbLo/BUILD/rustc-1.47.0-src/build/x86_64-unknown-linux-gnu/stage1-tools/x86_64-unknown-linux-gnu/release/deps/libregex_syntax-1cbcd9755ea913b5.rlib" "/tmp/B.TDgbLo/BUILD/rustc-1.47.0-src/build/x86_64-unknown-linux-gnu/stage1-tools/x86_64-unknown-linux-gnu/release/deps/libfnv-fed17f0e5d9a5e87.rlib" "/tmp/B.TDgbLo/BUILD/rustc-1.47.0-src/build/x86_64-unknown-linux-gnu/stage1-tools/x86_64-unknown-linux-gnu/release/deps/libbstr-36b61b51afdba58f.rlib" "/tmp/B.TDgbLo/BUILD/rustc-1.47.0-src/build/x86_64-unknown-linux-gnu/stage1-tools/x86_64-unknown-linux-gnu/release/deps/libaho_corasick-0af08b36fe8d3a48.rlib" "/tmp/B.TDgbLo/BUILD/rustc-1.47.0-src/build/x86_64-unknown-linux-gnu/stage1-tools/x86_64-unknown-linux-gnu/release/deps/libmemchr-85c8c10353553f89.rlib" "/tmp/B.TDgbLo/BUILD/rustc-1.47.0-src/build/x86_64-unknown-linux-gnu/stage1-tools/x86_64-unknown-linux-gnu/release/deps/libcrates_io-48f7f1df37506ed1.rlib" "/tmp/B.TDgbLo/BUILD/rustc-1.47.0-src/build/x86_64-unknown-linux-gnu/stage1-tools/x86_64-unknown-linux-gnu/release/deps/librustfix-7c6ba175f3f31ee1.rlib" "/tmp/B.TDgbLo/BUILD/rustc-1.47.0-src/build/x86_64-unknown-linux-gnu/stage1-tools/x86_64-unknown-linux-gnu/release/deps/libserde_json-15cb3f21021ea098.rlib" "/tmp/B.TDgbLo/BUILD/rustc-1.47.0-src/build/x86_64-unknown-linux-gnu/stage1-tools/x86_64-unknown-linux-gnu/release/deps/libryu-f0b540976ea5338e.rlib" "/tmp/B.TDgbLo/BUILD/rustc-1.47.0-src/build/x86_64-unknown-linux-gnu/stage1-tools/x86_64-unknown-linux-gnu/release/deps/libitoa-534c967b739185b9.rlib" "/tmp/B.TDgbLo/BUILD/rustc-1.47.0-src/build/x86_64-unknown-linux-gnu/stage1-tools/x86_64-unknown-linux-gnu/release/deps/libtar-fbe2b1c2eadfce09.rlib" "/tmp/B.TDgbLo/BUILD/rustc-1.47.0-src/build/x86_64-unknown-linux-gnu/stage1-tools/x86_64-unknown-linux-gnu/release/deps/libflate2-50bfe56d08073b41.rlib" "/tmp/B.TDgbLo/BUILD/rustc-1.47.0-src/build/x86_64-unknown-linux-gnu/stage1-tools/x86_64-unknown-linux-gnu/release/deps/libcrc32fast-0a02942444f18fd6.rlib" "/tmp/B.TDgbLo/BUILD/rustc-1.47.0-src/build/x86_64-unknown-linux-gnu/stage1-tools/x86_64-unknown-linux-gnu/release/deps/libgit2-0356008cce60292a.rlib" "/tmp/B.TDgbLo/BUILD/rustc-1.47.0-src/build/x86_64-unknown-linux-gnu/stage1-tools/x86_64-unknown-linux-gnu/release/deps/libopenssl_probe-4c79a8a6a45cc3a0.rlib" "/tmp/B.TDgbLo/BUILD/rustc-1.47.0-src/build/x86_64-unknown-linux-gnu/stage1-tools/x86_64-unknown-linux-gnu/release/deps/liblibgit2_sys-58feff1c2aca4410.rlib" "/tmp/B.TDgbLo/BUILD/rustc-1.47.0-src/build/x86_64-unknown-linux-gnu/stage1-tools/x86_64-unknown-linux-gnu/release/deps/liblibssh2_sys-a7ec042a84df187f.rlib" "/tmp/B.TDgbLo/BUILD/rustc-1.47.0-src/build/x86_64-unknown-linux-gnu/stage1-tools/x86_64-unknown-linux-gnu/release/deps/libopenssl_sys-dfcd606e37ca1d19.rlib" "/tmp/B.TDgbLo/BUILD/rustc-1.47.0-src/build/x86_64-unknown-linux-gnu/stage1-tools/x86_64-unknown-linux-gnu/release/deps/liblibz_sys-e75faa98bc07fe79.rlib" "/tmp/B.TDgbLo/BUILD/rustc-1.47.0-src/build/x86_64-unknown-linux-gnu/stage1-tools/x86_64-unknown-linux-gnu/release/deps/libbitflags-74604ce36ea909e3.rlib" "/tmp/B.TDgbLo/BUILD/rustc-1.47.0-src/build/x86_64-unknown-linux-gnu/stage1-tools/x86_64-unknown-linux-gnu/release/deps/libtempfile-2677a4730eafd9d6.rlib" "/tmp/B.TDgbLo/BUILD/rustc-1.47.0-src/build/x86_64-unknown-linux-gnu/stage1-tools/x86_64-unknown-linux-gnu/release/deps/librand-8d8c7c976e36cdad.rlib" "/tmp/B.TDgbLo/BUILD/rustc-1.47.0-src/build/x86_64-unknown-linux-gnu/stage1-tools/x86_64-unknown-linux-gnu/release/deps/librand_chacha-d7931b093373a8ec.rlib" "/tmp/B.TDgbLo/BUILD/rustc-1.47.0-src/build/x86_64-unknown-linux-gnu/stage1-tools/x86_64-unknown-linux-gnu/release/deps/libppv_lite86-82f9c4523414b678.rlib" "/tmp/B.TDgbLo/BUILD/rustc-1.47.0-src/build/x86_64-unknown-linux-gnu/stage1-tools/x86_64-unknown-linux-gnu/release/deps/librand_core-93e905a5d20e3423.rlib" "/tmp/B.TDgbLo/BUILD/rustc-1.47.0-src/build/x86_64-unknown-linux-gnu/stage1-tools/x86_64-unknown-linux-gnu/release/deps/libgetrandom-d2350ee42cdbe1ed.rlib" "/tmp/B.TDgbLo/BUILD/rustc-1.47.0-src/build/x86_64-unknown-linux-gnu/stage1-tools/x86_64-unknown-linux-gnu/release/deps/libremove_dir_all-4e7f51045e1a3b80.rlib" "/tmp/B.TDgbLo/BUILD/rustc-1.47.0-src/build/x86_64-unknown-linux-gnu/stage1-tools/x86_64-unknown-linux-gnu/release/deps/libglob-4e3829dd4b4d57ab.rlib" "/tmp/B.TDgbLo/BUILD/rustc-1.47.0-src/build/x86_64-unknown-linux-gnu/stage1-tools/x86_64-unknown-linux-gnu/release/deps/libtermcolor-b68e3f2e8d8c86ac.rlib" "/tmp/B.TDgbLo/BUILD/rustc-1.47.0-src/build/x86_64-unknown-linux-gnu/stage1-tools/x86_64-unknown-linux-gnu/release/deps/libcurl-8be3839598cb5975.rlib" "/tmp/B.TDgbLo/BUILD/rustc-1.47.0-src/build/x86_64-unknown-linux-gnu/stage1-tools/x86_64-unknown-linux-gnu/release/deps/libsocket2-8c20f5834ac22203.rlib" "/tmp/B.TDgbLo/BUILD/rustc-1.47.0-src/build/x86_64-unknown-linux-gnu/stage1-tools/x86_64-unknown-linux-gnu/release/deps/libcurl_sys-878aeace0baa5bc0.rlib" "/tmp/B.TDgbLo/BUILD/rustc-1.47.0-src/build/x86_64-unknown-linux-gnu/stage1-tools/x86_64-unknown-linux-gnu/release/deps/libbytesize-09c645bb44336462.rlib" "/tmp/B.TDgbLo/BUILD/rustc-1.47.0-src/build/x86_64-unknown-linux-gnu/stage1-tools/x86_64-unknown-linux-gnu/release/deps/liburl-fbb382a8398e9824.rlib" "/tmp/B.TDgbLo/BUILD/rustc-1.47.0-src/build/x86_64-unknown-linux-gnu/stage1-tools/x86_64-unknown-linux-gnu/release/deps/libpercent_encoding-2faf97e2e38c6263.rlib" "/tmp/B.TDgbLo/BUILD/rustc-1.47.0-src/build/x86_64-unknown-linux-gnu/stage1-tools/x86_64-unknown-linux-gnu/release/deps/libidna-a0d8a5d4a7d2fb76.rlib" "/tmp/B.TDgbLo/BUILD/rustc-1.47.0-src/build/x86_64-unknown-linux-gnu/stage1-tools/x86_64-unknown-linux-gnu/release/deps/libunicode_normalization-5c3eb87b12de9c54.rlib" "/tmp/B.TDgbLo/BUILD/rustc-1.47.0-src/build/x86_64-unknown-linux-gnu/stage1-tools/x86_64-unknown-linux-gnu/release/deps/libtinyvec-40836ce287d2c931.rlib" "/tmp/B.TDgbLo/BUILD/rustc-1.47.0-src/build/x86_64-unknown-linux-gnu/stage1-tools/x86_64-unknown-linux-gnu/release/deps/libunicode_bidi-3b4de6b7681a8ef4.rlib" "/tmp/B.TDgbLo/BUILD/rustc-1.47.0-src/build/x86_64-unknown-linux-gnu/stage1-tools/x86_64-unknown-linux-gnu/release/deps/libmatches-616c6dc6dc856b68.rlib" "/tmp/B.TDgbLo/BUILD/rustc-1.47.0-src/build/x86_64-unknown-linux-gnu/stage1-tools/x86_64-unknown-linux-gnu/release/deps/libcrossbeam_utils-cfc344a3537aab3d.rlib" "/tmp/B.TDgbLo/BUILD/rustc-1.47.0-src/build/x86_64-unknown-linux-gnu/stage1-tools/x86_64-unknown-linux-gnu/release/deps/liblazy_static-1749adffa815abc1.rlib" "/tmp/B.TDgbLo/BUILD/rustc-1.47.0-src/build/x86_64-unknown-linux-gnu/stage1-tools/x86_64-unknown-linux-gnu/release/deps/liblazycell-c706895e4f45a14a.rlib" "/tmp/B.TDgbLo/BUILD/rustc-1.47.0-src/build/x86_64-unknown-linux-gnu/stage1-tools/x86_64-unknown-linux-gnu/release/deps/libjobserver-0e97c79c0cfa562a.rlib" "/tmp/B.TDgbLo/BUILD/rustc-1.47.0-src/build/x86_64-unknown-linux-gnu/stage1-tools/x86_64-unknown-linux-gnu/release/deps/libfiletime-5fee34189b35b920.rlib" "/tmp/B.TDgbLo/BUILD/rustc-1.47.0-src/build/x86_64-unknown-linux-gnu/stage1-tools/x86_64-unknown-linux-gnu/release/deps/liblibc-4e45db8fed0075cf.rlib" "/tmp/B.TDgbLo/BUILD/rustc-1.47.0-src/build/x86_64-unknown-linux-gnu/stage1-tools/x86_64-unknown-linux-gnu/release/deps/libsemver-c9f342ce3aaa97f3.rlib" "/tmp/B.TDgbLo/BUILD/rustc-1.47.0-src/build/x86_64-unknown-linux-gnu/stage1-tools/x86_64-unknown-linux-gnu/release/deps/libsemver_parser-41d0bb354604d5f8.rlib" "/tmp/B.TDgbLo/BUILD/rustc-1.47.0-src/build/x86_64-unknown-linux-gnu/stage1-tools/x86_64-unknown-linux-gnu/release/deps/libcargo_platform-9d9f3b0ae3a0b949.rlib" "/tmp/B.TDgbLo/BUILD/rustc-1.47.0-src/build/x86_64-unknown-linux-gnu/stage1-tools/x86_64-unknown-linux-gnu/release/deps/libserde-649665a81685cf6a.rlib" "/tmp/B.TDgbLo/BUILD/rustc-1.47.0-src/build/x86_64-unknown-linux-gnu/stage1-tools/x86_64-unknown-linux-gnu/release/deps/liblog-742b2c6ee182f4c4.rlib" "/tmp/B.TDgbLo/BUILD/rustc-1.47.0-src/build/x86_64-unknown-linux-gnu/stage1-tools/x86_64-unknown-linux-gnu/release/deps/libcfg_if-d78d2ba7b47112c8.rlib" "/tmp/B.TDgbLo/BUILD/rustc-1.47.0-src/build/x86_64-unknown-linux-gnu/stage1-tools/x86_64-unknown-linux-gnu/release/deps/libanyhow-c441daa8117fe0cb.rlib" "-Wl,--start-group" "/tmp/B.TDgbLo/BUILD/rustc-1.47.0-src/build/x86_64-unknown-linux-gnu/stage1/lib/rustlib/x86_64-unknown-linux-gnu/lib/libstd-6454ae3faffd4fc6.rlib" "/tmp/B.TDgbLo/BUILD/rustc-1.47.0-src/build/x86_64-unknown-linux-gnu/stage1/lib/rustlib/x86_64-unknown-linux-gnu/lib/libpanic_unwind-7dc0921ba9f563f9.rlib" "/tmp/B.TDgbLo/BUILD/rustc-1.47.0-src/build/x86_64-unknown-linux-gnu/stage1/lib/rustlib/x86_64-unknown-linux-gnu/lib/libminiz_oxide-69dbb363bd1d6859.rlib" "/tmp/B.TDgbLo/BUILD/rustc-1.47.0-src/build/x86_64-unknown-linux-gnu/stage1/lib/rustlib/x86_64-unknown-linux-gnu/lib/libadler-94adcb76e3a21198.rlib" "/tmp/B.TDgbLo/BUILD/rustc-1.47.0-src/build/x86_64-unknown-linux-gnu/stage1/lib/rustlib/x86_64-unknown-linux-gnu/lib/libobject-94dbd6aa0acad18c.rlib" "/tmp/B.TDgbLo/BUILD/rustc-1.47.0-src/build/x86_64-unknown-linux-gnu/stage1/lib/rustlib/x86_64-unknown-linux-gnu/lib/libaddr2line-d1a8c5de6f5fc985.rlib" "/tmp/B.TDgbLo/BUILD/rustc-1.47.0-src/build/x86_64-unknown-linux-gnu/stage1/lib/rustlib/x86_64-unknown-linux-gnu/lib/libgimli-5d49b576732f4716.rlib" "/tmp/B.TDgbLo/BUILD/rustc-1.47.0-src/build/x86_64-unknown-linux-gnu/stage1/lib/rustlib/x86_64-unknown-linux-gnu/lib/librustc_demangle-9ecf024469963426.rlib" "/tmp/B.TDgbLo/BUILD/rustc-1.47.0-src/build/x86_64-unknown-linux-gnu/stage1/lib/rustlib/x86_64-unknown-linux-gnu/lib/libhashbrown-453eb836528ef4c1.rlib" "/tmp/B.TDgbLo/BUILD/rustc-1.47.0-src/build/x86_64-unknown-linux-gnu/stage1/lib/rustlib/x86_64-unknown-linux-gnu/lib/librustc_std_workspace_alloc-cc7a1900e6875d7f.rlib" "/tmp/B.TDgbLo/BUILD/rustc-1.47.0-src/build/x86_64-unknown-linux-gnu/stage1/lib/rustlib/x86_64-unknown-linux-gnu/lib/libunwind-c52e7ab4f4d261ce.rlib" "/tmp/B.TDgbLo/BUILD/rustc-1.47.0-src/build/x86_64-unknown-linux-gnu/stage1/lib/rustlib/x86_64-unknown-linux-gnu/lib/libcfg_if-ee80687053a9200b.rlib" "/tmp/B.TDgbLo/BUILD/rustc-1.47.0-src/build/x86_64-unknown-linux-gnu/stage1/lib/rustlib/x86_64-unknown-linux-gnu/lib/liblibc-26f6b86d802450a6.rlib" "/tmp/B.TDgbLo/BUILD/rustc-1.47.0-src/build/x86_64-unknown-linux-gnu/stage1/lib/rustlib/x86_64-unknown-linux-gnu/lib/liballoc-02588e90c32aabac.rlib" "/tmp/B.TDgbLo/BUILD/rustc-1.47.0-src/build/x86_64-unknown-linux-gnu/stage1/lib/rustlib/x86_64-unknown-linux-gnu/lib/librustc_std_workspace_core-358d434e7f12f4dd.rlib" "/tmp/B.TDgbLo/BUILD/rustc-1.47.0-src/build/x86_64-unknown-linux-gnu/stage1/lib/rustlib/x86_64-unknown-linux-gnu/lib/libcore-35c9e81069083a59.rlib" "-Wl,--end-group" "/tmp/B.TDgbLo/BUILD/rustc-1.47.0-src/build/x86_64-unknown-linux-gnu/stage1/lib/rustlib/x86_64-unknown-linux-gnu/lib/libcompiler_builtins-9a457396409d844f.rlib" "-Wl,-Bdynamic" "-lgit2" "-lssl" "-lcrypto" "-lz" "-lcurl" "-lutil" "-ldl" "-lutil" "-ldl" "-lrt" "-lpthread" "-lgcc_s" "-lc" "-lm" "-lrt" "-lpthread" "-lutil" "-ldl" "-lutil"
  = note: /usr/bin/ld: skipping incompatible /usr/libx32/libgit2.so when searching for -lgit2
          /usr/bin/ld: skipping incompatible /usr/libx32/libgit2.so when searching for -lgit2
          /usr/bin/ld: skipping incompatible /usr/libx32/libssl.so when searching for -lssl
          /usr/bin/ld: skipping incompatible /usr/libx32/libssl.a when searching for -lssl
          /usr/bin/ld: skipping incompatible /usr/libx32/libssl.so when searching for -lssl
          /usr/bin/ld: skipping incompatible /usr/libx32/libssl.a when searching for -lssl
          /usr/bin/ld: skipping incompatible /usr/libx32/libssl.so when searching for -lssl
          /usr/bin/ld: skipping incompatible /usr/libx32/libssl.a when searching for -lssl
          /usr/bin/ld: skipping incompatible /usr/libx32/gcc/x86_64-pld-linux-gnux32/10.2.0/../../../libssl.so when searching for -lssl
          /usr/bin/ld: skipping incompatible /usr/libx32/gcc/x86_64-pld-linux-gnux32/10.2.0/../../../libssl.a when searching for -lssl
          /usr/bin/ld: skipping incompatible /usr/libx32/libssl.so when searching for -lssl
          /usr/bin/ld: skipping incompatible /usr/libx32/libssl.a when searching for -lssl
          /usr/bin/ld: cannot find -lssl
          /usr/bin/ld: skipping incompatible /usr/libx32/libssl.so when searching for -lssl
          /usr/bin/ld: skipping incompatible /usr/libx32/libssl.so when searching for -lssl
          /usr/bin/ld: skipping incompatible /usr/libx32/libssl.so when searching for -lssl
          /usr/bin/ld: skipping incompatible /usr/libx32/gcc/x86_64-pld-linux-gnux32/10.2.0/../../../libssl.so when searching for -lssl
          /usr/bin/ld: skipping incompatible /usr/libx32/libssl.so when searching for -lssl
          /usr/bin/ld: skipping incompatible /usr/libx32/libcrypto.so when searching for -lcrypto
          /usr/bin/ld: skipping incompatible /usr/libx32/libcrypto.a when searching for -lcrypto
          /usr/bin/ld: skipping incompatible /usr/libx32/libcrypto.so when searching for -lcrypto
          /usr/bin/ld: skipping incompatible /usr/libx32/libcrypto.a when searching for -lcrypto
          /usr/bin/ld: skipping incompatible /usr/libx32/libcrypto.so when searching for -lcrypto
          /usr/bin/ld: skipping incompatible /usr/libx32/libcrypto.a when searching for -lcrypto
          /usr/bin/ld: skipping incompatible /usr/libx32/gcc/x86_64-pld-linux-gnux32/10.2.0/../../../libcrypto.so when searching for -lcrypto
          /usr/bin/ld: skipping incompatible /usr/libx32/gcc/x86_64-pld-linux-gnux32/10.2.0/../../../libcrypto.a when searching for -lcrypto
          /usr/bin/ld: skipping incompatible /usr/libx32/libcrypto.so when searching for -lcrypto
          /usr/bin/ld: skipping incompatible /usr/libx32/libcrypto.a when searching for -lcrypto
          /usr/bin/ld: cannot find -lcrypto
          /usr/bin/ld: skipping incompatible /usr/libx32/libcrypto.so when searching for -lcrypto
          /usr/bin/ld: skipping incompatible /usr/libx32/libcrypto.so when searching for -lcrypto
          /usr/bin/ld: skipping incompatible /usr/libx32/libcrypto.so when searching for -lcrypto
          /usr/bin/ld: skipping incompatible /usr/libx32/gcc/x86_64-pld-linux-gnux32/10.2.0/../../../libcrypto.so when searching for -lcrypto
          /usr/bin/ld: skipping incompatible /usr/libx32/libcrypto.so when searching for -lcrypto
          /usr/bin/ld: skipping incompatible /usr/libx32/libz.so when searching for -lz
          /usr/bin/ld: skipping incompatible /usr/libx32/libz.a when searching for -lz
          /usr/bin/ld: skipping incompatible /usr/libx32/libz.so when searching for -lz
          /usr/bin/ld: skipping incompatible /usr/libx32/libz.a when searching for -lz
          /usr/bin/ld: skipping incompatible /usr/libx32/libcurl.so when searching for -lcurl
          /usr/bin/ld: skipping incompatible /usr/libx32/libcurl.so when searching for -lcurl
          /usr/bin/ld: skipping incompatible /usr/libx32/libcurl.so when searching for -lcurl
          /usr/bin/ld: skipping incompatible /usr/libx32/gcc/x86_64-pld-linux-gnux32/10.2.0/../../../libcurl.so when searching for -lcurl
          /usr/bin/ld: skipping incompatible /usr/libx32/libcurl.so when searching for -lcurl
          /usr/bin/ld: cannot find -lcurl
          /usr/bin/ld: skipping incompatible /usr/libx32/libcurl.so when searching for -lcurl
          /usr/bin/ld: skipping incompatible /usr/libx32/libcurl.so when searching for -lcurl
          /usr/bin/ld: skipping incompatible /usr/libx32/libcurl.so when searching for -lcurl
          /usr/bin/ld: skipping incompatible /usr/libx32/gcc/x86_64-pld-linux-gnux32/10.2.0/../../../libcurl.so when searching for -lcurl
          /usr/bin/ld: skipping incompatible /usr/libx32/libcurl.so when searching for -lcurl
          /usr/bin/ld: skipping incompatible /usr/libx32/libutil.so when searching for -lutil
          /usr/bin/ld: skipping incompatible /usr/libx32/libutil.a when searching for -lutil
          /usr/bin/ld: skipping incompatible /usr/libx32/libutil.so when searching for -lutil
          /usr/bin/ld: skipping incompatible /usr/libx32/libutil.a when searching for -lutil
          /usr/bin/ld: skipping incompatible /usr/libx32/libdl.so when searching for -ldl
          /usr/bin/ld: skipping incompatible /usr/libx32/libdl.a when searching for -ldl
          /usr/bin/ld: skipping incompatible /usr/libx32/libdl.so when searching for -ldl
          /usr/bin/ld: skipping incompatible /usr/libx32/libdl.a when searching for -ldl
          /usr/bin/ld: skipping incompatible /usr/libx32/libutil.so when searching for -lutil
          /usr/bin/ld: skipping incompatible /usr/libx32/libutil.a when searching for -lutil
          /usr/bin/ld: skipping incompatible /usr/libx32/libutil.so when searching for -lutil
          /usr/bin/ld: skipping incompatible /usr/libx32/libutil.a when searching for -lutil
          /usr/bin/ld: skipping incompatible /usr/libx32/libdl.so when searching for -ldl
          /usr/bin/ld: skipping incompatible /usr/libx32/libdl.a when searching for -ldl
          /usr/bin/ld: skipping incompatible /usr/libx32/libdl.so when searching for -ldl
          /usr/bin/ld: skipping incompatible /usr/libx32/libdl.a when searching for -ldl
          /usr/bin/ld: skipping incompatible /usr/libx32/librt.so when searching for -lrt
          /usr/bin/ld: skipping incompatible /usr/libx32/librt.a when searching for -lrt
          /usr/bin/ld: skipping incompatible /usr/libx32/librt.so when searching for -lrt
          /usr/bin/ld: skipping incompatible /usr/libx32/librt.a when searching for -lrt
          /usr/bin/ld: skipping incompatible /usr/libx32/libpthread.so when searching for -lpthread
          /usr/bin/ld: skipping incompatible /usr/libx32/libpthread.a when searching for -lpthread
          /usr/bin/ld: skipping incompatible /usr/libx32/libpthread.so when searching for -lpthread
          /usr/bin/ld: skipping incompatible /usr/libx32/libpthread.a when searching for -lpthread
          collect2: error: ld returned 1 exit status
          

error: aborting due to previous error


Did not run successfully: exit code: 1
"/tmp/B.TDgbLo/BUILD/rustc-1.47.0-src/build/x86_64-unknown-linux-gnu/stage1/bin/rustc" "--crate-name" "cargo" "--edition=2018" "src/tools/cargo/src/bin/cargo/main.rs" "--error-format=json" "--json=diagnostic-rendered-ansi" "--crate-type" "bin" "--emit=dep-info,link" "-C" "opt-level=3" "-Cembed-bitcode=no" "-C" "debuginfo=0" "-C" "metadata=44a8ec1c4bb25658" "-C" "extra-filename=-44a8ec1c4bb25658" "--out-dir" "/tmp/B.TDgbLo/BUILD/rustc-1.47.0-src/build/x86_64-unknown-linux-gnu/stage1-tools/x86_64-unknown-linux-gnu/release/deps" "--target" "x86_64-unknown-linux-gnu" "-L" "dependency=/tmp/B.TDgbLo/BUILD/rustc-1.47.0-src/build/x86_64-unknown-linux-gnu/stage1-tools/x86_64-unknown-linux-gnu/release/deps" "-L" "dependency=/tmp/B.TDgbLo/BUILD/rustc-1.47.0-src/build/x86_64-unknown-linux-gnu/stage1-tools/release/deps" "--extern" "anyhow=/tmp/B.TDgbLo/BUILD/rustc-1.47.0-src/build/x86_64-unknown-linux-gnu/stage1-tools/x86_64-unknown-linux-gnu/release/deps/libanyhow-c441daa8117fe0cb.rlib" "--extern" "atty=/tmp/B.TDgbLo/BUILD/rustc-1.47.0-src/build/x86_64-unknown-linux-gnu/stage1-tools/x86_64-unknown-linux-gnu/release/deps/libatty-0589cc403e1c5d6a.rlib" "--extern" "bytesize=/tmp/B.TDgbLo/BUILD/rustc-1.47.0-src/build/x86_64-unknown-linux-gnu/stage1-tools/x86_64-unknown-linux-gnu/release/deps/libbytesize-09c645bb44336462.rlib" "--extern" "cargo=/tmp/B.TDgbLo/BUILD/rustc-1.47.0-src/build/x86_64-unknown-linux-gnu/stage1-tools/x86_64-unknown-linux-gnu/release/deps/libcargo-0b5769e368e74791.rlib" "--extern" "cargo_platform=/tmp/B.TDgbLo/BUILD/rustc-1.47.0-src/build/x86_64-unknown-linux-gnu/stage1-tools/x86_64-unknown-linux-gnu/release/deps/libcargo_platform-9d9f3b0ae3a0b949.rlib" "--extern" "clap=/tmp/B.TDgbLo/BUILD/rustc-1.47.0-src/build/x86_64-unknown-linux-gnu/stage1-tools/x86_64-unknown-linux-gnu/release/deps/libclap-42eac4cc3385cb16.rlib" "--extern" "crates_io=/tmp/B.TDgbLo/BUILD/rustc-1.47.0-src/build/x86_64-unknown-linux-gnu/stage1-tools/x86_64-unknown-linux-gnu/release/deps/libcrates_io-48f7f1df37506ed1.rlib" "--extern" "crossbeam_utils=/tmp/B.TDgbLo/BUILD/rustc-1.47.0-src/build/x86_64-unknown-linux-gnu/stage1-tools/x86_64-unknown-linux-gnu/release/deps/libcrossbeam_utils-cfc344a3537aab3d.rlib" "--extern" "crypto_hash=/tmp/B.TDgbLo/BUILD/rustc-1.47.0-src/build/x86_64-unknown-linux-gnu/stage1-tools/x86_64-unknown-linux-gnu/release/deps/libcrypto_hash-a16a00c519541e3e.rlib" "--extern" "curl=/tmp/B.TDgbLo/BUILD/rustc-1.47.0-src/build/x86_64-unknown-linux-gnu/stage1-tools/x86_64-unknown-linux-gnu/release/deps/libcurl-8be3839598cb5975.rlib" "--extern" "curl_sys=/tmp/B.TDgbLo/BUILD/rustc-1.47.0-src/build/x86_64-unknown-linux-gnu/stage1-tools/x86_64-unknown-linux-gnu/release/deps/libcurl_sys-878aeace0baa5bc0.rlib" "--extern" "env_logger=/tmp/B.TDgbLo/BUILD/rustc-1.47.0-src/build/x86_64-unknown-linux-gnu/stage1-tools/x86_64-unknown-linux-gnu/release/deps/libenv_logger-d73c9fb072f2eb51.rlib" "--extern" "filetime=/tmp/B.TDgbLo/BUILD/rustc-1.47.0-src/build/x86_64-unknown-linux-gnu/stage1-tools/x86_64-unknown-linux-gnu/release/deps/libfiletime-5fee34189b35b920.rlib" "--extern" "flate2=/tmp/B.TDgbLo/BUILD/rustc-1.47.0-src/build/x86_64-unknown-linux-gnu/stage1-tools/x86_64-unknown-linux-gnu/release/deps/libflate2-50bfe56d08073b41.rlib" "--extern" "git2=/tmp/B.TDgbLo/BUILD/rustc-1.47.0-src/build/x86_64-unknown-linux-gnu/stage1-tools/x86_64-unknown-linux-gnu/release/deps/libgit2-0356008cce60292a.rlib" "--extern" "git2_curl=/tmp/B.TDgbLo/BUILD/rustc-1.47.0-src/build/x86_64-unknown-linux-gnu/stage1-tools/x86_64-unknown-linux-gnu/release/deps/libgit2_curl-a85e8eb189f22e29.rlib" "--extern" "glob=/tmp/B.TDgbLo/BUILD/rustc-1.47.0-src/build/x86_64-unknown-linux-gnu/stage1-tools/x86_64-unknown-linux-gnu/release/deps/libglob-4e3829dd4b4d57ab.rlib" "--extern" "hex=/tmp/B.TDgbLo/BUILD/rustc-1.47.0-src/build/x86_64-unknown-linux-gnu/stage1-tools/x86_64-unknown-linux-gnu/release/deps/libhex-8c77d5ae92d00bc4.rlib" "--extern" "home=/tmp/B.TDgbLo/BUILD/rustc-1.47.0-src/build/x86_64-unknown-linux-gnu/stage1-tools/x86_64-unknown-linux-gnu/release/deps/libhome-2de5b433299ee662.rlib" "--extern" "humantime=/tmp/B.TDgbLo/BUILD/rustc-1.47.0-src/build/x86_64-unknown-linux-gnu/stage1-tools/x86_64-unknown-linux-gnu/release/deps/libhumantime-1435582d39a057c3.rlib" "--extern" "ignore=/tmp/B.TDgbLo/BUILD/rustc-1.47.0-src/build/x86_64-unknown-linux-gnu/stage1-tools/x86_64-unknown-linux-gnu/release/deps/libignore-0ebb57b5b1905b67.rlib" "--extern" "im_rc=/tmp/B.TDgbLo/BUILD/rustc-1.47.0-src/build/x86_64-unknown-linux-gnu/stage1-tools/x86_64-unknown-linux-gnu/release/deps/libim_rc-f64cfe61c3ff0595.rlib" "--extern" "jobserver=/tmp/B.TDgbLo/BUILD/rustc-1.47.0-src/build/x86_64-unknown-linux-gnu/stage1-tools/x86_64-unknown-linux-gnu/release/deps/libjobserver-0e97c79c0cfa562a.rlib" "--extern" "lazy_static=/tmp/B.TDgbLo/BUILD/rustc-1.47.0-src/build/x86_64-unknown-linux-gnu/stage1-tools/x86_64-unknown-linux-gnu/release/deps/liblazy_static-1749adffa815abc1.rlib" "--extern" "lazycell=/tmp/B.TDgbLo/BUILD/rustc-1.47.0-src/build/x86_64-unknown-linux-gnu/stage1-tools/x86_64-unknown-linux-gnu/release/deps/liblazycell-c706895e4f45a14a.rlib" "--extern" "libc=/tmp/B.TDgbLo/BUILD/rustc-1.47.0-src/build/x86_64-unknown-linux-gnu/stage1-tools/x86_64-unknown-linux-gnu/release/deps/liblibc-4e45db8fed0075cf.rlib" "--extern" "libgit2_sys=/tmp/B.TDgbLo/BUILD/rustc-1.47.0-src/build/x86_64-unknown-linux-gnu/stage1-tools/x86_64-unknown-linux-gnu/release/deps/liblibgit2_sys-58feff1c2aca4410.rlib" "--extern" "log=/tmp/B.TDgbLo/BUILD/rustc-1.47.0-src/build/x86_64-unknown-linux-gnu/stage1-tools/x86_64-unknown-linux-gnu/release/deps/liblog-742b2c6ee182f4c4.rlib" "--extern" "memchr=/tmp/B.TDgbLo/BUILD/rustc-1.47.0-src/build/x86_64-unknown-linux-gnu/stage1-tools/x86_64-unknown-linux-gnu/release/deps/libmemchr-85c8c10353553f89.rlib" "--extern" "num_cpus=/tmp/B.TDgbLo/BUILD/rustc-1.47.0-src/build/x86_64-unknown-linux-gnu/stage1-tools/x86_64-unknown-linux-gnu/release/deps/libnum_cpus-3cefb7fc6f97fcd9.rlib" "--extern" "opener=/tmp/B.TDgbLo/BUILD/rustc-1.47.0-src/build/x86_64-unknown-linux-gnu/stage1-tools/x86_64-unknown-linux-gnu/release/deps/libopener-d07bf6befd4a25ea.rlib" "--extern" "percent_encoding=/tmp/B.TDgbLo/BUILD/rustc-1.47.0-src/build/x86_64-unknown-linux-gnu/stage1-tools/x86_64-unknown-linux-gnu/release/deps/libpercent_encoding-2faf97e2e38c6263.rlib" "--extern" "rustc_workspace_hack=/tmp/B.TDgbLo/BUILD/rustc-1.47.0-src/build/x86_64-unknown-linux-gnu/stage1-tools/x86_64-unknown-linux-gnu/release/deps/librustc_workspace_hack-3a40c6b2605e68e2.rlib" "--extern" "rustfix=/tmp/B.TDgbLo/BUILD/rustc-1.47.0-src/build/x86_64-unknown-linux-gnu/stage1-tools/x86_64-unknown-linux-gnu/release/deps/librustfix-7c6ba175f3f31ee1.rlib" "--extern" "same_file=/tmp/B.TDgbLo/BUILD/rustc-1.47.0-src/build/x86_64-unknown-linux-gnu/stage1-tools/x86_64-unknown-linux-gnu/release/deps/libsame_file-b22539109bfe461f.rlib" "--extern" "semver=/tmp/B.TDgbLo/BUILD/rustc-1.47.0-src/build/x86_64-unknown-linux-gnu/stage1-tools/x86_64-unknown-linux-gnu/release/deps/libsemver-c9f342ce3aaa97f3.rlib" "--extern" "serde=/tmp/B.TDgbLo/BUILD/rustc-1.47.0-src/build/x86_64-unknown-linux-gnu/stage1-tools/x86_64-unknown-linux-gnu/release/deps/libserde-649665a81685cf6a.rlib" "--extern" "serde_ignored=/tmp/B.TDgbLo/BUILD/rustc-1.47.0-src/build/x86_64-unknown-linux-gnu/stage1-tools/x86_64-unknown-linux-gnu/release/deps/libserde_ignored-91e3eac630524f28.rlib" "--extern" "serde_json=/tmp/B.TDgbLo/BUILD/rustc-1.47.0-src/build/x86_64-unknown-linux-gnu/stage1-tools/x86_64-unknown-linux-gnu/release/deps/libserde_json-15cb3f21021ea098.rlib" "--extern" "shell_escape=/tmp/B.TDgbLo/BUILD/rustc-1.47.0-src/build/x86_64-unknown-linux-gnu/stage1-tools/x86_64-unknown-linux-gnu/release/deps/libshell_escape-6c24056ba6d9bd6c.rlib" "--extern" "strip_ansi_escapes=/tmp/B.TDgbLo/BUILD/rustc-1.47.0-src/build/x86_64-unknown-linux-gnu/stage1-tools/x86_64-unknown-linux-gnu/release/deps/libstrip_ansi_escapes-277d8fb4ebbebace.rlib" "--extern" "tar=/tmp/B.TDgbLo/BUILD/rustc-1.47.0-src/build/x86_64-unknown-linux-gnu/stage1-tools/x86_64-unknown-linux-gnu/release/deps/libtar-fbe2b1c2eadfce09.rlib" "--extern" "tempfile=/tmp/B.TDgbLo/BUILD/rustc-1.47.0-src/build/x86_64-unknown-linux-gnu/stage1-tools/x86_64-unknown-linux-gnu/release/deps/libtempfile-2677a4730eafd9d6.rlib" "--extern" "termcolor=/tmp/B.TDgbLo/BUILD/rustc-1.47.0-src/build/x86_64-unknown-linux-gnu/stage1-tools/x86_64-unknown-linux-gnu/release/deps/libtermcolor-b68e3f2e8d8c86ac.rlib" "--extern" "toml=/tmp/B.TDgbLo/BUILD/rustc-1.47.0-src/build/x86_64-unknown-linux-gnu/stage1-tools/x86_64-unknown-linux-gnu/release/deps/libtoml-da0f45bea612091c.rlib" "--extern" "unicode_width=/tmp/B.TDgbLo/BUILD/rustc-1.47.0-src/build/x86_64-unknown-linux-gnu/stage1-tools/x86_64-unknown-linux-gnu/release/deps/libunicode_width-ddd94c94ce90fdef.rlib" "--extern" "unicode_xid=/tmp/B.TDgbLo/BUILD/rustc-1.47.0-src/build/x86_64-unknown-linux-gnu/stage1-tools/x86_64-unknown-linux-gnu/release/deps/libunicode_xid-45864fa21cb4c37d.rlib" "--extern" "url=/tmp/B.TDgbLo/BUILD/rustc-1.47.0-src/build/x86_64-unknown-linux-gnu/stage1-tools/x86_64-unknown-linux-gnu/release/deps/liburl-fbb382a8398e9824.rlib" "--extern" "walkdir=/tmp/B.TDgbLo/BUILD/rustc-1.47.0-src/build/x86_64-unknown-linux-gnu/stage1-tools/x86_64-unknown-linux-gnu/release/deps/libwalkdir-8832c3d9c52ed13d.rlib" "-Zmacro-backtrace" "-Zbinary-dep-depinfo" "-L" "native=/usr/libx32" "-L" "native=/tmp/B.TDgbLo/BUILD/rustc-1.47.0-src/build/x86_64-unknown-linux-gnu/stage1-tools/x86_64-unknown-linux-gnu/release/build/libnghttp2-sys-e3235ac820f61501/out/i/lib" "-L" "native=/usr/libx32" "-L" "native=/tmp/B.TDgbLo/BUILD/rustc-1.47.0-src/build/x86_64-unknown-linux-gnu/stage1-tools/x86_64-unknown-linux-gnu/release/build/libssh2-sys-63ad9d847c1d4d48/out/build" "--sysroot" "/tmp/B.TDgbLo/BUILD/rustc-1.47.0-src/build/x86_64-unknown-linux-gnu/stage1"
-------------
error: could not compile `cargo`.

To learn more, run the command again with --verbose.
command did not execute successfully: "/tmp/B.TDgbLo/BUILD/rustc-1.47.0-src/rust-1.46.0-x86_64-unknown-linux-gnu/bin/cargo" "build" "--target" "x86_64-unknown-linux-gnu" "-Zbinary-dep-depinfo" "-j" "4" "--release" "--frozen" "--manifest-path" "/tmp/B.TDgbLo/BUILD/rustc-1.47.0-src/src/tools/cargo/Cargo.toml" "--message-format" "json-render-diagnostics"
expected success, got: exit code: 101
Traceback (most recent call last):
  File "./x.py", line 11, in <module>
    bootstrap.main()
  File "/tmp/B.TDgbLo/BUILD/rustc-1.47.0-src/src/bootstrap/bootstrap.py", line 1009, in main
    bootstrap(help_triggered)
  File "/tmp/B.TDgbLo/BUILD/rustc-1.47.0-src/src/bootstrap/bootstrap.py", line 995, in bootstrap
    run(args, env=env, verbose=build.verbose)
  File "/tmp/B.TDgbLo/BUILD/rustc-1.47.0-src/src/bootstrap/bootstrap.py", line 143, in run
    raise RuntimeError(err)
RuntimeError: failed to run: /tmp/B.TDgbLo/BUILD/rustc-1.47.0-src/build/bootstrap/debug/bootstrap dist -j 4 --verbose
error: Bad exit status from /tmp/B.TDgbLo/BUILD/tmp/rpm-tmp.92463 (%build)


RPM build errors:
    Bad exit status from /tmp/B.TDgbLo/BUILD/tmp/rpm-tmp.92463 (%build)
ended at: Thu Oct 15 13:26:13 2020, done in 1:14:27.556167
error: No files produced.
+ chmod -R u+rwX /tmp/B.TDgbLo/BUILD
+ rm -rf /tmp/B.TDgbLo/tmp /tmp/B.TDgbLo/BUILD
+ rm -rf /tmp/B.TDgbLo
Begin-PLD-Builder-Info
Build-Time: user:15793.31s sys:202.22s real:4604.66s (faults io:0 non-io:26060924)

End-PLD-Builder-Info
[Back to list of logs] [View rpm -qa of builder]