FailedOk

th/SRPMS[OK]
th/x32[OK]
th/i686[OK]
th/x86_64[OK]

ac/SRPMS[OK]
ac/i386[OK]
ac/i586[OK]
ac/i686[OK]
ac/alpha[OK]
ac/amd64[OK]
ac/athlon[OK]
ac/ppc[OK]
ac/sparc[OK]
ac/sparc64[OK]

Advanced Search
main()
Powered by PLD Linux
(c) 2002-2021 PLD Team
$Revision: 1.37 $
Powered by GNOME.
Your IP: 54.85.57.0

rust 7ea128d8-4ddf-46f2-b9cb-f285bcd5d203

Status:Failed
Source URL:https://buildlogs.pld-linux.org/pld/th/x32/FAIL/rust,7ea128d8-4ddf-46f2-b9cb-f285bcd5d203.bz2
text/plain URL:View!
full text:View!
rpm -qa of builder:View!
Date:2021/01/03 01:24:41
Runtime:1:17:17.763208

Toc:

  • error 1
  • error: linking with `cc` failed: exit code: 1
  • error 2
  • collect2: error: ld returned 1 exit status
  • error 3
  • error: aborting due to previous error
  • error 4
  • error: could not compile `cargo`.
  • error 5
  • RuntimeError: failed to run: /tmp/B.CG53H0/BUILD/rustc-1.47.0-src/build/bootstrap/debug/bootstrap dist -j 4 --verbose
  • error 6
  • error: Bad exit status from /tmp/B.CG53H0/BUILD/tmp/rpm-tmp.26533 (%build)
  • error 7
  • RPM build errors:
  • error 8
  • error: No files produced.

Content:

        c Sysroot { compiler: Compiler { stage: 1, host: TargetSelection { triple: "x86_64-unknown-linux-gnu", file: None } } }
        c Sysroot { compiler: Compiler { stage: 1, host: TargetSelection { triple: "x86_64-unknown-linux-gnu", file: None } } }
        c Sysroot { compiler: Compiler { stage: 1, host: TargetSelection { triple: "x86_64-unknown-linux-gnu", file: None } } }
        c Sysroot { compiler: Compiler { stage: 1, host: TargetSelection { triple: "x86_64-unknown-linux-gnu", file: None } } }
        c Sysroot { compiler: Compiler { stage: 1, host: TargetSelection { triple: "x86_64-unknown-linux-gnu", file: None } } }
        c Llvm { target: TargetSelection { triple: "x86_64-unknown-linux-gnu", file: None } }
Building stage1 tool cargo (x86_64-unknown-linux-gnu)
running: "/tmp/B.CG53H0/BUILD/rustc-1.47.0-src/rust-1.46.0-x86_64-unknown-linux-gnu/bin/cargo" "build" "--target" "x86_64-unknown-linux-gnu" "-Zbinary-dep-depinfo" "-j" "4" "--release" "--frozen" "--manifest-path" "/tmp/B.CG53H0/BUILD/rustc-1.47.0-src/src/tools/cargo/Cargo.toml" "--message-format" "json-render-diagnostics"
   Compiling pkg-config v0.3.18
   Compiling syn v1.0.38
   Compiling log v0.4.11
   Compiling crc32fast v1.2.0
   Compiling memchr v2.3.3
   Compiling matches v0.1.8
   Compiling tinyvec v0.3.4
   Compiling cfg-if v0.1.10
   Compiling percent-encoding v2.1.0
   Compiling serde_json v1.0.57
   Compiling typenum v1.12.0
   Compiling regex-syntax v0.6.18
   Compiling unicode-xid v0.2.1
   Compiling openssl-probe v0.1.2
   Compiling anyhow v1.0.32
   Compiling curl v0.4.31
   Compiling openssl v0.10.30
   Compiling foreign-types-shared v0.1.1
   Compiling fnv v1.0.7
   Compiling quick-error v1.2.3
   Compiling same-file v1.0.6
   Compiling utf8parse v0.1.1
   Compiling unicode-width v0.1.8
   Compiling termcolor v1.1.0
   Compiling hex v0.3.2
   Compiling smallvec v1.4.2
   Compiling strsim v0.8.0
   Compiling vec_map v0.8.2
   Compiling semver-parser v0.7.0
   Compiling ansi_term v0.11.0
   Compiling glob v0.3.0
   Compiling humantime v2.0.1
   Compiling lazycell v1.3.0
   Compiling shell-escape v0.1.5
   Compiling hex v0.4.2
   Compiling opener v0.4.1
   Compiling home v0.5.3
   Compiling bytesize v1.0.1
   Compiling libc v0.2.74
   Compiling crossbeam-utils v0.7.2
   Compiling proc-macro2 v1.0.19
   Compiling thread_local v1.0.1
   Compiling unicode-bidi v0.3.4
   Compiling unicode-normalization v0.1.13
   Compiling im-rc v15.0.0
   Compiling foreign-types v0.3.2
   Compiling humantime v1.3.0
   Compiling walkdir v2.3.1
   Compiling vte v0.3.3
   Compiling textwrap v0.11.0
   Compiling idna v0.2.0
   Compiling strip-ansi-escapes v0.1.0
   Compiling socket2 v0.3.12
   Compiling atty v0.2.14
   Compiling filetime v0.2.12
   Compiling jobserver v0.1.21
   Compiling quote v1.0.7
   Compiling aho-corasick v0.7.13
   Compiling bstr v0.2.13
   Compiling smallvec v0.6.13
   Compiling bitmaps v2.1.0
   Compiling clap v2.33.3
   Compiling tar v0.4.29
   Compiling cc v1.0.58
   Compiling regex v1.3.9
   Compiling rand_xoshiro v0.4.0
   Compiling sized-chunks v0.6.2
   Compiling libz-sys v1.0.27
   Compiling openssl-sys v0.9.58
   Compiling libnghttp2-sys v0.1.4+1.41.0
   Compiling curl-sys v0.4.34+curl-7.71.1
   Compiling libssh2-sys v0.2.18
   Compiling libgit2-sys v0.12.9+1.0.1
   Compiling globset v0.4.5
   Compiling env_logger v0.7.1
   Compiling ignore v0.4.16
   Compiling flate2 v1.0.16
   Compiling serde_derive v1.0.115
   Compiling cargo v0.48.0 (/tmp/B.CG53H0/BUILD/rustc-1.47.0-src/src/tools/cargo)
   Compiling crypto-hash v0.3.4
   Compiling serde v1.0.115
   Compiling url v2.1.1
   Compiling semver v0.10.0
   Compiling toml v0.5.6
   Compiling serde_ignored v0.1.2
   Compiling cargo-platform v0.1.1 (/tmp/B.CG53H0/BUILD/rustc-1.47.0-src/src/tools/cargo/crates/cargo-platform)
   Compiling git2 v0.13.8
   Compiling crates-io v0.31.1 (/tmp/B.CG53H0/BUILD/rustc-1.47.0-src/src/tools/cargo/crates/crates-io)
   Compiling rustfix v0.5.1
   Compiling rustc-workspace-hack v1.0.0 (/tmp/B.CG53H0/BUILD/rustc-1.47.0-src/src/tools/rustc-workspace-hack)
   Compiling git2-curl v0.14.0
error: linking with `cc` failed: exit code: 1
  |
  = note: "cc" "-Wl,--as-needed" "-Wl,-z,noexecstack" "-m64" "-Wl,--eh-frame-hdr" "-L" "/tmp/B.CG53H0/BUILD/rustc-1.47.0-src/build/x86_64-unknown-linux-gnu/stage1/lib/rustlib/x86_64-unknown-linux-gnu/lib" "/tmp/B.CG53H0/BUILD/rustc-1.47.0-src/build/x86_64-unknown-linux-gnu/stage1-tools/x86_64-unknown-linux-gnu/release/deps/cargo-5c88c79d8ef043aa.cargo.516xu9mi-cgu.0.rcgu.o" "/tmp/B.CG53H0/BUILD/rustc-1.47.0-src/build/x86_64-unknown-linux-gnu/stage1-tools/x86_64-unknown-linux-gnu/release/deps/cargo-5c88c79d8ef043aa.cargo.516xu9mi-cgu.1.rcgu.o" "/tmp/B.CG53H0/BUILD/rustc-1.47.0-src/build/x86_64-unknown-linux-gnu/stage1-tools/x86_64-unknown-linux-gnu/release/deps/cargo-5c88c79d8ef043aa.cargo.516xu9mi-cgu.10.rcgu.o" "/tmp/B.CG53H0/BUILD/rustc-1.47.0-src/build/x86_64-unknown-linux-gnu/stage1-tools/x86_64-unknown-linux-gnu/release/deps/cargo-5c88c79d8ef043aa.cargo.516xu9mi-cgu.11.rcgu.o" "/tmp/B.CG53H0/BUILD/rustc-1.47.0-src/build/x86_64-unknown-linux-gnu/stage1-tools/x86_64-unknown-linux-gnu/release/deps/cargo-5c88c79d8ef043aa.cargo.516xu9mi-cgu.12.rcgu.o" "/tmp/B.CG53H0/BUILD/rustc-1.47.0-src/build/x86_64-unknown-linux-gnu/stage1-tools/x86_64-unknown-linux-gnu/release/deps/cargo-5c88c79d8ef043aa.cargo.516xu9mi-cgu.13.rcgu.o" "/tmp/B.CG53H0/BUILD/rustc-1.47.0-src/build/x86_64-unknown-linux-gnu/stage1-tools/x86_64-unknown-linux-gnu/release/deps/cargo-5c88c79d8ef043aa.cargo.516xu9mi-cgu.14.rcgu.o" "/tmp/B.CG53H0/BUILD/rustc-1.47.0-src/build/x86_64-unknown-linux-gnu/stage1-tools/x86_64-unknown-linux-gnu/release/deps/cargo-5c88c79d8ef043aa.cargo.516xu9mi-cgu.15.rcgu.o" "/tmp/B.CG53H0/BUILD/rustc-1.47.0-src/build/x86_64-unknown-linux-gnu/stage1-tools/x86_64-unknown-linux-gnu/release/deps/cargo-5c88c79d8ef043aa.cargo.516xu9mi-cgu.2.rcgu.o" "/tmp/B.CG53H0/BUILD/rustc-1.47.0-src/build/x86_64-unknown-linux-gnu/stage1-tools/x86_64-unknown-linux-gnu/release/deps/cargo-5c88c79d8ef043aa.cargo.516xu9mi-cgu.3.rcgu.o" "/tmp/B.CG53H0/BUILD/rustc-1.47.0-src/build/x86_64-unknown-linux-gnu/stage1-tools/x86_64-unknown-linux-gnu/release/deps/cargo-5c88c79d8ef043aa.cargo.516xu9mi-cgu.4.rcgu.o" "/tmp/B.CG53H0/BUILD/rustc-1.47.0-src/build/x86_64-unknown-linux-gnu/stage1-tools/x86_64-unknown-linux-gnu/release/deps/cargo-5c88c79d8ef043aa.cargo.516xu9mi-cgu.5.rcgu.o" "/tmp/B.CG53H0/BUILD/rustc-1.47.0-src/build/x86_64-unknown-linux-gnu/stage1-tools/x86_64-unknown-linux-gnu/release/deps/cargo-5c88c79d8ef043aa.cargo.516xu9mi-cgu.6.rcgu.o" "/tmp/B.CG53H0/BUILD/rustc-1.47.0-src/build/x86_64-unknown-linux-gnu/stage1-tools/x86_64-unknown-linux-gnu/release/deps/cargo-5c88c79d8ef043aa.cargo.516xu9mi-cgu.7.rcgu.o" "/tmp/B.CG53H0/BUILD/rustc-1.47.0-src/build/x86_64-unknown-linux-gnu/stage1-tools/x86_64-unknown-linux-gnu/release/deps/cargo-5c88c79d8ef043aa.cargo.516xu9mi-cgu.8.rcgu.o" "/tmp/B.CG53H0/BUILD/rustc-1.47.0-src/build/x86_64-unknown-linux-gnu/stage1-tools/x86_64-unknown-linux-gnu/release/deps/cargo-5c88c79d8ef043aa.cargo.516xu9mi-cgu.9.rcgu.o" "-o" "/tmp/B.CG53H0/BUILD/rustc-1.47.0-src/build/x86_64-unknown-linux-gnu/stage1-tools/x86_64-unknown-linux-gnu/release/deps/cargo-5c88c79d8ef043aa" "/tmp/B.CG53H0/BUILD/rustc-1.47.0-src/build/x86_64-unknown-linux-gnu/stage1-tools/x86_64-unknown-linux-gnu/release/deps/cargo-5c88c79d8ef043aa.4lo2q1xdcfvdf0z4.rcgu.o" "-Wl,--gc-sections" "-pie" "-Wl,-zrelro" "-Wl,-znow" "-Wl,-O1" "-nodefaultlibs" "-L" "/tmp/B.CG53H0/BUILD/rustc-1.47.0-src/build/x86_64-unknown-linux-gnu/stage1-tools/x86_64-unknown-linux-gnu/release/deps" "-L" "/tmp/B.CG53H0/BUILD/rustc-1.47.0-src/build/x86_64-unknown-linux-gnu/stage1-tools/release/deps" "-L" "/usr/libx32" "-L" "/tmp/B.CG53H0/BUILD/rustc-1.47.0-src/build/x86_64-unknown-linux-gnu/stage1-tools/x86_64-unknown-linux-gnu/release/build/libnghttp2-sys-4fda1bc62777a32b/out/i/lib" "-L" "/usr/libx32" "-L" "/tmp/B.CG53H0/BUILD/rustc-1.47.0-src/build/x86_64-unknown-linux-gnu/stage1-tools/x86_64-unknown-linux-gnu/release/build/libssh2-sys-3b0284578f05b70b/out/build" "-L" "/tmp/B.CG53H0/BUILD/rustc-1.47.0-src/build/x86_64-unknown-linux-gnu/stage1/lib/rustlib/x86_64-unknown-linux-gnu/lib" "-Wl,-Bstatic" "/tmp/B.CG53H0/BUILD/rustc-1.47.0-src/build/x86_64-unknown-linux-gnu/stage1-tools/x86_64-unknown-linux-gnu/release/deps/libgit2_curl-2c57ea7bfc7f4b1d.rlib" "/tmp/B.CG53H0/BUILD/rustc-1.47.0-src/build/x86_64-unknown-linux-gnu/stage1-tools/x86_64-unknown-linux-gnu/release/deps/libenv_logger-b844f792dcd2891d.rlib" "/tmp/B.CG53H0/BUILD/rustc-1.47.0-src/build/x86_64-unknown-linux-gnu/stage1-tools/x86_64-unknown-linux-gnu/release/deps/libhumantime-177b57950ebb8cfe.rlib" "/tmp/B.CG53H0/BUILD/rustc-1.47.0-src/build/x86_64-unknown-linux-gnu/stage1-tools/x86_64-unknown-linux-gnu/release/deps/libquick_error-8217d39ff017fe32.rlib" "/tmp/B.CG53H0/BUILD/rustc-1.47.0-src/build/x86_64-unknown-linux-gnu/stage1-tools/x86_64-unknown-linux-gnu/release/deps/libcargo-d3082e555e849497.rlib" "/tmp/B.CG53H0/BUILD/rustc-1.47.0-src/build/x86_64-unknown-linux-gnu/stage1-tools/x86_64-unknown-linux-gnu/release/deps/libunicode_xid-092edef9b22d89e4.rlib" "/tmp/B.CG53H0/BUILD/rustc-1.47.0-src/build/x86_64-unknown-linux-gnu/stage1-tools/x86_64-unknown-linux-gnu/release/deps/libhex-16024d2482593b8a.rlib" "/tmp/B.CG53H0/BUILD/rustc-1.47.0-src/build/x86_64-unknown-linux-gnu/stage1-tools/x86_64-unknown-linux-gnu/release/deps/libhome-94d74b2f50701010.rlib" "/tmp/B.CG53H0/BUILD/rustc-1.47.0-src/build/x86_64-unknown-linux-gnu/stage1-tools/x86_64-unknown-linux-gnu/release/deps/libopener-b44a80bc2af63694.rlib" "/tmp/B.CG53H0/BUILD/rustc-1.47.0-src/build/x86_64-unknown-linux-gnu/stage1-tools/x86_64-unknown-linux-gnu/release/deps/libim_rc-7439a4fd0bbd3118.rlib" "/tmp/B.CG53H0/BUILD/rustc-1.47.0-src/build/x86_64-unknown-linux-gnu/stage1-tools/x86_64-unknown-linux-gnu/release/deps/librand_xoshiro-cfb888896804354f.rlib" "/tmp/B.CG53H0/BUILD/rustc-1.47.0-src/build/x86_64-unknown-linux-gnu/stage1-tools/x86_64-unknown-linux-gnu/release/deps/libsized_chunks-78d39d8699d384b5.rlib" "/tmp/B.CG53H0/BUILD/rustc-1.47.0-src/build/x86_64-unknown-linux-gnu/stage1-tools/x86_64-unknown-linux-gnu/release/deps/libbitmaps-00bf529d27dd66d2.rlib" "/tmp/B.CG53H0/BUILD/rustc-1.47.0-src/build/x86_64-unknown-linux-gnu/stage1-tools/x86_64-unknown-linux-gnu/release/deps/libtypenum-e9d1d0c8e1ec103f.rlib" "/tmp/B.CG53H0/BUILD/rustc-1.47.0-src/build/x86_64-unknown-linux-gnu/stage1-tools/x86_64-unknown-linux-gnu/release/deps/libtoml-cff5ac41c4ecbd87.rlib" "/tmp/B.CG53H0/BUILD/rustc-1.47.0-src/build/x86_64-unknown-linux-gnu/stage1-tools/x86_64-unknown-linux-gnu/release/deps/libstrip_ansi_escapes-03b27c315fa54046.rlib" "/tmp/B.CG53H0/BUILD/rustc-1.47.0-src/build/x86_64-unknown-linux-gnu/stage1-tools/x86_64-unknown-linux-gnu/release/deps/libvte-11290b8d7b8a11bc.rlib" "/tmp/B.CG53H0/BUILD/rustc-1.47.0-src/build/x86_64-unknown-linux-gnu/stage1-tools/x86_64-unknown-linux-gnu/release/deps/libutf8parse-32bf21c740807f40.rlib" "/tmp/B.CG53H0/BUILD/rustc-1.47.0-src/build/x86_64-unknown-linux-gnu/stage1-tools/x86_64-unknown-linux-gnu/release/deps/libhumantime-d3ce540840d29f15.rlib" "/tmp/B.CG53H0/BUILD/rustc-1.47.0-src/build/x86_64-unknown-linux-gnu/stage1-tools/x86_64-unknown-linux-gnu/release/deps/libnum_cpus-f8974101e72011fc.rlib" "/tmp/B.CG53H0/BUILD/rustc-1.47.0-src/build/x86_64-unknown-linux-gnu/stage1-tools/x86_64-unknown-linux-gnu/release/deps/libserde_ignored-578f18022b98b169.rlib" "/tmp/B.CG53H0/BUILD/rustc-1.47.0-src/build/x86_64-unknown-linux-gnu/stage1-tools/x86_64-unknown-linux-gnu/release/deps/libcrypto_hash-8e0643316e8806f8.rlib" "/tmp/B.CG53H0/BUILD/rustc-1.47.0-src/build/x86_64-unknown-linux-gnu/stage1-tools/x86_64-unknown-linux-gnu/release/deps/libopenssl-29c278f933c33e4a.rlib" "/tmp/B.CG53H0/BUILD/rustc-1.47.0-src/build/x86_64-unknown-linux-gnu/stage1-tools/x86_64-unknown-linux-gnu/release/deps/libforeign_types-c2f7b3ab68f54f16.rlib" "/tmp/B.CG53H0/BUILD/rustc-1.47.0-src/build/x86_64-unknown-linux-gnu/stage1-tools/x86_64-unknown-linux-gnu/release/deps/libforeign_types_shared-3e8b9e79886cfac5.rlib" "/tmp/B.CG53H0/BUILD/rustc-1.47.0-src/build/x86_64-unknown-linux-gnu/stage1-tools/x86_64-unknown-linux-gnu/release/deps/libhex-83310b03a62e90fb.rlib" "/tmp/B.CG53H0/BUILD/rustc-1.47.0-src/build/x86_64-unknown-linux-gnu/stage1-tools/x86_64-unknown-linux-gnu/release/deps/libshell_escape-9f0cca7886ceb0dc.rlib" "/tmp/B.CG53H0/BUILD/rustc-1.47.0-src/build/x86_64-unknown-linux-gnu/stage1-tools/x86_64-unknown-linux-gnu/release/deps/libclap-122e595fd6d84cfd.rlib" "/tmp/B.CG53H0/BUILD/rustc-1.47.0-src/build/x86_64-unknown-linux-gnu/stage1-tools/x86_64-unknown-linux-gnu/release/deps/libvec_map-8a1bea3df179d84b.rlib" "/tmp/B.CG53H0/BUILD/rustc-1.47.0-src/build/x86_64-unknown-linux-gnu/stage1-tools/x86_64-unknown-linux-gnu/release/deps/libtextwrap-094fae4b2cadcaec.rlib" "/tmp/B.CG53H0/BUILD/rustc-1.47.0-src/build/x86_64-unknown-linux-gnu/stage1-tools/x86_64-unknown-linux-gnu/release/deps/libunicode_width-4aca975006b57097.rlib" "/tmp/B.CG53H0/BUILD/rustc-1.47.0-src/build/x86_64-unknown-linux-gnu/stage1-tools/x86_64-unknown-linux-gnu/release/deps/libstrsim-e7ee1358f9aa1471.rlib" "/tmp/B.CG53H0/BUILD/rustc-1.47.0-src/build/x86_64-unknown-linux-gnu/stage1-tools/x86_64-unknown-linux-gnu/release/deps/libatty-77257cd9a784880c.rlib" "/tmp/B.CG53H0/BUILD/rustc-1.47.0-src/build/x86_64-unknown-linux-gnu/stage1-tools/x86_64-unknown-linux-gnu/release/deps/libansi_term-3371cef61a2a21f6.rlib" "/tmp/B.CG53H0/BUILD/rustc-1.47.0-src/build/x86_64-unknown-linux-gnu/stage1-tools/x86_64-unknown-linux-gnu/release/deps/libignore-c4153cee633a6d10.rlib" "/tmp/B.CG53H0/BUILD/rustc-1.47.0-src/build/x86_64-unknown-linux-gnu/stage1-tools/x86_64-unknown-linux-gnu/release/deps/libwalkdir-a0b961d2bc32f575.rlib" "/tmp/B.CG53H0/BUILD/rustc-1.47.0-src/build/x86_64-unknown-linux-gnu/stage1-tools/x86_64-unknown-linux-gnu/release/deps/libsame_file-d3a88c5137da83fe.rlib" "/tmp/B.CG53H0/BUILD/rustc-1.47.0-src/build/x86_64-unknown-linux-gnu/stage1-tools/x86_64-unknown-linux-gnu/release/deps/libglobset-ca97b9183f60d25d.rlib" "/tmp/B.CG53H0/BUILD/rustc-1.47.0-src/build/x86_64-unknown-linux-gnu/stage1-tools/x86_64-unknown-linux-gnu/release/deps/libregex-18c66ed15bee1d5b.rlib" "/tmp/B.CG53H0/BUILD/rustc-1.47.0-src/build/x86_64-unknown-linux-gnu/stage1-tools/x86_64-unknown-linux-gnu/release/deps/libthread_local-2862fc73c8eb7c72.rlib" "/tmp/B.CG53H0/BUILD/rustc-1.47.0-src/build/x86_64-unknown-linux-gnu/stage1-tools/x86_64-unknown-linux-gnu/release/deps/libregex_syntax-f7e4c8553c05b258.rlib" "/tmp/B.CG53H0/BUILD/rustc-1.47.0-src/build/x86_64-unknown-linux-gnu/stage1-tools/x86_64-unknown-linux-gnu/release/deps/libfnv-7d8699c311185657.rlib" "/tmp/B.CG53H0/BUILD/rustc-1.47.0-src/build/x86_64-unknown-linux-gnu/stage1-tools/x86_64-unknown-linux-gnu/release/deps/libbstr-a717a64d420559a6.rlib" "/tmp/B.CG53H0/BUILD/rustc-1.47.0-src/build/x86_64-unknown-linux-gnu/stage1-tools/x86_64-unknown-linux-gnu/release/deps/libaho_corasick-5ca8a7fe332fd92f.rlib" "/tmp/B.CG53H0/BUILD/rustc-1.47.0-src/build/x86_64-unknown-linux-gnu/stage1-tools/x86_64-unknown-linux-gnu/release/deps/libmemchr-e6ed49455175a19c.rlib" "/tmp/B.CG53H0/BUILD/rustc-1.47.0-src/build/x86_64-unknown-linux-gnu/stage1-tools/x86_64-unknown-linux-gnu/release/deps/libcrates_io-644a7fe171cdd91f.rlib" "/tmp/B.CG53H0/BUILD/rustc-1.47.0-src/build/x86_64-unknown-linux-gnu/stage1-tools/x86_64-unknown-linux-gnu/release/deps/librustfix-bc8236dbececc261.rlib" "/tmp/B.CG53H0/BUILD/rustc-1.47.0-src/build/x86_64-unknown-linux-gnu/stage1-tools/x86_64-unknown-linux-gnu/release/deps/libserde_json-8ff00c347d190267.rlib" "/tmp/B.CG53H0/BUILD/rustc-1.47.0-src/build/x86_64-unknown-linux-gnu/stage1-tools/x86_64-unknown-linux-gnu/release/deps/libryu-fc7ab1671ac576f7.rlib" "/tmp/B.CG53H0/BUILD/rustc-1.47.0-src/build/x86_64-unknown-linux-gnu/stage1-tools/x86_64-unknown-linux-gnu/release/deps/libitoa-458ff90d438982e5.rlib" "/tmp/B.CG53H0/BUILD/rustc-1.47.0-src/build/x86_64-unknown-linux-gnu/stage1-tools/x86_64-unknown-linux-gnu/release/deps/libtar-746bc09eeb451828.rlib" "/tmp/B.CG53H0/BUILD/rustc-1.47.0-src/build/x86_64-unknown-linux-gnu/stage1-tools/x86_64-unknown-linux-gnu/release/deps/libflate2-b58042e27464d270.rlib" "/tmp/B.CG53H0/BUILD/rustc-1.47.0-src/build/x86_64-unknown-linux-gnu/stage1-tools/x86_64-unknown-linux-gnu/release/deps/libcrc32fast-4876503c3844fd09.rlib" "/tmp/B.CG53H0/BUILD/rustc-1.47.0-src/build/x86_64-unknown-linux-gnu/stage1-tools/x86_64-unknown-linux-gnu/release/deps/libgit2-0cb7559df5484a67.rlib" "/tmp/B.CG53H0/BUILD/rustc-1.47.0-src/build/x86_64-unknown-linux-gnu/stage1-tools/x86_64-unknown-linux-gnu/release/deps/libopenssl_probe-957aeb0f0d963714.rlib" "/tmp/B.CG53H0/BUILD/rustc-1.47.0-src/build/x86_64-unknown-linux-gnu/stage1-tools/x86_64-unknown-linux-gnu/release/deps/liblibgit2_sys-6bc07d4ec0569a8f.rlib" "/tmp/B.CG53H0/BUILD/rustc-1.47.0-src/build/x86_64-unknown-linux-gnu/stage1-tools/x86_64-unknown-linux-gnu/release/deps/liblibssh2_sys-ca670bfc27ddbe32.rlib" "/tmp/B.CG53H0/BUILD/rustc-1.47.0-src/build/x86_64-unknown-linux-gnu/stage1-tools/x86_64-unknown-linux-gnu/release/deps/libopenssl_sys-5f66f03cec386c8c.rlib" "/tmp/B.CG53H0/BUILD/rustc-1.47.0-src/build/x86_64-unknown-linux-gnu/stage1-tools/x86_64-unknown-linux-gnu/release/deps/liblibz_sys-aa659de2af7c4f03.rlib" "/tmp/B.CG53H0/BUILD/rustc-1.47.0-src/build/x86_64-unknown-linux-gnu/stage1-tools/x86_64-unknown-linux-gnu/release/deps/libbitflags-57b1c39a98302204.rlib" "/tmp/B.CG53H0/BUILD/rustc-1.47.0-src/build/x86_64-unknown-linux-gnu/stage1-tools/x86_64-unknown-linux-gnu/release/deps/libtempfile-3a4a66f4c104130a.rlib" "/tmp/B.CG53H0/BUILD/rustc-1.47.0-src/build/x86_64-unknown-linux-gnu/stage1-tools/x86_64-unknown-linux-gnu/release/deps/librand-ed9f7885fb1a9c39.rlib" "/tmp/B.CG53H0/BUILD/rustc-1.47.0-src/build/x86_64-unknown-linux-gnu/stage1-tools/x86_64-unknown-linux-gnu/release/deps/librand_chacha-d483ce8df63eb949.rlib" "/tmp/B.CG53H0/BUILD/rustc-1.47.0-src/build/x86_64-unknown-linux-gnu/stage1-tools/x86_64-unknown-linux-gnu/release/deps/libppv_lite86-f0449d89b18d1184.rlib" "/tmp/B.CG53H0/BUILD/rustc-1.47.0-src/build/x86_64-unknown-linux-gnu/stage1-tools/x86_64-unknown-linux-gnu/release/deps/librand_core-41c93247687eb4b9.rlib" "/tmp/B.CG53H0/BUILD/rustc-1.47.0-src/build/x86_64-unknown-linux-gnu/stage1-tools/x86_64-unknown-linux-gnu/release/deps/libgetrandom-2f8b633192e40bef.rlib" "/tmp/B.CG53H0/BUILD/rustc-1.47.0-src/build/x86_64-unknown-linux-gnu/stage1-tools/x86_64-unknown-linux-gnu/release/deps/libremove_dir_all-2b102f972a3aae03.rlib" "/tmp/B.CG53H0/BUILD/rustc-1.47.0-src/build/x86_64-unknown-linux-gnu/stage1-tools/x86_64-unknown-linux-gnu/release/deps/libglob-149add108b4b28cc.rlib" "/tmp/B.CG53H0/BUILD/rustc-1.47.0-src/build/x86_64-unknown-linux-gnu/stage1-tools/x86_64-unknown-linux-gnu/release/deps/libtermcolor-27d8c20f59f1c145.rlib" "/tmp/B.CG53H0/BUILD/rustc-1.47.0-src/build/x86_64-unknown-linux-gnu/stage1-tools/x86_64-unknown-linux-gnu/release/deps/libcurl-3d92623931411f4f.rlib" "/tmp/B.CG53H0/BUILD/rustc-1.47.0-src/build/x86_64-unknown-linux-gnu/stage1-tools/x86_64-unknown-linux-gnu/release/deps/libsocket2-a441ed146d421de9.rlib" "/tmp/B.CG53H0/BUILD/rustc-1.47.0-src/build/x86_64-unknown-linux-gnu/stage1-tools/x86_64-unknown-linux-gnu/release/deps/libcurl_sys-186d2671591575dd.rlib" "/tmp/B.CG53H0/BUILD/rustc-1.47.0-src/build/x86_64-unknown-linux-gnu/stage1-tools/x86_64-unknown-linux-gnu/release/deps/libbytesize-d11346e8217678e4.rlib" "/tmp/B.CG53H0/BUILD/rustc-1.47.0-src/build/x86_64-unknown-linux-gnu/stage1-tools/x86_64-unknown-linux-gnu/release/deps/liburl-a2792312feceeefd.rlib" "/tmp/B.CG53H0/BUILD/rustc-1.47.0-src/build/x86_64-unknown-linux-gnu/stage1-tools/x86_64-unknown-linux-gnu/release/deps/libpercent_encoding-2a0bd4657303b972.rlib" "/tmp/B.CG53H0/BUILD/rustc-1.47.0-src/build/x86_64-unknown-linux-gnu/stage1-tools/x86_64-unknown-linux-gnu/release/deps/libidna-0033a28fcda5303b.rlib" "/tmp/B.CG53H0/BUILD/rustc-1.47.0-src/build/x86_64-unknown-linux-gnu/stage1-tools/x86_64-unknown-linux-gnu/release/deps/libunicode_normalization-bfa2c2a678ba59f6.rlib" "/tmp/B.CG53H0/BUILD/rustc-1.47.0-src/build/x86_64-unknown-linux-gnu/stage1-tools/x86_64-unknown-linux-gnu/release/deps/libtinyvec-fceb5577abea31d3.rlib" "/tmp/B.CG53H0/BUILD/rustc-1.47.0-src/build/x86_64-unknown-linux-gnu/stage1-tools/x86_64-unknown-linux-gnu/release/deps/libunicode_bidi-9fb03f9ab5b7d962.rlib" "/tmp/B.CG53H0/BUILD/rustc-1.47.0-src/build/x86_64-unknown-linux-gnu/stage1-tools/x86_64-unknown-linux-gnu/release/deps/libmatches-75560289afa7deba.rlib" "/tmp/B.CG53H0/BUILD/rustc-1.47.0-src/build/x86_64-unknown-linux-gnu/stage1-tools/x86_64-unknown-linux-gnu/release/deps/libcrossbeam_utils-21e542e2a15d0bde.rlib" "/tmp/B.CG53H0/BUILD/rustc-1.47.0-src/build/x86_64-unknown-linux-gnu/stage1-tools/x86_64-unknown-linux-gnu/release/deps/liblazy_static-6c2d67fa68c0c39b.rlib" "/tmp/B.CG53H0/BUILD/rustc-1.47.0-src/build/x86_64-unknown-linux-gnu/stage1-tools/x86_64-unknown-linux-gnu/release/deps/liblazycell-5f5d914c3f231da0.rlib" "/tmp/B.CG53H0/BUILD/rustc-1.47.0-src/build/x86_64-unknown-linux-gnu/stage1-tools/x86_64-unknown-linux-gnu/release/deps/libjobserver-7542974e82666af0.rlib" "/tmp/B.CG53H0/BUILD/rustc-1.47.0-src/build/x86_64-unknown-linux-gnu/stage1-tools/x86_64-unknown-linux-gnu/release/deps/libfiletime-1f44dff80dbc94de.rlib" "/tmp/B.CG53H0/BUILD/rustc-1.47.0-src/build/x86_64-unknown-linux-gnu/stage1-tools/x86_64-unknown-linux-gnu/release/deps/liblibc-9069780b3a1602cd.rlib" "/tmp/B.CG53H0/BUILD/rustc-1.47.0-src/build/x86_64-unknown-linux-gnu/stage1-tools/x86_64-unknown-linux-gnu/release/deps/libsemver-d999394e0a167a33.rlib" "/tmp/B.CG53H0/BUILD/rustc-1.47.0-src/build/x86_64-unknown-linux-gnu/stage1-tools/x86_64-unknown-linux-gnu/release/deps/libsemver_parser-8bebadd9ea55e009.rlib" "/tmp/B.CG53H0/BUILD/rustc-1.47.0-src/build/x86_64-unknown-linux-gnu/stage1-tools/x86_64-unknown-linux-gnu/release/deps/libcargo_platform-945e86223b531def.rlib" "/tmp/B.CG53H0/BUILD/rustc-1.47.0-src/build/x86_64-unknown-linux-gnu/stage1-tools/x86_64-unknown-linux-gnu/release/deps/libserde-209cdc5b3b92f0a5.rlib" "/tmp/B.CG53H0/BUILD/rustc-1.47.0-src/build/x86_64-unknown-linux-gnu/stage1-tools/x86_64-unknown-linux-gnu/release/deps/liblog-c29f77c1477d6f2c.rlib" "/tmp/B.CG53H0/BUILD/rustc-1.47.0-src/build/x86_64-unknown-linux-gnu/stage1-tools/x86_64-unknown-linux-gnu/release/deps/libcfg_if-6b4fb215b66e066c.rlib" "/tmp/B.CG53H0/BUILD/rustc-1.47.0-src/build/x86_64-unknown-linux-gnu/stage1-tools/x86_64-unknown-linux-gnu/release/deps/libanyhow-1420ed232111dd6d.rlib" "-Wl,--start-group" "/tmp/B.CG53H0/BUILD/rustc-1.47.0-src/build/x86_64-unknown-linux-gnu/stage1/lib/rustlib/x86_64-unknown-linux-gnu/lib/libstd-2afe0dcd1dde8dca.rlib" "/tmp/B.CG53H0/BUILD/rustc-1.47.0-src/build/x86_64-unknown-linux-gnu/stage1/lib/rustlib/x86_64-unknown-linux-gnu/lib/libpanic_unwind-3a8368deb7bfa36c.rlib" "/tmp/B.CG53H0/BUILD/rustc-1.47.0-src/build/x86_64-unknown-linux-gnu/stage1/lib/rustlib/x86_64-unknown-linux-gnu/lib/libminiz_oxide-c11ded11a1b56f6f.rlib" "/tmp/B.CG53H0/BUILD/rustc-1.47.0-src/build/x86_64-unknown-linux-gnu/stage1/lib/rustlib/x86_64-unknown-linux-gnu/lib/libadler-43b83ce034b11316.rlib" "/tmp/B.CG53H0/BUILD/rustc-1.47.0-src/build/x86_64-unknown-linux-gnu/stage1/lib/rustlib/x86_64-unknown-linux-gnu/lib/libobject-ab246db430e85fda.rlib" "/tmp/B.CG53H0/BUILD/rustc-1.47.0-src/build/x86_64-unknown-linux-gnu/stage1/lib/rustlib/x86_64-unknown-linux-gnu/lib/libaddr2line-c74a8ea5bd441c79.rlib" "/tmp/B.CG53H0/BUILD/rustc-1.47.0-src/build/x86_64-unknown-linux-gnu/stage1/lib/rustlib/x86_64-unknown-linux-gnu/lib/libgimli-3e0e527c38d7a49b.rlib" "/tmp/B.CG53H0/BUILD/rustc-1.47.0-src/build/x86_64-unknown-linux-gnu/stage1/lib/rustlib/x86_64-unknown-linux-gnu/lib/librustc_demangle-2653f8756637cfb2.rlib" "/tmp/B.CG53H0/BUILD/rustc-1.47.0-src/build/x86_64-unknown-linux-gnu/stage1/lib/rustlib/x86_64-unknown-linux-gnu/lib/libhashbrown-94296c59bfad9811.rlib" "/tmp/B.CG53H0/BUILD/rustc-1.47.0-src/build/x86_64-unknown-linux-gnu/stage1/lib/rustlib/x86_64-unknown-linux-gnu/lib/librustc_std_workspace_alloc-1f6b02f18df6c596.rlib" "/tmp/B.CG53H0/BUILD/rustc-1.47.0-src/build/x86_64-unknown-linux-gnu/stage1/lib/rustlib/x86_64-unknown-linux-gnu/lib/libunwind-70787d78520bbfc1.rlib" "/tmp/B.CG53H0/BUILD/rustc-1.47.0-src/build/x86_64-unknown-linux-gnu/stage1/lib/rustlib/x86_64-unknown-linux-gnu/lib/libcfg_if-e177095edb5f83d9.rlib" "/tmp/B.CG53H0/BUILD/rustc-1.47.0-src/build/x86_64-unknown-linux-gnu/stage1/lib/rustlib/x86_64-unknown-linux-gnu/lib/liblibc-cd4ea6b6f53878f9.rlib" "/tmp/B.CG53H0/BUILD/rustc-1.47.0-src/build/x86_64-unknown-linux-gnu/stage1/lib/rustlib/x86_64-unknown-linux-gnu/lib/liballoc-6ceb3d03c24c0bd5.rlib" "/tmp/B.CG53H0/BUILD/rustc-1.47.0-src/build/x86_64-unknown-linux-gnu/stage1/lib/rustlib/x86_64-unknown-linux-gnu/lib/librustc_std_workspace_core-d4adf81a33c45493.rlib" "/tmp/B.CG53H0/BUILD/rustc-1.47.0-src/build/x86_64-unknown-linux-gnu/stage1/lib/rustlib/x86_64-unknown-linux-gnu/lib/libcore-781f645f090477f9.rlib" "-Wl,--end-group" "/tmp/B.CG53H0/BUILD/rustc-1.47.0-src/build/x86_64-unknown-linux-gnu/stage1/lib/rustlib/x86_64-unknown-linux-gnu/lib/libcompiler_builtins-7b5e5262ce7b2872.rlib" "-Wl,-Bdynamic" "-lgit2" "-lssl" "-lcrypto" "-lz" "-lcurl" "-lutil" "-ldl" "-lutil" "-ldl" "-lrt" "-lpthread" "-lgcc_s" "-lc" "-lm" "-lrt" "-lpthread" "-lutil" "-ldl" "-lutil"
  = note: /usr/bin/ld: skipping incompatible /usr/libx32/libgit2.so when searching for -lgit2
          /usr/bin/ld: skipping incompatible /usr/libx32/libgit2.so when searching for -lgit2
          /usr/bin/ld: skipping incompatible /usr/libx32/libssl.so when searching for -lssl
          /usr/bin/ld: skipping incompatible /usr/libx32/libssl.a when searching for -lssl
          /usr/bin/ld: skipping incompatible /usr/libx32/libssl.so when searching for -lssl
          /usr/bin/ld: skipping incompatible /usr/libx32/libssl.a when searching for -lssl
          /usr/bin/ld: skipping incompatible /usr/libx32/libcrypto.so when searching for -lcrypto
          /usr/bin/ld: skipping incompatible /usr/libx32/libcrypto.a when searching for -lcrypto
          /usr/bin/ld: skipping incompatible /usr/libx32/libcrypto.so when searching for -lcrypto
          /usr/bin/ld: skipping incompatible /usr/libx32/libcrypto.a when searching for -lcrypto
          /usr/bin/ld: skipping incompatible /usr/libx32/libz.so when searching for -lz
          /usr/bin/ld: skipping incompatible /usr/libx32/libz.a when searching for -lz
          /usr/bin/ld: skipping incompatible /usr/libx32/libz.so when searching for -lz
          /usr/bin/ld: skipping incompatible /usr/libx32/libz.a when searching for -lz
          /usr/bin/ld: skipping incompatible /usr/libx32/libcurl.so when searching for -lcurl
          /usr/bin/ld: skipping incompatible /usr/libx32/libcurl.so when searching for -lcurl
          /usr/bin/ld: skipping incompatible /usr/libx32/libcurl.so when searching for -lcurl
          /usr/bin/ld: skipping incompatible /usr/libx32/gcc/x86_64-pld-linux-gnux32/10.2.0/../../../libcurl.so when searching for -lcurl
          /usr/bin/ld: skipping incompatible /usr/libx32/libcurl.so when searching for -lcurl
          /usr/bin/ld: cannot find -lcurl
          /usr/bin/ld: skipping incompatible /usr/libx32/libcurl.so when searching for -lcurl
          /usr/bin/ld: skipping incompatible /usr/libx32/libcurl.so when searching for -lcurl
          /usr/bin/ld: skipping incompatible /usr/libx32/libcurl.so when searching for -lcurl
          /usr/bin/ld: skipping incompatible /usr/libx32/gcc/x86_64-pld-linux-gnux32/10.2.0/../../../libcurl.so when searching for -lcurl
          /usr/bin/ld: skipping incompatible /usr/libx32/libcurl.so when searching for -lcurl
          /usr/bin/ld: skipping incompatible /usr/libx32/libutil.so when searching for -lutil
          /usr/bin/ld: skipping incompatible /usr/libx32/libutil.a when searching for -lutil
          /usr/bin/ld: skipping incompatible /usr/libx32/libutil.so when searching for -lutil
          /usr/bin/ld: skipping incompatible /usr/libx32/libutil.a when searching for -lutil
          /usr/bin/ld: skipping incompatible /usr/libx32/libdl.so when searching for -ldl
          /usr/bin/ld: skipping incompatible /usr/libx32/libdl.a when searching for -ldl
          /usr/bin/ld: skipping incompatible /usr/libx32/libdl.so when searching for -ldl
          /usr/bin/ld: skipping incompatible /usr/libx32/libdl.a when searching for -ldl
          /usr/bin/ld: skipping incompatible /usr/libx32/libutil.so when searching for -lutil
          /usr/bin/ld: skipping incompatible /usr/libx32/libutil.a when searching for -lutil
          /usr/bin/ld: skipping incompatible /usr/libx32/libutil.so when searching for -lutil
          /usr/bin/ld: skipping incompatible /usr/libx32/libutil.a when searching for -lutil
          /usr/bin/ld: skipping incompatible /usr/libx32/libdl.so when searching for -ldl
          /usr/bin/ld: skipping incompatible /usr/libx32/libdl.a when searching for -ldl
          /usr/bin/ld: skipping incompatible /usr/libx32/libdl.so when searching for -ldl
          /usr/bin/ld: skipping incompatible /usr/libx32/libdl.a when searching for -ldl
          /usr/bin/ld: skipping incompatible /usr/libx32/librt.so when searching for -lrt
          /usr/bin/ld: skipping incompatible /usr/libx32/librt.a when searching for -lrt
          /usr/bin/ld: skipping incompatible /usr/libx32/librt.so when searching for -lrt
          /usr/bin/ld: skipping incompatible /usr/libx32/librt.a when searching for -lrt
          /usr/bin/ld: skipping incompatible /usr/libx32/libpthread.so when searching for -lpthread
          /usr/bin/ld: skipping incompatible /usr/libx32/libpthread.a when searching for -lpthread
          /usr/bin/ld: skipping incompatible /usr/libx32/libpthread.so when searching for -lpthread
          /usr/bin/ld: skipping incompatible /usr/libx32/libpthread.a when searching for -lpthread
          collect2: error: ld returned 1 exit status
          

error: aborting due to previous error


Did not run successfully: exit code: 1
"/tmp/B.CG53H0/BUILD/rustc-1.47.0-src/build/x86_64-unknown-linux-gnu/stage1/bin/rustc" "--crate-name" "cargo" "--edition=2018" "src/tools/cargo/src/bin/cargo/main.rs" "--error-format=json" "--json=diagnostic-rendered-ansi" "--crate-type" "bin" "--emit=dep-info,link" "-C" "opt-level=3" "-Cembed-bitcode=no" "-C" "debuginfo=0" "-C" "metadata=5c88c79d8ef043aa" "-C" "extra-filename=-5c88c79d8ef043aa" "--out-dir" "/tmp/B.CG53H0/BUILD/rustc-1.47.0-src/build/x86_64-unknown-linux-gnu/stage1-tools/x86_64-unknown-linux-gnu/release/deps" "--target" "x86_64-unknown-linux-gnu" "-L" "dependency=/tmp/B.CG53H0/BUILD/rustc-1.47.0-src/build/x86_64-unknown-linux-gnu/stage1-tools/x86_64-unknown-linux-gnu/release/deps" "-L" "dependency=/tmp/B.CG53H0/BUILD/rustc-1.47.0-src/build/x86_64-unknown-linux-gnu/stage1-tools/release/deps" "--extern" "anyhow=/tmp/B.CG53H0/BUILD/rustc-1.47.0-src/build/x86_64-unknown-linux-gnu/stage1-tools/x86_64-unknown-linux-gnu/release/deps/libanyhow-1420ed232111dd6d.rlib" "--extern" "atty=/tmp/B.CG53H0/BUILD/rustc-1.47.0-src/build/x86_64-unknown-linux-gnu/stage1-tools/x86_64-unknown-linux-gnu/release/deps/libatty-77257cd9a784880c.rlib" "--extern" "bytesize=/tmp/B.CG53H0/BUILD/rustc-1.47.0-src/build/x86_64-unknown-linux-gnu/stage1-tools/x86_64-unknown-linux-gnu/release/deps/libbytesize-d11346e8217678e4.rlib" "--extern" "cargo=/tmp/B.CG53H0/BUILD/rustc-1.47.0-src/build/x86_64-unknown-linux-gnu/stage1-tools/x86_64-unknown-linux-gnu/release/deps/libcargo-d3082e555e849497.rlib" "--extern" "cargo_platform=/tmp/B.CG53H0/BUILD/rustc-1.47.0-src/build/x86_64-unknown-linux-gnu/stage1-tools/x86_64-unknown-linux-gnu/release/deps/libcargo_platform-945e86223b531def.rlib" "--extern" "clap=/tmp/B.CG53H0/BUILD/rustc-1.47.0-src/build/x86_64-unknown-linux-gnu/stage1-tools/x86_64-unknown-linux-gnu/release/deps/libclap-122e595fd6d84cfd.rlib" "--extern" "crates_io=/tmp/B.CG53H0/BUILD/rustc-1.47.0-src/build/x86_64-unknown-linux-gnu/stage1-tools/x86_64-unknown-linux-gnu/release/deps/libcrates_io-644a7fe171cdd91f.rlib" "--extern" "crossbeam_utils=/tmp/B.CG53H0/BUILD/rustc-1.47.0-src/build/x86_64-unknown-linux-gnu/stage1-tools/x86_64-unknown-linux-gnu/release/deps/libcrossbeam_utils-21e542e2a15d0bde.rlib" "--extern" "crypto_hash=/tmp/B.CG53H0/BUILD/rustc-1.47.0-src/build/x86_64-unknown-linux-gnu/stage1-tools/x86_64-unknown-linux-gnu/release/deps/libcrypto_hash-8e0643316e8806f8.rlib" "--extern" "curl=/tmp/B.CG53H0/BUILD/rustc-1.47.0-src/build/x86_64-unknown-linux-gnu/stage1-tools/x86_64-unknown-linux-gnu/release/deps/libcurl-3d92623931411f4f.rlib" "--extern" "curl_sys=/tmp/B.CG53H0/BUILD/rustc-1.47.0-src/build/x86_64-unknown-linux-gnu/stage1-tools/x86_64-unknown-linux-gnu/release/deps/libcurl_sys-186d2671591575dd.rlib" "--extern" "env_logger=/tmp/B.CG53H0/BUILD/rustc-1.47.0-src/build/x86_64-unknown-linux-gnu/stage1-tools/x86_64-unknown-linux-gnu/release/deps/libenv_logger-b844f792dcd2891d.rlib" "--extern" "filetime=/tmp/B.CG53H0/BUILD/rustc-1.47.0-src/build/x86_64-unknown-linux-gnu/stage1-tools/x86_64-unknown-linux-gnu/release/deps/libfiletime-1f44dff80dbc94de.rlib" "--extern" "flate2=/tmp/B.CG53H0/BUILD/rustc-1.47.0-src/build/x86_64-unknown-linux-gnu/stage1-tools/x86_64-unknown-linux-gnu/release/deps/libflate2-b58042e27464d270.rlib" "--extern" "git2=/tmp/B.CG53H0/BUILD/rustc-1.47.0-src/build/x86_64-unknown-linux-gnu/stage1-tools/x86_64-unknown-linux-gnu/release/deps/libgit2-0cb7559df5484a67.rlib" "--extern" "git2_curl=/tmp/B.CG53H0/BUILD/rustc-1.47.0-src/build/x86_64-unknown-linux-gnu/stage1-tools/x86_64-unknown-linux-gnu/release/deps/libgit2_curl-2c57ea7bfc7f4b1d.rlib" "--extern" "glob=/tmp/B.CG53H0/BUILD/rustc-1.47.0-src/build/x86_64-unknown-linux-gnu/stage1-tools/x86_64-unknown-linux-gnu/release/deps/libglob-149add108b4b28cc.rlib" "--extern" "hex=/tmp/B.CG53H0/BUILD/rustc-1.47.0-src/build/x86_64-unknown-linux-gnu/stage1-tools/x86_64-unknown-linux-gnu/release/deps/libhex-16024d2482593b8a.rlib" "--extern" "home=/tmp/B.CG53H0/BUILD/rustc-1.47.0-src/build/x86_64-unknown-linux-gnu/stage1-tools/x86_64-unknown-linux-gnu/release/deps/libhome-94d74b2f50701010.rlib" "--extern" "humantime=/tmp/B.CG53H0/BUILD/rustc-1.47.0-src/build/x86_64-unknown-linux-gnu/stage1-tools/x86_64-unknown-linux-gnu/release/deps/libhumantime-d3ce540840d29f15.rlib" "--extern" "ignore=/tmp/B.CG53H0/BUILD/rustc-1.47.0-src/build/x86_64-unknown-linux-gnu/stage1-tools/x86_64-unknown-linux-gnu/release/deps/libignore-c4153cee633a6d10.rlib" "--extern" "im_rc=/tmp/B.CG53H0/BUILD/rustc-1.47.0-src/build/x86_64-unknown-linux-gnu/stage1-tools/x86_64-unknown-linux-gnu/release/deps/libim_rc-7439a4fd0bbd3118.rlib" "--extern" "jobserver=/tmp/B.CG53H0/BUILD/rustc-1.47.0-src/build/x86_64-unknown-linux-gnu/stage1-tools/x86_64-unknown-linux-gnu/release/deps/libjobserver-7542974e82666af0.rlib" "--extern" "lazy_static=/tmp/B.CG53H0/BUILD/rustc-1.47.0-src/build/x86_64-unknown-linux-gnu/stage1-tools/x86_64-unknown-linux-gnu/release/deps/liblazy_static-6c2d67fa68c0c39b.rlib" "--extern" "lazycell=/tmp/B.CG53H0/BUILD/rustc-1.47.0-src/build/x86_64-unknown-linux-gnu/stage1-tools/x86_64-unknown-linux-gnu/release/deps/liblazycell-5f5d914c3f231da0.rlib" "--extern" "libc=/tmp/B.CG53H0/BUILD/rustc-1.47.0-src/build/x86_64-unknown-linux-gnu/stage1-tools/x86_64-unknown-linux-gnu/release/deps/liblibc-9069780b3a1602cd.rlib" "--extern" "libgit2_sys=/tmp/B.CG53H0/BUILD/rustc-1.47.0-src/build/x86_64-unknown-linux-gnu/stage1-tools/x86_64-unknown-linux-gnu/release/deps/liblibgit2_sys-6bc07d4ec0569a8f.rlib" "--extern" "log=/tmp/B.CG53H0/BUILD/rustc-1.47.0-src/build/x86_64-unknown-linux-gnu/stage1-tools/x86_64-unknown-linux-gnu/release/deps/liblog-c29f77c1477d6f2c.rlib" "--extern" "memchr=/tmp/B.CG53H0/BUILD/rustc-1.47.0-src/build/x86_64-unknown-linux-gnu/stage1-tools/x86_64-unknown-linux-gnu/release/deps/libmemchr-e6ed49455175a19c.rlib" "--extern" "num_cpus=/tmp/B.CG53H0/BUILD/rustc-1.47.0-src/build/x86_64-unknown-linux-gnu/stage1-tools/x86_64-unknown-linux-gnu/release/deps/libnum_cpus-f8974101e72011fc.rlib" "--extern" "opener=/tmp/B.CG53H0/BUILD/rustc-1.47.0-src/build/x86_64-unknown-linux-gnu/stage1-tools/x86_64-unknown-linux-gnu/release/deps/libopener-b44a80bc2af63694.rlib" "--extern" "percent_encoding=/tmp/B.CG53H0/BUILD/rustc-1.47.0-src/build/x86_64-unknown-linux-gnu/stage1-tools/x86_64-unknown-linux-gnu/release/deps/libpercent_encoding-2a0bd4657303b972.rlib" "--extern" "rustc_workspace_hack=/tmp/B.CG53H0/BUILD/rustc-1.47.0-src/build/x86_64-unknown-linux-gnu/stage1-tools/x86_64-unknown-linux-gnu/release/deps/librustc_workspace_hack-fec29a579c699b36.rlib" "--extern" "rustfix=/tmp/B.CG53H0/BUILD/rustc-1.47.0-src/build/x86_64-unknown-linux-gnu/stage1-tools/x86_64-unknown-linux-gnu/release/deps/librustfix-bc8236dbececc261.rlib" "--extern" "same_file=/tmp/B.CG53H0/BUILD/rustc-1.47.0-src/build/x86_64-unknown-linux-gnu/stage1-tools/x86_64-unknown-linux-gnu/release/deps/libsame_file-d3a88c5137da83fe.rlib" "--extern" "semver=/tmp/B.CG53H0/BUILD/rustc-1.47.0-src/build/x86_64-unknown-linux-gnu/stage1-tools/x86_64-unknown-linux-gnu/release/deps/libsemver-d999394e0a167a33.rlib" "--extern" "serde=/tmp/B.CG53H0/BUILD/rustc-1.47.0-src/build/x86_64-unknown-linux-gnu/stage1-tools/x86_64-unknown-linux-gnu/release/deps/libserde-209cdc5b3b92f0a5.rlib" "--extern" "serde_ignored=/tmp/B.CG53H0/BUILD/rustc-1.47.0-src/build/x86_64-unknown-linux-gnu/stage1-tools/x86_64-unknown-linux-gnu/release/deps/libserde_ignored-578f18022b98b169.rlib" "--extern" "serde_json=/tmp/B.CG53H0/BUILD/rustc-1.47.0-src/build/x86_64-unknown-linux-gnu/stage1-tools/x86_64-unknown-linux-gnu/release/deps/libserde_json-8ff00c347d190267.rlib" "--extern" "shell_escape=/tmp/B.CG53H0/BUILD/rustc-1.47.0-src/build/x86_64-unknown-linux-gnu/stage1-tools/x86_64-unknown-linux-gnu/release/deps/libshell_escape-9f0cca7886ceb0dc.rlib" "--extern" "strip_ansi_escapes=/tmp/B.CG53H0/BUILD/rustc-1.47.0-src/build/x86_64-unknown-linux-gnu/stage1-tools/x86_64-unknown-linux-gnu/release/deps/libstrip_ansi_escapes-03b27c315fa54046.rlib" "--extern" "tar=/tmp/B.CG53H0/BUILD/rustc-1.47.0-src/build/x86_64-unknown-linux-gnu/stage1-tools/x86_64-unknown-linux-gnu/release/deps/libtar-746bc09eeb451828.rlib" "--extern" "tempfile=/tmp/B.CG53H0/BUILD/rustc-1.47.0-src/build/x86_64-unknown-linux-gnu/stage1-tools/x86_64-unknown-linux-gnu/release/deps/libtempfile-3a4a66f4c104130a.rlib" "--extern" "termcolor=/tmp/B.CG53H0/BUILD/rustc-1.47.0-src/build/x86_64-unknown-linux-gnu/stage1-tools/x86_64-unknown-linux-gnu/release/deps/libtermcolor-27d8c20f59f1c145.rlib" "--extern" "toml=/tmp/B.CG53H0/BUILD/rustc-1.47.0-src/build/x86_64-unknown-linux-gnu/stage1-tools/x86_64-unknown-linux-gnu/release/deps/libtoml-cff5ac41c4ecbd87.rlib" "--extern" "unicode_width=/tmp/B.CG53H0/BUILD/rustc-1.47.0-src/build/x86_64-unknown-linux-gnu/stage1-tools/x86_64-unknown-linux-gnu/release/deps/libunicode_width-4aca975006b57097.rlib" "--extern" "unicode_xid=/tmp/B.CG53H0/BUILD/rustc-1.47.0-src/build/x86_64-unknown-linux-gnu/stage1-tools/x86_64-unknown-linux-gnu/release/deps/libunicode_xid-092edef9b22d89e4.rlib" "--extern" "url=/tmp/B.CG53H0/BUILD/rustc-1.47.0-src/build/x86_64-unknown-linux-gnu/stage1-tools/x86_64-unknown-linux-gnu/release/deps/liburl-a2792312feceeefd.rlib" "--extern" "walkdir=/tmp/B.CG53H0/BUILD/rustc-1.47.0-src/build/x86_64-unknown-linux-gnu/stage1-tools/x86_64-unknown-linux-gnu/release/deps/libwalkdir-a0b961d2bc32f575.rlib" "-Zmacro-backtrace" "-Zbinary-dep-depinfo" "-L" "native=/usr/libx32" "-L" "native=/tmp/B.CG53H0/BUILD/rustc-1.47.0-src/build/x86_64-unknown-linux-gnu/stage1-tools/x86_64-unknown-linux-gnu/release/build/libnghttp2-sys-4fda1bc62777a32b/out/i/lib" "-L" "native=/usr/libx32" "-L" "native=/tmp/B.CG53H0/BUILD/rustc-1.47.0-src/build/x86_64-unknown-linux-gnu/stage1-tools/x86_64-unknown-linux-gnu/release/build/libssh2-sys-3b0284578f05b70b/out/build" "--sysroot" "/tmp/B.CG53H0/BUILD/rustc-1.47.0-src/build/x86_64-unknown-linux-gnu/stage1"
-------------
error: could not compile `cargo`.

To learn more, run the command again with --verbose.
command did not execute successfully: "/tmp/B.CG53H0/BUILD/rustc-1.47.0-src/rust-1.46.0-x86_64-unknown-linux-gnu/bin/cargo" "build" "--target" "x86_64-unknown-linux-gnu" "-Zbinary-dep-depinfo" "-j" "4" "--release" "--frozen" "--manifest-path" "/tmp/B.CG53H0/BUILD/rustc-1.47.0-src/src/tools/cargo/Cargo.toml" "--message-format" "json-render-diagnostics"
expected success, got: exit code: 101
Traceback (most recent call last):
  File "./x.py", line 11, in <module>
    bootstrap.main()
  File "/tmp/B.CG53H0/BUILD/rustc-1.47.0-src/src/bootstrap/bootstrap.py", line 1009, in main
    bootstrap(help_triggered)
  File "/tmp/B.CG53H0/BUILD/rustc-1.47.0-src/src/bootstrap/bootstrap.py", line 995, in bootstrap
    run(args, env=env, verbose=build.verbose)
  File "/tmp/B.CG53H0/BUILD/rustc-1.47.0-src/src/bootstrap/bootstrap.py", line 143, in run
    raise RuntimeError(err)
RuntimeError: failed to run: /tmp/B.CG53H0/BUILD/rustc-1.47.0-src/build/bootstrap/debug/bootstrap dist -j 4 --verbose
error: Bad exit status from /tmp/B.CG53H0/BUILD/tmp/rpm-tmp.26533 (%build)


RPM build errors:
    Bad exit status from /tmp/B.CG53H0/BUILD/tmp/rpm-tmp.26533 (%build)
ended at: Sun Jan  3 01:24:21 2021, done in 1:17:17.763208
error: No files produced.
+ chmod -R u+rwX /tmp/B.CG53H0/BUILD
+ rm -rf /tmp/B.CG53H0/tmp /tmp/B.CG53H0/BUILD
+ rm -rf /tmp/B.CG53H0
Begin-PLD-Builder-Info
Build-Time: user:16003.15s sys:249.88s real:4694.36s (faults io:228 non-io:24815555)

End-PLD-Builder-Info
[Back to list of logs] [View rpm -qa of builder]