FailedOk

th/SRPMS[OK]
th/x32[OK]
th/i686[OK]
th/x86_64[OK]

ac/SRPMS[OK]
ac/i386[OK]
ac/i586[OK]
ac/i686[OK]
ac/alpha[OK]
ac/amd64[OK]
ac/athlon[OK]
ac/ppc[OK]
ac/sparc[OK]
ac/sparc64[OK]

Advanced Search
main()
Powered by PLD Linux
(c) 2002-2021 PLD Team
$Revision: 1.37 $
Powered by sfistak.
Your IP: 3.239.51.78

scute 1e16530b-6873-4c9f-82a2-6cfbb6314f3a

Status:Failed
Source URL:https://buildlogs.pld-linux.org/pld/th/x32/FAIL/scute,1e16530b-6873-4c9f-82a2-6cfbb6314f3a.bz2
text/plain URL:View!
rpm -qa of builder:View!
Date:2021/01/10 16:12:04
Runtime:0:00:24.597239

Toc:

  • prep
  • Executing(%prep): /bin/sh -e /tmp/B.yS_Etj/BUILD/tmp/rpm-tmp.7340
  • build
  • Executing(%build): /bin/sh -e /tmp/B.yS_Etj/BUILD/tmp/rpm-tmp.7340
  • error 1
  • collect2: error: ld returned 1 exit status
  • error 2
  • make[2]: *** [Makefile:836: scute.la] Error 1
  • error 3
  • make[1]: *** [Makefile:453: all-recursive] Error 1
  • error 4
  • error: Bad exit status from /tmp/B.yS_Etj/BUILD/tmp/rpm-tmp.7340 (%build)
  • error 5
  • RPM build errors:
  • error 6
  • error: No files produced.

Content:

request from: qboosh
checking if we should skip the build
started at: Sun Jan 10 16:11:37 2021
killing old processes on a builder
sending signal 9 to pid -1
cleaning up /tmp
fetching https://srcbuilder.pld-linux.org/th//srpms/1e16530b-6873-4c9f-82a2-6cfbb6314f3a/scute-1.7.0-1.src.rpm
fetched 863288 bytes, 2172.2 K/s
installing srpm: scute-1.7.0-1.src.rpm
+ install -d /tmp/B.yS_Etj/BUILD /tmp/B.yS_Etj/RPMS
+ LC_ALL=en_US.UTF-8
+ rpm -qp --changelog scute-1.7.0-1.src.rpm
* Sun Jan 10 2021 PLD Linux Team <feedback@pld-linux.org>
- For complete changelog see: http://git.pld-linux.org/?p=packages/scute.git;a=log;h=master
* Sun Jan 10 2021 Jakub Bogusz <qboosh@pld-linux.org> 44644d8
- updated to 1.7.0 - updated info patch + rpm -Uhv --nodeps --define '_topdir /tmp/B.yS_Etj' --define '_specdir %{_topdir}' --define '_sourcedir %{_specdir}' --define '_rpmdir %{_topdir}/RPMS' --define '_builddir %{_topdir}/BUILD' scute-1.7.0-1.src.rpm Preparing... ################################################## scute ################################################## + rm -f scute-1.7.0-1.src.rpm + install -m 700 -d /tmp/B.yS_Etj/BUILD/tmp + TMPDIR=/tmp/B.yS_Etj/BUILD/tmp + exec nice -n 0 rpmbuild -bp --short-circuit --nodeps --define '_topdir /tmp/B.yS_Etj' --define '_specdir %{_topdir}' --define '_sourcedir %{_specdir}' --define '_rpmdir %{_topdir}/RPMS' --define '_builddir %{_topdir}/BUILD' --target x32-pld-linux --define 'prep exit 0' /tmp/B.yS_Etj/scute.spec Building target platforms: x32-pld-linux checking BuildConflict-ing packages no BuildConflicts found checking BR rpm: Building target platforms: x32-pld-linux no BR needed building RPM using: set -ex; : build-id: 1e16530b-6873-4c9f-82a2-6cfbb6314f3a; TMPDIR=/tmp/B.yS_Etj/BUILD/tmp exec nice -n 0 rpmbuild -bb --define '_smp_mflags -j9' --define '_make_opts -Otarget' --define '_pld_builder 1' --define '_topdir /tmp/B.yS_Etj' --define '_specdir %{_topdir}' --define '_sourcedir %{_specdir}' --define '_rpmdir %{_topdir}/RPMS' --define '_builddir %{_topdir}/BUILD' --target x32-pld-linux /tmp/B.yS_Etj/scute.spec + : build-id: 1e16530b-6873-4c9f-82a2-6cfbb6314f3a + TMPDIR=/tmp/B.yS_Etj/BUILD/tmp + exec nice -n 0 rpmbuild -bb --define '_smp_mflags -j9' --define '_make_opts -Otarget' --define '_pld_builder 1' --define '_topdir /tmp/B.yS_Etj' --define '_specdir %{_topdir}' --define '_sourcedir %{_specdir}' --define '_rpmdir %{_topdir}/RPMS' --define '_builddir %{_topdir}/BUILD' --target x32-pld-linux /tmp/B.yS_Etj/scute.spec Building target platforms: x32-pld-linux Executing(%prep): /bin/sh -e /tmp/B.yS_Etj/BUILD/tmp/rpm-tmp.7340 + umask 022 + cd /tmp/B.yS_Etj/BUILD + cd /tmp/B.yS_Etj/BUILD + rm -rf scute-1.7.0 + /usr/bin/bzip2 -dc /tmp/B.yS_Etj/scute-1.7.0.tar.bz2 + /bin/tar -xf - + STATUS=0 + '[' 0 -ne 0 ']' + cd scute-1.7.0 + /bin/id -u + '[' 1000 '=' 0 ']' + /bin/id -u + '[' 1000 '=' 0 ']' + /bin/chmod -Rf a+rX,u+w,g-w,o-w . + echo 'Patch #0 (scute-info.patch):' Patch #0 (scute-info.patch): + '[' -f /tmp/B.yS_Etj/scute-info.patch ']' + /bin/cat /tmp/B.yS_Etj/scute-info.patch + /usr/bin/patch -s -p1 + exit 0 Executing(%build): /bin/sh -e /tmp/B.yS_Etj/BUILD/tmp/rpm-tmp.7340 HOME=/home/users/builder PATH=/home/users/builder/GNUstep/Tools:/bin:/usr/bin:/usr/local/bin TMPDIR=/tmp/B.yS_Etj/BUILD/tmp + umask 022 + cd /tmp/B.yS_Etj/BUILD + cd scute-1.7.0 + libtoolize --copy --force --install libtoolize: putting auxiliary files in AC_CONFIG_AUX_DIR, 'build-aux'. libtoolize: copying file 'build-aux/config.guess' libtoolize: copying file 'build-aux/config.sub' libtoolize: copying file 'build-aux/install-sh' libtoolize: copying file 'build-aux/ltmain.sh' libtoolize: putting macros in AC_CONFIG_MACRO_DIRS, 'm4'. libtoolize: copying file 'm4/libtool.m4' libtoolize: copying file 'm4/ltoptions.m4' libtoolize: copying file 'm4/ltsugar.m4' libtoolize: copying file 'm4/ltversion.m4' libtoolize: copying file 'm4/lt~obsolete.m4' + aclocal -I m4 + autoconf configure.ac:85: warning: The macro `AC_CONFIG_HEADER' is obsolete. configure.ac:85: You should run autoupdate. ./lib/autoconf/status.m4:719: AC_CONFIG_HEADER is expanded from... configure.ac:85: the top level configure.ac:285: warning: The macro `AC_HEADER_STDC' is obsolete. configure.ac:285: You should run autoupdate. ./lib/autoconf/headers.m4:704: AC_HEADER_STDC is expanded from... configure.ac:285: the top level + autoheader + automake -a -c -f --foreign configure.ac:95: installing 'build-aux/compile' configure.ac:87: installing 'build-aux/missing' src/Makefile.am: installing 'build-aux/depcomp' + ./configure 'LDFLAGS=-Wl,--as-needed -Wl,--no-copy-dt-needed-entries -Wl,-z,relro -Wl,-z,combreloc ' 'CFLAGS=-O2 -fwrapv -pipe -Wformat -Werror=format-security -gdwarf-4 -fno-debug-types-section -fvar-tracking-assignments -g2 -Wp,-D_FORTIFY_SOURCE=2 -fstack-protector-strong --param=ssp-buffer-size=4 -Werror=trampolines -fPIC -mtune=generic -march=x86-64 -gdwarf-4 -fno-debug-types-section -fvar-tracking-assignments -g2 ' 'CXXFLAGS=-O2 -fwrapv -pipe -Wformat -Werror=format-security -gdwarf-4 -fno-debug-types-section -fvar-tracking-assignments -g2 -Wp,-D_FORTIFY_SOURCE=2 -fstack-protector-strong --param=ssp-buffer-size=4 -Werror=trampolines -fPIC -mtune=generic -march=x86-64 -gdwarf-4 -fno-debug-types-section -fvar-tracking-assignments -g2 ' 'FFLAGS=-O2 -fwrapv -pipe -Wformat -Werror=format-security -gdwarf-4 -fno-debug-types-section -fvar-tracking-assignments -g2 -Wp,-D_FORTIFY_SOURCE=2 -fstack-protector-strong --param=ssp-buffer-size=4 -Werror=trampolines -fPIC -mtune=generic -march=x86-64 -gdwarf-4 -fno-debug-types-section -fvar-tracking-assignments -g2 ' 'FCFLAGS=-O2 -fwrapv -pipe -Wformat -Werror=format-security -gdwarf-4 -fno-debug-types-section -fvar-tracking-assignments -g2 -Wp,-D_FORTIFY_SOURCE=2 -fstack-protector-strong --param=ssp-buffer-size=4 -Werror=trampolines -fPIC -mtune=generic -march=x86-64 -gdwarf-4 -fno-debug-types-section -fvar-tracking-assignments -g2 ' 'CPPFLAGS=' 'CC=x86_64-pld-linux-gnux32-gcc' 'CXX=x86_64-pld-linux-gnux32-g++' '--host=x86_64-pld-linux-gnux32' '--build=x86_64-pld-linux-gnux32' '--prefix=/usr' '--exec-prefix=/usr' '--bindir=/usr/bin' '--sbindir=/usr/sbin' '--sysconfdir=/etc' '--datadir=/usr/share' '--includedir=/usr/include' '--libdir=/usr/libx32' '--libexecdir=/usr/libexec' '--localstatedir=/var' '--sharedstatedir=/var/lib' '--mandir=/usr/share/man' '--infodir=/usr/share/info' '--x-libraries=/usr/libx32' checking for a BSD-compatible install... /usr/bin/install -c checking whether build environment is sane... yes checking for a race-free mkdir -p... /bin/mkdir -p checking for mawk... mawk checking whether make sets $(MAKE)... yes checking whether make supports nested variables... yes checking whether to enable maintainer-specific portions of Makefiles... no checking build system type... x86_64-pld-linux-gnux32 checking host system type... x86_64-pld-linux-gnux32 configure: autobuild project... scute configure: autobuild revision... 1.7.0-unknown configure: autobuild hostname... naiad configure: autobuild timestamp... 20210110-161148 checking whether make supports the include directive... yes (GNU style) checking for x86_64-pld-linux-gnux32-gcc... x86_64-pld-linux-gnux32-gcc checking whether the C compiler works... yes checking for C compiler default output file name... a.out checking for suffix of executables... checking whether we are cross compiling... no checking for suffix of object files... o checking whether the compiler supports GNU C... yes checking whether x86_64-pld-linux-gnux32-gcc accepts -g... yes checking for x86_64-pld-linux-gnux32-gcc option to enable C11 features... none needed checking whether x86_64-pld-linux-gnux32-gcc understands -c and -o together... yes checking dependency style of x86_64-pld-linux-gnux32-gcc... gcc3 checking for stdio.h... yes checking for stdlib.h... yes checking for string.h... yes checking for inttypes.h... yes checking for stdint.h... yes checking for strings.h... yes checking for sys/stat.h... yes checking for sys/types.h... yes checking for unistd.h... yes checking for wchar.h... yes checking for minix/config.h... no checking whether it is safe to define __EXTENSIONS__... yes checking whether _XOPEN_SOURCE should be defined... no checking for x86_64-pld-linux-gnux32-gcc... (cached) x86_64-pld-linux-gnux32-gcc checking whether the compiler supports GNU C... (cached) yes checking whether x86_64-pld-linux-gnux32-gcc accepts -g... (cached) yes checking for x86_64-pld-linux-gnux32-gcc option to enable C11 features... (cached) none needed checking whether x86_64-pld-linux-gnux32-gcc understands -c and -o together... (cached) yes checking dependency style of x86_64-pld-linux-gnux32-gcc... (cached) gcc3 checking for gitlog-to-changelog... no configure: checking for cc features checking if gcc ignores unknown -Wno-* options... yes checking if gcc supports -Wpointer-arith... yes checking how to print strings... print -r checking for a sed that does not truncate output... /bin/sed checking for grep that handles long lines and -e... /bin/grep checking for egrep... /bin/grep -E checking for fgrep... /bin/grep -F checking for ld used by x86_64-pld-linux-gnux32-gcc... /usr/bin/ld checking if the linker (/usr/bin/ld) is GNU ld... yes checking for BSD- or MS-compatible name lister (nm)... /usr/bin/nm -B checking the name lister (/usr/bin/nm -B) interface... BSD nm checking whether ln -s works... yes checking the maximum length of command line arguments... 1572864 checking how to convert x86_64-pld-linux-gnux32 file names to x86_64-pld-linux-gnux32 format... func_convert_file_noop checking how to convert x86_64-pld-linux-gnux32 file names to toolchain format... func_convert_file_noop checking for /usr/bin/ld option to reload object files... -r checking for x86_64-pld-linux-gnux32-objdump... no checking for objdump... objdump checking how to recognize dependent libraries... (cached) pass_all checking for x86_64-pld-linux-gnux32-dlltool... no checking for dlltool... no checking how to associate runtime and link libraries... print -r -- checking for x86_64-pld-linux-gnux32-ar... no checking for ar... ar checking for archiver @FILE support... @ checking for x86_64-pld-linux-gnux32-strip... no checking for strip... strip checking for x86_64-pld-linux-gnux32-ranlib... no checking for ranlib... ranlib checking command to parse /usr/bin/nm -B output from x86_64-pld-linux-gnux32-gcc object... ok checking for sysroot... no checking for a working dd... /bin/dd checking how to truncate binary pipes... /bin/dd bs=4096 count=1 checking for x86_64-pld-linux-gnux32-mt... no checking for mt... no checking if : is a manifest tool... no checking for dlfcn.h... yes checking for objdir... .libs checking if x86_64-pld-linux-gnux32-gcc supports -fno-rtti -fno-exceptions... no checking for x86_64-pld-linux-gnux32-gcc option to produce PIC... -fPIC -DPIC checking if x86_64-pld-linux-gnux32-gcc PIC flag -fPIC -DPIC works... yes checking if x86_64-pld-linux-gnux32-gcc static flag -static works... yes checking if x86_64-pld-linux-gnux32-gcc supports -c -o file.o... yes checking if x86_64-pld-linux-gnux32-gcc supports -c -o file.o... (cached) yes checking whether the x86_64-pld-linux-gnux32-gcc linker (/usr/bin/ld -m elf32_x86_64) supports shared libraries... yes checking whether -lc should be explicitly linked in... no checking dynamic linker characteristics... GNU/Linux ld.so checking how to hardcode library paths into programs... immediate checking whether stripping libraries is possible... yes checking if libtool supports shared libraries... yes checking whether to build shared libraries... yes checking whether to build static libraries... no checking for x86_64-pld-linux-gnux32-windres... no checking for windres... no checking for gpg-error-config... /usr/bin/gpg-error-config checking for gpgrt-config... /usr/bin/gpgrt-config configure: Use gpgrt-config with /usr/libx32 as gpg-error-config checking for GPG Error - version >= 1.38... yes (1.41-unknown) configure: Use gpgrt-config as libassuan-config checking for LIBASSUAN - version >= 2.5.0... yes (2.5.4-unknown) checking for egrep... (cached) /bin/grep -E checking for stdlib.h... (cached) yes checking for string.h... (cached) yes checking for _Bool... yes checking for stdbool.h that conforms to C99... yes checking for inline... inline checking for ttyname... yes checking for localtime_r... yes checking for timegm... yes checking for stpcpy... yes checking for convert... convert checking for epstopdf... epstopdf checking that generated files are newer than configure... done configure: creating ./config.status config.status: creating Makefile config.status: creating m4/Makefile config.status: creating src/Makefile config.status: creating tests/Makefile config.status: creating doc/Makefile config.status: creating src/versioninfo.rc config.status: creating config.h config.status: executing depfiles commands config.status: executing libtool commands Scute v1.7.0-unknown has been configured as follows: Revision: 0000000 (0) Platform: x86_64-pld-linux-gnux32 + /usr/bin/make -Otarget -j9 /usr/bin/make all-recursive Making all in m4 make[2]: Nothing to be done for 'all'. Making all in src make[2]: Entering directory '/tmp/B.yS_Etj/BUILD/scute-1.7.0/src' /bin/sh ../libtool --tag=CC --mode=compile x86_64-pld-linux-gnux32-gcc -DHAVE_CONFIG_H -I. -I.. -I./../include -I/usr/include -Wall -Wno-pointer-sign -Wpointer-arith -O2 -fwrapv -pipe -Wformat -Werror=format-security -gdwarf-4 -fno-debug-types-section -fvar-tracking-assignments -g2 -Wp,-D_FORTIFY_SOURCE=2 -fstack-protector-strong --param=ssp-buffer-size=4 -Werror=trampolines -fPIC -mtune=generic -march=x86-64 -gdwarf-4 -fno-debug-types-section -fvar-tracking-assignments -g2 -MT scute_la-locking.lo -MD -MP -MF .deps/scute_la-locking.Tpo -c -o scute_la-locking.lo `test -f 'locking.c' || echo './'`locking.c libtool: compile: x86_64-pld-linux-gnux32-gcc -DHAVE_CONFIG_H -I. -I.. -I./../include -I/usr/include -Wall -Wno-pointer-sign -Wpointer-arith -O2 -fwrapv -pipe -Wformat -Werror=format-security -gdwarf-4 -fno-debug-types-section -fvar-tracking-assignments -g2 -Wp,-D_FORTIFY_SOURCE=2 -fstack-protector-strong --param=ssp-buffer-size=4 -Werror=trampolines -fPIC -mtune=generic -march=x86-64 -gdwarf-4 -fno-debug-types-section -fvar-tracking-assignments -g2 -MT scute_la-locking.lo -MD -MP -MF .deps/scute_la-locking.Tpo -c locking.c -fPIC -DPIC -o .libs/scute_la-locking.o mv -f .deps/scute_la-locking.Tpo .deps/scute_la-locking.Plo make[2]: Leaving directory '/tmp/B.yS_Etj/BUILD/scute-1.7.0/src' make[2]: Entering directory '/tmp/B.yS_Etj/BUILD/scute-1.7.0/src' /bin/sh ../libtool --tag=CC --mode=compile x86_64-pld-linux-gnux32-gcc -DHAVE_CONFIG_H -I. -I.. -I./../include -I/usr/include -Wall -Wno-pointer-sign -Wpointer-arith -O2 -fwrapv -pipe -Wformat -Werror=format-security -gdwarf-4 -fno-debug-types-section -fvar-tracking-assignments -g2 -Wp,-D_FORTIFY_SOURCE=2 -fstack-protector-strong --param=ssp-buffer-size=4 -Werror=trampolines -fPIC -mtune=generic -march=x86-64 -gdwarf-4 -fno-debug-types-section -fvar-tracking-assignments -g2 -MT scute_la-error-mapping.lo -MD -MP -MF .deps/scute_la-error-mapping.Tpo -c -o scute_la-error-mapping.lo `test -f 'error-mapping.c' || echo './'`error-mapping.c libtool: compile: x86_64-pld-linux-gnux32-gcc -DHAVE_CONFIG_H -I. -I.. -I./../include -I/usr/include -Wall -Wno-pointer-sign -Wpointer-arith -O2 -fwrapv -pipe -Wformat -Werror=format-security -gdwarf-4 -fno-debug-types-section -fvar-tracking-assignments -g2 -Wp,-D_FORTIFY_SOURCE=2 -fstack-protector-strong --param=ssp-buffer-size=4 -Werror=trampolines -fPIC -mtune=generic -march=x86-64 -gdwarf-4 -fno-debug-types-section -fvar-tracking-assignments -g2 -MT scute_la-error-mapping.lo -MD -MP -MF .deps/scute_la-error-mapping.Tpo -c error-mapping.c -fPIC -DPIC -o .libs/scute_la-error-mapping.o mv -f .deps/scute_la-error-mapping.Tpo .deps/scute_la-error-mapping.Plo make[2]: Leaving directory '/tmp/B.yS_Etj/BUILD/scute-1.7.0/src' make[2]: Entering directory '/tmp/B.yS_Etj/BUILD/scute-1.7.0/src' /bin/sh ../libtool --tag=CC --mode=compile x86_64-pld-linux-gnux32-gcc -DHAVE_CONFIG_H -I. -I.. -I./../include -I/usr/include -Wall -Wno-pointer-sign -Wpointer-arith -O2 -fwrapv -pipe -Wformat -Werror=format-security -gdwarf-4 -fno-debug-types-section -fvar-tracking-assignments -g2 -Wp,-D_FORTIFY_SOURCE=2 -fstack-protector-strong --param=ssp-buffer-size=4 -Werror=trampolines -fPIC -mtune=generic -march=x86-64 -gdwarf-4 -fno-debug-types-section -fvar-tracking-assignments -g2 -MT scute_la-readconf.lo -MD -MP -MF .deps/scute_la-readconf.Tpo -c -o scute_la-readconf.lo `test -f 'readconf.c' || echo './'`readconf.c libtool: compile: x86_64-pld-linux-gnux32-gcc -DHAVE_CONFIG_H -I. -I.. -I./../include -I/usr/include -Wall -Wno-pointer-sign -Wpointer-arith -O2 -fwrapv -pipe -Wformat -Werror=format-security -gdwarf-4 -fno-debug-types-section -fvar-tracking-assignments -g2 -Wp,-D_FORTIFY_SOURCE=2 -fstack-protector-strong --param=ssp-buffer-size=4 -Werror=trampolines -fPIC -mtune=generic -march=x86-64 -gdwarf-4 -fno-debug-types-section -fvar-tracking-assignments -g2 -MT scute_la-readconf.lo -MD -MP -MF .deps/scute_la-readconf.Tpo -c readconf.c -fPIC -DPIC -o .libs/scute_la-readconf.o mv -f .deps/scute_la-readconf.Tpo .deps/scute_la-readconf.Plo make[2]: Leaving directory '/tmp/B.yS_Etj/BUILD/scute-1.7.0/src' make[2]: Entering directory '/tmp/B.yS_Etj/BUILD/scute-1.7.0/src' /bin/sh ../libtool --tag=CC --mode=compile x86_64-pld-linux-gnux32-gcc -DHAVE_CONFIG_H -I. -I.. -I./../include -I/usr/include -Wall -Wno-pointer-sign -Wpointer-arith -O2 -fwrapv -pipe -Wformat -Werror=format-security -gdwarf-4 -fno-debug-types-section -fvar-tracking-assignments -g2 -Wp,-D_FORTIFY_SOURCE=2 -fstack-protector-strong --param=ssp-buffer-size=4 -Werror=trampolines -fPIC -mtune=generic -march=x86-64 -gdwarf-4 -fno-debug-types-section -fvar-tracking-assignments -g2 -MT scute_la-debug.lo -MD -MP -MF .deps/scute_la-debug.Tpo -c -o scute_la-debug.lo `test -f 'debug.c' || echo './'`debug.c libtool: compile: x86_64-pld-linux-gnux32-gcc -DHAVE_CONFIG_H -I. -I.. -I./../include -I/usr/include -Wall -Wno-pointer-sign -Wpointer-arith -O2 -fwrapv -pipe -Wformat -Werror=format-security -gdwarf-4 -fno-debug-types-section -fvar-tracking-assignments -g2 -Wp,-D_FORTIFY_SOURCE=2 -fstack-protector-strong --param=ssp-buffer-size=4 -Werror=trampolines -fPIC -mtune=generic -march=x86-64 -gdwarf-4 -fno-debug-types-section -fvar-tracking-assignments -g2 -MT scute_la-debug.lo -MD -MP -MF .deps/scute_la-debug.Tpo -c debug.c -fPIC -DPIC -o .libs/scute_la-debug.o mv -f .deps/scute_la-debug.Tpo .deps/scute_la-debug.Plo make[2]: Leaving directory '/tmp/B.yS_Etj/BUILD/scute-1.7.0/src' make[2]: Entering directory '/tmp/B.yS_Etj/BUILD/scute-1.7.0/src' /bin/sh ../libtool --tag=CC --mode=compile x86_64-pld-linux-gnux32-gcc -DHAVE_CONFIG_H -I. -I.. -I./../include -I/usr/include -Wall -Wno-pointer-sign -Wpointer-arith -O2 -fwrapv -pipe -Wformat -Werror=format-security -gdwarf-4 -fno-debug-types-section -fvar-tracking-assignments -g2 -Wp,-D_FORTIFY_SOURCE=2 -fstack-protector-strong --param=ssp-buffer-size=4 -Werror=trampolines -fPIC -mtune=generic -march=x86-64 -gdwarf-4 -fno-debug-types-section -fvar-tracking-assignments -g2 -MT scute_la-table.lo -MD -MP -MF .deps/scute_la-table.Tpo -c -o scute_la-table.lo `test -f 'table.c' || echo './'`table.c libtool: compile: x86_64-pld-linux-gnux32-gcc -DHAVE_CONFIG_H -I. -I.. -I./../include -I/usr/include -Wall -Wno-pointer-sign -Wpointer-arith -O2 -fwrapv -pipe -Wformat -Werror=format-security -gdwarf-4 -fno-debug-types-section -fvar-tracking-assignments -g2 -Wp,-D_FORTIFY_SOURCE=2 -fstack-protector-strong --param=ssp-buffer-size=4 -Werror=trampolines -fPIC -mtune=generic -march=x86-64 -gdwarf-4 -fno-debug-types-section -fvar-tracking-assignments -g2 -MT scute_la-table.lo -MD -MP -MF .deps/scute_la-table.Tpo -c table.c -fPIC -DPIC -o .libs/scute_la-table.o mv -f .deps/scute_la-table.Tpo .deps/scute_la-table.Plo make[2]: Leaving directory '/tmp/B.yS_Etj/BUILD/scute-1.7.0/src' make[2]: Entering directory '/tmp/B.yS_Etj/BUILD/scute-1.7.0/src' /bin/sh ../libtool --tag=CC --mode=compile x86_64-pld-linux-gnux32-gcc -DHAVE_CONFIG_H -I. -I.. -I./../include -I/usr/include -Wall -Wno-pointer-sign -Wpointer-arith -O2 -fwrapv -pipe -Wformat -Werror=format-security -gdwarf-4 -fno-debug-types-section -fvar-tracking-assignments -g2 -Wp,-D_FORTIFY_SOURCE=2 -fstack-protector-strong --param=ssp-buffer-size=4 -Werror=trampolines -fPIC -mtune=generic -march=x86-64 -gdwarf-4 -fno-debug-types-section -fvar-tracking-assignments -g2 -MT scute_la-get-path.lo -MD -MP -MF .deps/scute_la-get-path.Tpo -c -o scute_la-get-path.lo `test -f 'get-path.c' || echo './'`get-path.c libtool: compile: x86_64-pld-linux-gnux32-gcc -DHAVE_CONFIG_H -I. -I.. -I./../include -I/usr/include -Wall -Wno-pointer-sign -Wpointer-arith -O2 -fwrapv -pipe -Wformat -Werror=format-security -gdwarf-4 -fno-debug-types-section -fvar-tracking-assignments -g2 -Wp,-D_FORTIFY_SOURCE=2 -fstack-protector-strong --param=ssp-buffer-size=4 -Werror=trampolines -fPIC -mtune=generic -march=x86-64 -gdwarf-4 -fno-debug-types-section -fvar-tracking-assignments -g2 -MT scute_la-get-path.lo -MD -MP -MF .deps/scute_la-get-path.Tpo -c get-path.c -fPIC -DPIC -o .libs/scute_la-get-path.o mv -f .deps/scute_la-get-path.Tpo .deps/scute_la-get-path.Plo make[2]: Leaving directory '/tmp/B.yS_Etj/BUILD/scute-1.7.0/src' make[2]: Entering directory '/tmp/B.yS_Etj/BUILD/scute-1.7.0/src' /bin/sh ../libtool --tag=CC --mode=compile x86_64-pld-linux-gnux32-gcc -DHAVE_CONFIG_H -I. -I.. -I./../include -I/usr/include -Wall -Wno-pointer-sign -Wpointer-arith -O2 -fwrapv -pipe -Wformat -Werror=format-security -gdwarf-4 -fno-debug-types-section -fvar-tracking-assignments -g2 -Wp,-D_FORTIFY_SOURCE=2 -fstack-protector-strong --param=ssp-buffer-size=4 -Werror=trampolines -fPIC -mtune=generic -march=x86-64 -gdwarf-4 -fno-debug-types-section -fvar-tracking-assignments -g2 -MT scute_la-p11-cancelfunction.lo -MD -MP -MF .deps/scute_la-p11-cancelfunction.Tpo -c -o scute_la-p11-cancelfunction.lo `test -f 'p11-cancelfunction.c' || echo './'`p11-cancelfunction.c libtool: compile: x86_64-pld-linux-gnux32-gcc -DHAVE_CONFIG_H -I. -I.. -I./../include -I/usr/include -Wall -Wno-pointer-sign -Wpointer-arith -O2 -fwrapv -pipe -Wformat -Werror=format-security -gdwarf-4 -fno-debug-types-section -fvar-tracking-assignments -g2 -Wp,-D_FORTIFY_SOURCE=2 -fstack-protector-strong --param=ssp-buffer-size=4 -Werror=trampolines -fPIC -mtune=generic -march=x86-64 -gdwarf-4 -fno-debug-types-section -fvar-tracking-assignments -g2 -MT scute_la-p11-cancelfunction.lo -MD -MP -MF .deps/scute_la-p11-cancelfunction.Tpo -c p11-cancelfunction.c -fPIC -DPIC -o .libs/scute_la-p11-cancelfunction.o mv -f .deps/scute_la-p11-cancelfunction.Tpo .deps/scute_la-p11-cancelfunction.Plo make[2]: Leaving directory '/tmp/B.yS_Etj/BUILD/scute-1.7.0/src' make[2]: Entering directory '/tmp/B.yS_Etj/BUILD/scute-1.7.0/src' /bin/sh ../libtool --tag=CC --mode=compile x86_64-pld-linux-gnux32-gcc -DHAVE_CONFIG_H -I. -I.. -I./../include -I/usr/include -Wall -Wno-pointer-sign -Wpointer-arith -O2 -fwrapv -pipe -Wformat -Werror=format-security -gdwarf-4 -fno-debug-types-section -fvar-tracking-assignments -g2 -Wp,-D_FORTIFY_SOURCE=2 -fstack-protector-strong --param=ssp-buffer-size=4 -Werror=trampolines -fPIC -mtune=generic -march=x86-64 -gdwarf-4 -fno-debug-types-section -fvar-tracking-assignments -g2 -MT scute_la-p11-copyobject.lo -MD -MP -MF .deps/scute_la-p11-copyobject.Tpo -c -o scute_la-p11-copyobject.lo `test -f 'p11-copyobject.c' || echo './'`p11-copyobject.c libtool: compile: x86_64-pld-linux-gnux32-gcc -DHAVE_CONFIG_H -I. -I.. -I./../include -I/usr/include -Wall -Wno-pointer-sign -Wpointer-arith -O2 -fwrapv -pipe -Wformat -Werror=format-security -gdwarf-4 -fno-debug-types-section -fvar-tracking-assignments -g2 -Wp,-D_FORTIFY_SOURCE=2 -fstack-protector-strong --param=ssp-buffer-size=4 -Werror=trampolines -fPIC -mtune=generic -march=x86-64 -gdwarf-4 -fno-debug-types-section -fvar-tracking-assignments -g2 -MT scute_la-p11-copyobject.lo -MD -MP -MF .deps/scute_la-p11-copyobject.Tpo -c p11-copyobject.c -fPIC -DPIC -o .libs/scute_la-p11-copyobject.o mv -f .deps/scute_la-p11-copyobject.Tpo .deps/scute_la-p11-copyobject.Plo make[2]: Leaving directory '/tmp/B.yS_Etj/BUILD/scute-1.7.0/src' make[2]: Entering directory '/tmp/B.yS_Etj/BUILD/scute-1.7.0/src' /bin/sh ../libtool --tag=CC --mode=compile x86_64-pld-linux-gnux32-gcc -DHAVE_CONFIG_H -I. -I.. -I./../include -I/usr/include -Wall -Wno-pointer-sign -Wpointer-arith -O2 -fwrapv -pipe -Wformat -Werror=format-security -gdwarf-4 -fno-debug-types-section -fvar-tracking-assignments -g2 -Wp,-D_FORTIFY_SOURCE=2 -fstack-protector-strong --param=ssp-buffer-size=4 -Werror=trampolines -fPIC -mtune=generic -march=x86-64 -gdwarf-4 -fno-debug-types-section -fvar-tracking-assignments -g2 -MT scute_la-p11-closesession.lo -MD -MP -MF .deps/scute_la-p11-closesession.Tpo -c -o scute_la-p11-closesession.lo `test -f 'p11-closesession.c' || echo './'`p11-closesession.c libtool: compile: x86_64-pld-linux-gnux32-gcc -DHAVE_CONFIG_H -I. -I.. -I./../include -I/usr/include -Wall -Wno-pointer-sign -Wpointer-arith -O2 -fwrapv -pipe -Wformat -Werror=format-security -gdwarf-4 -fno-debug-types-section -fvar-tracking-assignments -g2 -Wp,-D_FORTIFY_SOURCE=2 -fstack-protector-strong --param=ssp-buffer-size=4 -Werror=trampolines -fPIC -mtune=generic -march=x86-64 -gdwarf-4 -fno-debug-types-section -fvar-tracking-assignments -g2 -MT scute_la-p11-closesession.lo -MD -MP -MF .deps/scute_la-p11-closesession.Tpo -c p11-closesession.c -fPIC -DPIC -o .libs/scute_la-p11-closesession.o mv -f .deps/scute_la-p11-closesession.Tpo .deps/scute_la-p11-closesession.Plo make[2]: Leaving directory '/tmp/B.yS_Etj/BUILD/scute-1.7.0/src' make[2]: Entering directory '/tmp/B.yS_Etj/BUILD/scute-1.7.0/src' /bin/sh ../libtool --tag=CC --mode=compile x86_64-pld-linux-gnux32-gcc -DHAVE_CONFIG_H -I. -I.. -I./../include -I/usr/include -Wall -Wno-pointer-sign -Wpointer-arith -O2 -fwrapv -pipe -Wformat -Werror=format-security -gdwarf-4 -fno-debug-types-section -fvar-tracking-assignments -g2 -Wp,-D_FORTIFY_SOURCE=2 -fstack-protector-strong --param=ssp-buffer-size=4 -Werror=trampolines -fPIC -mtune=generic -march=x86-64 -gdwarf-4 -fno-debug-types-section -fvar-tracking-assignments -g2 -MT scute_la-gpgsm.lo -MD -MP -MF .deps/scute_la-gpgsm.Tpo -c -o scute_la-gpgsm.lo `test -f 'gpgsm.c' || echo './'`gpgsm.c libtool: compile: x86_64-pld-linux-gnux32-gcc -DHAVE_CONFIG_H -I. -I.. -I./../include -I/usr/include -Wall -Wno-pointer-sign -Wpointer-arith -O2 -fwrapv -pipe -Wformat -Werror=format-security -gdwarf-4 -fno-debug-types-section -fvar-tracking-assignments -g2 -Wp,-D_FORTIFY_SOURCE=2 -fstack-protector-strong --param=ssp-buffer-size=4 -Werror=trampolines -fPIC -mtune=generic -march=x86-64 -gdwarf-4 -fno-debug-types-section -fvar-tracking-assignments -g2 -MT scute_la-gpgsm.lo -MD -MP -MF .deps/scute_la-gpgsm.Tpo -c gpgsm.c -fPIC -DPIC -o .libs/scute_la-gpgsm.o mv -f .deps/scute_la-gpgsm.Tpo .deps/scute_la-gpgsm.Plo make[2]: Leaving directory '/tmp/B.yS_Etj/BUILD/scute-1.7.0/src' make[2]: Entering directory '/tmp/B.yS_Etj/BUILD/scute-1.7.0/src' /bin/sh ../libtool --tag=CC --mode=compile x86_64-pld-linux-gnux32-gcc -DHAVE_CONFIG_H -I. -I.. -I./../include -I/usr/include -Wall -Wno-pointer-sign -Wpointer-arith -O2 -fwrapv -pipe -Wformat -Werror=format-security -gdwarf-4 -fno-debug-types-section -fvar-tracking-assignments -g2 -Wp,-D_FORTIFY_SOURCE=2 -fstack-protector-strong --param=ssp-buffer-size=4 -Werror=trampolines -fPIC -mtune=generic -march=x86-64 -gdwarf-4 -fno-debug-types-section -fvar-tracking-assignments -g2 -MT scute_la-cert-gpgsm.lo -MD -MP -MF .deps/scute_la-cert-gpgsm.Tpo -c -o scute_la-cert-gpgsm.lo `test -f 'cert-gpgsm.c' || echo './'`cert-gpgsm.c libtool: compile: x86_64-pld-linux-gnux32-gcc -DHAVE_CONFIG_H -I. -I.. -I./../include -I/usr/include -Wall -Wno-pointer-sign -Wpointer-arith -O2 -fwrapv -pipe -Wformat -Werror=format-security -gdwarf-4 -fno-debug-types-section -fvar-tracking-assignments -g2 -Wp,-D_FORTIFY_SOURCE=2 -fstack-protector-strong --param=ssp-buffer-size=4 -Werror=trampolines -fPIC -mtune=generic -march=x86-64 -gdwarf-4 -fno-debug-types-section -fvar-tracking-assignments -g2 -MT scute_la-cert-gpgsm.lo -MD -MP -MF .deps/scute_la-cert-gpgsm.Tpo -c cert-gpgsm.c -fPIC -DPIC -o .libs/scute_la-cert-gpgsm.o mv -f .deps/scute_la-cert-gpgsm.Tpo .deps/scute_la-cert-gpgsm.Plo make[2]: Leaving directory '/tmp/B.yS_Etj/BUILD/scute-1.7.0/src' make[2]: Entering directory '/tmp/B.yS_Etj/BUILD/scute-1.7.0/src' /bin/sh ../libtool --tag=CC --mode=compile x86_64-pld-linux-gnux32-gcc -DHAVE_CONFIG_H -I. -I.. -I./../include -I/usr/include -Wall -Wno-pointer-sign -Wpointer-arith -O2 -fwrapv -pipe -Wformat -Werror=format-security -gdwarf-4 -fno-debug-types-section -fvar-tracking-assignments -g2 -Wp,-D_FORTIFY_SOURCE=2 -fstack-protector-strong --param=ssp-buffer-size=4 -Werror=trampolines -fPIC -mtune=generic -march=x86-64 -gdwarf-4 -fno-debug-types-section -fvar-tracking-assignments -g2 -MT scute_la-p11-createobject.lo -MD -MP -MF .deps/scute_la-p11-createobject.Tpo -c -o scute_la-p11-createobject.lo `test -f 'p11-createobject.c' || echo './'`p11-createobject.c libtool: compile: x86_64-pld-linux-gnux32-gcc -DHAVE_CONFIG_H -I. -I.. -I./../include -I/usr/include -Wall -Wno-pointer-sign -Wpointer-arith -O2 -fwrapv -pipe -Wformat -Werror=format-security -gdwarf-4 -fno-debug-types-section -fvar-tracking-assignments -g2 -Wp,-D_FORTIFY_SOURCE=2 -fstack-protector-strong --param=ssp-buffer-size=4 -Werror=trampolines -fPIC -mtune=generic -march=x86-64 -gdwarf-4 -fno-debug-types-section -fvar-tracking-assignments -g2 -MT scute_la-p11-createobject.lo -MD -MP -MF .deps/scute_la-p11-createobject.Tpo -c p11-createobject.c -fPIC -DPIC -o .libs/scute_la-p11-createobject.o mv -f .deps/scute_la-p11-createobject.Tpo .deps/scute_la-p11-createobject.Plo make[2]: Leaving directory '/tmp/B.yS_Etj/BUILD/scute-1.7.0/src' make[2]: Entering directory '/tmp/B.yS_Etj/BUILD/scute-1.7.0/src' /bin/sh ../libtool --tag=CC --mode=compile x86_64-pld-linux-gnux32-gcc -DHAVE_CONFIG_H -I. -I.. -I./../include -I/usr/include -Wall -Wno-pointer-sign -Wpointer-arith -O2 -fwrapv -pipe -Wformat -Werror=format-security -gdwarf-4 -fno-debug-types-section -fvar-tracking-assignments -g2 -Wp,-D_FORTIFY_SOURCE=2 -fstack-protector-strong --param=ssp-buffer-size=4 -Werror=trampolines -fPIC -mtune=generic -march=x86-64 -gdwarf-4 -fno-debug-types-section -fvar-tracking-assignments -g2 -MT scute_la-p11-closeallsessions.lo -MD -MP -MF .deps/scute_la-p11-closeallsessions.Tpo -c -o scute_la-p11-closeallsessions.lo `test -f 'p11-closeallsessions.c' || echo './'`p11-closeallsessions.c libtool: compile: x86_64-pld-linux-gnux32-gcc -DHAVE_CONFIG_H -I. -I.. -I./../include -I/usr/include -Wall -Wno-pointer-sign -Wpointer-arith -O2 -fwrapv -pipe -Wformat -Werror=format-security -gdwarf-4 -fno-debug-types-section -fvar-tracking-assignments -g2 -Wp,-D_FORTIFY_SOURCE=2 -fstack-protector-strong --param=ssp-buffer-size=4 -Werror=trampolines -fPIC -mtune=generic -march=x86-64 -gdwarf-4 -fno-debug-types-section -fvar-tracking-assignments -g2 -MT scute_la-p11-closeallsessions.lo -MD -MP -MF .deps/scute_la-p11-closeallsessions.Tpo -c p11-closeallsessions.c -fPIC -DPIC -o .libs/scute_la-p11-closeallsessions.o mv -f .deps/scute_la-p11-closeallsessions.Tpo .deps/scute_la-p11-closeallsessions.Plo make[2]: Leaving directory '/tmp/B.yS_Etj/BUILD/scute-1.7.0/src' make[2]: Entering directory '/tmp/B.yS_Etj/BUILD/scute-1.7.0/src' /bin/sh ../libtool --tag=CC --mode=compile x86_64-pld-linux-gnux32-gcc -DHAVE_CONFIG_H -I. -I.. -I./../include -I/usr/include -Wall -Wno-pointer-sign -Wpointer-arith -O2 -fwrapv -pipe -Wformat -Werror=format-security -gdwarf-4 -fno-debug-types-section -fvar-tracking-assignments -g2 -Wp,-D_FORTIFY_SOURCE=2 -fstack-protector-strong --param=ssp-buffer-size=4 -Werror=trampolines -fPIC -mtune=generic -march=x86-64 -gdwarf-4 -fno-debug-types-section -fvar-tracking-assignments -g2 -MT scute_la-p11-decryptdigestupdate.lo -MD -MP -MF .deps/scute_la-p11-decryptdigestupdate.Tpo -c -o scute_la-p11-decryptdigestupdate.lo `test -f 'p11-decryptdigestupdate.c' || echo './'`p11-decryptdigestupdate.c libtool: compile: x86_64-pld-linux-gnux32-gcc -DHAVE_CONFIG_H -I. -I.. -I./../include -I/usr/include -Wall -Wno-pointer-sign -Wpointer-arith -O2 -fwrapv -pipe -Wformat -Werror=format-security -gdwarf-4 -fno-debug-types-section -fvar-tracking-assignments -g2 -Wp,-D_FORTIFY_SOURCE=2 -fstack-protector-strong --param=ssp-buffer-size=4 -Werror=trampolines -fPIC -mtune=generic -march=x86-64 -gdwarf-4 -fno-debug-types-section -fvar-tracking-assignments -g2 -MT scute_la-p11-decryptdigestupdate.lo -MD -MP -MF .deps/scute_la-p11-decryptdigestupdate.Tpo -c p11-decryptdigestupdate.c -fPIC -DPIC -o .libs/scute_la-p11-decryptdigestupdate.o mv -f .deps/scute_la-p11-decryptdigestupdate.Tpo .deps/scute_la-p11-decryptdigestupdate.Plo make[2]: Leaving directory '/tmp/B.yS_Etj/BUILD/scute-1.7.0/src' make[2]: Entering directory '/tmp/B.yS_Etj/BUILD/scute-1.7.0/src' /bin/sh ../libtool --tag=CC --mode=compile x86_64-pld-linux-gnux32-gcc -DHAVE_CONFIG_H -I. -I.. -I./../include -I/usr/include -Wall -Wno-pointer-sign -Wpointer-arith -O2 -fwrapv -pipe -Wformat -Werror=format-security -gdwarf-4 -fno-debug-types-section -fvar-tracking-assignments -g2 -Wp,-D_FORTIFY_SOURCE=2 -fstack-protector-strong --param=ssp-buffer-size=4 -Werror=trampolines -fPIC -mtune=generic -march=x86-64 -gdwarf-4 -fno-debug-types-section -fvar-tracking-assignments -g2 -MT scute_la-p11-decrypt.lo -MD -MP -MF .deps/scute_la-p11-decrypt.Tpo -c -o scute_la-p11-decrypt.lo `test -f 'p11-decrypt.c' || echo './'`p11-decrypt.c libtool: compile: x86_64-pld-linux-gnux32-gcc -DHAVE_CONFIG_H -I. -I.. -I./../include -I/usr/include -Wall -Wno-pointer-sign -Wpointer-arith -O2 -fwrapv -pipe -Wformat -Werror=format-security -gdwarf-4 -fno-debug-types-section -fvar-tracking-assignments -g2 -Wp,-D_FORTIFY_SOURCE=2 -fstack-protector-strong --param=ssp-buffer-size=4 -Werror=trampolines -fPIC -mtune=generic -march=x86-64 -gdwarf-4 -fno-debug-types-section -fvar-tracking-assignments -g2 -MT scute_la-p11-decrypt.lo -MD -MP -MF .deps/scute_la-p11-decrypt.Tpo -c p11-decrypt.c -fPIC -DPIC -o .libs/scute_la-p11-decrypt.o mv -f .deps/scute_la-p11-decrypt.Tpo .deps/scute_la-p11-decrypt.Plo make[2]: Leaving directory '/tmp/B.yS_Etj/BUILD/scute-1.7.0/src' make[2]: Entering directory '/tmp/B.yS_Etj/BUILD/scute-1.7.0/src' /bin/sh ../libtool --tag=CC --mode=compile x86_64-pld-linux-gnux32-gcc -DHAVE_CONFIG_H -I. -I.. -I./../include -I/usr/include -Wall -Wno-pointer-sign -Wpointer-arith -O2 -fwrapv -pipe -Wformat -Werror=format-security -gdwarf-4 -fno-debug-types-section -fvar-tracking-assignments -g2 -Wp,-D_FORTIFY_SOURCE=2 -fstack-protector-strong --param=ssp-buffer-size=4 -Werror=trampolines -fPIC -mtune=generic -march=x86-64 -gdwarf-4 -fno-debug-types-section -fvar-tracking-assignments -g2 -MT scute_la-p11-decryptupdate.lo -MD -MP -MF .deps/scute_la-p11-decryptupdate.Tpo -c -o scute_la-p11-decryptupdate.lo `test -f 'p11-decryptupdate.c' || echo './'`p11-decryptupdate.c libtool: compile: x86_64-pld-linux-gnux32-gcc -DHAVE_CONFIG_H -I. -I.. -I./../include -I/usr/include -Wall -Wno-pointer-sign -Wpointer-arith -O2 -fwrapv -pipe -Wformat -Werror=format-security -gdwarf-4 -fno-debug-types-section -fvar-tracking-assignments -g2 -Wp,-D_FORTIFY_SOURCE=2 -fstack-protector-strong --param=ssp-buffer-size=4 -Werror=trampolines -fPIC -mtune=generic -march=x86-64 -gdwarf-4 -fno-debug-types-section -fvar-tracking-assignments -g2 -MT scute_la-p11-decryptupdate.lo -MD -MP -MF .deps/scute_la-p11-decryptupdate.Tpo -c p11-decryptupdate.c -fPIC -DPIC -o .libs/scute_la-p11-decryptupdate.o mv -f .deps/scute_la-p11-decryptupdate.Tpo .deps/scute_la-p11-decryptupdate.Plo make[2]: Leaving directory '/tmp/B.yS_Etj/BUILD/scute-1.7.0/src' make[2]: Entering directory '/tmp/B.yS_Etj/BUILD/scute-1.7.0/src' /bin/sh ../libtool --tag=CC --mode=compile x86_64-pld-linux-gnux32-gcc -DHAVE_CONFIG_H -I. -I.. -I./../include -I/usr/include -Wall -Wno-pointer-sign -Wpointer-arith -O2 -fwrapv -pipe -Wformat -Werror=format-security -gdwarf-4 -fno-debug-types-section -fvar-tracking-assignments -g2 -Wp,-D_FORTIFY_SOURCE=2 -fstack-protector-strong --param=ssp-buffer-size=4 -Werror=trampolines -fPIC -mtune=generic -march=x86-64 -gdwarf-4 -fno-debug-types-section -fvar-tracking-assignments -g2 -MT scute_la-p11-decryptfinal.lo -MD -MP -MF .deps/scute_la-p11-decryptfinal.Tpo -c -o scute_la-p11-decryptfinal.lo `test -f 'p11-decryptfinal.c' || echo './'`p11-decryptfinal.c libtool: compile: x86_64-pld-linux-gnux32-gcc -DHAVE_CONFIG_H -I. -I.. -I./../include -I/usr/include -Wall -Wno-pointer-sign -Wpointer-arith -O2 -fwrapv -pipe -Wformat -Werror=format-security -gdwarf-4 -fno-debug-types-section -fvar-tracking-assignments -g2 -Wp,-D_FORTIFY_SOURCE=2 -fstack-protector-strong --param=ssp-buffer-size=4 -Werror=trampolines -fPIC -mtune=generic -march=x86-64 -gdwarf-4 -fno-debug-types-section -fvar-tracking-assignments -g2 -MT scute_la-p11-decryptfinal.lo -MD -MP -MF .deps/scute_la-p11-decryptfinal.Tpo -c p11-decryptfinal.c -fPIC -DPIC -o .libs/scute_la-p11-decryptfinal.o mv -f .deps/scute_la-p11-decryptfinal.Tpo .deps/scute_la-p11-decryptfinal.Plo make[2]: Leaving directory '/tmp/B.yS_Etj/BUILD/scute-1.7.0/src' make[2]: Entering directory '/tmp/B.yS_Etj/BUILD/scute-1.7.0/src' /bin/sh ../libtool --tag=CC --mode=compile x86_64-pld-linux-gnux32-gcc -DHAVE_CONFIG_H -I. -I.. -I./../include -I/usr/include -Wall -Wno-pointer-sign -Wpointer-arith -O2 -fwrapv -pipe -Wformat -Werror=format-security -gdwarf-4 -fno-debug-types-section -fvar-tracking-assignments -g2 -Wp,-D_FORTIFY_SOURCE=2 -fstack-protector-strong --param=ssp-buffer-size=4 -Werror=trampolines -fPIC -mtune=generic -march=x86-64 -gdwarf-4 -fno-debug-types-section -fvar-tracking-assignments -g2 -MT scute_la-p11-decryptinit.lo -MD -MP -MF .deps/scute_la-p11-decryptinit.Tpo -c -o scute_la-p11-decryptinit.lo `test -f 'p11-decryptinit.c' || echo './'`p11-decryptinit.c libtool: compile: x86_64-pld-linux-gnux32-gcc -DHAVE_CONFIG_H -I. -I.. -I./../include -I/usr/include -Wall -Wno-pointer-sign -Wpointer-arith -O2 -fwrapv -pipe -Wformat -Werror=format-security -gdwarf-4 -fno-debug-types-section -fvar-tracking-assignments -g2 -Wp,-D_FORTIFY_SOURCE=2 -fstack-protector-strong --param=ssp-buffer-size=4 -Werror=trampolines -fPIC -mtune=generic -march=x86-64 -gdwarf-4 -fno-debug-types-section -fvar-tracking-assignments -g2 -MT scute_la-p11-decryptinit.lo -MD -MP -MF .deps/scute_la-p11-decryptinit.Tpo -c p11-decryptinit.c -fPIC -DPIC -o .libs/scute_la-p11-decryptinit.o mv -f .deps/scute_la-p11-decryptinit.Tpo .deps/scute_la-p11-decryptinit.Plo make[2]: Leaving directory '/tmp/B.yS_Etj/BUILD/scute-1.7.0/src' make[2]: Entering directory '/tmp/B.yS_Etj/BUILD/scute-1.7.0/src' /bin/sh ../libtool --tag=CC --mode=compile x86_64-pld-linux-gnux32-gcc -DHAVE_CONFIG_H -I. -I.. -I./../include -I/usr/include -Wall -Wno-pointer-sign -Wpointer-arith -O2 -fwrapv -pipe -Wformat -Werror=format-security -gdwarf-4 -fno-debug-types-section -fvar-tracking-assignments -g2 -Wp,-D_FORTIFY_SOURCE=2 -fstack-protector-strong --param=ssp-buffer-size=4 -Werror=trampolines -fPIC -mtune=generic -march=x86-64 -gdwarf-4 -fno-debug-types-section -fvar-tracking-assignments -g2 -MT scute_la-cert-object.lo -MD -MP -MF .deps/scute_la-cert-object.Tpo -c -o scute_la-cert-object.lo `test -f 'cert-object.c' || echo './'`cert-object.c libtool: compile: x86_64-pld-linux-gnux32-gcc -DHAVE_CONFIG_H -I. -I.. -I./../include -I/usr/include -Wall -Wno-pointer-sign -Wpointer-arith -O2 -fwrapv -pipe -Wformat -Werror=format-security -gdwarf-4 -fno-debug-types-section -fvar-tracking-assignments -g2 -Wp,-D_FORTIFY_SOURCE=2 -fstack-protector-strong --param=ssp-buffer-size=4 -Werror=trampolines -fPIC -mtune=generic -march=x86-64 -gdwarf-4 -fno-debug-types-section -fvar-tracking-assignments -g2 -MT scute_la-cert-object.lo -MD -MP -MF .deps/scute_la-cert-object.Tpo -c cert-object.c -fPIC -DPIC -o .libs/scute_la-cert-object.o mv -f .deps/scute_la-cert-object.Tpo .deps/scute_la-cert-object.Plo make[2]: Leaving directory '/tmp/B.yS_Etj/BUILD/scute-1.7.0/src' make[2]: Entering directory '/tmp/B.yS_Etj/BUILD/scute-1.7.0/src' /bin/sh ../libtool --tag=CC --mode=compile x86_64-pld-linux-gnux32-gcc -DHAVE_CONFIG_H -I. -I.. -I./../include -I/usr/include -Wall -Wno-pointer-sign -Wpointer-arith -O2 -fwrapv -pipe -Wformat -Werror=format-security -gdwarf-4 -fno-debug-types-section -fvar-tracking-assignments -g2 -Wp,-D_FORTIFY_SOURCE=2 -fstack-protector-strong --param=ssp-buffer-size=4 -Werror=trampolines -fPIC -mtune=generic -march=x86-64 -gdwarf-4 -fno-debug-types-section -fvar-tracking-assignments -g2 -MT scute_la-p11-decryptverifyupdate.lo -MD -MP -MF .deps/scute_la-p11-decryptverifyupdate.Tpo -c -o scute_la-p11-decryptverifyupdate.lo `test -f 'p11-decryptverifyupdate.c' || echo './'`p11-decryptverifyupdate.c libtool: compile: x86_64-pld-linux-gnux32-gcc -DHAVE_CONFIG_H -I. -I.. -I./../include -I/usr/include -Wall -Wno-pointer-sign -Wpointer-arith -O2 -fwrapv -pipe -Wformat -Werror=format-security -gdwarf-4 -fno-debug-types-section -fvar-tracking-assignments -g2 -Wp,-D_FORTIFY_SOURCE=2 -fstack-protector-strong --param=ssp-buffer-size=4 -Werror=trampolines -fPIC -mtune=generic -march=x86-64 -gdwarf-4 -fno-debug-types-section -fvar-tracking-assignments -g2 -MT scute_la-p11-decryptverifyupdate.lo -MD -MP -MF .deps/scute_la-p11-decryptverifyupdate.Tpo -c p11-decryptverifyupdate.c -fPIC -DPIC -o .libs/scute_la-p11-decryptverifyupdate.o mv -f .deps/scute_la-p11-decryptverifyupdate.Tpo .deps/scute_la-p11-decryptverifyupdate.Plo make[2]: Leaving directory '/tmp/B.yS_Etj/BUILD/scute-1.7.0/src' make[2]: Entering directory '/tmp/B.yS_Etj/BUILD/scute-1.7.0/src' /bin/sh ../libtool --tag=CC --mode=compile x86_64-pld-linux-gnux32-gcc -DHAVE_CONFIG_H -I. -I.. -I./../include -I/usr/include -Wall -Wno-pointer-sign -Wpointer-arith -O2 -fwrapv -pipe -Wformat -Werror=format-security -gdwarf-4 -fno-debug-types-section -fvar-tracking-assignments -g2 -Wp,-D_FORTIFY_SOURCE=2 -fstack-protector-strong --param=ssp-buffer-size=4 -Werror=trampolines -fPIC -mtune=generic -march=x86-64 -gdwarf-4 -fno-debug-types-section -fvar-tracking-assignments -g2 -MT scute_la-p11-derivekey.lo -MD -MP -MF .deps/scute_la-p11-derivekey.Tpo -c -o scute_la-p11-derivekey.lo `test -f 'p11-derivekey.c' || echo './'`p11-derivekey.c libtool: compile: x86_64-pld-linux-gnux32-gcc -DHAVE_CONFIG_H -I. -I.. -I./../include -I/usr/include -Wall -Wno-pointer-sign -Wpointer-arith -O2 -fwrapv -pipe -Wformat -Werror=format-security -gdwarf-4 -fno-debug-types-section -fvar-tracking-assignments -g2 -Wp,-D_FORTIFY_SOURCE=2 -fstack-protector-strong --param=ssp-buffer-size=4 -Werror=trampolines -fPIC -mtune=generic -march=x86-64 -gdwarf-4 -fno-debug-types-section -fvar-tracking-assignments -g2 -MT scute_la-p11-derivekey.lo -MD -MP -MF .deps/scute_la-p11-derivekey.Tpo -c p11-derivekey.c -fPIC -DPIC -o .libs/scute_la-p11-derivekey.o mv -f .deps/scute_la-p11-derivekey.Tpo .deps/scute_la-p11-derivekey.Plo make[2]: Leaving directory '/tmp/B.yS_Etj/BUILD/scute-1.7.0/src' make[2]: Entering directory '/tmp/B.yS_Etj/BUILD/scute-1.7.0/src' /bin/sh ../libtool --tag=CC --mode=compile x86_64-pld-linux-gnux32-gcc -DHAVE_CONFIG_H -I. -I.. -I./../include -I/usr/include -Wall -Wno-pointer-sign -Wpointer-arith -O2 -fwrapv -pipe -Wformat -Werror=format-security -gdwarf-4 -fno-debug-types-section -fvar-tracking-assignments -g2 -Wp,-D_FORTIFY_SOURCE=2 -fstack-protector-strong --param=ssp-buffer-size=4 -Werror=trampolines -fPIC -mtune=generic -march=x86-64 -gdwarf-4 -fno-debug-types-section -fvar-tracking-assignments -g2 -MT scute_la-slots.lo -MD -MP -MF .deps/scute_la-slots.Tpo -c -o scute_la-slots.lo `test -f 'slots.c' || echo './'`slots.c libtool: compile: x86_64-pld-linux-gnux32-gcc -DHAVE_CONFIG_H -I. -I.. -I./../include -I/usr/include -Wall -Wno-pointer-sign -Wpointer-arith -O2 -fwrapv -pipe -Wformat -Werror=format-security -gdwarf-4 -fno-debug-types-section -fvar-tracking-assignments -g2 -Wp,-D_FORTIFY_SOURCE=2 -fstack-protector-strong --param=ssp-buffer-size=4 -Werror=trampolines -fPIC -mtune=generic -march=x86-64 -gdwarf-4 -fno-debug-types-section -fvar-tracking-assignments -g2 -MT scute_la-slots.lo -MD -MP -MF .deps/scute_la-slots.Tpo -c slots.c -fPIC -DPIC -o .libs/scute_la-slots.o mv -f .deps/scute_la-slots.Tpo .deps/scute_la-slots.Plo make[2]: Leaving directory '/tmp/B.yS_Etj/BUILD/scute-1.7.0/src' make[2]: Entering directory '/tmp/B.yS_Etj/BUILD/scute-1.7.0/src' /bin/sh ../libtool --tag=CC --mode=compile x86_64-pld-linux-gnux32-gcc -DHAVE_CONFIG_H -I. -I.. -I./../include -I/usr/include -Wall -Wno-pointer-sign -Wpointer-arith -O2 -fwrapv -pipe -Wformat -Werror=format-security -gdwarf-4 -fno-debug-types-section -fvar-tracking-assignments -g2 -Wp,-D_FORTIFY_SOURCE=2 -fstack-protector-strong --param=ssp-buffer-size=4 -Werror=trampolines -fPIC -mtune=generic -march=x86-64 -gdwarf-4 -fno-debug-types-section -fvar-tracking-assignments -g2 -MT scute_la-p11-destroyobject.lo -MD -MP -MF .deps/scute_la-p11-destroyobject.Tpo -c -o scute_la-p11-destroyobject.lo `test -f 'p11-destroyobject.c' || echo './'`p11-destroyobject.c libtool: compile: x86_64-pld-linux-gnux32-gcc -DHAVE_CONFIG_H -I. -I.. -I./../include -I/usr/include -Wall -Wno-pointer-sign -Wpointer-arith -O2 -fwrapv -pipe -Wformat -Werror=format-security -gdwarf-4 -fno-debug-types-section -fvar-tracking-assignments -g2 -Wp,-D_FORTIFY_SOURCE=2 -fstack-protector-strong --param=ssp-buffer-size=4 -Werror=trampolines -fPIC -mtune=generic -march=x86-64 -gdwarf-4 -fno-debug-types-section -fvar-tracking-assignments -g2 -MT scute_la-p11-destroyobject.lo -MD -MP -MF .deps/scute_la-p11-destroyobject.Tpo -c p11-destroyobject.c -fPIC -DPIC -o .libs/scute_la-p11-destroyobject.o mv -f .deps/scute_la-p11-destroyobject.Tpo .deps/scute_la-p11-destroyobject.Plo make[2]: Leaving directory '/tmp/B.yS_Etj/BUILD/scute-1.7.0/src' make[2]: Entering directory '/tmp/B.yS_Etj/BUILD/scute-1.7.0/src' /bin/sh ../libtool --tag=CC --mode=compile x86_64-pld-linux-gnux32-gcc -DHAVE_CONFIG_H -I. -I.. -I./../include -I/usr/include -Wall -Wno-pointer-sign -Wpointer-arith -O2 -fwrapv -pipe -Wformat -Werror=format-security -gdwarf-4 -fno-debug-types-section -fvar-tracking-assignments -g2 -Wp,-D_FORTIFY_SOURCE=2 -fstack-protector-strong --param=ssp-buffer-size=4 -Werror=trampolines -fPIC -mtune=generic -march=x86-64 -gdwarf-4 -fno-debug-types-section -fvar-tracking-assignments -g2 -MT scute_la-p11-digestencryptupdate.lo -MD -MP -MF .deps/scute_la-p11-digestencryptupdate.Tpo -c -o scute_la-p11-digestencryptupdate.lo `test -f 'p11-digestencryptupdate.c' || echo './'`p11-digestencryptupdate.c libtool: compile: x86_64-pld-linux-gnux32-gcc -DHAVE_CONFIG_H -I. -I.. -I./../include -I/usr/include -Wall -Wno-pointer-sign -Wpointer-arith -O2 -fwrapv -pipe -Wformat -Werror=format-security -gdwarf-4 -fno-debug-types-section -fvar-tracking-assignments -g2 -Wp,-D_FORTIFY_SOURCE=2 -fstack-protector-strong --param=ssp-buffer-size=4 -Werror=trampolines -fPIC -mtune=generic -march=x86-64 -gdwarf-4 -fno-debug-types-section -fvar-tracking-assignments -g2 -MT scute_la-p11-digestencryptupdate.lo -MD -MP -MF .deps/scute_la-p11-digestencryptupdate.Tpo -c p11-digestencryptupdate.c -fPIC -DPIC -o .libs/scute_la-p11-digestencryptupdate.o mv -f .deps/scute_la-p11-digestencryptupdate.Tpo .deps/scute_la-p11-digestencryptupdate.Plo make[2]: Leaving directory '/tmp/B.yS_Etj/BUILD/scute-1.7.0/src' make[2]: Entering directory '/tmp/B.yS_Etj/BUILD/scute-1.7.0/src' /bin/sh ../libtool --tag=CC --mode=compile x86_64-pld-linux-gnux32-gcc -DHAVE_CONFIG_H -I. -I.. -I./../include -I/usr/include -Wall -Wno-pointer-sign -Wpointer-arith -O2 -fwrapv -pipe -Wformat -Werror=format-security -gdwarf-4 -fno-debug-types-section -fvar-tracking-assignments -g2 -Wp,-D_FORTIFY_SOURCE=2 -fstack-protector-strong --param=ssp-buffer-size=4 -Werror=trampolines -fPIC -mtune=generic -march=x86-64 -gdwarf-4 -fno-debug-types-section -fvar-tracking-assignments -g2 -MT scute_la-p11-digestfinal.lo -MD -MP -MF .deps/scute_la-p11-digestfinal.Tpo -c -o scute_la-p11-digestfinal.lo `test -f 'p11-digestfinal.c' || echo './'`p11-digestfinal.c libtool: compile: x86_64-pld-linux-gnux32-gcc -DHAVE_CONFIG_H -I. -I.. -I./../include -I/usr/include -Wall -Wno-pointer-sign -Wpointer-arith -O2 -fwrapv -pipe -Wformat -Werror=format-security -gdwarf-4 -fno-debug-types-section -fvar-tracking-assignments -g2 -Wp,-D_FORTIFY_SOURCE=2 -fstack-protector-strong --param=ssp-buffer-size=4 -Werror=trampolines -fPIC -mtune=generic -march=x86-64 -gdwarf-4 -fno-debug-types-section -fvar-tracking-assignments -g2 -MT scute_la-p11-digestfinal.lo -MD -MP -MF .deps/scute_la-p11-digestfinal.Tpo -c p11-digestfinal.c -fPIC -DPIC -o .libs/scute_la-p11-digestfinal.o mv -f .deps/scute_la-p11-digestfinal.Tpo .deps/scute_la-p11-digestfinal.Plo make[2]: Leaving directory '/tmp/B.yS_Etj/BUILD/scute-1.7.0/src' make[2]: Entering directory '/tmp/B.yS_Etj/BUILD/scute-1.7.0/src' /bin/sh ../libtool --tag=CC --mode=compile x86_64-pld-linux-gnux32-gcc -DHAVE_CONFIG_H -I. -I.. -I./../include -I/usr/include -Wall -Wno-pointer-sign -Wpointer-arith -O2 -fwrapv -pipe -Wformat -Werror=format-security -gdwarf-4 -fno-debug-types-section -fvar-tracking-assignments -g2 -Wp,-D_FORTIFY_SOURCE=2 -fstack-protector-strong --param=ssp-buffer-size=4 -Werror=trampolines -fPIC -mtune=generic -march=x86-64 -gdwarf-4 -fno-debug-types-section -fvar-tracking-assignments -g2 -MT scute_la-p11-digest.lo -MD -MP -MF .deps/scute_la-p11-digest.Tpo -c -o scute_la-p11-digest.lo `test -f 'p11-digest.c' || echo './'`p11-digest.c libtool: compile: x86_64-pld-linux-gnux32-gcc -DHAVE_CONFIG_H -I. -I.. -I./../include -I/usr/include -Wall -Wno-pointer-sign -Wpointer-arith -O2 -fwrapv -pipe -Wformat -Werror=format-security -gdwarf-4 -fno-debug-types-section -fvar-tracking-assignments -g2 -Wp,-D_FORTIFY_SOURCE=2 -fstack-protector-strong --param=ssp-buffer-size=4 -Werror=trampolines -fPIC -mtune=generic -march=x86-64 -gdwarf-4 -fno-debug-types-section -fvar-tracking-assignments -g2 -MT scute_la-p11-digest.lo -MD -MP -MF .deps/scute_la-p11-digest.Tpo -c p11-digest.c -fPIC -DPIC -o .libs/scute_la-p11-digest.o mv -f .deps/scute_la-p11-digest.Tpo .deps/scute_la-p11-digest.Plo make[2]: Leaving directory '/tmp/B.yS_Etj/BUILD/scute-1.7.0/src' make[2]: Entering directory '/tmp/B.yS_Etj/BUILD/scute-1.7.0/src' /bin/sh ../libtool --tag=CC --mode=compile x86_64-pld-linux-gnux32-gcc -DHAVE_CONFIG_H -I. -I.. -I./../include -I/usr/include -Wall -Wno-pointer-sign -Wpointer-arith -O2 -fwrapv -pipe -Wformat -Werror=format-security -gdwarf-4 -fno-debug-types-section -fvar-tracking-assignments -g2 -Wp,-D_FORTIFY_SOURCE=2 -fstack-protector-strong --param=ssp-buffer-size=4 -Werror=trampolines -fPIC -mtune=generic -march=x86-64 -gdwarf-4 -fno-debug-types-section -fvar-tracking-assignments -g2 -MT scute_la-p11-digestinit.lo -MD -MP -MF .deps/scute_la-p11-digestinit.Tpo -c -o scute_la-p11-digestinit.lo `test -f 'p11-digestinit.c' || echo './'`p11-digestinit.c libtool: compile: x86_64-pld-linux-gnux32-gcc -DHAVE_CONFIG_H -I. -I.. -I./../include -I/usr/include -Wall -Wno-pointer-sign -Wpointer-arith -O2 -fwrapv -pipe -Wformat -Werror=format-security -gdwarf-4 -fno-debug-types-section -fvar-tracking-assignments -g2 -Wp,-D_FORTIFY_SOURCE=2 -fstack-protector-strong --param=ssp-buffer-size=4 -Werror=trampolines -fPIC -mtune=generic -march=x86-64 -gdwarf-4 -fno-debug-types-section -fvar-tracking-assignments -g2 -MT scute_la-p11-digestinit.lo -MD -MP -MF .deps/scute_la-p11-digestinit.Tpo -c p11-digestinit.c -fPIC -DPIC -o .libs/scute_la-p11-digestinit.o mv -f .deps/scute_la-p11-digestinit.Tpo .deps/scute_la-p11-digestinit.Plo make[2]: Leaving directory '/tmp/B.yS_Etj/BUILD/scute-1.7.0/src' make[2]: Entering directory '/tmp/B.yS_Etj/BUILD/scute-1.7.0/src' /bin/sh ../libtool --tag=CC --mode=compile x86_64-pld-linux-gnux32-gcc -DHAVE_CONFIG_H -I. -I.. -I./../include -I/usr/include -Wall -Wno-pointer-sign -Wpointer-arith -O2 -fwrapv -pipe -Wformat -Werror=format-security -gdwarf-4 -fno-debug-types-section -fvar-tracking-assignments -g2 -Wp,-D_FORTIFY_SOURCE=2 -fstack-protector-strong --param=ssp-buffer-size=4 -Werror=trampolines -fPIC -mtune=generic -march=x86-64 -gdwarf-4 -fno-debug-types-section -fvar-tracking-assignments -g2 -MT scute_la-p11-digestkey.lo -MD -MP -MF .deps/scute_la-p11-digestkey.Tpo -c -o scute_la-p11-digestkey.lo `test -f 'p11-digestkey.c' || echo './'`p11-digestkey.c libtool: compile: x86_64-pld-linux-gnux32-gcc -DHAVE_CONFIG_H -I. -I.. -I./../include -I/usr/include -Wall -Wno-pointer-sign -Wpointer-arith -O2 -fwrapv -pipe -Wformat -Werror=format-security -gdwarf-4 -fno-debug-types-section -fvar-tracking-assignments -g2 -Wp,-D_FORTIFY_SOURCE=2 -fstack-protector-strong --param=ssp-buffer-size=4 -Werror=trampolines -fPIC -mtune=generic -march=x86-64 -gdwarf-4 -fno-debug-types-section -fvar-tracking-assignments -g2 -MT scute_la-p11-digestkey.lo -MD -MP -MF .deps/scute_la-p11-digestkey.Tpo -c p11-digestkey.c -fPIC -DPIC -o .libs/scute_la-p11-digestkey.o mv -f .deps/scute_la-p11-digestkey.Tpo .deps/scute_la-p11-digestkey.Plo make[2]: Leaving directory '/tmp/B.yS_Etj/BUILD/scute-1.7.0/src' make[2]: Entering directory '/tmp/B.yS_Etj/BUILD/scute-1.7.0/src' /bin/sh ../libtool --tag=CC --mode=compile x86_64-pld-linux-gnux32-gcc -DHAVE_CONFIG_H -I. -I.. -I./../include -I/usr/include -Wall -Wno-pointer-sign -Wpointer-arith -O2 -fwrapv -pipe -Wformat -Werror=format-security -gdwarf-4 -fno-debug-types-section -fvar-tracking-assignments -g2 -Wp,-D_FORTIFY_SOURCE=2 -fstack-protector-strong --param=ssp-buffer-size=4 -Werror=trampolines -fPIC -mtune=generic -march=x86-64 -gdwarf-4 -fno-debug-types-section -fvar-tracking-assignments -g2 -MT scute_la-p11-digestupdate.lo -MD -MP -MF .deps/scute_la-p11-digestupdate.Tpo -c -o scute_la-p11-digestupdate.lo `test -f 'p11-digestupdate.c' || echo './'`p11-digestupdate.c libtool: compile: x86_64-pld-linux-gnux32-gcc -DHAVE_CONFIG_H -I. -I.. -I./../include -I/usr/include -Wall -Wno-pointer-sign -Wpointer-arith -O2 -fwrapv -pipe -Wformat -Werror=format-security -gdwarf-4 -fno-debug-types-section -fvar-tracking-assignments -g2 -Wp,-D_FORTIFY_SOURCE=2 -fstack-protector-strong --param=ssp-buffer-size=4 -Werror=trampolines -fPIC -mtune=generic -march=x86-64 -gdwarf-4 -fno-debug-types-section -fvar-tracking-assignments -g2 -MT scute_la-p11-digestupdate.lo -MD -MP -MF .deps/scute_la-p11-digestupdate.Tpo -c p11-digestupdate.c -fPIC -DPIC -o .libs/scute_la-p11-digestupdate.o mv -f .deps/scute_la-p11-digestupdate.Tpo .deps/scute_la-p11-digestupdate.Plo make[2]: Leaving directory '/tmp/B.yS_Etj/BUILD/scute-1.7.0/src' make[2]: Entering directory '/tmp/B.yS_Etj/BUILD/scute-1.7.0/src' /bin/sh ../libtool --tag=CC --mode=compile x86_64-pld-linux-gnux32-gcc -DHAVE_CONFIG_H -I. -I.. -I./../include -I/usr/include -Wall -Wno-pointer-sign -Wpointer-arith -O2 -fwrapv -pipe -Wformat -Werror=format-security -gdwarf-4 -fno-debug-types-section -fvar-tracking-assignments -g2 -Wp,-D_FORTIFY_SOURCE=2 -fstack-protector-strong --param=ssp-buffer-size=4 -Werror=trampolines -fPIC -mtune=generic -march=x86-64 -gdwarf-4 -fno-debug-types-section -fvar-tracking-assignments -g2 -MT scute_la-p11-encrypt.lo -MD -MP -MF .deps/scute_la-p11-encrypt.Tpo -c -o scute_la-p11-encrypt.lo `test -f 'p11-encrypt.c' || echo './'`p11-encrypt.c libtool: compile: x86_64-pld-linux-gnux32-gcc -DHAVE_CONFIG_H -I. -I.. -I./../include -I/usr/include -Wall -Wno-pointer-sign -Wpointer-arith -O2 -fwrapv -pipe -Wformat -Werror=format-security -gdwarf-4 -fno-debug-types-section -fvar-tracking-assignments -g2 -Wp,-D_FORTIFY_SOURCE=2 -fstack-protector-strong --param=ssp-buffer-size=4 -Werror=trampolines -fPIC -mtune=generic -march=x86-64 -gdwarf-4 -fno-debug-types-section -fvar-tracking-assignments -g2 -MT scute_la-p11-encrypt.lo -MD -MP -MF .deps/scute_la-p11-encrypt.Tpo -c p11-encrypt.c -fPIC -DPIC -o .libs/scute_la-p11-encrypt.o mv -f .deps/scute_la-p11-encrypt.Tpo .deps/scute_la-p11-encrypt.Plo make[2]: Leaving directory '/tmp/B.yS_Etj/BUILD/scute-1.7.0/src' make[2]: Entering directory '/tmp/B.yS_Etj/BUILD/scute-1.7.0/src' /bin/sh ../libtool --tag=CC --mode=compile x86_64-pld-linux-gnux32-gcc -DHAVE_CONFIG_H -I. -I.. -I./../include -I/usr/include -Wall -Wno-pointer-sign -Wpointer-arith -O2 -fwrapv -pipe -Wformat -Werror=format-security -gdwarf-4 -fno-debug-types-section -fvar-tracking-assignments -g2 -Wp,-D_FORTIFY_SOURCE=2 -fstack-protector-strong --param=ssp-buffer-size=4 -Werror=trampolines -fPIC -mtune=generic -march=x86-64 -gdwarf-4 -fno-debug-types-section -fvar-tracking-assignments -g2 -MT scute_la-p11-encryptfinal.lo -MD -MP -MF .deps/scute_la-p11-encryptfinal.Tpo -c -o scute_la-p11-encryptfinal.lo `test -f 'p11-encryptfinal.c' || echo './'`p11-encryptfinal.c libtool: compile: x86_64-pld-linux-gnux32-gcc -DHAVE_CONFIG_H -I. -I.. -I./../include -I/usr/include -Wall -Wno-pointer-sign -Wpointer-arith -O2 -fwrapv -pipe -Wformat -Werror=format-security -gdwarf-4 -fno-debug-types-section -fvar-tracking-assignments -g2 -Wp,-D_FORTIFY_SOURCE=2 -fstack-protector-strong --param=ssp-buffer-size=4 -Werror=trampolines -fPIC -mtune=generic -march=x86-64 -gdwarf-4 -fno-debug-types-section -fvar-tracking-assignments -g2 -MT scute_la-p11-encryptfinal.lo -MD -MP -MF .deps/scute_la-p11-encryptfinal.Tpo -c p11-encryptfinal.c -fPIC -DPIC -o .libs/scute_la-p11-encryptfinal.o mv -f .deps/scute_la-p11-encryptfinal.Tpo .deps/scute_la-p11-encryptfinal.Plo make[2]: Leaving directory '/tmp/B.yS_Etj/BUILD/scute-1.7.0/src' make[2]: Entering directory '/tmp/B.yS_Etj/BUILD/scute-1.7.0/src' /bin/sh ../libtool --tag=CC --mode=compile x86_64-pld-linux-gnux32-gcc -DHAVE_CONFIG_H -I. -I.. -I./../include -I/usr/include -Wall -Wno-pointer-sign -Wpointer-arith -O2 -fwrapv -pipe -Wformat -Werror=format-security -gdwarf-4 -fno-debug-types-section -fvar-tracking-assignments -g2 -Wp,-D_FORTIFY_SOURCE=2 -fstack-protector-strong --param=ssp-buffer-size=4 -Werror=trampolines -fPIC -mtune=generic -march=x86-64 -gdwarf-4 -fno-debug-types-section -fvar-tracking-assignments -g2 -MT scute_la-p11-encryptinit.lo -MD -MP -MF .deps/scute_la-p11-encryptinit.Tpo -c -o scute_la-p11-encryptinit.lo `test -f 'p11-encryptinit.c' || echo './'`p11-encryptinit.c libtool: compile: x86_64-pld-linux-gnux32-gcc -DHAVE_CONFIG_H -I. -I.. -I./../include -I/usr/include -Wall -Wno-pointer-sign -Wpointer-arith -O2 -fwrapv -pipe -Wformat -Werror=format-security -gdwarf-4 -fno-debug-types-section -fvar-tracking-assignments -g2 -Wp,-D_FORTIFY_SOURCE=2 -fstack-protector-strong --param=ssp-buffer-size=4 -Werror=trampolines -fPIC -mtune=generic -march=x86-64 -gdwarf-4 -fno-debug-types-section -fvar-tracking-assignments -g2 -MT scute_la-p11-encryptinit.lo -MD -MP -MF .deps/scute_la-p11-encryptinit.Tpo -c p11-encryptinit.c -fPIC -DPIC -o .libs/scute_la-p11-encryptinit.o mv -f .deps/scute_la-p11-encryptinit.Tpo .deps/scute_la-p11-encryptinit.Plo make[2]: Leaving directory '/tmp/B.yS_Etj/BUILD/scute-1.7.0/src' make[2]: Entering directory '/tmp/B.yS_Etj/BUILD/scute-1.7.0/src' /bin/sh ../libtool --tag=CC --mode=compile x86_64-pld-linux-gnux32-gcc -DHAVE_CONFIG_H -I. -I.. -I./../include -I/usr/include -Wall -Wno-pointer-sign -Wpointer-arith -O2 -fwrapv -pipe -Wformat -Werror=format-security -gdwarf-4 -fno-debug-types-section -fvar-tracking-assignments -g2 -Wp,-D_FORTIFY_SOURCE=2 -fstack-protector-strong --param=ssp-buffer-size=4 -Werror=trampolines -fPIC -mtune=generic -march=x86-64 -gdwarf-4 -fno-debug-types-section -fvar-tracking-assignments -g2 -MT scute_la-p11-encryptupdate.lo -MD -MP -MF .deps/scute_la-p11-encryptupdate.Tpo -c -o scute_la-p11-encryptupdate.lo `test -f 'p11-encryptupdate.c' || echo './'`p11-encryptupdate.c libtool: compile: x86_64-pld-linux-gnux32-gcc -DHAVE_CONFIG_H -I. -I.. -I./../include -I/usr/include -Wall -Wno-pointer-sign -Wpointer-arith -O2 -fwrapv -pipe -Wformat -Werror=format-security -gdwarf-4 -fno-debug-types-section -fvar-tracking-assignments -g2 -Wp,-D_FORTIFY_SOURCE=2 -fstack-protector-strong --param=ssp-buffer-size=4 -Werror=trampolines -fPIC -mtune=generic -march=x86-64 -gdwarf-4 -fno-debug-types-section -fvar-tracking-assignments -g2 -MT scute_la-p11-encryptupdate.lo -MD -MP -MF .deps/scute_la-p11-encryptupdate.Tpo -c p11-encryptupdate.c -fPIC -DPIC -o .libs/scute_la-p11-encryptupdate.o mv -f .deps/scute_la-p11-encryptupdate.Tpo .deps/scute_la-p11-encryptupdate.Plo make[2]: Leaving directory '/tmp/B.yS_Etj/BUILD/scute-1.7.0/src' make[2]: Entering directory '/tmp/B.yS_Etj/BUILD/scute-1.7.0/src' /bin/sh ../libtool --tag=CC --mode=compile x86_64-pld-linux-gnux32-gcc -DHAVE_CONFIG_H -I. -I.. -I./../include -I/usr/include -Wall -Wno-pointer-sign -Wpointer-arith -O2 -fwrapv -pipe -Wformat -Werror=format-security -gdwarf-4 -fno-debug-types-section -fvar-tracking-assignments -g2 -Wp,-D_FORTIFY_SOURCE=2 -fstack-protector-strong --param=ssp-buffer-size=4 -Werror=trampolines -fPIC -mtune=generic -march=x86-64 -gdwarf-4 -fno-debug-types-section -fvar-tracking-assignments -g2 -MT scute_la-p11-finalize.lo -MD -MP -MF .deps/scute_la-p11-finalize.Tpo -c -o scute_la-p11-finalize.lo `test -f 'p11-finalize.c' || echo './'`p11-finalize.c libtool: compile: x86_64-pld-linux-gnux32-gcc -DHAVE_CONFIG_H -I. -I.. -I./../include -I/usr/include -Wall -Wno-pointer-sign -Wpointer-arith -O2 -fwrapv -pipe -Wformat -Werror=format-security -gdwarf-4 -fno-debug-types-section -fvar-tracking-assignments -g2 -Wp,-D_FORTIFY_SOURCE=2 -fstack-protector-strong --param=ssp-buffer-size=4 -Werror=trampolines -fPIC -mtune=generic -march=x86-64 -gdwarf-4 -fno-debug-types-section -fvar-tracking-assignments -g2 -MT scute_la-p11-finalize.lo -MD -MP -MF .deps/scute_la-p11-finalize.Tpo -c p11-finalize.c -fPIC -DPIC -o .libs/scute_la-p11-finalize.o mv -f .deps/scute_la-p11-finalize.Tpo .deps/scute_la-p11-finalize.Plo make[2]: Leaving directory '/tmp/B.yS_Etj/BUILD/scute-1.7.0/src' make[2]: Entering directory '/tmp/B.yS_Etj/BUILD/scute-1.7.0/src' /bin/sh ../libtool --tag=CC --mode=compile x86_64-pld-linux-gnux32-gcc -DHAVE_CONFIG_H -I. -I.. -I./../include -I/usr/include -Wall -Wno-pointer-sign -Wpointer-arith -O2 -fwrapv -pipe -Wformat -Werror=format-security -gdwarf-4 -fno-debug-types-section -fvar-tracking-assignments -g2 -Wp,-D_FORTIFY_SOURCE=2 -fstack-protector-strong --param=ssp-buffer-size=4 -Werror=trampolines -fPIC -mtune=generic -march=x86-64 -gdwarf-4 -fno-debug-types-section -fvar-tracking-assignments -g2 -MT scute_la-p11-findobjectsfinal.lo -MD -MP -MF .deps/scute_la-p11-findobjectsfinal.Tpo -c -o scute_la-p11-findobjectsfinal.lo `test -f 'p11-findobjectsfinal.c' || echo './'`p11-findobjectsfinal.c libtool: compile: x86_64-pld-linux-gnux32-gcc -DHAVE_CONFIG_H -I. -I.. -I./../include -I/usr/include -Wall -Wno-pointer-sign -Wpointer-arith -O2 -fwrapv -pipe -Wformat -Werror=format-security -gdwarf-4 -fno-debug-types-section -fvar-tracking-assignments -g2 -Wp,-D_FORTIFY_SOURCE=2 -fstack-protector-strong --param=ssp-buffer-size=4 -Werror=trampolines -fPIC -mtune=generic -march=x86-64 -gdwarf-4 -fno-debug-types-section -fvar-tracking-assignments -g2 -MT scute_la-p11-findobjectsfinal.lo -MD -MP -MF .deps/scute_la-p11-findobjectsfinal.Tpo -c p11-findobjectsfinal.c -fPIC -DPIC -o .libs/scute_la-p11-findobjectsfinal.o mv -f .deps/scute_la-p11-findobjectsfinal.Tpo .deps/scute_la-p11-findobjectsfinal.Plo make[2]: Leaving directory '/tmp/B.yS_Etj/BUILD/scute-1.7.0/src' make[2]: Entering directory '/tmp/B.yS_Etj/BUILD/scute-1.7.0/src' /bin/sh ../libtool --tag=CC --mode=compile x86_64-pld-linux-gnux32-gcc -DHAVE_CONFIG_H -I. -I.. -I./../include -I/usr/include -Wall -Wno-pointer-sign -Wpointer-arith -O2 -fwrapv -pipe -Wformat -Werror=format-security -gdwarf-4 -fno-debug-types-section -fvar-tracking-assignments -g2 -Wp,-D_FORTIFY_SOURCE=2 -fstack-protector-strong --param=ssp-buffer-size=4 -Werror=trampolines -fPIC -mtune=generic -march=x86-64 -gdwarf-4 -fno-debug-types-section -fvar-tracking-assignments -g2 -MT scute_la-p11-generatekey.lo -MD -MP -MF .deps/scute_la-p11-generatekey.Tpo -c -o scute_la-p11-generatekey.lo `test -f 'p11-generatekey.c' || echo './'`p11-generatekey.c libtool: compile: x86_64-pld-linux-gnux32-gcc -DHAVE_CONFIG_H -I. -I.. -I./../include -I/usr/include -Wall -Wno-pointer-sign -Wpointer-arith -O2 -fwrapv -pipe -Wformat -Werror=format-security -gdwarf-4 -fno-debug-types-section -fvar-tracking-assignments -g2 -Wp,-D_FORTIFY_SOURCE=2 -fstack-protector-strong --param=ssp-buffer-size=4 -Werror=trampolines -fPIC -mtune=generic -march=x86-64 -gdwarf-4 -fno-debug-types-section -fvar-tracking-assignments -g2 -MT scute_la-p11-generatekey.lo -MD -MP -MF .deps/scute_la-p11-generatekey.Tpo -c p11-generatekey.c -fPIC -DPIC -o .libs/scute_la-p11-generatekey.o mv -f .deps/scute_la-p11-generatekey.Tpo .deps/scute_la-p11-generatekey.Plo make[2]: Leaving directory '/tmp/B.yS_Etj/BUILD/scute-1.7.0/src' make[2]: Entering directory '/tmp/B.yS_Etj/BUILD/scute-1.7.0/src' /bin/sh ../libtool --tag=CC --mode=compile x86_64-pld-linux-gnux32-gcc -DHAVE_CONFIG_H -I. -I.. -I./../include -I/usr/include -Wall -Wno-pointer-sign -Wpointer-arith -O2 -fwrapv -pipe -Wformat -Werror=format-security -gdwarf-4 -fno-debug-types-section -fvar-tracking-assignments -g2 -Wp,-D_FORTIFY_SOURCE=2 -fstack-protector-strong --param=ssp-buffer-size=4 -Werror=trampolines -fPIC -mtune=generic -march=x86-64 -gdwarf-4 -fno-debug-types-section -fvar-tracking-assignments -g2 -MT scute_la-p11-findobjects.lo -MD -MP -MF .deps/scute_la-p11-findobjects.Tpo -c -o scute_la-p11-findobjects.lo `test -f 'p11-findobjects.c' || echo './'`p11-findobjects.c libtool: compile: x86_64-pld-linux-gnux32-gcc -DHAVE_CONFIG_H -I. -I.. -I./../include -I/usr/include -Wall -Wno-pointer-sign -Wpointer-arith -O2 -fwrapv -pipe -Wformat -Werror=format-security -gdwarf-4 -fno-debug-types-section -fvar-tracking-assignments -g2 -Wp,-D_FORTIFY_SOURCE=2 -fstack-protector-strong --param=ssp-buffer-size=4 -Werror=trampolines -fPIC -mtune=generic -march=x86-64 -gdwarf-4 -fno-debug-types-section -fvar-tracking-assignments -g2 -MT scute_la-p11-findobjects.lo -MD -MP -MF .deps/scute_la-p11-findobjects.Tpo -c p11-findobjects.c -fPIC -DPIC -o .libs/scute_la-p11-findobjects.o mv -f .deps/scute_la-p11-findobjects.Tpo .deps/scute_la-p11-findobjects.Plo make[2]: Leaving directory '/tmp/B.yS_Etj/BUILD/scute-1.7.0/src' make[2]: Entering directory '/tmp/B.yS_Etj/BUILD/scute-1.7.0/src' /bin/sh ../libtool --tag=CC --mode=compile x86_64-pld-linux-gnux32-gcc -DHAVE_CONFIG_H -I. -I.. -I./../include -I/usr/include -Wall -Wno-pointer-sign -Wpointer-arith -O2 -fwrapv -pipe -Wformat -Werror=format-security -gdwarf-4 -fno-debug-types-section -fvar-tracking-assignments -g2 -Wp,-D_FORTIFY_SOURCE=2 -fstack-protector-strong --param=ssp-buffer-size=4 -Werror=trampolines -fPIC -mtune=generic -march=x86-64 -gdwarf-4 -fno-debug-types-section -fvar-tracking-assignments -g2 -MT scute_la-agent.lo -MD -MP -MF .deps/scute_la-agent.Tpo -c -o scute_la-agent.lo `test -f 'agent.c' || echo './'`agent.c libtool: compile: x86_64-pld-linux-gnux32-gcc -DHAVE_CONFIG_H -I. -I.. -I./../include -I/usr/include -Wall -Wno-pointer-sign -Wpointer-arith -O2 -fwrapv -pipe -Wformat -Werror=format-security -gdwarf-4 -fno-debug-types-section -fvar-tracking-assignments -g2 -Wp,-D_FORTIFY_SOURCE=2 -fstack-protector-strong --param=ssp-buffer-size=4 -Werror=trampolines -fPIC -mtune=generic -march=x86-64 -gdwarf-4 -fno-debug-types-section -fvar-tracking-assignments -g2 -MT scute_la-agent.lo -MD -MP -MF .deps/scute_la-agent.Tpo -c agent.c -fPIC -DPIC -o .libs/scute_la-agent.o mv -f .deps/scute_la-agent.Tpo .deps/scute_la-agent.Plo make[2]: Leaving directory '/tmp/B.yS_Etj/BUILD/scute-1.7.0/src' make[2]: Entering directory '/tmp/B.yS_Etj/BUILD/scute-1.7.0/src' /bin/sh ../libtool --tag=CC --mode=compile x86_64-pld-linux-gnux32-gcc -DHAVE_CONFIG_H -I. -I.. -I./../include -I/usr/include -Wall -Wno-pointer-sign -Wpointer-arith -O2 -fwrapv -pipe -Wformat -Werror=format-security -gdwarf-4 -fno-debug-types-section -fvar-tracking-assignments -g2 -Wp,-D_FORTIFY_SOURCE=2 -fstack-protector-strong --param=ssp-buffer-size=4 -Werror=trampolines -fPIC -mtune=generic -march=x86-64 -gdwarf-4 -fno-debug-types-section -fvar-tracking-assignments -g2 -MT scute_la-p11-generatekeypair.lo -MD -MP -MF .deps/scute_la-p11-generatekeypair.Tpo -c -o scute_la-p11-generatekeypair.lo `test -f 'p11-generatekeypair.c' || echo './'`p11-generatekeypair.c libtool: compile: x86_64-pld-linux-gnux32-gcc -DHAVE_CONFIG_H -I. -I.. -I./../include -I/usr/include -Wall -Wno-pointer-sign -Wpointer-arith -O2 -fwrapv -pipe -Wformat -Werror=format-security -gdwarf-4 -fno-debug-types-section -fvar-tracking-assignments -g2 -Wp,-D_FORTIFY_SOURCE=2 -fstack-protector-strong --param=ssp-buffer-size=4 -Werror=trampolines -fPIC -mtune=generic -march=x86-64 -gdwarf-4 -fno-debug-types-section -fvar-tracking-assignments -g2 -MT scute_la-p11-generatekeypair.lo -MD -MP -MF .deps/scute_la-p11-generatekeypair.Tpo -c p11-generatekeypair.c -fPIC -DPIC -o .libs/scute_la-p11-generatekeypair.o mv -f .deps/scute_la-p11-generatekeypair.Tpo .deps/scute_la-p11-generatekeypair.Plo make[2]: Leaving directory '/tmp/B.yS_Etj/BUILD/scute-1.7.0/src' make[2]: Entering directory '/tmp/B.yS_Etj/BUILD/scute-1.7.0/src' /bin/sh ../libtool --tag=CC --mode=compile x86_64-pld-linux-gnux32-gcc -DHAVE_CONFIG_H -I. -I.. -I./../include -I/usr/include -Wall -Wno-pointer-sign -Wpointer-arith -O2 -fwrapv -pipe -Wformat -Werror=format-security -gdwarf-4 -fno-debug-types-section -fvar-tracking-assignments -g2 -Wp,-D_FORTIFY_SOURCE=2 -fstack-protector-strong --param=ssp-buffer-size=4 -Werror=trampolines -fPIC -mtune=generic -march=x86-64 -gdwarf-4 -fno-debug-types-section -fvar-tracking-assignments -g2 -MT scute_la-p11-findobjectsinit.lo -MD -MP -MF .deps/scute_la-p11-findobjectsinit.Tpo -c -o scute_la-p11-findobjectsinit.lo `test -f 'p11-findobjectsinit.c' || echo './'`p11-findobjectsinit.c libtool: compile: x86_64-pld-linux-gnux32-gcc -DHAVE_CONFIG_H -I. -I.. -I./../include -I/usr/include -Wall -Wno-pointer-sign -Wpointer-arith -O2 -fwrapv -pipe -Wformat -Werror=format-security -gdwarf-4 -fno-debug-types-section -fvar-tracking-assignments -g2 -Wp,-D_FORTIFY_SOURCE=2 -fstack-protector-strong --param=ssp-buffer-size=4 -Werror=trampolines -fPIC -mtune=generic -march=x86-64 -gdwarf-4 -fno-debug-types-section -fvar-tracking-assignments -g2 -MT scute_la-p11-findobjectsinit.lo -MD -MP -MF .deps/scute_la-p11-findobjectsinit.Tpo -c p11-findobjectsinit.c -fPIC -DPIC -o .libs/scute_la-p11-findobjectsinit.o mv -f .deps/scute_la-p11-findobjectsinit.Tpo .deps/scute_la-p11-findobjectsinit.Plo make[2]: Leaving directory '/tmp/B.yS_Etj/BUILD/scute-1.7.0/src' make[2]: Entering directory '/tmp/B.yS_Etj/BUILD/scute-1.7.0/src' /bin/sh ../libtool --tag=CC --mode=compile x86_64-pld-linux-gnux32-gcc -DHAVE_CONFIG_H -I. -I.. -I./../include -I/usr/include -Wall -Wno-pointer-sign -Wpointer-arith -O2 -fwrapv -pipe -Wformat -Werror=format-security -gdwarf-4 -fno-debug-types-section -fvar-tracking-assignments -g2 -Wp,-D_FORTIFY_SOURCE=2 -fstack-protector-strong --param=ssp-buffer-size=4 -Werror=trampolines -fPIC -mtune=generic -march=x86-64 -gdwarf-4 -fno-debug-types-section -fvar-tracking-assignments -g2 -MT scute_la-p11-getattributevalue.lo -MD -MP -MF .deps/scute_la-p11-getattributevalue.Tpo -c -o scute_la-p11-getattributevalue.lo `test -f 'p11-getattributevalue.c' || echo './'`p11-getattributevalue.c libtool: compile: x86_64-pld-linux-gnux32-gcc -DHAVE_CONFIG_H -I. -I.. -I./../include -I/usr/include -Wall -Wno-pointer-sign -Wpointer-arith -O2 -fwrapv -pipe -Wformat -Werror=format-security -gdwarf-4 -fno-debug-types-section -fvar-tracking-assignments -g2 -Wp,-D_FORTIFY_SOURCE=2 -fstack-protector-strong --param=ssp-buffer-size=4 -Werror=trampolines -fPIC -mtune=generic -march=x86-64 -gdwarf-4 -fno-debug-types-section -fvar-tracking-assignments -g2 -MT scute_la-p11-getattributevalue.lo -MD -MP -MF .deps/scute_la-p11-getattributevalue.Tpo -c p11-getattributevalue.c -fPIC -DPIC -o .libs/scute_la-p11-getattributevalue.o mv -f .deps/scute_la-p11-getattributevalue.Tpo .deps/scute_la-p11-getattributevalue.Plo make[2]: Leaving directory '/tmp/B.yS_Etj/BUILD/scute-1.7.0/src' make[2]: Entering directory '/tmp/B.yS_Etj/BUILD/scute-1.7.0/src' /bin/sh ../libtool --tag=CC --mode=compile x86_64-pld-linux-gnux32-gcc -DHAVE_CONFIG_H -I. -I.. -I./../include -I/usr/include -Wall -Wno-pointer-sign -Wpointer-arith -O2 -fwrapv -pipe -Wformat -Werror=format-security -gdwarf-4 -fno-debug-types-section -fvar-tracking-assignments -g2 -Wp,-D_FORTIFY_SOURCE=2 -fstack-protector-strong --param=ssp-buffer-size=4 -Werror=trampolines -fPIC -mtune=generic -march=x86-64 -gdwarf-4 -fno-debug-types-section -fvar-tracking-assignments -g2 -MT scute_la-p11-getfunctionlist.lo -MD -MP -MF .deps/scute_la-p11-getfunctionlist.Tpo -c -o scute_la-p11-getfunctionlist.lo `test -f 'p11-getfunctionlist.c' || echo './'`p11-getfunctionlist.c libtool: compile: x86_64-pld-linux-gnux32-gcc -DHAVE_CONFIG_H -I. -I.. -I./../include -I/usr/include -Wall -Wno-pointer-sign -Wpointer-arith -O2 -fwrapv -pipe -Wformat -Werror=format-security -gdwarf-4 -fno-debug-types-section -fvar-tracking-assignments -g2 -Wp,-D_FORTIFY_SOURCE=2 -fstack-protector-strong --param=ssp-buffer-size=4 -Werror=trampolines -fPIC -mtune=generic -march=x86-64 -gdwarf-4 -fno-debug-types-section -fvar-tracking-assignments -g2 -MT scute_la-p11-getfunctionlist.lo -MD -MP -MF .deps/scute_la-p11-getfunctionlist.Tpo -c p11-getfunctionlist.c -fPIC -DPIC -o .libs/scute_la-p11-getfunctionlist.o mv -f .deps/scute_la-p11-getfunctionlist.Tpo .deps/scute_la-p11-getfunctionlist.Plo make[2]: Leaving directory '/tmp/B.yS_Etj/BUILD/scute-1.7.0/src' make[2]: Entering directory '/tmp/B.yS_Etj/BUILD/scute-1.7.0/src' /bin/sh ../libtool --tag=CC --mode=compile x86_64-pld-linux-gnux32-gcc -DHAVE_CONFIG_H -I. -I.. -I./../include -I/usr/include -Wall -Wno-pointer-sign -Wpointer-arith -O2 -fwrapv -pipe -Wformat -Werror=format-security -gdwarf-4 -fno-debug-types-section -fvar-tracking-assignments -g2 -Wp,-D_FORTIFY_SOURCE=2 -fstack-protector-strong --param=ssp-buffer-size=4 -Werror=trampolines -fPIC -mtune=generic -march=x86-64 -gdwarf-4 -fno-debug-types-section -fvar-tracking-assignments -g2 -MT scute_la-p11-getfunctionstatus.lo -MD -MP -MF .deps/scute_la-p11-getfunctionstatus.Tpo -c -o scute_la-p11-getfunctionstatus.lo `test -f 'p11-getfunctionstatus.c' || echo './'`p11-getfunctionstatus.c libtool: compile: x86_64-pld-linux-gnux32-gcc -DHAVE_CONFIG_H -I. -I.. -I./../include -I/usr/include -Wall -Wno-pointer-sign -Wpointer-arith -O2 -fwrapv -pipe -Wformat -Werror=format-security -gdwarf-4 -fno-debug-types-section -fvar-tracking-assignments -g2 -Wp,-D_FORTIFY_SOURCE=2 -fstack-protector-strong --param=ssp-buffer-size=4 -Werror=trampolines -fPIC -mtune=generic -march=x86-64 -gdwarf-4 -fno-debug-types-section -fvar-tracking-assignments -g2 -MT scute_la-p11-getfunctionstatus.lo -MD -MP -MF .deps/scute_la-p11-getfunctionstatus.Tpo -c p11-getfunctionstatus.c -fPIC -DPIC -o .libs/scute_la-p11-getfunctionstatus.o mv -f .deps/scute_la-p11-getfunctionstatus.Tpo .deps/scute_la-p11-getfunctionstatus.Plo make[2]: Leaving directory '/tmp/B.yS_Etj/BUILD/scute-1.7.0/src' make[2]: Entering directory '/tmp/B.yS_Etj/BUILD/scute-1.7.0/src' /bin/sh ../libtool --tag=CC --mode=compile x86_64-pld-linux-gnux32-gcc -DHAVE_CONFIG_H -I. -I.. -I./../include -I/usr/include -Wall -Wno-pointer-sign -Wpointer-arith -O2 -fwrapv -pipe -Wformat -Werror=format-security -gdwarf-4 -fno-debug-types-section -fvar-tracking-assignments -g2 -Wp,-D_FORTIFY_SOURCE=2 -fstack-protector-strong --param=ssp-buffer-size=4 -Werror=trampolines -fPIC -mtune=generic -march=x86-64 -gdwarf-4 -fno-debug-types-section -fvar-tracking-assignments -g2 -MT scute_la-p11-getobjectsize.lo -MD -MP -MF .deps/scute_la-p11-getobjectsize.Tpo -c -o scute_la-p11-getobjectsize.lo `test -f 'p11-getobjectsize.c' || echo './'`p11-getobjectsize.c libtool: compile: x86_64-pld-linux-gnux32-gcc -DHAVE_CONFIG_H -I. -I.. -I./../include -I/usr/include -Wall -Wno-pointer-sign -Wpointer-arith -O2 -fwrapv -pipe -Wformat -Werror=format-security -gdwarf-4 -fno-debug-types-section -fvar-tracking-assignments -g2 -Wp,-D_FORTIFY_SOURCE=2 -fstack-protector-strong --param=ssp-buffer-size=4 -Werror=trampolines -fPIC -mtune=generic -march=x86-64 -gdwarf-4 -fno-debug-types-section -fvar-tracking-assignments -g2 -MT scute_la-p11-getobjectsize.lo -MD -MP -MF .deps/scute_la-p11-getobjectsize.Tpo -c p11-getobjectsize.c -fPIC -DPIC -o .libs/scute_la-p11-getobjectsize.o mv -f .deps/scute_la-p11-getobjectsize.Tpo .deps/scute_la-p11-getobjectsize.Plo make[2]: Leaving directory '/tmp/B.yS_Etj/BUILD/scute-1.7.0/src' make[2]: Entering directory '/tmp/B.yS_Etj/BUILD/scute-1.7.0/src' /bin/sh ../libtool --tag=CC --mode=compile x86_64-pld-linux-gnux32-gcc -DHAVE_CONFIG_H -I. -I.. -I./../include -I/usr/include -Wall -Wno-pointer-sign -Wpointer-arith -O2 -fwrapv -pipe -Wformat -Werror=format-security -gdwarf-4 -fno-debug-types-section -fvar-tracking-assignments -g2 -Wp,-D_FORTIFY_SOURCE=2 -fstack-protector-strong --param=ssp-buffer-size=4 -Werror=trampolines -fPIC -mtune=generic -march=x86-64 -gdwarf-4 -fno-debug-types-section -fvar-tracking-assignments -g2 -MT scute_la-p11-generaterandom.lo -MD -MP -MF .deps/scute_la-p11-generaterandom.Tpo -c -o scute_la-p11-generaterandom.lo `test -f 'p11-generaterandom.c' || echo './'`p11-generaterandom.c libtool: compile: x86_64-pld-linux-gnux32-gcc -DHAVE_CONFIG_H -I. -I.. -I./../include -I/usr/include -Wall -Wno-pointer-sign -Wpointer-arith -O2 -fwrapv -pipe -Wformat -Werror=format-security -gdwarf-4 -fno-debug-types-section -fvar-tracking-assignments -g2 -Wp,-D_FORTIFY_SOURCE=2 -fstack-protector-strong --param=ssp-buffer-size=4 -Werror=trampolines -fPIC -mtune=generic -march=x86-64 -gdwarf-4 -fno-debug-types-section -fvar-tracking-assignments -g2 -MT scute_la-p11-generaterandom.lo -MD -MP -MF .deps/scute_la-p11-generaterandom.Tpo -c p11-generaterandom.c -fPIC -DPIC -o .libs/scute_la-p11-generaterandom.o mv -f .deps/scute_la-p11-generaterandom.Tpo .deps/scute_la-p11-generaterandom.Plo make[2]: Leaving directory '/tmp/B.yS_Etj/BUILD/scute-1.7.0/src' make[2]: Entering directory '/tmp/B.yS_Etj/BUILD/scute-1.7.0/src' /bin/sh ../libtool --tag=CC --mode=compile x86_64-pld-linux-gnux32-gcc -DHAVE_CONFIG_H -I. -I.. -I./../include -I/usr/include -Wall -Wno-pointer-sign -Wpointer-arith -O2 -fwrapv -pipe -Wformat -Werror=format-security -gdwarf-4 -fno-debug-types-section -fvar-tracking-assignments -g2 -Wp,-D_FORTIFY_SOURCE=2 -fstack-protector-strong --param=ssp-buffer-size=4 -Werror=trampolines -fPIC -mtune=generic -march=x86-64 -gdwarf-4 -fno-debug-types-section -fvar-tracking-assignments -g2 -MT scute_la-p11-getmechanisminfo.lo -MD -MP -MF .deps/scute_la-p11-getmechanisminfo.Tpo -c -o scute_la-p11-getmechanisminfo.lo `test -f 'p11-getmechanisminfo.c' || echo './'`p11-getmechanisminfo.c libtool: compile: x86_64-pld-linux-gnux32-gcc -DHAVE_CONFIG_H -I. -I.. -I./../include -I/usr/include -Wall -Wno-pointer-sign -Wpointer-arith -O2 -fwrapv -pipe -Wformat -Werror=format-security -gdwarf-4 -fno-debug-types-section -fvar-tracking-assignments -g2 -Wp,-D_FORTIFY_SOURCE=2 -fstack-protector-strong --param=ssp-buffer-size=4 -Werror=trampolines -fPIC -mtune=generic -march=x86-64 -gdwarf-4 -fno-debug-types-section -fvar-tracking-assignments -g2 -MT scute_la-p11-getmechanisminfo.lo -MD -MP -MF .deps/scute_la-p11-getmechanisminfo.Tpo -c p11-getmechanisminfo.c -fPIC -DPIC -o .libs/scute_la-p11-getmechanisminfo.o mv -f .deps/scute_la-p11-getmechanisminfo.Tpo .deps/scute_la-p11-getmechanisminfo.Plo make[2]: Leaving directory '/tmp/B.yS_Etj/BUILD/scute-1.7.0/src' make[2]: Entering directory '/tmp/B.yS_Etj/BUILD/scute-1.7.0/src' /bin/sh ../libtool --tag=CC --mode=compile x86_64-pld-linux-gnux32-gcc -DHAVE_CONFIG_H -I. -I.. -I./../include -I/usr/include -Wall -Wno-pointer-sign -Wpointer-arith -O2 -fwrapv -pipe -Wformat -Werror=format-security -gdwarf-4 -fno-debug-types-section -fvar-tracking-assignments -g2 -Wp,-D_FORTIFY_SOURCE=2 -fstack-protector-strong --param=ssp-buffer-size=4 -Werror=trampolines -fPIC -mtune=generic -march=x86-64 -gdwarf-4 -fno-debug-types-section -fvar-tracking-assignments -g2 -MT scute_la-p11-getinfo.lo -MD -MP -MF .deps/scute_la-p11-getinfo.Tpo -c -o scute_la-p11-getinfo.lo `test -f 'p11-getinfo.c' || echo './'`p11-getinfo.c libtool: compile: x86_64-pld-linux-gnux32-gcc -DHAVE_CONFIG_H -I. -I.. -I./../include -I/usr/include -Wall -Wno-pointer-sign -Wpointer-arith -O2 -fwrapv -pipe -Wformat -Werror=format-security -gdwarf-4 -fno-debug-types-section -fvar-tracking-assignments -g2 -Wp,-D_FORTIFY_SOURCE=2 -fstack-protector-strong --param=ssp-buffer-size=4 -Werror=trampolines -fPIC -mtune=generic -march=x86-64 -gdwarf-4 -fno-debug-types-section -fvar-tracking-assignments -g2 -MT scute_la-p11-getinfo.lo -MD -MP -MF .deps/scute_la-p11-getinfo.Tpo -c p11-getinfo.c -fPIC -DPIC -o .libs/scute_la-p11-getinfo.o mv -f .deps/scute_la-p11-getinfo.Tpo .deps/scute_la-p11-getinfo.Plo make[2]: Leaving directory '/tmp/B.yS_Etj/BUILD/scute-1.7.0/src' make[2]: Entering directory '/tmp/B.yS_Etj/BUILD/scute-1.7.0/src' /bin/sh ../libtool --tag=CC --mode=compile x86_64-pld-linux-gnux32-gcc -DHAVE_CONFIG_H -I. -I.. -I./../include -I/usr/include -Wall -Wno-pointer-sign -Wpointer-arith -O2 -fwrapv -pipe -Wformat -Werror=format-security -gdwarf-4 -fno-debug-types-section -fvar-tracking-assignments -g2 -Wp,-D_FORTIFY_SOURCE=2 -fstack-protector-strong --param=ssp-buffer-size=4 -Werror=trampolines -fPIC -mtune=generic -march=x86-64 -gdwarf-4 -fno-debug-types-section -fvar-tracking-assignments -g2 -MT scute_la-p11-getmechanismlist.lo -MD -MP -MF .deps/scute_la-p11-getmechanismlist.Tpo -c -o scute_la-p11-getmechanismlist.lo `test -f 'p11-getmechanismlist.c' || echo './'`p11-getmechanismlist.c libtool: compile: x86_64-pld-linux-gnux32-gcc -DHAVE_CONFIG_H -I. -I.. -I./../include -I/usr/include -Wall -Wno-pointer-sign -Wpointer-arith -O2 -fwrapv -pipe -Wformat -Werror=format-security -gdwarf-4 -fno-debug-types-section -fvar-tracking-assignments -g2 -Wp,-D_FORTIFY_SOURCE=2 -fstack-protector-strong --param=ssp-buffer-size=4 -Werror=trampolines -fPIC -mtune=generic -march=x86-64 -gdwarf-4 -fno-debug-types-section -fvar-tracking-assignments -g2 -MT scute_la-p11-getmechanismlist.lo -MD -MP -MF .deps/scute_la-p11-getmechanismlist.Tpo -c p11-getmechanismlist.c -fPIC -DPIC -o .libs/scute_la-p11-getmechanismlist.o mv -f .deps/scute_la-p11-getmechanismlist.Tpo .deps/scute_la-p11-getmechanismlist.Plo make[2]: Leaving directory '/tmp/B.yS_Etj/BUILD/scute-1.7.0/src' make[2]: Entering directory '/tmp/B.yS_Etj/BUILD/scute-1.7.0/src' /bin/sh ../libtool --tag=CC --mode=compile x86_64-pld-linux-gnux32-gcc -DHAVE_CONFIG_H -I. -I.. -I./../include -I/usr/include -Wall -Wno-pointer-sign -Wpointer-arith -O2 -fwrapv -pipe -Wformat -Werror=format-security -gdwarf-4 -fno-debug-types-section -fvar-tracking-assignments -g2 -Wp,-D_FORTIFY_SOURCE=2 -fstack-protector-strong --param=ssp-buffer-size=4 -Werror=trampolines -fPIC -mtune=generic -march=x86-64 -gdwarf-4 -fno-debug-types-section -fvar-tracking-assignments -g2 -MT scute_la-p11-getoperationstate.lo -MD -MP -MF .deps/scute_la-p11-getoperationstate.Tpo -c -o scute_la-p11-getoperationstate.lo `test -f 'p11-getoperationstate.c' || echo './'`p11-getoperationstate.c libtool: compile: x86_64-pld-linux-gnux32-gcc -DHAVE_CONFIG_H -I. -I.. -I./../include -I/usr/include -Wall -Wno-pointer-sign -Wpointer-arith -O2 -fwrapv -pipe -Wformat -Werror=format-security -gdwarf-4 -fno-debug-types-section -fvar-tracking-assignments -g2 -Wp,-D_FORTIFY_SOURCE=2 -fstack-protector-strong --param=ssp-buffer-size=4 -Werror=trampolines -fPIC -mtune=generic -march=x86-64 -gdwarf-4 -fno-debug-types-section -fvar-tracking-assignments -g2 -MT scute_la-p11-getoperationstate.lo -MD -MP -MF .deps/scute_la-p11-getoperationstate.Tpo -c p11-getoperationstate.c -fPIC -DPIC -o .libs/scute_la-p11-getoperationstate.o mv -f .deps/scute_la-p11-getoperationstate.Tpo .deps/scute_la-p11-getoperationstate.Plo make[2]: Leaving directory '/tmp/B.yS_Etj/BUILD/scute-1.7.0/src' make[2]: Entering directory '/tmp/B.yS_Etj/BUILD/scute-1.7.0/src' /bin/sh ../libtool --tag=CC --mode=compile x86_64-pld-linux-gnux32-gcc -DHAVE_CONFIG_H -I. -I.. -I./../include -I/usr/include -Wall -Wno-pointer-sign -Wpointer-arith -O2 -fwrapv -pipe -Wformat -Werror=format-security -gdwarf-4 -fno-debug-types-section -fvar-tracking-assignments -g2 -Wp,-D_FORTIFY_SOURCE=2 -fstack-protector-strong --param=ssp-buffer-size=4 -Werror=trampolines -fPIC -mtune=generic -march=x86-64 -gdwarf-4 -fno-debug-types-section -fvar-tracking-assignments -g2 -MT scute_la-p11-getslotlist.lo -MD -MP -MF .deps/scute_la-p11-getslotlist.Tpo -c -o scute_la-p11-getslotlist.lo `test -f 'p11-getslotlist.c' || echo './'`p11-getslotlist.c libtool: compile: x86_64-pld-linux-gnux32-gcc -DHAVE_CONFIG_H -I. -I.. -I./../include -I/usr/include -Wall -Wno-pointer-sign -Wpointer-arith -O2 -fwrapv -pipe -Wformat -Werror=format-security -gdwarf-4 -fno-debug-types-section -fvar-tracking-assignments -g2 -Wp,-D_FORTIFY_SOURCE=2 -fstack-protector-strong --param=ssp-buffer-size=4 -Werror=trampolines -fPIC -mtune=generic -march=x86-64 -gdwarf-4 -fno-debug-types-section -fvar-tracking-assignments -g2 -MT scute_la-p11-getslotlist.lo -MD -MP -MF .deps/scute_la-p11-getslotlist.Tpo -c p11-getslotlist.c -fPIC -DPIC -o .libs/scute_la-p11-getslotlist.o mv -f .deps/scute_la-p11-getslotlist.Tpo .deps/scute_la-p11-getslotlist.Plo make[2]: Leaving directory '/tmp/B.yS_Etj/BUILD/scute-1.7.0/src' make[2]: Entering directory '/tmp/B.yS_Etj/BUILD/scute-1.7.0/src' /bin/sh ../libtool --tag=CC --mode=compile x86_64-pld-linux-gnux32-gcc -DHAVE_CONFIG_H -I. -I.. -I./../include -I/usr/include -Wall -Wno-pointer-sign -Wpointer-arith -O2 -fwrapv -pipe -Wformat -Werror=format-security -gdwarf-4 -fno-debug-types-section -fvar-tracking-assignments -g2 -Wp,-D_FORTIFY_SOURCE=2 -fstack-protector-strong --param=ssp-buffer-size=4 -Werror=trampolines -fPIC -mtune=generic -march=x86-64 -gdwarf-4 -fno-debug-types-section -fvar-tracking-assignments -g2 -MT scute_la-p11-getsessioninfo.lo -MD -MP -MF .deps/scute_la-p11-getsessioninfo.Tpo -c -o scute_la-p11-getsessioninfo.lo `test -f 'p11-getsessioninfo.c' || echo './'`p11-getsessioninfo.c libtool: compile: x86_64-pld-linux-gnux32-gcc -DHAVE_CONFIG_H -I. -I.. -I./../include -I/usr/include -Wall -Wno-pointer-sign -Wpointer-arith -O2 -fwrapv -pipe -Wformat -Werror=format-security -gdwarf-4 -fno-debug-types-section -fvar-tracking-assignments -g2 -Wp,-D_FORTIFY_SOURCE=2 -fstack-protector-strong --param=ssp-buffer-size=4 -Werror=trampolines -fPIC -mtune=generic -march=x86-64 -gdwarf-4 -fno-debug-types-section -fvar-tracking-assignments -g2 -MT scute_la-p11-getsessioninfo.lo -MD -MP -MF .deps/scute_la-p11-getsessioninfo.Tpo -c p11-getsessioninfo.c -fPIC -DPIC -o .libs/scute_la-p11-getsessioninfo.o mv -f .deps/scute_la-p11-getsessioninfo.Tpo .deps/scute_la-p11-getsessioninfo.Plo make[2]: Leaving directory '/tmp/B.yS_Etj/BUILD/scute-1.7.0/src' make[2]: Entering directory '/tmp/B.yS_Etj/BUILD/scute-1.7.0/src' /bin/sh ../libtool --tag=CC --mode=compile x86_64-pld-linux-gnux32-gcc -DHAVE_CONFIG_H -I. -I.. -I./../include -I/usr/include -Wall -Wno-pointer-sign -Wpointer-arith -O2 -fwrapv -pipe -Wformat -Werror=format-security -gdwarf-4 -fno-debug-types-section -fvar-tracking-assignments -g2 -Wp,-D_FORTIFY_SOURCE=2 -fstack-protector-strong --param=ssp-buffer-size=4 -Werror=trampolines -fPIC -mtune=generic -march=x86-64 -gdwarf-4 -fno-debug-types-section -fvar-tracking-assignments -g2 -MT scute_la-p11-initpin.lo -MD -MP -MF .deps/scute_la-p11-initpin.Tpo -c -o scute_la-p11-initpin.lo `test -f 'p11-initpin.c' || echo './'`p11-initpin.c libtool: compile: x86_64-pld-linux-gnux32-gcc -DHAVE_CONFIG_H -I. -I.. -I./../include -I/usr/include -Wall -Wno-pointer-sign -Wpointer-arith -O2 -fwrapv -pipe -Wformat -Werror=format-security -gdwarf-4 -fno-debug-types-section -fvar-tracking-assignments -g2 -Wp,-D_FORTIFY_SOURCE=2 -fstack-protector-strong --param=ssp-buffer-size=4 -Werror=trampolines -fPIC -mtune=generic -march=x86-64 -gdwarf-4 -fno-debug-types-section -fvar-tracking-assignments -g2 -MT scute_la-p11-initpin.lo -MD -MP -MF .deps/scute_la-p11-initpin.Tpo -c p11-initpin.c -fPIC -DPIC -o .libs/scute_la-p11-initpin.o mv -f .deps/scute_la-p11-initpin.Tpo .deps/scute_la-p11-initpin.Plo make[2]: Leaving directory '/tmp/B.yS_Etj/BUILD/scute-1.7.0/src' make[2]: Entering directory '/tmp/B.yS_Etj/BUILD/scute-1.7.0/src' /bin/sh ../libtool --tag=CC --mode=compile x86_64-pld-linux-gnux32-gcc -DHAVE_CONFIG_H -I. -I.. -I./../include -I/usr/include -Wall -Wno-pointer-sign -Wpointer-arith -O2 -fwrapv -pipe -Wformat -Werror=format-security -gdwarf-4 -fno-debug-types-section -fvar-tracking-assignments -g2 -Wp,-D_FORTIFY_SOURCE=2 -fstack-protector-strong --param=ssp-buffer-size=4 -Werror=trampolines -fPIC -mtune=generic -march=x86-64 -gdwarf-4 -fno-debug-types-section -fvar-tracking-assignments -g2 -MT scute_la-p11-inittoken.lo -MD -MP -MF .deps/scute_la-p11-inittoken.Tpo -c -o scute_la-p11-inittoken.lo `test -f 'p11-inittoken.c' || echo './'`p11-inittoken.c libtool: compile: x86_64-pld-linux-gnux32-gcc -DHAVE_CONFIG_H -I. -I.. -I./../include -I/usr/include -Wall -Wno-pointer-sign -Wpointer-arith -O2 -fwrapv -pipe -Wformat -Werror=format-security -gdwarf-4 -fno-debug-types-section -fvar-tracking-assignments -g2 -Wp,-D_FORTIFY_SOURCE=2 -fstack-protector-strong --param=ssp-buffer-size=4 -Werror=trampolines -fPIC -mtune=generic -march=x86-64 -gdwarf-4 -fno-debug-types-section -fvar-tracking-assignments -g2 -MT scute_la-p11-inittoken.lo -MD -MP -MF .deps/scute_la-p11-inittoken.Tpo -c p11-inittoken.c -fPIC -DPIC -o .libs/scute_la-p11-inittoken.o mv -f .deps/scute_la-p11-inittoken.Tpo .deps/scute_la-p11-inittoken.Plo make[2]: Leaving directory '/tmp/B.yS_Etj/BUILD/scute-1.7.0/src' make[2]: Entering directory '/tmp/B.yS_Etj/BUILD/scute-1.7.0/src' /bin/sh ../libtool --tag=CC --mode=compile x86_64-pld-linux-gnux32-gcc -DHAVE_CONFIG_H -I. -I.. -I./../include -I/usr/include -Wall -Wno-pointer-sign -Wpointer-arith -O2 -fwrapv -pipe -Wformat -Werror=format-security -gdwarf-4 -fno-debug-types-section -fvar-tracking-assignments -g2 -Wp,-D_FORTIFY_SOURCE=2 -fstack-protector-strong --param=ssp-buffer-size=4 -Werror=trampolines -fPIC -mtune=generic -march=x86-64 -gdwarf-4 -fno-debug-types-section -fvar-tracking-assignments -g2 -MT scute_la-p11-logout.lo -MD -MP -MF .deps/scute_la-p11-logout.Tpo -c -o scute_la-p11-logout.lo `test -f 'p11-logout.c' || echo './'`p11-logout.c libtool: compile: x86_64-pld-linux-gnux32-gcc -DHAVE_CONFIG_H -I. -I.. -I./../include -I/usr/include -Wall -Wno-pointer-sign -Wpointer-arith -O2 -fwrapv -pipe -Wformat -Werror=format-security -gdwarf-4 -fno-debug-types-section -fvar-tracking-assignments -g2 -Wp,-D_FORTIFY_SOURCE=2 -fstack-protector-strong --param=ssp-buffer-size=4 -Werror=trampolines -fPIC -mtune=generic -march=x86-64 -gdwarf-4 -fno-debug-types-section -fvar-tracking-assignments -g2 -MT scute_la-p11-logout.lo -MD -MP -MF .deps/scute_la-p11-logout.Tpo -c p11-logout.c -fPIC -DPIC -o .libs/scute_la-p11-logout.o mv -f .deps/scute_la-p11-logout.Tpo .deps/scute_la-p11-logout.Plo make[2]: Leaving directory '/tmp/B.yS_Etj/BUILD/scute-1.7.0/src' make[2]: Entering directory '/tmp/B.yS_Etj/BUILD/scute-1.7.0/src' /bin/sh ../libtool --tag=CC --mode=compile x86_64-pld-linux-gnux32-gcc -DHAVE_CONFIG_H -I. -I.. -I./../include -I/usr/include -Wall -Wno-pointer-sign -Wpointer-arith -O2 -fwrapv -pipe -Wformat -Werror=format-security -gdwarf-4 -fno-debug-types-section -fvar-tracking-assignments -g2 -Wp,-D_FORTIFY_SOURCE=2 -fstack-protector-strong --param=ssp-buffer-size=4 -Werror=trampolines -fPIC -mtune=generic -march=x86-64 -gdwarf-4 -fno-debug-types-section -fvar-tracking-assignments -g2 -MT scute_la-p11-login.lo -MD -MP -MF .deps/scute_la-p11-login.Tpo -c -o scute_la-p11-login.lo `test -f 'p11-login.c' || echo './'`p11-login.c libtool: compile: x86_64-pld-linux-gnux32-gcc -DHAVE_CONFIG_H -I. -I.. -I./../include -I/usr/include -Wall -Wno-pointer-sign -Wpointer-arith -O2 -fwrapv -pipe -Wformat -Werror=format-security -gdwarf-4 -fno-debug-types-section -fvar-tracking-assignments -g2 -Wp,-D_FORTIFY_SOURCE=2 -fstack-protector-strong --param=ssp-buffer-size=4 -Werror=trampolines -fPIC -mtune=generic -march=x86-64 -gdwarf-4 -fno-debug-types-section -fvar-tracking-assignments -g2 -MT scute_la-p11-login.lo -MD -MP -MF .deps/scute_la-p11-login.Tpo -c p11-login.c -fPIC -DPIC -o .libs/scute_la-p11-login.o mv -f .deps/scute_la-p11-login.Tpo .deps/scute_la-p11-login.Plo make[2]: Leaving directory '/tmp/B.yS_Etj/BUILD/scute-1.7.0/src' make[2]: Entering directory '/tmp/B.yS_Etj/BUILD/scute-1.7.0/src' /bin/sh ../libtool --tag=CC --mode=compile x86_64-pld-linux-gnux32-gcc -DHAVE_CONFIG_H -I. -I.. -I./../include -I/usr/include -Wall -Wno-pointer-sign -Wpointer-arith -O2 -fwrapv -pipe -Wformat -Werror=format-security -gdwarf-4 -fno-debug-types-section -fvar-tracking-assignments -g2 -Wp,-D_FORTIFY_SOURCE=2 -fstack-protector-strong --param=ssp-buffer-size=4 -Werror=trampolines -fPIC -mtune=generic -march=x86-64 -gdwarf-4 -fno-debug-types-section -fvar-tracking-assignments -g2 -MT scute_la-p11-initialize.lo -MD -MP -MF .deps/scute_la-p11-initialize.Tpo -c -o scute_la-p11-initialize.lo `test -f 'p11-initialize.c' || echo './'`p11-initialize.c libtool: compile: x86_64-pld-linux-gnux32-gcc -DHAVE_CONFIG_H -I. -I.. -I./../include -I/usr/include -Wall -Wno-pointer-sign -Wpointer-arith -O2 -fwrapv -pipe -Wformat -Werror=format-security -gdwarf-4 -fno-debug-types-section -fvar-tracking-assignments -g2 -Wp,-D_FORTIFY_SOURCE=2 -fstack-protector-strong --param=ssp-buffer-size=4 -Werror=trampolines -fPIC -mtune=generic -march=x86-64 -gdwarf-4 -fno-debug-types-section -fvar-tracking-assignments -g2 -MT scute_la-p11-initialize.lo -MD -MP -MF .deps/scute_la-p11-initialize.Tpo -c p11-initialize.c -fPIC -DPIC -o .libs/scute_la-p11-initialize.o mv -f .deps/scute_la-p11-initialize.Tpo .deps/scute_la-p11-initialize.Plo make[2]: Leaving directory '/tmp/B.yS_Etj/BUILD/scute-1.7.0/src' make[2]: Entering directory '/tmp/B.yS_Etj/BUILD/scute-1.7.0/src' /bin/sh ../libtool --tag=CC --mode=compile x86_64-pld-linux-gnux32-gcc -DHAVE_CONFIG_H -I. -I.. -I./../include -I/usr/include -Wall -Wno-pointer-sign -Wpointer-arith -O2 -fwrapv -pipe -Wformat -Werror=format-security -gdwarf-4 -fno-debug-types-section -fvar-tracking-assignments -g2 -Wp,-D_FORTIFY_SOURCE=2 -fstack-protector-strong --param=ssp-buffer-size=4 -Werror=trampolines -fPIC -mtune=generic -march=x86-64 -gdwarf-4 -fno-debug-types-section -fvar-tracking-assignments -g2 -MT scute_la-p11-getslotinfo.lo -MD -MP -MF .deps/scute_la-p11-getslotinfo.Tpo -c -o scute_la-p11-getslotinfo.lo `test -f 'p11-getslotinfo.c' || echo './'`p11-getslotinfo.c libtool: compile: x86_64-pld-linux-gnux32-gcc -DHAVE_CONFIG_H -I. -I.. -I./../include -I/usr/include -Wall -Wno-pointer-sign -Wpointer-arith -O2 -fwrapv -pipe -Wformat -Werror=format-security -gdwarf-4 -fno-debug-types-section -fvar-tracking-assignments -g2 -Wp,-D_FORTIFY_SOURCE=2 -fstack-protector-strong --param=ssp-buffer-size=4 -Werror=trampolines -fPIC -mtune=generic -march=x86-64 -gdwarf-4 -fno-debug-types-section -fvar-tracking-assignments -g2 -MT scute_la-p11-getslotinfo.lo -MD -MP -MF .deps/scute_la-p11-getslotinfo.Tpo -c p11-getslotinfo.c -fPIC -DPIC -o .libs/scute_la-p11-getslotinfo.o mv -f .deps/scute_la-p11-getslotinfo.Tpo .deps/scute_la-p11-getslotinfo.Plo make[2]: Leaving directory '/tmp/B.yS_Etj/BUILD/scute-1.7.0/src' make[2]: Entering directory '/tmp/B.yS_Etj/BUILD/scute-1.7.0/src' /bin/sh ../libtool --tag=CC --mode=compile x86_64-pld-linux-gnux32-gcc -DHAVE_CONFIG_H -I. -I.. -I./../include -I/usr/include -Wall -Wno-pointer-sign -Wpointer-arith -O2 -fwrapv -pipe -Wformat -Werror=format-security -gdwarf-4 -fno-debug-types-section -fvar-tracking-assignments -g2 -Wp,-D_FORTIFY_SOURCE=2 -fstack-protector-strong --param=ssp-buffer-size=4 -Werror=trampolines -fPIC -mtune=generic -march=x86-64 -gdwarf-4 -fno-debug-types-section -fvar-tracking-assignments -g2 -MT scute_la-p11-gettokeninfo.lo -MD -MP -MF .deps/scute_la-p11-gettokeninfo.Tpo -c -o scute_la-p11-gettokeninfo.lo `test -f 'p11-gettokeninfo.c' || echo './'`p11-gettokeninfo.c libtool: compile: x86_64-pld-linux-gnux32-gcc -DHAVE_CONFIG_H -I. -I.. -I./../include -I/usr/include -Wall -Wno-pointer-sign -Wpointer-arith -O2 -fwrapv -pipe -Wformat -Werror=format-security -gdwarf-4 -fno-debug-types-section -fvar-tracking-assignments -g2 -Wp,-D_FORTIFY_SOURCE=2 -fstack-protector-strong --param=ssp-buffer-size=4 -Werror=trampolines -fPIC -mtune=generic -march=x86-64 -gdwarf-4 -fno-debug-types-section -fvar-tracking-assignments -g2 -MT scute_la-p11-gettokeninfo.lo -MD -MP -MF .deps/scute_la-p11-gettokeninfo.Tpo -c p11-gettokeninfo.c -fPIC -DPIC -o .libs/scute_la-p11-gettokeninfo.o mv -f .deps/scute_la-p11-gettokeninfo.Tpo .deps/scute_la-p11-gettokeninfo.Plo make[2]: Leaving directory '/tmp/B.yS_Etj/BUILD/scute-1.7.0/src' make[2]: Entering directory '/tmp/B.yS_Etj/BUILD/scute-1.7.0/src' /bin/sh ../libtool --tag=CC --mode=compile x86_64-pld-linux-gnux32-gcc -DHAVE_CONFIG_H -I. -I.. -I./../include -I/usr/include -Wall -Wno-pointer-sign -Wpointer-arith -O2 -fwrapv -pipe -Wformat -Werror=format-security -gdwarf-4 -fno-debug-types-section -fvar-tracking-assignments -g2 -Wp,-D_FORTIFY_SOURCE=2 -fstack-protector-strong --param=ssp-buffer-size=4 -Werror=trampolines -fPIC -mtune=generic -march=x86-64 -gdwarf-4 -fno-debug-types-section -fvar-tracking-assignments -g2 -MT scute_la-p11-opensession.lo -MD -MP -MF .deps/scute_la-p11-opensession.Tpo -c -o scute_la-p11-opensession.lo `test -f 'p11-opensession.c' || echo './'`p11-opensession.c libtool: compile: x86_64-pld-linux-gnux32-gcc -DHAVE_CONFIG_H -I. -I.. -I./../include -I/usr/include -Wall -Wno-pointer-sign -Wpointer-arith -O2 -fwrapv -pipe -Wformat -Werror=format-security -gdwarf-4 -fno-debug-types-section -fvar-tracking-assignments -g2 -Wp,-D_FORTIFY_SOURCE=2 -fstack-protector-strong --param=ssp-buffer-size=4 -Werror=trampolines -fPIC -mtune=generic -march=x86-64 -gdwarf-4 -fno-debug-types-section -fvar-tracking-assignments -g2 -MT scute_la-p11-opensession.lo -MD -MP -MF .deps/scute_la-p11-opensession.Tpo -c p11-opensession.c -fPIC -DPIC -o .libs/scute_la-p11-opensession.o mv -f .deps/scute_la-p11-opensession.Tpo .deps/scute_la-p11-opensession.Plo make[2]: Leaving directory '/tmp/B.yS_Etj/BUILD/scute-1.7.0/src' make[2]: Entering directory '/tmp/B.yS_Etj/BUILD/scute-1.7.0/src' /bin/sh ../libtool --tag=CC --mode=compile x86_64-pld-linux-gnux32-gcc -DHAVE_CONFIG_H -I. -I.. -I./../include -I/usr/include -Wall -Wno-pointer-sign -Wpointer-arith -O2 -fwrapv -pipe -Wformat -Werror=format-security -gdwarf-4 -fno-debug-types-section -fvar-tracking-assignments -g2 -Wp,-D_FORTIFY_SOURCE=2 -fstack-protector-strong --param=ssp-buffer-size=4 -Werror=trampolines -fPIC -mtune=generic -march=x86-64 -gdwarf-4 -fno-debug-types-section -fvar-tracking-assignments -g2 -MT scute_la-p11-seedrandom.lo -MD -MP -MF .deps/scute_la-p11-seedrandom.Tpo -c -o scute_la-p11-seedrandom.lo `test -f 'p11-seedrandom.c' || echo './'`p11-seedrandom.c libtool: compile: x86_64-pld-linux-gnux32-gcc -DHAVE_CONFIG_H -I. -I.. -I./../include -I/usr/include -Wall -Wno-pointer-sign -Wpointer-arith -O2 -fwrapv -pipe -Wformat -Werror=format-security -gdwarf-4 -fno-debug-types-section -fvar-tracking-assignments -g2 -Wp,-D_FORTIFY_SOURCE=2 -fstack-protector-strong --param=ssp-buffer-size=4 -Werror=trampolines -fPIC -mtune=generic -march=x86-64 -gdwarf-4 -fno-debug-types-section -fvar-tracking-assignments -g2 -MT scute_la-p11-seedrandom.lo -MD -MP -MF .deps/scute_la-p11-seedrandom.Tpo -c p11-seedrandom.c -fPIC -DPIC -o .libs/scute_la-p11-seedrandom.o mv -f .deps/scute_la-p11-seedrandom.Tpo .deps/scute_la-p11-seedrandom.Plo make[2]: Leaving directory '/tmp/B.yS_Etj/BUILD/scute-1.7.0/src' make[2]: Entering directory '/tmp/B.yS_Etj/BUILD/scute-1.7.0/src' /bin/sh ../libtool --tag=CC --mode=compile x86_64-pld-linux-gnux32-gcc -DHAVE_CONFIG_H -I. -I.. -I./../include -I/usr/include -Wall -Wno-pointer-sign -Wpointer-arith -O2 -fwrapv -pipe -Wformat -Werror=format-security -gdwarf-4 -fno-debug-types-section -fvar-tracking-assignments -g2 -Wp,-D_FORTIFY_SOURCE=2 -fstack-protector-strong --param=ssp-buffer-size=4 -Werror=trampolines -fPIC -mtune=generic -march=x86-64 -gdwarf-4 -fno-debug-types-section -fvar-tracking-assignments -g2 -MT scute_la-p11-setoperationstate.lo -MD -MP -MF .deps/scute_la-p11-setoperationstate.Tpo -c -o scute_la-p11-setoperationstate.lo `test -f 'p11-setoperationstate.c' || echo './'`p11-setoperationstate.c libtool: compile: x86_64-pld-linux-gnux32-gcc -DHAVE_CONFIG_H -I. -I.. -I./../include -I/usr/include -Wall -Wno-pointer-sign -Wpointer-arith -O2 -fwrapv -pipe -Wformat -Werror=format-security -gdwarf-4 -fno-debug-types-section -fvar-tracking-assignments -g2 -Wp,-D_FORTIFY_SOURCE=2 -fstack-protector-strong --param=ssp-buffer-size=4 -Werror=trampolines -fPIC -mtune=generic -march=x86-64 -gdwarf-4 -fno-debug-types-section -fvar-tracking-assignments -g2 -MT scute_la-p11-setoperationstate.lo -MD -MP -MF .deps/scute_la-p11-setoperationstate.Tpo -c p11-setoperationstate.c -fPIC -DPIC -o .libs/scute_la-p11-setoperationstate.o mv -f .deps/scute_la-p11-setoperationstate.Tpo .deps/scute_la-p11-setoperationstate.Plo make[2]: Leaving directory '/tmp/B.yS_Etj/BUILD/scute-1.7.0/src' make[2]: Entering directory '/tmp/B.yS_Etj/BUILD/scute-1.7.0/src' /bin/sh ../libtool --tag=CC --mode=compile x86_64-pld-linux-gnux32-gcc -DHAVE_CONFIG_H -I. -I.. -I./../include -I/usr/include -Wall -Wno-pointer-sign -Wpointer-arith -O2 -fwrapv -pipe -Wformat -Werror=format-security -gdwarf-4 -fno-debug-types-section -fvar-tracking-assignments -g2 -Wp,-D_FORTIFY_SOURCE=2 -fstack-protector-strong --param=ssp-buffer-size=4 -Werror=trampolines -fPIC -mtune=generic -march=x86-64 -gdwarf-4 -fno-debug-types-section -fvar-tracking-assignments -g2 -MT scute_la-p11-setattributevalue.lo -MD -MP -MF .deps/scute_la-p11-setattributevalue.Tpo -c -o scute_la-p11-setattributevalue.lo `test -f 'p11-setattributevalue.c' || echo './'`p11-setattributevalue.c libtool: compile: x86_64-pld-linux-gnux32-gcc -DHAVE_CONFIG_H -I. -I.. -I./../include -I/usr/include -Wall -Wno-pointer-sign -Wpointer-arith -O2 -fwrapv -pipe -Wformat -Werror=format-security -gdwarf-4 -fno-debug-types-section -fvar-tracking-assignments -g2 -Wp,-D_FORTIFY_SOURCE=2 -fstack-protector-strong --param=ssp-buffer-size=4 -Werror=trampolines -fPIC -mtune=generic -march=x86-64 -gdwarf-4 -fno-debug-types-section -fvar-tracking-assignments -g2 -MT scute_la-p11-setattributevalue.lo -MD -MP -MF .deps/scute_la-p11-setattributevalue.Tpo -c p11-setattributevalue.c -fPIC -DPIC -o .libs/scute_la-p11-setattributevalue.o mv -f .deps/scute_la-p11-setattributevalue.Tpo .deps/scute_la-p11-setattributevalue.Plo make[2]: Leaving directory '/tmp/B.yS_Etj/BUILD/scute-1.7.0/src' make[2]: Entering directory '/tmp/B.yS_Etj/BUILD/scute-1.7.0/src' /bin/sh ../libtool --tag=CC --mode=compile x86_64-pld-linux-gnux32-gcc -DHAVE_CONFIG_H -I. -I.. -I./../include -I/usr/include -Wall -Wno-pointer-sign -Wpointer-arith -O2 -fwrapv -pipe -Wformat -Werror=format-security -gdwarf-4 -fno-debug-types-section -fvar-tracking-assignments -g2 -Wp,-D_FORTIFY_SOURCE=2 -fstack-protector-strong --param=ssp-buffer-size=4 -Werror=trampolines -fPIC -mtune=generic -march=x86-64 -gdwarf-4 -fno-debug-types-section -fvar-tracking-assignments -g2 -MT scute_la-p11-setpin.lo -MD -MP -MF .deps/scute_la-p11-setpin.Tpo -c -o scute_la-p11-setpin.lo `test -f 'p11-setpin.c' || echo './'`p11-setpin.c libtool: compile: x86_64-pld-linux-gnux32-gcc -DHAVE_CONFIG_H -I. -I.. -I./../include -I/usr/include -Wall -Wno-pointer-sign -Wpointer-arith -O2 -fwrapv -pipe -Wformat -Werror=format-security -gdwarf-4 -fno-debug-types-section -fvar-tracking-assignments -g2 -Wp,-D_FORTIFY_SOURCE=2 -fstack-protector-strong --param=ssp-buffer-size=4 -Werror=trampolines -fPIC -mtune=generic -march=x86-64 -gdwarf-4 -fno-debug-types-section -fvar-tracking-assignments -g2 -MT scute_la-p11-setpin.lo -MD -MP -MF .deps/scute_la-p11-setpin.Tpo -c p11-setpin.c -fPIC -DPIC -o .libs/scute_la-p11-setpin.o mv -f .deps/scute_la-p11-setpin.Tpo .deps/scute_la-p11-setpin.Plo make[2]: Leaving directory '/tmp/B.yS_Etj/BUILD/scute-1.7.0/src' make[2]: Entering directory '/tmp/B.yS_Etj/BUILD/scute-1.7.0/src' /bin/sh ../libtool --tag=CC --mode=compile x86_64-pld-linux-gnux32-gcc -DHAVE_CONFIG_H -I. -I.. -I./../include -I/usr/include -Wall -Wno-pointer-sign -Wpointer-arith -O2 -fwrapv -pipe -Wformat -Werror=format-security -gdwarf-4 -fno-debug-types-section -fvar-tracking-assignments -g2 -Wp,-D_FORTIFY_SOURCE=2 -fstack-protector-strong --param=ssp-buffer-size=4 -Werror=trampolines -fPIC -mtune=generic -march=x86-64 -gdwarf-4 -fno-debug-types-section -fvar-tracking-assignments -g2 -MT scute_la-p11-signfinal.lo -MD -MP -MF .deps/scute_la-p11-signfinal.Tpo -c -o scute_la-p11-signfinal.lo `test -f 'p11-signfinal.c' || echo './'`p11-signfinal.c libtool: compile: x86_64-pld-linux-gnux32-gcc -DHAVE_CONFIG_H -I. -I.. -I./../include -I/usr/include -Wall -Wno-pointer-sign -Wpointer-arith -O2 -fwrapv -pipe -Wformat -Werror=format-security -gdwarf-4 -fno-debug-types-section -fvar-tracking-assignments -g2 -Wp,-D_FORTIFY_SOURCE=2 -fstack-protector-strong --param=ssp-buffer-size=4 -Werror=trampolines -fPIC -mtune=generic -march=x86-64 -gdwarf-4 -fno-debug-types-section -fvar-tracking-assignments -g2 -MT scute_la-p11-signfinal.lo -MD -MP -MF .deps/scute_la-p11-signfinal.Tpo -c p11-signfinal.c -fPIC -DPIC -o .libs/scute_la-p11-signfinal.o mv -f .deps/scute_la-p11-signfinal.Tpo .deps/scute_la-p11-signfinal.Plo make[2]: Leaving directory '/tmp/B.yS_Etj/BUILD/scute-1.7.0/src' make[2]: Entering directory '/tmp/B.yS_Etj/BUILD/scute-1.7.0/src' /bin/sh ../libtool --tag=CC --mode=compile x86_64-pld-linux-gnux32-gcc -DHAVE_CONFIG_H -I. -I.. -I./../include -I/usr/include -Wall -Wno-pointer-sign -Wpointer-arith -O2 -fwrapv -pipe -Wformat -Werror=format-security -gdwarf-4 -fno-debug-types-section -fvar-tracking-assignments -g2 -Wp,-D_FORTIFY_SOURCE=2 -fstack-protector-strong --param=ssp-buffer-size=4 -Werror=trampolines -fPIC -mtune=generic -march=x86-64 -gdwarf-4 -fno-debug-types-section -fvar-tracking-assignments -g2 -MT scute_la-p11-sign.lo -MD -MP -MF .deps/scute_la-p11-sign.Tpo -c -o scute_la-p11-sign.lo `test -f 'p11-sign.c' || echo './'`p11-sign.c libtool: compile: x86_64-pld-linux-gnux32-gcc -DHAVE_CONFIG_H -I. -I.. -I./../include -I/usr/include -Wall -Wno-pointer-sign -Wpointer-arith -O2 -fwrapv -pipe -Wformat -Werror=format-security -gdwarf-4 -fno-debug-types-section -fvar-tracking-assignments -g2 -Wp,-D_FORTIFY_SOURCE=2 -fstack-protector-strong --param=ssp-buffer-size=4 -Werror=trampolines -fPIC -mtune=generic -march=x86-64 -gdwarf-4 -fno-debug-types-section -fvar-tracking-assignments -g2 -MT scute_la-p11-sign.lo -MD -MP -MF .deps/scute_la-p11-sign.Tpo -c p11-sign.c -fPIC -DPIC -o .libs/scute_la-p11-sign.o mv -f .deps/scute_la-p11-sign.Tpo .deps/scute_la-p11-sign.Plo make[2]: Leaving directory '/tmp/B.yS_Etj/BUILD/scute-1.7.0/src' make[2]: Entering directory '/tmp/B.yS_Etj/BUILD/scute-1.7.0/src' /bin/sh ../libtool --tag=CC --mode=compile x86_64-pld-linux-gnux32-gcc -DHAVE_CONFIG_H -I. -I.. -I./../include -I/usr/include -Wall -Wno-pointer-sign -Wpointer-arith -O2 -fwrapv -pipe -Wformat -Werror=format-security -gdwarf-4 -fno-debug-types-section -fvar-tracking-assignments -g2 -Wp,-D_FORTIFY_SOURCE=2 -fstack-protector-strong --param=ssp-buffer-size=4 -Werror=trampolines -fPIC -mtune=generic -march=x86-64 -gdwarf-4 -fno-debug-types-section -fvar-tracking-assignments -g2 -MT scute_la-p11-signencryptupdate.lo -MD -MP -MF .deps/scute_la-p11-signencryptupdate.Tpo -c -o scute_la-p11-signencryptupdate.lo `test -f 'p11-signencryptupdate.c' || echo './'`p11-signencryptupdate.c libtool: compile: x86_64-pld-linux-gnux32-gcc -DHAVE_CONFIG_H -I. -I.. -I./../include -I/usr/include -Wall -Wno-pointer-sign -Wpointer-arith -O2 -fwrapv -pipe -Wformat -Werror=format-security -gdwarf-4 -fno-debug-types-section -fvar-tracking-assignments -g2 -Wp,-D_FORTIFY_SOURCE=2 -fstack-protector-strong --param=ssp-buffer-size=4 -Werror=trampolines -fPIC -mtune=generic -march=x86-64 -gdwarf-4 -fno-debug-types-section -fvar-tracking-assignments -g2 -MT scute_la-p11-signencryptupdate.lo -MD -MP -MF .deps/scute_la-p11-signencryptupdate.Tpo -c p11-signencryptupdate.c -fPIC -DPIC -o .libs/scute_la-p11-signencryptupdate.o mv -f .deps/scute_la-p11-signencryptupdate.Tpo .deps/scute_la-p11-signencryptupdate.Plo make[2]: Leaving directory '/tmp/B.yS_Etj/BUILD/scute-1.7.0/src' make[2]: Entering directory '/tmp/B.yS_Etj/BUILD/scute-1.7.0/src' /bin/sh ../libtool --tag=CC --mode=compile x86_64-pld-linux-gnux32-gcc -DHAVE_CONFIG_H -I. -I.. -I./../include -I/usr/include -Wall -Wno-pointer-sign -Wpointer-arith -O2 -fwrapv -pipe -Wformat -Werror=format-security -gdwarf-4 -fno-debug-types-section -fvar-tracking-assignments -g2 -Wp,-D_FORTIFY_SOURCE=2 -fstack-protector-strong --param=ssp-buffer-size=4 -Werror=trampolines -fPIC -mtune=generic -march=x86-64 -gdwarf-4 -fno-debug-types-section -fvar-tracking-assignments -g2 -MT scute_la-p11-signrecover.lo -MD -MP -MF .deps/scute_la-p11-signrecover.Tpo -c -o scute_la-p11-signrecover.lo `test -f 'p11-signrecover.c' || echo './'`p11-signrecover.c libtool: compile: x86_64-pld-linux-gnux32-gcc -DHAVE_CONFIG_H -I. -I.. -I./../include -I/usr/include -Wall -Wno-pointer-sign -Wpointer-arith -O2 -fwrapv -pipe -Wformat -Werror=format-security -gdwarf-4 -fno-debug-types-section -fvar-tracking-assignments -g2 -Wp,-D_FORTIFY_SOURCE=2 -fstack-protector-strong --param=ssp-buffer-size=4 -Werror=trampolines -fPIC -mtune=generic -march=x86-64 -gdwarf-4 -fno-debug-types-section -fvar-tracking-assignments -g2 -MT scute_la-p11-signrecover.lo -MD -MP -MF .deps/scute_la-p11-signrecover.Tpo -c p11-signrecover.c -fPIC -DPIC -o .libs/scute_la-p11-signrecover.o mv -f .deps/scute_la-p11-signrecover.Tpo .deps/scute_la-p11-signrecover.Plo make[2]: Leaving directory '/tmp/B.yS_Etj/BUILD/scute-1.7.0/src' make[2]: Entering directory '/tmp/B.yS_Etj/BUILD/scute-1.7.0/src' /bin/sh ../libtool --tag=CC --mode=compile x86_64-pld-linux-gnux32-gcc -DHAVE_CONFIG_H -I. -I.. -I./../include -I/usr/include -Wall -Wno-pointer-sign -Wpointer-arith -O2 -fwrapv -pipe -Wformat -Werror=format-security -gdwarf-4 -fno-debug-types-section -fvar-tracking-assignments -g2 -Wp,-D_FORTIFY_SOURCE=2 -fstack-protector-strong --param=ssp-buffer-size=4 -Werror=trampolines -fPIC -mtune=generic -march=x86-64 -gdwarf-4 -fno-debug-types-section -fvar-tracking-assignments -g2 -MT scute_la-p11-signinit.lo -MD -MP -MF .deps/scute_la-p11-signinit.Tpo -c -o scute_la-p11-signinit.lo `test -f 'p11-signinit.c' || echo './'`p11-signinit.c libtool: compile: x86_64-pld-linux-gnux32-gcc -DHAVE_CONFIG_H -I. -I.. -I./../include -I/usr/include -Wall -Wno-pointer-sign -Wpointer-arith -O2 -fwrapv -pipe -Wformat -Werror=format-security -gdwarf-4 -fno-debug-types-section -fvar-tracking-assignments -g2 -Wp,-D_FORTIFY_SOURCE=2 -fstack-protector-strong --param=ssp-buffer-size=4 -Werror=trampolines -fPIC -mtune=generic -march=x86-64 -gdwarf-4 -fno-debug-types-section -fvar-tracking-assignments -g2 -MT scute_la-p11-signinit.lo -MD -MP -MF .deps/scute_la-p11-signinit.Tpo -c p11-signinit.c -fPIC -DPIC -o .libs/scute_la-p11-signinit.o mv -f .deps/scute_la-p11-signinit.Tpo .deps/scute_la-p11-signinit.Plo make[2]: Leaving directory '/tmp/B.yS_Etj/BUILD/scute-1.7.0/src' make[2]: Entering directory '/tmp/B.yS_Etj/BUILD/scute-1.7.0/src' /bin/sh ../libtool --tag=CC --mode=compile x86_64-pld-linux-gnux32-gcc -DHAVE_CONFIG_H -I. -I.. -I./../include -I/usr/include -Wall -Wno-pointer-sign -Wpointer-arith -O2 -fwrapv -pipe -Wformat -Werror=format-security -gdwarf-4 -fno-debug-types-section -fvar-tracking-assignments -g2 -Wp,-D_FORTIFY_SOURCE=2 -fstack-protector-strong --param=ssp-buffer-size=4 -Werror=trampolines -fPIC -mtune=generic -march=x86-64 -gdwarf-4 -fno-debug-types-section -fvar-tracking-assignments -g2 -MT scute_la-p11-signrecoverinit.lo -MD -MP -MF .deps/scute_la-p11-signrecoverinit.Tpo -c -o scute_la-p11-signrecoverinit.lo `test -f 'p11-signrecoverinit.c' || echo './'`p11-signrecoverinit.c libtool: compile: x86_64-pld-linux-gnux32-gcc -DHAVE_CONFIG_H -I. -I.. -I./../include -I/usr/include -Wall -Wno-pointer-sign -Wpointer-arith -O2 -fwrapv -pipe -Wformat -Werror=format-security -gdwarf-4 -fno-debug-types-section -fvar-tracking-assignments -g2 -Wp,-D_FORTIFY_SOURCE=2 -fstack-protector-strong --param=ssp-buffer-size=4 -Werror=trampolines -fPIC -mtune=generic -march=x86-64 -gdwarf-4 -fno-debug-types-section -fvar-tracking-assignments -g2 -MT scute_la-p11-signrecoverinit.lo -MD -MP -MF .deps/scute_la-p11-signrecoverinit.Tpo -c p11-signrecoverinit.c -fPIC -DPIC -o .libs/scute_la-p11-signrecoverinit.o mv -f .deps/scute_la-p11-signrecoverinit.Tpo .deps/scute_la-p11-signrecoverinit.Plo make[2]: Leaving directory '/tmp/B.yS_Etj/BUILD/scute-1.7.0/src' make[2]: Entering directory '/tmp/B.yS_Etj/BUILD/scute-1.7.0/src' /bin/sh ../libtool --tag=CC --mode=compile x86_64-pld-linux-gnux32-gcc -DHAVE_CONFIG_H -I. -I.. -I./../include -I/usr/include -Wall -Wno-pointer-sign -Wpointer-arith -O2 -fwrapv -pipe -Wformat -Werror=format-security -gdwarf-4 -fno-debug-types-section -fvar-tracking-assignments -g2 -Wp,-D_FORTIFY_SOURCE=2 -fstack-protector-strong --param=ssp-buffer-size=4 -Werror=trampolines -fPIC -mtune=generic -march=x86-64 -gdwarf-4 -fno-debug-types-section -fvar-tracking-assignments -g2 -MT scute_la-p11-signupdate.lo -MD -MP -MF .deps/scute_la-p11-signupdate.Tpo -c -o scute_la-p11-signupdate.lo `test -f 'p11-signupdate.c' || echo './'`p11-signupdate.c libtool: compile: x86_64-pld-linux-gnux32-gcc -DHAVE_CONFIG_H -I. -I.. -I./../include -I/usr/include -Wall -Wno-pointer-sign -Wpointer-arith -O2 -fwrapv -pipe -Wformat -Werror=format-security -gdwarf-4 -fno-debug-types-section -fvar-tracking-assignments -g2 -Wp,-D_FORTIFY_SOURCE=2 -fstack-protector-strong --param=ssp-buffer-size=4 -Werror=trampolines -fPIC -mtune=generic -march=x86-64 -gdwarf-4 -fno-debug-types-section -fvar-tracking-assignments -g2 -MT scute_la-p11-signupdate.lo -MD -MP -MF .deps/scute_la-p11-signupdate.Tpo -c p11-signupdate.c -fPIC -DPIC -o .libs/scute_la-p11-signupdate.o mv -f .deps/scute_la-p11-signupdate.Tpo .deps/scute_la-p11-signupdate.Plo make[2]: Leaving directory '/tmp/B.yS_Etj/BUILD/scute-1.7.0/src' make[2]: Entering directory '/tmp/B.yS_Etj/BUILD/scute-1.7.0/src' /bin/sh ../libtool --tag=CC --mode=compile x86_64-pld-linux-gnux32-gcc -DHAVE_CONFIG_H -I. -I.. -I./../include -I/usr/include -Wall -Wno-pointer-sign -Wpointer-arith -O2 -fwrapv -pipe -Wformat -Werror=format-security -gdwarf-4 -fno-debug-types-section -fvar-tracking-assignments -g2 -Wp,-D_FORTIFY_SOURCE=2 -fstack-protector-strong --param=ssp-buffer-size=4 -Werror=trampolines -fPIC -mtune=generic -march=x86-64 -gdwarf-4 -fno-debug-types-section -fvar-tracking-assignments -g2 -MT scute_la-p11-unwrapkey.lo -MD -MP -MF .deps/scute_la-p11-unwrapkey.Tpo -c -o scute_la-p11-unwrapkey.lo `test -f 'p11-unwrapkey.c' || echo './'`p11-unwrapkey.c libtool: compile: x86_64-pld-linux-gnux32-gcc -DHAVE_CONFIG_H -I. -I.. -I./../include -I/usr/include -Wall -Wno-pointer-sign -Wpointer-arith -O2 -fwrapv -pipe -Wformat -Werror=format-security -gdwarf-4 -fno-debug-types-section -fvar-tracking-assignments -g2 -Wp,-D_FORTIFY_SOURCE=2 -fstack-protector-strong --param=ssp-buffer-size=4 -Werror=trampolines -fPIC -mtune=generic -march=x86-64 -gdwarf-4 -fno-debug-types-section -fvar-tracking-assignments -g2 -MT scute_la-p11-unwrapkey.lo -MD -MP -MF .deps/scute_la-p11-unwrapkey.Tpo -c p11-unwrapkey.c -fPIC -DPIC -o .libs/scute_la-p11-unwrapkey.o mv -f .deps/scute_la-p11-unwrapkey.Tpo .deps/scute_la-p11-unwrapkey.Plo make[2]: Leaving directory '/tmp/B.yS_Etj/BUILD/scute-1.7.0/src' make[2]: Entering directory '/tmp/B.yS_Etj/BUILD/scute-1.7.0/src' /bin/sh ../libtool --tag=CC --mode=compile x86_64-pld-linux-gnux32-gcc -DHAVE_CONFIG_H -I. -I.. -I./../include -I/usr/include -Wall -Wno-pointer-sign -Wpointer-arith -O2 -fwrapv -pipe -Wformat -Werror=format-security -gdwarf-4 -fno-debug-types-section -fvar-tracking-assignments -g2 -Wp,-D_FORTIFY_SOURCE=2 -fstack-protector-strong --param=ssp-buffer-size=4 -Werror=trampolines -fPIC -mtune=generic -march=x86-64 -gdwarf-4 -fno-debug-types-section -fvar-tracking-assignments -g2 -MT scute_la-p11-verify.lo -MD -MP -MF .deps/scute_la-p11-verify.Tpo -c -o scute_la-p11-verify.lo `test -f 'p11-verify.c' || echo './'`p11-verify.c libtool: compile: x86_64-pld-linux-gnux32-gcc -DHAVE_CONFIG_H -I. -I.. -I./../include -I/usr/include -Wall -Wno-pointer-sign -Wpointer-arith -O2 -fwrapv -pipe -Wformat -Werror=format-security -gdwarf-4 -fno-debug-types-section -fvar-tracking-assignments -g2 -Wp,-D_FORTIFY_SOURCE=2 -fstack-protector-strong --param=ssp-buffer-size=4 -Werror=trampolines -fPIC -mtune=generic -march=x86-64 -gdwarf-4 -fno-debug-types-section -fvar-tracking-assignments -g2 -MT scute_la-p11-verify.lo -MD -MP -MF .deps/scute_la-p11-verify.Tpo -c p11-verify.c -fPIC -DPIC -o .libs/scute_la-p11-verify.o mv -f .deps/scute_la-p11-verify.Tpo .deps/scute_la-p11-verify.Plo make[2]: Leaving directory '/tmp/B.yS_Etj/BUILD/scute-1.7.0/src' make[2]: Entering directory '/tmp/B.yS_Etj/BUILD/scute-1.7.0/src' /bin/sh ../libtool --tag=CC --mode=compile x86_64-pld-linux-gnux32-gcc -DHAVE_CONFIG_H -I. -I.. -I./../include -I/usr/include -Wall -Wno-pointer-sign -Wpointer-arith -O2 -fwrapv -pipe -Wformat -Werror=format-security -gdwarf-4 -fno-debug-types-section -fvar-tracking-assignments -g2 -Wp,-D_FORTIFY_SOURCE=2 -fstack-protector-strong --param=ssp-buffer-size=4 -Werror=trampolines -fPIC -mtune=generic -march=x86-64 -gdwarf-4 -fno-debug-types-section -fvar-tracking-assignments -g2 -MT scute_la-p11-verifyrecover.lo -MD -MP -MF .deps/scute_la-p11-verifyrecover.Tpo -c -o scute_la-p11-verifyrecover.lo `test -f 'p11-verifyrecover.c' || echo './'`p11-verifyrecover.c libtool: compile: x86_64-pld-linux-gnux32-gcc -DHAVE_CONFIG_H -I. -I.. -I./../include -I/usr/include -Wall -Wno-pointer-sign -Wpointer-arith -O2 -fwrapv -pipe -Wformat -Werror=format-security -gdwarf-4 -fno-debug-types-section -fvar-tracking-assignments -g2 -Wp,-D_FORTIFY_SOURCE=2 -fstack-protector-strong --param=ssp-buffer-size=4 -Werror=trampolines -fPIC -mtune=generic -march=x86-64 -gdwarf-4 -fno-debug-types-section -fvar-tracking-assignments -g2 -MT scute_la-p11-verifyrecover.lo -MD -MP -MF .deps/scute_la-p11-verifyrecover.Tpo -c p11-verifyrecover.c -fPIC -DPIC -o .libs/scute_la-p11-verifyrecover.o mv -f .deps/scute_la-p11-verifyrecover.Tpo .deps/scute_la-p11-verifyrecover.Plo make[2]: Leaving directory '/tmp/B.yS_Etj/BUILD/scute-1.7.0/src' make[2]: Entering directory '/tmp/B.yS_Etj/BUILD/scute-1.7.0/src' /bin/sh ../libtool --tag=CC --mode=compile x86_64-pld-linux-gnux32-gcc -DHAVE_CONFIG_H -I. -I.. -I./../include -I/usr/include -Wall -Wno-pointer-sign -Wpointer-arith -O2 -fwrapv -pipe -Wformat -Werror=format-security -gdwarf-4 -fno-debug-types-section -fvar-tracking-assignments -g2 -Wp,-D_FORTIFY_SOURCE=2 -fstack-protector-strong --param=ssp-buffer-size=4 -Werror=trampolines -fPIC -mtune=generic -march=x86-64 -gdwarf-4 -fno-debug-types-section -fvar-tracking-assignments -g2 -MT scute_la-p11-verifyinit.lo -MD -MP -MF .deps/scute_la-p11-verifyinit.Tpo -c -o scute_la-p11-verifyinit.lo `test -f 'p11-verifyinit.c' || echo './'`p11-verifyinit.c libtool: compile: x86_64-pld-linux-gnux32-gcc -DHAVE_CONFIG_H -I. -I.. -I./../include -I/usr/include -Wall -Wno-pointer-sign -Wpointer-arith -O2 -fwrapv -pipe -Wformat -Werror=format-security -gdwarf-4 -fno-debug-types-section -fvar-tracking-assignments -g2 -Wp,-D_FORTIFY_SOURCE=2 -fstack-protector-strong --param=ssp-buffer-size=4 -Werror=trampolines -fPIC -mtune=generic -march=x86-64 -gdwarf-4 -fno-debug-types-section -fvar-tracking-assignments -g2 -MT scute_la-p11-verifyinit.lo -MD -MP -MF .deps/scute_la-p11-verifyinit.Tpo -c p11-verifyinit.c -fPIC -DPIC -o .libs/scute_la-p11-verifyinit.o mv -f .deps/scute_la-p11-verifyinit.Tpo .deps/scute_la-p11-verifyinit.Plo make[2]: Leaving directory '/tmp/B.yS_Etj/BUILD/scute-1.7.0/src' make[2]: Entering directory '/tmp/B.yS_Etj/BUILD/scute-1.7.0/src' /bin/sh ../libtool --tag=CC --mode=compile x86_64-pld-linux-gnux32-gcc -DHAVE_CONFIG_H -I. -I.. -I./../include -I/usr/include -Wall -Wno-pointer-sign -Wpointer-arith -O2 -fwrapv -pipe -Wformat -Werror=format-security -gdwarf-4 -fno-debug-types-section -fvar-tracking-assignments -g2 -Wp,-D_FORTIFY_SOURCE=2 -fstack-protector-strong --param=ssp-buffer-size=4 -Werror=trampolines -fPIC -mtune=generic -march=x86-64 -gdwarf-4 -fno-debug-types-section -fvar-tracking-assignments -g2 -MT scute_la-p11-verifyfinal.lo -MD -MP -MF .deps/scute_la-p11-verifyfinal.Tpo -c -o scute_la-p11-verifyfinal.lo `test -f 'p11-verifyfinal.c' || echo './'`p11-verifyfinal.c libtool: compile: x86_64-pld-linux-gnux32-gcc -DHAVE_CONFIG_H -I. -I.. -I./../include -I/usr/include -Wall -Wno-pointer-sign -Wpointer-arith -O2 -fwrapv -pipe -Wformat -Werror=format-security -gdwarf-4 -fno-debug-types-section -fvar-tracking-assignments -g2 -Wp,-D_FORTIFY_SOURCE=2 -fstack-protector-strong --param=ssp-buffer-size=4 -Werror=trampolines -fPIC -mtune=generic -march=x86-64 -gdwarf-4 -fno-debug-types-section -fvar-tracking-assignments -g2 -MT scute_la-p11-verifyfinal.lo -MD -MP -MF .deps/scute_la-p11-verifyfinal.Tpo -c p11-verifyfinal.c -fPIC -DPIC -o .libs/scute_la-p11-verifyfinal.o mv -f .deps/scute_la-p11-verifyfinal.Tpo .deps/scute_la-p11-verifyfinal.Plo make[2]: Leaving directory '/tmp/B.yS_Etj/BUILD/scute-1.7.0/src' make[2]: Entering directory '/tmp/B.yS_Etj/BUILD/scute-1.7.0/src' /bin/sh ../libtool --tag=CC --mode=compile x86_64-pld-linux-gnux32-gcc -DHAVE_CONFIG_H -I. -I.. -I./../include -I/usr/include -Wall -Wno-pointer-sign -Wpointer-arith -O2 -fwrapv -pipe -Wformat -Werror=format-security -gdwarf-4 -fno-debug-types-section -fvar-tracking-assignments -g2 -Wp,-D_FORTIFY_SOURCE=2 -fstack-protector-strong --param=ssp-buffer-size=4 -Werror=trampolines -fPIC -mtune=generic -march=x86-64 -gdwarf-4 -fno-debug-types-section -fvar-tracking-assignments -g2 -MT scute_la-p11-verifyupdate.lo -MD -MP -MF .deps/scute_la-p11-verifyupdate.Tpo -c -o scute_la-p11-verifyupdate.lo `test -f 'p11-verifyupdate.c' || echo './'`p11-verifyupdate.c libtool: compile: x86_64-pld-linux-gnux32-gcc -DHAVE_CONFIG_H -I. -I.. -I./../include -I/usr/include -Wall -Wno-pointer-sign -Wpointer-arith -O2 -fwrapv -pipe -Wformat -Werror=format-security -gdwarf-4 -fno-debug-types-section -fvar-tracking-assignments -g2 -Wp,-D_FORTIFY_SOURCE=2 -fstack-protector-strong --param=ssp-buffer-size=4 -Werror=trampolines -fPIC -mtune=generic -march=x86-64 -gdwarf-4 -fno-debug-types-section -fvar-tracking-assignments -g2 -MT scute_la-p11-verifyupdate.lo -MD -MP -MF .deps/scute_la-p11-verifyupdate.Tpo -c p11-verifyupdate.c -fPIC -DPIC -o .libs/scute_la-p11-verifyupdate.o mv -f .deps/scute_la-p11-verifyupdate.Tpo .deps/scute_la-p11-verifyupdate.Plo make[2]: Leaving directory '/tmp/B.yS_Etj/BUILD/scute-1.7.0/src' make[2]: Entering directory '/tmp/B.yS_Etj/BUILD/scute-1.7.0/src' /bin/sh ../libtool --tag=CC --mode=compile x86_64-pld-linux-gnux32-gcc -DHAVE_CONFIG_H -I. -I.. -I./../include -I/usr/include -Wall -Wno-pointer-sign -Wpointer-arith -O2 -fwrapv -pipe -Wformat -Werror=format-security -gdwarf-4 -fno-debug-types-section -fvar-tracking-assignments -g2 -Wp,-D_FORTIFY_SOURCE=2 -fstack-protector-strong --param=ssp-buffer-size=4 -Werror=trampolines -fPIC -mtune=generic -march=x86-64 -gdwarf-4 -fno-debug-types-section -fvar-tracking-assignments -g2 -MT scute_la-p11-verifyrecoverinit.lo -MD -MP -MF .deps/scute_la-p11-verifyrecoverinit.Tpo -c -o scute_la-p11-verifyrecoverinit.lo `test -f 'p11-verifyrecoverinit.c' || echo './'`p11-verifyrecoverinit.c libtool: compile: x86_64-pld-linux-gnux32-gcc -DHAVE_CONFIG_H -I. -I.. -I./../include -I/usr/include -Wall -Wno-pointer-sign -Wpointer-arith -O2 -fwrapv -pipe -Wformat -Werror=format-security -gdwarf-4 -fno-debug-types-section -fvar-tracking-assignments -g2 -Wp,-D_FORTIFY_SOURCE=2 -fstack-protector-strong --param=ssp-buffer-size=4 -Werror=trampolines -fPIC -mtune=generic -march=x86-64 -gdwarf-4 -fno-debug-types-section -fvar-tracking-assignments -g2 -MT scute_la-p11-verifyrecoverinit.lo -MD -MP -MF .deps/scute_la-p11-verifyrecoverinit.Tpo -c p11-verifyrecoverinit.c -fPIC -DPIC -o .libs/scute_la-p11-verifyrecoverinit.o mv -f .deps/scute_la-p11-verifyrecoverinit.Tpo .deps/scute_la-p11-verifyrecoverinit.Plo make[2]: Leaving directory '/tmp/B.yS_Etj/BUILD/scute-1.7.0/src' make[2]: Entering directory '/tmp/B.yS_Etj/BUILD/scute-1.7.0/src' /bin/sh ../libtool --tag=CC --mode=compile x86_64-pld-linux-gnux32-gcc -DHAVE_CONFIG_H -I. -I.. -I./../include -I/usr/include -Wall -Wno-pointer-sign -Wpointer-arith -O2 -fwrapv -pipe -Wformat -Werror=format-security -gdwarf-4 -fno-debug-types-section -fvar-tracking-assignments -g2 -Wp,-D_FORTIFY_SOURCE=2 -fstack-protector-strong --param=ssp-buffer-size=4 -Werror=trampolines -fPIC -mtune=generic -march=x86-64 -gdwarf-4 -fno-debug-types-section -fvar-tracking-assignments -g2 -MT scute_la-p11-waitforslotevent.lo -MD -MP -MF .deps/scute_la-p11-waitforslotevent.Tpo -c -o scute_la-p11-waitforslotevent.lo `test -f 'p11-waitforslotevent.c' || echo './'`p11-waitforslotevent.c libtool: compile: x86_64-pld-linux-gnux32-gcc -DHAVE_CONFIG_H -I. -I.. -I./../include -I/usr/include -Wall -Wno-pointer-sign -Wpointer-arith -O2 -fwrapv -pipe -Wformat -Werror=format-security -gdwarf-4 -fno-debug-types-section -fvar-tracking-assignments -g2 -Wp,-D_FORTIFY_SOURCE=2 -fstack-protector-strong --param=ssp-buffer-size=4 -Werror=trampolines -fPIC -mtune=generic -march=x86-64 -gdwarf-4 -fno-debug-types-section -fvar-tracking-assignments -g2 -MT scute_la-p11-waitforslotevent.lo -MD -MP -MF .deps/scute_la-p11-waitforslotevent.Tpo -c p11-waitforslotevent.c -fPIC -DPIC -o .libs/scute_la-p11-waitforslotevent.o mv -f .deps/scute_la-p11-waitforslotevent.Tpo .deps/scute_la-p11-waitforslotevent.Plo make[2]: Leaving directory '/tmp/B.yS_Etj/BUILD/scute-1.7.0/src' make[2]: Entering directory '/tmp/B.yS_Etj/BUILD/scute-1.7.0/src' /bin/sh ../libtool --tag=CC --mode=compile x86_64-pld-linux-gnux32-gcc -DHAVE_CONFIG_H -I. -I.. -I./../include -I/usr/include -Wall -Wno-pointer-sign -Wpointer-arith -O2 -fwrapv -pipe -Wformat -Werror=format-security -gdwarf-4 -fno-debug-types-section -fvar-tracking-assignments -g2 -Wp,-D_FORTIFY_SOURCE=2 -fstack-protector-strong --param=ssp-buffer-size=4 -Werror=trampolines -fPIC -mtune=generic -march=x86-64 -gdwarf-4 -fno-debug-types-section -fvar-tracking-assignments -g2 -MT scute_la-p11-wrapkey.lo -MD -MP -MF .deps/scute_la-p11-wrapkey.Tpo -c -o scute_la-p11-wrapkey.lo `test -f 'p11-wrapkey.c' || echo './'`p11-wrapkey.c libtool: compile: x86_64-pld-linux-gnux32-gcc -DHAVE_CONFIG_H -I. -I.. -I./../include -I/usr/include -Wall -Wno-pointer-sign -Wpointer-arith -O2 -fwrapv -pipe -Wformat -Werror=format-security -gdwarf-4 -fno-debug-types-section -fvar-tracking-assignments -g2 -Wp,-D_FORTIFY_SOURCE=2 -fstack-protector-strong --param=ssp-buffer-size=4 -Werror=trampolines -fPIC -mtune=generic -march=x86-64 -gdwarf-4 -fno-debug-types-section -fvar-tracking-assignments -g2 -MT scute_la-p11-wrapkey.lo -MD -MP -MF .deps/scute_la-p11-wrapkey.Tpo -c p11-wrapkey.c -fPIC -DPIC -o .libs/scute_la-p11-wrapkey.o mv -f .deps/scute_la-p11-wrapkey.Tpo .deps/scute_la-p11-wrapkey.Plo make[2]: Leaving directory '/tmp/B.yS_Etj/BUILD/scute-1.7.0/src' make[2]: Entering directory '/tmp/B.yS_Etj/BUILD/scute-1.7.0/src' /bin/sh ../libtool --tag=CC --mode=link x86_64-pld-linux-gnux32-gcc -Wall -Wno-pointer-sign -Wpointer-arith -O2 -fwrapv -pipe -Wformat -Werror=format-security -gdwarf-4 -fno-debug-types-section -fvar-tracking-assignments -g2 -Wp,-D_FORTIFY_SOURCE=2 -fstack-protector-strong --param=ssp-buffer-size=4 -Werror=trampolines -fPIC -mtune=generic -march=x86-64 -gdwarf-4 -fno-debug-types-section -fvar-tracking-assignments -g2 -module -avoid-version -Wl,--version-script=./libscute.vers -version-info 0:5:0 -Wl,--as-needed -Wl,--no-copy-dt-needed-entries -Wl,-z,relro -Wl,-z,combreloc -o scute.la -rpath /usr/libx32 scute_la-debug.lo scute_la-readconf.lo scute_la-locking.lo scute_la-error-mapping.lo scute_la-get-path.lo scute_la-agent.lo scute_la-slots.lo scute_la-table.lo scute_la-cert-gpgsm.lo scute_la-cert-object.lo scute_la-gpgsm.lo scute_la-p11-cancelfunction.lo scute_la-p11-closeallsessions.lo scute_la-p11-closesession.lo scute_la-p11-copyobject.lo scute_la-p11-createobject.lo scute_la-p11-decrypt.lo scute_la-p11-decryptdigestupdate.lo scute_la-p11-decryptfinal.lo scute_la-p11-decryptinit.lo scute_la-p11-decryptupdate.lo scute_la-p11-decryptverifyupdate.lo scute_la-p11-derivekey.lo scute_la-p11-destroyobject.lo scute_la-p11-digest.lo scute_la-p11-digestencryptupdate.lo scute_la-p11-digestfinal.lo scute_la-p11-digestinit.lo scute_la-p11-digestkey.lo scute_la-p11-digestupdate.lo scute_la-p11-encrypt.lo scute_la-p11-encryptfinal.lo scute_la-p11-encryptinit.lo scute_la-p11-encryptupdate.lo scute_la-p11-finalize.lo scute_la-p11-findobjects.lo scute_la-p11-findobjectsfinal.lo scute_la-p11-findobjectsinit.lo scute_la-p11-generatekey.lo scute_la-p11-generatekeypair.lo scute_la-p11-generaterandom.lo scute_la-p11-getattributevalue.lo scute_la-p11-getfunctionlist.lo scute_la-p11-getfunctionstatus.lo scute_la-p11-getinfo.lo scute_la-p11-getmechanisminfo.lo scute_la-p11-getmechanismlist.lo scute_la-p11-getobjectsize.lo scute_la-p11-getoperationstate.lo scute_la-p11-getsessioninfo.lo scute_la-p11-getslotinfo.lo scute_la-p11-getslotlist.lo scute_la-p11-gettokeninfo.lo scute_la-p11-initialize.lo scute_la-p11-initpin.lo scute_la-p11-inittoken.lo scute_la-p11-login.lo scute_la-p11-logout.lo scute_la-p11-opensession.lo scute_la-p11-seedrandom.lo scute_la-p11-setattributevalue.lo scute_la-p11-setoperationstate.lo scute_la-p11-setpin.lo scute_la-p11-sign.lo scute_la-p11-signencryptupdate.lo scute_la-p11-signfinal.lo scute_la-p11-signinit.lo scute_la-p11-signrecover.lo scute_la-p11-signrecoverinit.lo scute_la-p11-signupdate.lo scute_la-p11-unwrapkey.lo scute_la-p11-verify.lo scute_la-p11-verifyfinal.lo scute_la-p11-verifyinit.lo scute_la-p11-verifyrecover.lo scute_la-p11-verifyrecoverinit.lo scute_la-p11-verifyupdate.lo scute_la-p11-waitforslotevent.lo scute_la-p11-wrapkey.lo -L/usr/libx32 -lassuan -L/usr/libx32 -lgpg-error libtool: link: x86_64-pld-linux-gnux32-gcc -shared -fPIC -DPIC -O2 -gdwarf-4 -g2 -fstack-protector-strong -mtune=generic -march=x86-64 -gdwarf-4 -g2 -Wl,--version-script=./libscute.vers -Wl,--as-needed -Wl,--no-copy-dt-needed-entries -Wl,-z -Wl,relro -Wl,-z -Wl,combreloc .libs/scute_la-debug.o .libs/scute_la-readconf.o .libs/scute_la-locking.o .libs/scute_la-error-mapping.o .libs/scute_la-get-path.o .libs/scute_la-agent.o .libs/scute_la-slots.o .libs/scute_la-table.o .libs/scute_la-cert-gpgsm.o .libs/scute_la-cert-object.o .libs/scute_la-gpgsm.o .libs/scute_la-p11-cancelfunction.o .libs/scute_la-p11-closeallsessions.o .libs/scute_la-p11-closesession.o .libs/scute_la-p11-copyobject.o .libs/scute_la-p11-createobject.o .libs/scute_la-p11-decrypt.o .libs/scute_la-p11-decryptdigestupdate.o .libs/scute_la-p11-decryptfinal.o .libs/scute_la-p11-decryptinit.o .libs/scute_la-p11-decryptupdate.o .libs/scute_la-p11-decryptverifyupdate.o .libs/scute_la-p11-derivekey.o .libs/scute_la-p11-destroyobject.o .libs/scute_la-p11-digest.o .libs/scute_la-p11-digestencryptupdate.o .libs/scute_la-p11-digestfinal.o .libs/scute_la-p11-digestinit.o .libs/scute_la-p11-digestkey.o .libs/scute_la-p11-digestupdate.o .libs/scute_la-p11-encrypt.o .libs/scute_la-p11-encryptfinal.o .libs/scute_la-p11-encryptinit.o .libs/scute_la-p11-encryptupdate.o .libs/scute_la-p11-finalize.o .libs/scute_la-p11-findobjects.o .libs/scute_la-p11-findobjectsfinal.o .libs/scute_la-p11-findobjectsinit.o .libs/scute_la-p11-generatekey.o .libs/scute_la-p11-generatekeypair.o .libs/scute_la-p11-generaterandom.o .libs/scute_la-p11-getattributevalue.o .libs/scute_la-p11-getfunctionlist.o .libs/scute_la-p11-getfunctionstatus.o .libs/scute_la-p11-getinfo.o .libs/scute_la-p11-getmechanisminfo.o .libs/scute_la-p11-getmechanismlist.o .libs/scute_la-p11-getobjectsize.o .libs/scute_la-p11-getoperationstate.o .libs/scute_la-p11-getsessioninfo.o .libs/scute_la-p11-getslotinfo.o .libs/scute_la-p11-getslotlist.o .libs/scute_la-p11-gettokeninfo.o .libs/scute_la-p11-initialize.o .libs/scute_la-p11-initpin.o .libs/scute_la-p11-inittoken.o .libs/scute_la-p11-login.o .libs/scute_la-p11-logout.o .libs/scute_la-p11-opensession.o .libs/scute_la-p11-seedrandom.o .libs/scute_la-p11-setattributevalue.o .libs/scute_la-p11-setoperationstate.o .libs/scute_la-p11-setpin.o .libs/scute_la-p11-sign.o .libs/scute_la-p11-signencryptupdate.o .libs/scute_la-p11-signfinal.o .libs/scute_la-p11-signinit.o .libs/scute_la-p11-signrecover.o .libs/scute_la-p11-signrecoverinit.o .libs/scute_la-p11-signupdate.o .libs/scute_la-p11-unwrapkey.o .libs/scute_la-p11-verify.o .libs/scute_la-p11-verifyfinal.o .libs/scute_la-p11-verifyinit.o .libs/scute_la-p11-verifyrecover.o .libs/scute_la-p11-verifyrecoverinit.o .libs/scute_la-p11-verifyupdate.o .libs/scute_la-p11-waitforslotevent.o .libs/scute_la-p11-wrapkey.o -L/usr/libx32 /usr/libx32/libassuan.so /usr/libx32/libgpg-error.so -Wl,-soname -Wl,scute.so -o .libs/scute.so /usr/bin/ld: .libs/scute_la-readconf.o:/tmp/B.yS_Etj/BUILD/scute-1.7.0/src/options.h:28: multiple definition of `_scute_opt'; .libs/scute_la-debug.o:/tmp/B.yS_Etj/BUILD/scute-1.7.0/src/options.h:28: first defined here /usr/bin/ld: .libs/scute_la-error-mapping.o:/tmp/B.yS_Etj/BUILD/scute-1.7.0/src/options.h:28: multiple definition of `_scute_opt'; .libs/scute_la-debug.o:/tmp/B.yS_Etj/BUILD/scute-1.7.0/src/options.h:28: first defined here /usr/bin/ld: .libs/scute_la-get-path.o:/tmp/B.yS_Etj/BUILD/scute-1.7.0/src/options.h:28: multiple definition of `_scute_opt'; .libs/scute_la-debug.o:/tmp/B.yS_Etj/BUILD/scute-1.7.0/src/options.h:28: first defined here /usr/bin/ld: .libs/scute_la-agent.o:/tmp/B.yS_Etj/BUILD/scute-1.7.0/src/options.h:28: multiple definition of `_scute_opt'; .libs/scute_la-debug.o:/tmp/B.yS_Etj/BUILD/scute-1.7.0/src/options.h:28: first defined here /usr/bin/ld: .libs/scute_la-slots.o:/tmp/B.yS_Etj/BUILD/scute-1.7.0/src/options.h:28: multiple definition of `_scute_opt'; .libs/scute_la-debug.o:/tmp/B.yS_Etj/BUILD/scute-1.7.0/src/options.h:28: first defined here /usr/bin/ld: .libs/scute_la-cert-gpgsm.o:/tmp/B.yS_Etj/BUILD/scute-1.7.0/src/options.h:28: multiple definition of `_scute_opt'; .libs/scute_la-debug.o:/tmp/B.yS_Etj/BUILD/scute-1.7.0/src/options.h:28: first defined here /usr/bin/ld: .libs/scute_la-cert-object.o:/tmp/B.yS_Etj/BUILD/scute-1.7.0/src/options.h:28: multiple definition of `_scute_opt'; .libs/scute_la-debug.o:/tmp/B.yS_Etj/BUILD/scute-1.7.0/src/options.h:28: first defined here /usr/bin/ld: .libs/scute_la-gpgsm.o:/tmp/B.yS_Etj/BUILD/scute-1.7.0/src/options.h:28: multiple definition of `_scute_opt'; .libs/scute_la-debug.o:/tmp/B.yS_Etj/BUILD/scute-1.7.0/src/options.h:28: first defined here /usr/bin/ld: .libs/scute_la-p11-findobjectsinit.o:/tmp/B.yS_Etj/BUILD/scute-1.7.0/src/options.h:28: multiple definition of `_scute_opt'; .libs/scute_la-debug.o:/tmp/B.yS_Etj/BUILD/scute-1.7.0/src/options.h:28: first defined here /usr/bin/ld: .libs/scute_la-p11-initialize.o:/tmp/B.yS_Etj/BUILD/scute-1.7.0/src/options.h:28: multiple definition of `_scute_opt'; .libs/scute_la-debug.o:/tmp/B.yS_Etj/BUILD/scute-1.7.0/src/options.h:28: first defined here collect2: error: ld returned 1 exit status make[2]: *** [Makefile:836: scute.la] Error 1 make[2]: Leaving directory '/tmp/B.yS_Etj/BUILD/scute-1.7.0/src' make[1]: *** [Makefile:453: all-recursive] Error 1 make: *** [Makefile:385: all] Error 2 error: Bad exit status from /tmp/B.yS_Etj/BUILD/tmp/rpm-tmp.7340 (%build) RPM build errors: Bad exit status from /tmp/B.yS_Etj/BUILD/tmp/rpm-tmp.7340 (%build) ended at: Sun Jan 10 16:12:04 2021, done in 0:00:24.597239 error: No files produced. + chmod -R u+rwX /tmp/B.yS_Etj/BUILD + rm -rf /tmp/B.yS_Etj/tmp /tmp/B.yS_Etj/BUILD + rm -rf /tmp/B.yS_Etj Begin-PLD-Builder-Info Build-Time: user:29.43s sys:8.09s real:27.28s (faults io:15 non-io:2209156) End-PLD-Builder-Info
[Back to list of logs] [View rpm -qa of builder]