FailedOk

th/SRPMS[OK]
th/x32[OK]
th/i686[OK]
th/x86_64[OK]

ac/SRPMS[OK]
ac/i386[OK]
ac/i586[OK]
ac/i686[OK]
ac/alpha[OK]
ac/amd64[OK]
ac/athlon[OK]
ac/ppc[OK]
ac/sparc[OK]
ac/sparc64[OK]

Advanced Search
main()
Powered by PLD Linux
(c) 2002-2020 PLD Team
$Revision: 1.37 $
Powered by vim.
Your IP: 34.234.207.100

seamonkey 7cd9080b-aaa3-48bb-ac29-e4a1e28ef75d

Status:Failed
Source URL:https://buildlogs.pld-linux.org/pld/th/x32/FAIL/seamonkey,7cd9080b-aaa3-48bb-ac29-e4a1e28ef75d.bz2
text/plain URL:View!
full text:View!
rpm -qa of builder:View!
Date:2020/10/12 18:29:08
Runtime:0:00:59.376405

Toc:

  • error 1
  • mozbuild.configure.ConfigureError: The target compiler does not agree with configure about the target bitness.
  • error 2
  • make[1]: *** [/tmp/B.l_2C7P/BUILD/seamonkey-2.53.4/client.mk:362: configure] Error 1
  • error 3
  • error: Bad exit status from /tmp/B.l_2C7P/BUILD/tmp/rpm-tmp.29729 (%build)
  • error 4
  • RPM build errors:
  • error 5
  • error: No files produced.

Content:

Installing setuptools, pip, wheel...done.
running build_ext
copying build/lib.linux-x86_64-2.7/psutil/_psutil_linux.so -> psutil
copying build/lib.linux-x86_64-2.7/psutil/_psutil_posix.so -> psutil

Reexecuting in the virtualenv
Adding configure options from /tmp/B.l_2C7P/BUILD/seamonkey-2.53.4/.mozconfig
  --prefix=/usr
  --libdir=/usr/libx32
  --disable-debug
  --disable-strip
  --disable-install-strip
  --disable-tests
  --disable-crashreporter
  --disable-elf-hack
  --disable-necko-wifi
  --disable-updater
  --enable-application=suite
  --enable-calendar
  --enable-chrome-format=omni
  --enable-default-toolkit=cairo-gtk3
  --enable-dominspector
  --enable-extensions=default
  --enable-irc
  --enable-ldap
  --enable-startup-notification
  --enable-system-cairo
  --enable-system-hunspell
  --enable-system-sqlite
  --with-distribution-id=org.pld-linux
  --with-pthreads
  --with-system-bz2
  --with-system-ffi
  --with-system-icu
  --with-system-jpeg
  --with-system-libevent
  --with-system-libvpx
  --with-system-nspr
  --with-system-nss
  --with-system-pixman
  --with-system-png
  --with-system-sqlite
  --with-system-zlib
  CXXFLAGS=-O2 -fwrapv -pipe -Wformat -Werror=format-security -gdwarf-4 -fno-debug-types-section -fvar-tracking-assignments -g2 -Wp,-D_FORTIFY_SOURCE=2 -fstack-protector-strong --param=ssp-buffer-size=4 -Werror=trampolines -fPIC -mtune=generic -march=x86-64 -gdwarf-4 -fno-debug-types-section -fvar-tracking-assignments -g2  -D_FILE_OFFSET_BITS=64
  CFLAGS=-O2 -fwrapv -pipe -Wformat -Werror=format-security -gdwarf-4 -fno-debug-types-section -fvar-tracking-assignments -g2 -Wp,-D_FORTIFY_SOURCE=2 -fstack-protector-strong --param=ssp-buffer-size=4 -Werror=trampolines -fPIC -mtune=generic -march=x86-64 -gdwarf-4 -fno-debug-types-section -fvar-tracking-assignments -g2  -D_FILE_OFFSET_BITS=64
  EPOCHREALTIME=1602520111.081954
  RANDOM=25473
checking for vcs source checkout... no
checking for a shell... /bin/sh
checking for host system type... x86_64-pc-linux-gnu
checking for target system type... x86_64-pc-linux-gnu
checking whether cross compiling... no
checking for the target C compiler... /usr/bin/x86_64-pld-linux-gnux32-gcc
checking whether the target C compiler can be used... yes
checking for Python 3... /usr/bin/python3 (3.8.6)
checking for pkg_config... /usr/bin/pkg-config
checking for pkg-config version... 0.29.2
checking for yasm... /usr/bin/yasm
checking yasm version... 1.3.0
checking the target C compiler version... 10.2.0
checking the target C compiler works... yes
checking for the target C++ compiler... /usr/bin/x86_64-pld-linux-gnux32-g++
checking whether the target C++ compiler can be used... yes
checking the target C++ compiler version... 10.2.0
checking the target C++ compiler works... yes
checking for the host C compiler... /usr/bin/x86_64-pld-linux-gnux32-gcc
checking whether the host C compiler can be used... yes
checking the host C compiler version... 10.2.0
checking the host C compiler works... yes
checking for the host C++ compiler... /usr/bin/x86_64-pld-linux-gnux32-g++
checking whether the host C++ compiler can be used... yes
checking the host C++ compiler version... 10.2.0
checking the host C++ compiler works... yes
checking for 64-bit OS... no
Traceback (most recent call last):
  File "/tmp/B.l_2C7P/BUILD/seamonkey-2.53.4/configure.py", line 32, in <module>
    sys.exit(main(sys.argv))
  File "/tmp/B.l_2C7P/BUILD/seamonkey-2.53.4/configure.py", line 24, in main
    sandbox.run(os.path.join(os.path.dirname(__file__), 'moz.configure'))
  File "/tmp/B.l_2C7P/BUILD/seamonkey-2.53.4/mozilla/python/mozbuild/mozbuild/configure/__init__.py", line 449, in run
    func(*args)
  File "/tmp/B.l_2C7P/BUILD/seamonkey-2.53.4/mozilla/python/mozbuild/mozbuild/configure/__init__.py", line 493, in _value_for
    return self._value_for_depends(obj)
  File "/tmp/B.l_2C7P/BUILD/seamonkey-2.53.4/mozilla/python/mozbuild/mozbuild/util.py", line 925, in method_call
    cache[args] = self.func(instance, *args)
  File "/tmp/B.l_2C7P/BUILD/seamonkey-2.53.4/mozilla/python/mozbuild/mozbuild/configure/__init__.py", line 502, in _value_for_depends
    return obj.result()
  File "/tmp/B.l_2C7P/BUILD/seamonkey-2.53.4/mozilla/python/mozbuild/mozbuild/util.py", line 925, in method_call
    cache[args] = self.func(instance, *args)
  File "/tmp/B.l_2C7P/BUILD/seamonkey-2.53.4/mozilla/python/mozbuild/mozbuild/configure/__init__.py", line 146, in result
    return self._func(*resolved_args)
  File "/tmp/B.l_2C7P/BUILD/seamonkey-2.53.4/mozilla/python/mozbuild/mozbuild/configure/__init__.py", line 1020, in wrapped
    return new_func(*args, **kwargs)
  File "/tmp/B.l_2C7P/BUILD/seamonkey-2.53.4/mozilla/build/moz.configure/toolchain.configure", line 1069, in check_have_64_bit
    configure_error('The target compiler does not agree with configure '
  File "/tmp/B.l_2C7P/BUILD/seamonkey-2.53.4/mozilla/python/mozbuild/mozbuild/configure/__init__.py", line 1020, in wrapped
    return new_func(*args, **kwargs)
  File "/tmp/B.l_2C7P/BUILD/seamonkey-2.53.4/mozilla/build/moz.configure/util.configure", line 20, in configure_error
    raise ConfigureError(message)
mozbuild.configure.ConfigureError: The target compiler does not agree with configure about the target bitness.
*** Fix above errors and then restart with\
               "/usr/bin/make -f client.mk build"
make[1]: *** [/tmp/B.l_2C7P/BUILD/seamonkey-2.53.4/client.mk:362: configure] Error 1
make[1]: Leaving directory '/tmp/B.l_2C7P/BUILD/seamonkey-2.53.4'
make: *** [client.mk:374: /tmp/B.l_2C7P/BUILD/seamonkey-2.53.4/obj-x32/Makefile] Error 2
error: Bad exit status from /tmp/B.l_2C7P/BUILD/tmp/rpm-tmp.29729 (%build)


RPM build errors:
    Bad exit status from /tmp/B.l_2C7P/BUILD/tmp/rpm-tmp.29729 (%build)
ended at: Mon Oct 12 18:28:32 2020, done in 0:00:59.376405
error: No files produced.
+ chmod -R u+rwX /tmp/B.l_2C7P/BUILD
+ rm -rf /tmp/B.l_2C7P/tmp /tmp/B.l_2C7P/BUILD
+ rm -rf /tmp/B.l_2C7P
Begin-PLD-Builder-Info
Build-Time: user:33.84s sys:31.55s real:202.41s (faults io:0 non-io:223333)

End-PLD-Builder-Info
[Back to list of logs] [View rpm -qa of builder]