FailedOk

th/SRPMS[OK]
th/x32[OK]
th/i686[OK]
th/x86_64[OK]

ac/SRPMS[OK]
ac/i386[OK]
ac/i586[OK]
ac/i686[OK]
ac/alpha[OK]
ac/amd64[OK]
ac/athlon[OK]
ac/ppc[OK]
ac/sparc[OK]
ac/sparc64[OK]

Advanced Search
main()
Powered by PLD Linux
(c) 2002-2018 PLD Team
$Revision: 1.37 $
Powered by Real Operating System.
Your IP: 35.172.201.102

sleuthkit 51334c5a-1cf6-4b43-944d-3579a3bf9c0c

Status:Failed
Source URL:ftp://buildlogs.pld-linux.org/th/x32/FAIL/sleuthkit,51334c5a-1cf6-4b43-944d-3579a3bf9c0c.bz2
text/plain URL:View!
full text:View!
rpm -qa of builder:View!
Date:2018/11/26 00:26:15
Runtime:0:01:15.797902

Toc:

  • error 1
  • "%s: Error: Index line length is zero",
  • error 2
  • make[2]: *** [Makefile:707: all-local] Error 1
  • error 3
  • make[1]: *** [Makefile:433: all-recursive] Error 1
  • error 4
  • error: Bad exit status from /tmp/B.JWIKG9/BUILD/tmp/rpm-tmp.24799 (%build)
  • error 5
  • RPM build errors:
  • error 6
  • error: No files produced.

Content:

ntfs.c: In function 'is_clustalloc':
ntfs.c:527:17: warning: comparison of integer expressions of different signedness: 'ssize_t' {aka 'int'} and 'unsigned int' [-Wsign-compare]
         if (cnt != ntfs->fs_info.block_size) {
                 ^~
ntfs.c: In function 'ntfs_proc_compunit':
ntfs.c:1153:21: warning: comparison of integer expressions of different signedness: 'ssize_t' {aka 'int'} and 'unsigned int' [-Wsign-compare]
             if (cnt != fs->block_size) {
                     ^~
ntfs.c:1184:21: warning: comparison of integer expressions of different signedness: 'ssize_t' {aka 'int'} and 'unsigned int' [-Wsign-compare]
             if (cnt != fs->block_size) {
                     ^~
ntfs.c: In function 'ntfs_load_bmap':
ntfs.c:3092:13: warning: comparison of integer expressions of different signedness: 'ssize_t' {aka 'int'} and 'unsigned int' [-Wsign-compare]
     if (cnt != fs->block_size) {
             ^~
ntfs.c: In function 'ntfs_open':
ntfs.c:4974:13: warning: comparison of integer expressions of different signedness: 'ssize_t' {aka 'int'} and 'unsigned int' [-Wsign-compare]
     if (cnt != len) {
             ^~
libtool: compile:  x86_64-pld-linux-gnux32-gcc -DHAVE_CONFIG_H -I. -I../../tsk -I../.. -I./../.. -pthread -I/usr/local/include -Wall -Wextra -Wno-unused-parameter -O2 -fwrapv -pipe -Wformat -Werror=format-security -gdwarf-4 -fno-debug-types-section -fvar-tracking-assignments -g2 -Wp,-D_FORTIFY_SOURCE=2 -fstack-protector-strong --param=ssp-buffer-size=4 -fPIC -mtune=generic -march=x86-64 -gdwarf-4 -fno-debug-types-section -fvar-tracking-assignments -g2 -MT ntfs.lo -MD -MP -MF .deps/ntfs.Tpo -c ntfs.c -o ntfs.o >/dev/null 2>&1
mv -f .deps/ntfs.Tpo .deps/ntfs.Plo
make[3]: Leaving directory '/tmp/B.JWIKG9/BUILD/sleuthkit-4.6.4/tsk/fs'
make[3]: Entering directory '/tmp/B.JWIKG9/BUILD/sleuthkit-4.6.4/tsk/fs'
/bin/sh ../../libtool  --tag=CC   --mode=compile x86_64-pld-linux-gnux32-gcc -DHAVE_CONFIG_H -I. -I../../tsk  -I../.. -I./../.. -pthread -I/usr/local/include -Wall -Wextra -Wno-unused-parameter -O2 -fwrapv -pipe -Wformat -Werror=format-security -gdwarf-4 -fno-debug-types-section -fvar-tracking-assignments -g2 -Wp,-D_FORTIFY_SOURCE=2 -fstack-protector-strong --param=ssp-buffer-size=4 -fPIC -mtune=generic -march=x86-64 -gdwarf-4 -fno-debug-types-section -fvar-tracking-assignments -g2  -MT hfs.lo -MD -MP -MF .deps/hfs.Tpo -c -o hfs.lo hfs.c
libtool: compile:  x86_64-pld-linux-gnux32-gcc -DHAVE_CONFIG_H -I. -I../../tsk -I../.. -I./../.. -pthread -I/usr/local/include -Wall -Wextra -Wno-unused-parameter -O2 -fwrapv -pipe -Wformat -Werror=format-security -gdwarf-4 -fno-debug-types-section -fvar-tracking-assignments -g2 -Wp,-D_FORTIFY_SOURCE=2 -fstack-protector-strong --param=ssp-buffer-size=4 -fPIC -mtune=generic -march=x86-64 -gdwarf-4 -fno-debug-types-section -fvar-tracking-assignments -g2 -MT hfs.lo -MD -MP -MF .deps/hfs.Tpo -c hfs.c  -fPIC -DPIC -o .libs/hfs.o
libtool: compile:  x86_64-pld-linux-gnux32-gcc -DHAVE_CONFIG_H -I. -I../../tsk -I../.. -I./../.. -pthread -I/usr/local/include -Wall -Wextra -Wno-unused-parameter -O2 -fwrapv -pipe -Wformat -Werror=format-security -gdwarf-4 -fno-debug-types-section -fvar-tracking-assignments -g2 -Wp,-D_FORTIFY_SOURCE=2 -fstack-protector-strong --param=ssp-buffer-size=4 -fPIC -mtune=generic -march=x86-64 -gdwarf-4 -fno-debug-types-section -fvar-tracking-assignments -g2 -MT hfs.lo -MD -MP -MF .deps/hfs.Tpo -c hfs.c -o hfs.o >/dev/null 2>&1
mv -f .deps/hfs.Tpo .deps/hfs.Plo
make[3]: Leaving directory '/tmp/B.JWIKG9/BUILD/sleuthkit-4.6.4/tsk/fs'
make[3]: Entering directory '/tmp/B.JWIKG9/BUILD/sleuthkit-4.6.4/tsk/fs'
/bin/sh ../../libtool  --tag=CXX   --mode=compile x86_64-pld-linux-gnux32-g++ -DHAVE_CONFIG_H -I. -I../../tsk  -I../.. -I./../.. -pthread -I/usr/local/include -Wall -Wextra -Wno-unused-parameter -O2 -fwrapv -pipe -Wformat -Werror=format-security -gdwarf-4 -fno-debug-types-section -fvar-tracking-assignments -g2 -Wp,-D_FORTIFY_SOURCE=2 -fstack-protector-strong --param=ssp-buffer-size=4 -fPIC -mtune=generic -march=x86-64 -gdwarf-4 -fno-debug-types-section -fvar-tracking-assignments -g2  -MT yaffs.lo -MD -MP -MF .deps/yaffs.Tpo -c -o yaffs.lo yaffs.cpp
libtool: compile:  x86_64-pld-linux-gnux32-g++ -DHAVE_CONFIG_H -I. -I../../tsk -I../.. -I./../.. -pthread -I/usr/local/include -Wall -Wextra -Wno-unused-parameter -O2 -fwrapv -pipe -Wformat -Werror=format-security -gdwarf-4 -fno-debug-types-section -fvar-tracking-assignments -g2 -Wp,-D_FORTIFY_SOURCE=2 -fstack-protector-strong --param=ssp-buffer-size=4 -fPIC -mtune=generic -march=x86-64 -gdwarf-4 -fno-debug-types-section -fvar-tracking-assignments -g2 -MT yaffs.lo -MD -MP -MF .deps/yaffs.Tpo -c yaffs.cpp  -fPIC -DPIC -o .libs/yaffs.o
yaffs.cpp: In function 'TSK_RETVAL_ENUM yaffscache_obj_id_and_version_to_inode(uint32_t, uint32_t, TSK_INUM_T*)':
yaffs.cpp:89:17: warning: format '%llu' expects argument of type 'long long unsigned int', but argument 2 has type 'uint32_t' {aka 'unsigned int'} [-Wformat=]
                 "yaffsfs_parse_image_load_cache: Max object ID %" PRIuOFF " is invalid", obj_id);
                 ^~~~~~~~~~~~~~~~~~~~~~~~~~~~~~~~~~~~~~~~~~~~~~~~~~~~~~~~~~~~~~~~~~~~~~~  ~~~~~~
yaffs.cpp:97:17: warning: format '%llu' expects argument of type 'long long unsigned int', but argument 2 has type 'uint32_t' {aka 'unsigned int'} [-Wformat=]
                 "yaffsfs_parse_image_load_cache: Max version number %" PRIuOFF " is invalid", version_num);
                 ^~~~~~~~~~~~~~~~~~~~~~~~~~~~~~~~~~~~~~~~~~~~~~~~~~~~~~~~~~~~~~~~~~~~~~~~~~~~  ~~~~~~~~~~~
libtool: compile:  x86_64-pld-linux-gnux32-g++ -DHAVE_CONFIG_H -I. -I../../tsk -I../.. -I./../.. -pthread -I/usr/local/include -Wall -Wextra -Wno-unused-parameter -O2 -fwrapv -pipe -Wformat -Werror=format-security -gdwarf-4 -fno-debug-types-section -fvar-tracking-assignments -g2 -Wp,-D_FORTIFY_SOURCE=2 -fstack-protector-strong --param=ssp-buffer-size=4 -fPIC -mtune=generic -march=x86-64 -gdwarf-4 -fno-debug-types-section -fvar-tracking-assignments -g2 -MT yaffs.lo -MD -MP -MF .deps/yaffs.Tpo -c yaffs.cpp -o yaffs.o >/dev/null 2>&1
mv -f .deps/yaffs.Tpo .deps/yaffs.Plo
make[3]: Leaving directory '/tmp/B.JWIKG9/BUILD/sleuthkit-4.6.4/tsk/fs'
make[3]: Entering directory '/tmp/B.JWIKG9/BUILD/sleuthkit-4.6.4/tsk/fs'
/bin/sh ../../libtool  --tag=CXX   --mode=link x86_64-pld-linux-gnux32-g++ -Wall -Wextra -Wno-unused-parameter -O2 -fwrapv -pipe -Wformat -Werror=format-security -gdwarf-4 -fno-debug-types-section -fvar-tracking-assignments -g2 -Wp,-D_FORTIFY_SOURCE=2 -fstack-protector-strong --param=ssp-buffer-size=4 -fPIC -mtune=generic -march=x86-64 -gdwarf-4 -fno-debug-types-section -fvar-tracking-assignments -g2   -Wl,--as-needed -Wl,--no-copy-dt-needed-entries -Wl,-z,relro -Wl,-z,combreloc  -pthread -L/usr/local/lib -o libtskfs.la  fs_inode.lo fs_io.lo fs_block.lo fs_open.lo fs_name.lo fs_dir.lo fs_types.lo fs_attr.lo fs_attrlist.lo fs_load.lo fs_parse.lo fs_file.lo unix_misc.lo nofs_misc.lo ffs.lo ffs_dent.lo ext2fs.lo ext2fs_dent.lo ext2fs_journal.lo fatfs.lo fatfs_meta.lo fatfs_dent.lo fatxxfs.lo fatxxfs_meta.lo fatxxfs_dent.lo exfatfs.lo exfatfs_meta.lo exfatfs_dent.lo fatfs_utils.lo ntfs.lo ntfs_dent.lo swapfs.lo rawfs.lo iso9660.lo iso9660_dent.lo hfs.lo hfs_dent.lo hfs_journal.lo hfs_unicompare.lo lzvn.lo dcalc_lib.lo dcat_lib.lo dls_lib.lo dstat_lib.lo ffind_lib.lo fls_lib.lo icat_lib.lo ifind_lib.lo ils_lib.lo usn_journal.lo usnjls_lib.lo walk_cpp.lo yaffs.lo  -lewf -ldl -lz -lafflib -lpq -lsqlite3 -ldl -lstdc++ 
libtool: link: ar cru .libs/libtskfs.a .libs/fs_inode.o .libs/fs_io.o .libs/fs_block.o .libs/fs_open.o .libs/fs_name.o .libs/fs_dir.o .libs/fs_types.o .libs/fs_attr.o .libs/fs_attrlist.o .libs/fs_load.o .libs/fs_parse.o .libs/fs_file.o .libs/unix_misc.o .libs/nofs_misc.o .libs/ffs.o .libs/ffs_dent.o .libs/ext2fs.o .libs/ext2fs_dent.o .libs/ext2fs_journal.o .libs/fatfs.o .libs/fatfs_meta.o .libs/fatfs_dent.o .libs/fatxxfs.o .libs/fatxxfs_meta.o .libs/fatxxfs_dent.o .libs/exfatfs.o .libs/exfatfs_meta.o .libs/exfatfs_dent.o .libs/fatfs_utils.o .libs/ntfs.o .libs/ntfs_dent.o .libs/swapfs.o .libs/rawfs.o .libs/iso9660.o .libs/iso9660_dent.o .libs/hfs.o .libs/hfs_dent.o .libs/hfs_journal.o .libs/hfs_unicompare.o .libs/lzvn.o .libs/dcalc_lib.o .libs/dcat_lib.o .libs/dls_lib.o .libs/dstat_lib.o .libs/ffind_lib.o .libs/fls_lib.o .libs/icat_lib.o .libs/ifind_lib.o .libs/ils_lib.o .libs/usn_journal.o .libs/usnjls_lib.o .libs/walk_cpp.o .libs/yaffs.o 
libtool: link: ranlib .libs/libtskfs.a
libtool: link: ( cd ".libs" && rm -f "libtskfs.la" && ln -s "../libtskfs.la" "libtskfs.la" )
make[3]: Leaving directory '/tmp/B.JWIKG9/BUILD/sleuthkit-4.6.4/tsk/fs'
Making all in hashdb
make[3]: Entering directory '/tmp/B.JWIKG9/BUILD/sleuthkit-4.6.4/tsk/hashdb'
/bin/sh ../../libtool  --tag=CC   --mode=compile x86_64-pld-linux-gnux32-gcc -DHAVE_CONFIG_H -I. -I../../tsk  -I../.. -I./../.. -pthread -I/usr/local/include -Wall -Wextra -Wno-unused-parameter -O2 -fwrapv -pipe -Wformat -Werror=format-security -gdwarf-4 -fno-debug-types-section -fvar-tracking-assignments -g2 -Wp,-D_FORTIFY_SOURCE=2 -fstack-protector-strong --param=ssp-buffer-size=4 -fPIC -mtune=generic -march=x86-64 -gdwarf-4 -fno-debug-types-section -fvar-tracking-assignments -g2  -MT hdb_base.lo -MD -MP -MF .deps/hdb_base.Tpo -c -o hdb_base.lo hdb_base.c
libtool: compile:  x86_64-pld-linux-gnux32-gcc -DHAVE_CONFIG_H -I. -I../../tsk -I../.. -I./../.. -pthread -I/usr/local/include -Wall -Wextra -Wno-unused-parameter -O2 -fwrapv -pipe -Wformat -Werror=format-security -gdwarf-4 -fno-debug-types-section -fvar-tracking-assignments -g2 -Wp,-D_FORTIFY_SOURCE=2 -fstack-protector-strong --param=ssp-buffer-size=4 -fPIC -mtune=generic -march=x86-64 -gdwarf-4 -fno-debug-types-section -fvar-tracking-assignments -g2 -MT hdb_base.lo -MD -MP -MF .deps/hdb_base.Tpo -c hdb_base.c  -fPIC -DPIC -o .libs/hdb_base.o
libtool: compile:  x86_64-pld-linux-gnux32-gcc -DHAVE_CONFIG_H -I. -I../../tsk -I../.. -I./../.. -pthread -I/usr/local/include -Wall -Wextra -Wno-unused-parameter -O2 -fwrapv -pipe -Wformat -Werror=format-security -gdwarf-4 -fno-debug-types-section -fvar-tracking-assignments -g2 -Wp,-D_FORTIFY_SOURCE=2 -fstack-protector-strong --param=ssp-buffer-size=4 -fPIC -mtune=generic -march=x86-64 -gdwarf-4 -fno-debug-types-section -fvar-tracking-assignments -g2 -MT hdb_base.lo -MD -MP -MF .deps/hdb_base.Tpo -c hdb_base.c -o hdb_base.o >/dev/null 2>&1
mv -f .deps/hdb_base.Tpo .deps/hdb_base.Plo
make[3]: Leaving directory '/tmp/B.JWIKG9/BUILD/sleuthkit-4.6.4/tsk/hashdb'
make[3]: Entering directory '/tmp/B.JWIKG9/BUILD/sleuthkit-4.6.4/tsk/hashdb'
/bin/sh ../../libtool  --tag=CC   --mode=compile x86_64-pld-linux-gnux32-gcc -DHAVE_CONFIG_H -I. -I../../tsk  -I../.. -I./../.. -pthread -I/usr/local/include -Wall -Wextra -Wno-unused-parameter -O2 -fwrapv -pipe -Wformat -Werror=format-security -gdwarf-4 -fno-debug-types-section -fvar-tracking-assignments -g2 -Wp,-D_FORTIFY_SOURCE=2 -fstack-protector-strong --param=ssp-buffer-size=4 -fPIC -mtune=generic -march=x86-64 -gdwarf-4 -fno-debug-types-section -fvar-tracking-assignments -g2  -MT idxonly.lo -MD -MP -MF .deps/idxonly.Tpo -c -o idxonly.lo idxonly.c
libtool: compile:  x86_64-pld-linux-gnux32-gcc -DHAVE_CONFIG_H -I. -I../../tsk -I../.. -I./../.. -pthread -I/usr/local/include -Wall -Wextra -Wno-unused-parameter -O2 -fwrapv -pipe -Wformat -Werror=format-security -gdwarf-4 -fno-debug-types-section -fvar-tracking-assignments -g2 -Wp,-D_FORTIFY_SOURCE=2 -fstack-protector-strong --param=ssp-buffer-size=4 -fPIC -mtune=generic -march=x86-64 -gdwarf-4 -fno-debug-types-section -fvar-tracking-assignments -g2 -MT idxonly.lo -MD -MP -MF .deps/idxonly.Tpo -c idxonly.c  -fPIC -DPIC -o .libs/idxonly.o
libtool: compile:  x86_64-pld-linux-gnux32-gcc -DHAVE_CONFIG_H -I. -I../../tsk -I../.. -I./../.. -pthread -I/usr/local/include -Wall -Wextra -Wno-unused-parameter -O2 -fwrapv -pipe -Wformat -Werror=format-security -gdwarf-4 -fno-debug-types-section -fvar-tracking-assignments -g2 -Wp,-D_FORTIFY_SOURCE=2 -fstack-protector-strong --param=ssp-buffer-size=4 -fPIC -mtune=generic -march=x86-64 -gdwarf-4 -fno-debug-types-section -fvar-tracking-assignments -g2 -MT idxonly.lo -MD -MP -MF .deps/idxonly.Tpo -c idxonly.c -o idxonly.o >/dev/null 2>&1
mv -f .deps/idxonly.Tpo .deps/idxonly.Plo
make[3]: Leaving directory '/tmp/B.JWIKG9/BUILD/sleuthkit-4.6.4/tsk/hashdb'
make[3]: Entering directory '/tmp/B.JWIKG9/BUILD/sleuthkit-4.6.4/tsk/hashdb'
/bin/sh ../../libtool  --tag=CC   --mode=compile x86_64-pld-linux-gnux32-gcc -DHAVE_CONFIG_H -I. -I../../tsk  -I../.. -I./../.. -pthread -I/usr/local/include -Wall -Wextra -Wno-unused-parameter -O2 -fwrapv -pipe -Wformat -Werror=format-security -gdwarf-4 -fno-debug-types-section -fvar-tracking-assignments -g2 -Wp,-D_FORTIFY_SOURCE=2 -fstack-protector-strong --param=ssp-buffer-size=4 -fPIC -mtune=generic -march=x86-64 -gdwarf-4 -fno-debug-types-section -fvar-tracking-assignments -g2  -MT md5sum.lo -MD -MP -MF .deps/md5sum.Tpo -c -o md5sum.lo md5sum.c
libtool: compile:  x86_64-pld-linux-gnux32-gcc -DHAVE_CONFIG_H -I. -I../../tsk -I../.. -I./../.. -pthread -I/usr/local/include -Wall -Wextra -Wno-unused-parameter -O2 -fwrapv -pipe -Wformat -Werror=format-security -gdwarf-4 -fno-debug-types-section -fvar-tracking-assignments -g2 -Wp,-D_FORTIFY_SOURCE=2 -fstack-protector-strong --param=ssp-buffer-size=4 -fPIC -mtune=generic -march=x86-64 -gdwarf-4 -fno-debug-types-section -fvar-tracking-assignments -g2 -MT md5sum.lo -MD -MP -MF .deps/md5sum.Tpo -c md5sum.c  -fPIC -DPIC -o .libs/md5sum.o
libtool: compile:  x86_64-pld-linux-gnux32-gcc -DHAVE_CONFIG_H -I. -I../../tsk -I../.. -I./../.. -pthread -I/usr/local/include -Wall -Wextra -Wno-unused-parameter -O2 -fwrapv -pipe -Wformat -Werror=format-security -gdwarf-4 -fno-debug-types-section -fvar-tracking-assignments -g2 -Wp,-D_FORTIFY_SOURCE=2 -fstack-protector-strong --param=ssp-buffer-size=4 -fPIC -mtune=generic -march=x86-64 -gdwarf-4 -fno-debug-types-section -fvar-tracking-assignments -g2 -MT md5sum.lo -MD -MP -MF .deps/md5sum.Tpo -c md5sum.c -o md5sum.o >/dev/null 2>&1
mv -f .deps/md5sum.Tpo .deps/md5sum.Plo
make[3]: Leaving directory '/tmp/B.JWIKG9/BUILD/sleuthkit-4.6.4/tsk/hashdb'
make[3]: Entering directory '/tmp/B.JWIKG9/BUILD/sleuthkit-4.6.4/tsk/hashdb'
/bin/sh ../../libtool  --tag=CC   --mode=compile x86_64-pld-linux-gnux32-gcc -DHAVE_CONFIG_H -I. -I../../tsk  -I../.. -I./../.. -pthread -I/usr/local/include -Wall -Wextra -Wno-unused-parameter -O2 -fwrapv -pipe -Wformat -Werror=format-security -gdwarf-4 -fno-debug-types-section -fvar-tracking-assignments -g2 -Wp,-D_FORTIFY_SOURCE=2 -fstack-protector-strong --param=ssp-buffer-size=4 -fPIC -mtune=generic -march=x86-64 -gdwarf-4 -fno-debug-types-section -fvar-tracking-assignments -g2  -MT encase.lo -MD -MP -MF .deps/encase.Tpo -c -o encase.lo encase.c
libtool: compile:  x86_64-pld-linux-gnux32-gcc -DHAVE_CONFIG_H -I. -I../../tsk -I../.. -I./../.. -pthread -I/usr/local/include -Wall -Wextra -Wno-unused-parameter -O2 -fwrapv -pipe -Wformat -Werror=format-security -gdwarf-4 -fno-debug-types-section -fvar-tracking-assignments -g2 -Wp,-D_FORTIFY_SOURCE=2 -fstack-protector-strong --param=ssp-buffer-size=4 -fPIC -mtune=generic -march=x86-64 -gdwarf-4 -fno-debug-types-section -fvar-tracking-assignments -g2 -MT encase.lo -MD -MP -MF .deps/encase.Tpo -c encase.c  -fPIC -DPIC -o .libs/encase.o
encase.c: In function 'encase_name':
encase.c:62:5: warning: 'memset' used with length equal to number of elements without multiplication by element size [-Wmemset-elt-size]
     memset(buf, '\0', 40);
     ^~~~~~
libtool: compile:  x86_64-pld-linux-gnux32-gcc -DHAVE_CONFIG_H -I. -I../../tsk -I../.. -I./../.. -pthread -I/usr/local/include -Wall -Wextra -Wno-unused-parameter -O2 -fwrapv -pipe -Wformat -Werror=format-security -gdwarf-4 -fno-debug-types-section -fvar-tracking-assignments -g2 -Wp,-D_FORTIFY_SOURCE=2 -fstack-protector-strong --param=ssp-buffer-size=4 -fPIC -mtune=generic -march=x86-64 -gdwarf-4 -fno-debug-types-section -fvar-tracking-assignments -g2 -MT encase.lo -MD -MP -MF .deps/encase.Tpo -c encase.c -o encase.o >/dev/null 2>&1
mv -f .deps/encase.Tpo .deps/encase.Plo
make[3]: Leaving directory '/tmp/B.JWIKG9/BUILD/sleuthkit-4.6.4/tsk/hashdb'
make[3]: Entering directory '/tmp/B.JWIKG9/BUILD/sleuthkit-4.6.4/tsk/hashdb'
/bin/sh ../../libtool  --tag=CC   --mode=compile x86_64-pld-linux-gnux32-gcc -DHAVE_CONFIG_H -I. -I../../tsk  -I../.. -I./../.. -pthread -I/usr/local/include -Wall -Wextra -Wno-unused-parameter -O2 -fwrapv -pipe -Wformat -Werror=format-security -gdwarf-4 -fno-debug-types-section -fvar-tracking-assignments -g2 -Wp,-D_FORTIFY_SOURCE=2 -fstack-protector-strong --param=ssp-buffer-size=4 -fPIC -mtune=generic -march=x86-64 -gdwarf-4 -fno-debug-types-section -fvar-tracking-assignments -g2  -MT nsrl.lo -MD -MP -MF .deps/nsrl.Tpo -c -o nsrl.lo nsrl.c
libtool: compile:  x86_64-pld-linux-gnux32-gcc -DHAVE_CONFIG_H -I. -I../../tsk -I../.. -I./../.. -pthread -I/usr/local/include -Wall -Wextra -Wno-unused-parameter -O2 -fwrapv -pipe -Wformat -Werror=format-security -gdwarf-4 -fno-debug-types-section -fvar-tracking-assignments -g2 -Wp,-D_FORTIFY_SOURCE=2 -fstack-protector-strong --param=ssp-buffer-size=4 -fPIC -mtune=generic -march=x86-64 -gdwarf-4 -fno-debug-types-section -fvar-tracking-assignments -g2 -MT nsrl.lo -MD -MP -MF .deps/nsrl.Tpo -c nsrl.c  -fPIC -DPIC -o .libs/nsrl.o
libtool: compile:  x86_64-pld-linux-gnux32-gcc -DHAVE_CONFIG_H -I. -I../../tsk -I../.. -I./../.. -pthread -I/usr/local/include -Wall -Wextra -Wno-unused-parameter -O2 -fwrapv -pipe -Wformat -Werror=format-security -gdwarf-4 -fno-debug-types-section -fvar-tracking-assignments -g2 -Wp,-D_FORTIFY_SOURCE=2 -fstack-protector-strong --param=ssp-buffer-size=4 -fPIC -mtune=generic -march=x86-64 -gdwarf-4 -fno-debug-types-section -fvar-tracking-assignments -g2 -MT nsrl.lo -MD -MP -MF .deps/nsrl.Tpo -c nsrl.c -o nsrl.o >/dev/null 2>&1
mv -f .deps/nsrl.Tpo .deps/nsrl.Plo
make[3]: Leaving directory '/tmp/B.JWIKG9/BUILD/sleuthkit-4.6.4/tsk/hashdb'
make[3]: Entering directory '/tmp/B.JWIKG9/BUILD/sleuthkit-4.6.4/tsk/hashdb'
/bin/sh ../../libtool  --tag=CC   --mode=compile x86_64-pld-linux-gnux32-gcc -DHAVE_CONFIG_H -I. -I../../tsk  -I../.. -I./../.. -pthread -I/usr/local/include -Wall -Wextra -Wno-unused-parameter -O2 -fwrapv -pipe -Wformat -Werror=format-security -gdwarf-4 -fno-debug-types-section -fvar-tracking-assignments -g2 -Wp,-D_FORTIFY_SOURCE=2 -fstack-protector-strong --param=ssp-buffer-size=4 -fPIC -mtune=generic -march=x86-64 -gdwarf-4 -fno-debug-types-section -fvar-tracking-assignments -g2  -MT hashkeeper.lo -MD -MP -MF .deps/hashkeeper.Tpo -c -o hashkeeper.lo hashkeeper.c
libtool: compile:  x86_64-pld-linux-gnux32-gcc -DHAVE_CONFIG_H -I. -I../../tsk -I../.. -I./../.. -pthread -I/usr/local/include -Wall -Wextra -Wno-unused-parameter -O2 -fwrapv -pipe -Wformat -Werror=format-security -gdwarf-4 -fno-debug-types-section -fvar-tracking-assignments -g2 -Wp,-D_FORTIFY_SOURCE=2 -fstack-protector-strong --param=ssp-buffer-size=4 -fPIC -mtune=generic -march=x86-64 -gdwarf-4 -fno-debug-types-section -fvar-tracking-assignments -g2 -MT hashkeeper.lo -MD -MP -MF .deps/hashkeeper.Tpo -c hashkeeper.c  -fPIC -DPIC -o .libs/hashkeeper.o
libtool: compile:  x86_64-pld-linux-gnux32-gcc -DHAVE_CONFIG_H -I. -I../../tsk -I../.. -I./../.. -pthread -I/usr/local/include -Wall -Wextra -Wno-unused-parameter -O2 -fwrapv -pipe -Wformat -Werror=format-security -gdwarf-4 -fno-debug-types-section -fvar-tracking-assignments -g2 -Wp,-D_FORTIFY_SOURCE=2 -fstack-protector-strong --param=ssp-buffer-size=4 -fPIC -mtune=generic -march=x86-64 -gdwarf-4 -fno-debug-types-section -fvar-tracking-assignments -g2 -MT hashkeeper.lo -MD -MP -MF .deps/hashkeeper.Tpo -c hashkeeper.c -o hashkeeper.o >/dev/null 2>&1
mv -f .deps/hashkeeper.Tpo .deps/hashkeeper.Plo
make[3]: Leaving directory '/tmp/B.JWIKG9/BUILD/sleuthkit-4.6.4/tsk/hashdb'
make[3]: Entering directory '/tmp/B.JWIKG9/BUILD/sleuthkit-4.6.4/tsk/hashdb'
/bin/sh ../../libtool  --tag=CC   --mode=compile x86_64-pld-linux-gnux32-gcc -DHAVE_CONFIG_H -I. -I../../tsk  -I../.. -I./../.. -pthread -I/usr/local/include -Wall -Wextra -Wno-unused-parameter -O2 -fwrapv -pipe -Wformat -Werror=format-security -gdwarf-4 -fno-debug-types-section -fvar-tracking-assignments -g2 -Wp,-D_FORTIFY_SOURCE=2 -fstack-protector-strong --param=ssp-buffer-size=4 -fPIC -mtune=generic -march=x86-64 -gdwarf-4 -fno-debug-types-section -fvar-tracking-assignments -g2  -MT tsk_hashdb.lo -MD -MP -MF .deps/tsk_hashdb.Tpo -c -o tsk_hashdb.lo tsk_hashdb.c
libtool: compile:  x86_64-pld-linux-gnux32-gcc -DHAVE_CONFIG_H -I. -I../../tsk -I../.. -I./../.. -pthread -I/usr/local/include -Wall -Wextra -Wno-unused-parameter -O2 -fwrapv -pipe -Wformat -Werror=format-security -gdwarf-4 -fno-debug-types-section -fvar-tracking-assignments -g2 -Wp,-D_FORTIFY_SOURCE=2 -fstack-protector-strong --param=ssp-buffer-size=4 -fPIC -mtune=generic -march=x86-64 -gdwarf-4 -fno-debug-types-section -fvar-tracking-assignments -g2 -MT tsk_hashdb.lo -MD -MP -MF .deps/tsk_hashdb.Tpo -c tsk_hashdb.c  -fPIC -DPIC -o .libs/tsk_hashdb.o
libtool: compile:  x86_64-pld-linux-gnux32-gcc -DHAVE_CONFIG_H -I. -I../../tsk -I../.. -I./../.. -pthread -I/usr/local/include -Wall -Wextra -Wno-unused-parameter -O2 -fwrapv -pipe -Wformat -Werror=format-security -gdwarf-4 -fno-debug-types-section -fvar-tracking-assignments -g2 -Wp,-D_FORTIFY_SOURCE=2 -fstack-protector-strong --param=ssp-buffer-size=4 -fPIC -mtune=generic -march=x86-64 -gdwarf-4 -fno-debug-types-section -fvar-tracking-assignments -g2 -MT tsk_hashdb.lo -MD -MP -MF .deps/tsk_hashdb.Tpo -c tsk_hashdb.c -o tsk_hashdb.o >/dev/null 2>&1
mv -f .deps/tsk_hashdb.Tpo .deps/tsk_hashdb.Plo
make[3]: Leaving directory '/tmp/B.JWIKG9/BUILD/sleuthkit-4.6.4/tsk/hashdb'
make[3]: Entering directory '/tmp/B.JWIKG9/BUILD/sleuthkit-4.6.4/tsk/hashdb'
/bin/sh ../../libtool  --tag=CXX   --mode=compile x86_64-pld-linux-gnux32-g++ -DHAVE_CONFIG_H -I. -I../../tsk  -I../.. -I./../.. -pthread -I/usr/local/include -Wall -Wextra -Wno-unused-parameter -O2 -fwrapv -pipe -Wformat -Werror=format-security -gdwarf-4 -fno-debug-types-section -fvar-tracking-assignments -g2 -Wp,-D_FORTIFY_SOURCE=2 -fstack-protector-strong --param=ssp-buffer-size=4 -fPIC -mtune=generic -march=x86-64 -gdwarf-4 -fno-debug-types-section -fvar-tracking-assignments -g2  -MT binsrch_index.lo -MD -MP -MF .deps/binsrch_index.Tpo -c -o binsrch_index.lo binsrch_index.cpp
libtool: compile:  x86_64-pld-linux-gnux32-g++ -DHAVE_CONFIG_H -I. -I../../tsk -I../.. -I./../.. -pthread -I/usr/local/include -Wall -Wextra -Wno-unused-parameter -O2 -fwrapv -pipe -Wformat -Werror=format-security -gdwarf-4 -fno-debug-types-section -fvar-tracking-assignments -g2 -Wp,-D_FORTIFY_SOURCE=2 -fstack-protector-strong --param=ssp-buffer-size=4 -fPIC -mtune=generic -march=x86-64 -gdwarf-4 -fno-debug-types-section -fvar-tracking-assignments -g2 -MT binsrch_index.lo -MD -MP -MF .deps/binsrch_index.Tpo -c binsrch_index.cpp  -fPIC -DPIC -o .libs/binsrch_index.o
binsrch_index.cpp: In function 'int8_t hdb_binsrch_lookup_str(TSK_HDB_INFO*, const char*, TSK_HDB_FLAG_ENUM, TSK_HDB_LOOKUP_FN, void*)':
binsrch_index.cpp:1153:13: warning: too many arguments for format [-Wformat-extra-args]
             "%s: Error: Index line length is zero",
             ^~~~~~~~~~~~~~~~~~~~~~~~~~~~~~~~~~~~~~
libtool: compile:  x86_64-pld-linux-gnux32-g++ -DHAVE_CONFIG_H -I. -I../../tsk -I../.. -I./../.. -pthread -I/usr/local/include -Wall -Wextra -Wno-unused-parameter -O2 -fwrapv -pipe -Wformat -Werror=format-security -gdwarf-4 -fno-debug-types-section -fvar-tracking-assignments -g2 -Wp,-D_FORTIFY_SOURCE=2 -fstack-protector-strong --param=ssp-buffer-size=4 -fPIC -mtune=generic -march=x86-64 -gdwarf-4 -fno-debug-types-section -fvar-tracking-assignments -g2 -MT binsrch_index.lo -MD -MP -MF .deps/binsrch_index.Tpo -c binsrch_index.cpp -o binsrch_index.o >/dev/null 2>&1
mv -f .deps/binsrch_index.Tpo .deps/binsrch_index.Plo
make[3]: Leaving directory '/tmp/B.JWIKG9/BUILD/sleuthkit-4.6.4/tsk/hashdb'
make[3]: Entering directory '/tmp/B.JWIKG9/BUILD/sleuthkit-4.6.4/tsk/hashdb'
/bin/sh ../../libtool  --tag=CXX   --mode=compile x86_64-pld-linux-gnux32-g++ -DHAVE_CONFIG_H -I. -I../../tsk  -I../.. -I./../.. -pthread -I/usr/local/include -Wall -Wextra -Wno-unused-parameter -O2 -fwrapv -pipe -Wformat -Werror=format-security -gdwarf-4 -fno-debug-types-section -fvar-tracking-assignments -g2 -Wp,-D_FORTIFY_SOURCE=2 -fstack-protector-strong --param=ssp-buffer-size=4 -fPIC -mtune=generic -march=x86-64 -gdwarf-4 -fno-debug-types-section -fvar-tracking-assignments -g2  -MT sqlite_hdb.lo -MD -MP -MF .deps/sqlite_hdb.Tpo -c -o sqlite_hdb.lo sqlite_hdb.cpp
libtool: compile:  x86_64-pld-linux-gnux32-g++ -DHAVE_CONFIG_H -I. -I../../tsk -I../.. -I./../.. -pthread -I/usr/local/include -Wall -Wextra -Wno-unused-parameter -O2 -fwrapv -pipe -Wformat -Werror=format-security -gdwarf-4 -fno-debug-types-section -fvar-tracking-assignments -g2 -Wp,-D_FORTIFY_SOURCE=2 -fstack-protector-strong --param=ssp-buffer-size=4 -fPIC -mtune=generic -march=x86-64 -gdwarf-4 -fno-debug-types-section -fvar-tracking-assignments -g2 -MT sqlite_hdb.lo -MD -MP -MF .deps/sqlite_hdb.Tpo -c sqlite_hdb.cpp  -fPIC -DPIC -o .libs/sqlite_hdb.o
libtool: compile:  x86_64-pld-linux-gnux32-g++ -DHAVE_CONFIG_H -I. -I../../tsk -I../.. -I./../.. -pthread -I/usr/local/include -Wall -Wextra -Wno-unused-parameter -O2 -fwrapv -pipe -Wformat -Werror=format-security -gdwarf-4 -fno-debug-types-section -fvar-tracking-assignments -g2 -Wp,-D_FORTIFY_SOURCE=2 -fstack-protector-strong --param=ssp-buffer-size=4 -fPIC -mtune=generic -march=x86-64 -gdwarf-4 -fno-debug-types-section -fvar-tracking-assignments -g2 -MT sqlite_hdb.lo -MD -MP -MF .deps/sqlite_hdb.Tpo -c sqlite_hdb.cpp -o sqlite_hdb.o >/dev/null 2>&1
mv -f .deps/sqlite_hdb.Tpo .deps/sqlite_hdb.Plo
make[3]: Leaving directory '/tmp/B.JWIKG9/BUILD/sleuthkit-4.6.4/tsk/hashdb'
make[3]: Entering directory '/tmp/B.JWIKG9/BUILD/sleuthkit-4.6.4/tsk/hashdb'
/bin/sh ../../libtool  --tag=CXX   --mode=link x86_64-pld-linux-gnux32-g++ -Wall -Wextra -Wno-unused-parameter -O2 -fwrapv -pipe -Wformat -Werror=format-security -gdwarf-4 -fno-debug-types-section -fvar-tracking-assignments -g2 -Wp,-D_FORTIFY_SOURCE=2 -fstack-protector-strong --param=ssp-buffer-size=4 -fPIC -mtune=generic -march=x86-64 -gdwarf-4 -fno-debug-types-section -fvar-tracking-assignments -g2   -Wl,--as-needed -Wl,--no-copy-dt-needed-entries -Wl,-z,relro -Wl,-z,combreloc  -pthread -L/usr/local/lib -o libtskhashdb.la  encase.lo hashkeeper.lo idxonly.lo md5sum.lo nsrl.lo sqlite_hdb.lo binsrch_index.lo tsk_hashdb.lo hdb_base.lo  -lewf -ldl -lz -lafflib -lpq -lsqlite3 -ldl -lstdc++ 
libtool: link: ar cru .libs/libtskhashdb.a .libs/encase.o .libs/hashkeeper.o .libs/idxonly.o .libs/md5sum.o .libs/nsrl.o .libs/sqlite_hdb.o .libs/binsrch_index.o .libs/tsk_hashdb.o .libs/hdb_base.o 
libtool: link: ranlib .libs/libtskhashdb.a
libtool: link: ( cd ".libs" && rm -f "libtskhashdb.la" && ln -s "../libtskhashdb.la" "libtskhashdb.la" )
make[3]: Leaving directory '/tmp/B.JWIKG9/BUILD/sleuthkit-4.6.4/tsk/hashdb'
Making all in auto
make[3]: Entering directory '/tmp/B.JWIKG9/BUILD/sleuthkit-4.6.4/tsk/auto'
/bin/sh ../../libtool  --tag=CXX   --mode=compile x86_64-pld-linux-gnux32-g++ -DHAVE_CONFIG_H -I. -I../../tsk  -I../.. -I./../.. -pthread -I/usr/local/include -Wall -Wextra -Wno-unused-parameter -Wmultichar -Wsign-promo -Wno-overloaded-virtual -O2 -fwrapv -pipe -Wformat -Werror=format-security -gdwarf-4 -fno-debug-types-section -fvar-tracking-assignments -g2 -Wp,-D_FORTIFY_SOURCE=2 -fstack-protector-strong --param=ssp-buffer-size=4 -fPIC -mtune=generic -march=x86-64 -gdwarf-4 -fno-debug-types-section -fvar-tracking-assignments -g2  -MT is_image_supported.lo -MD -MP -MF .deps/is_image_supported.Tpo -c -o is_image_supported.lo is_image_supported.cpp
libtool: compile:  x86_64-pld-linux-gnux32-g++ -DHAVE_CONFIG_H -I. -I../../tsk -I../.. -I./../.. -pthread -I/usr/local/include -Wall -Wextra -Wno-unused-parameter -Wmultichar -Wsign-promo -Wno-overloaded-virtual -O2 -fwrapv -pipe -Wformat -Werror=format-security -gdwarf-4 -fno-debug-types-section -fvar-tracking-assignments -g2 -Wp,-D_FORTIFY_SOURCE=2 -fstack-protector-strong --param=ssp-buffer-size=4 -fPIC -mtune=generic -march=x86-64 -gdwarf-4 -fno-debug-types-section -fvar-tracking-assignments -g2 -MT is_image_supported.lo -MD -MP -MF .deps/is_image_supported.Tpo -c is_image_supported.cpp  -fPIC -DPIC -o .libs/is_image_supported.o
libtool: compile:  x86_64-pld-linux-gnux32-g++ -DHAVE_CONFIG_H -I. -I../../tsk -I../.. -I./../.. -pthread -I/usr/local/include -Wall -Wextra -Wno-unused-parameter -Wmultichar -Wsign-promo -Wno-overloaded-virtual -O2 -fwrapv -pipe -Wformat -Werror=format-security -gdwarf-4 -fno-debug-types-section -fvar-tracking-assignments -g2 -Wp,-D_FORTIFY_SOURCE=2 -fstack-protector-strong --param=ssp-buffer-size=4 -fPIC -mtune=generic -march=x86-64 -gdwarf-4 -fno-debug-types-section -fvar-tracking-assignments -g2 -MT is_image_supported.lo -MD -MP -MF .deps/is_image_supported.Tpo -c is_image_supported.cpp -o is_image_supported.o >/dev/null 2>&1
mv -f .deps/is_image_supported.Tpo .deps/is_image_supported.Plo
make[3]: Leaving directory '/tmp/B.JWIKG9/BUILD/sleuthkit-4.6.4/tsk/auto'
make[3]: Entering directory '/tmp/B.JWIKG9/BUILD/sleuthkit-4.6.4/tsk/auto'
/bin/sh ../../libtool  --tag=CXX   --mode=compile x86_64-pld-linux-gnux32-g++ -DHAVE_CONFIG_H -I. -I../../tsk  -I../.. -I./../.. -pthread -I/usr/local/include -Wall -Wextra -Wno-unused-parameter -Wmultichar -Wsign-promo -Wno-overloaded-virtual -O2 -fwrapv -pipe -Wformat -Werror=format-security -gdwarf-4 -fno-debug-types-section -fvar-tracking-assignments -g2 -Wp,-D_FORTIFY_SOURCE=2 -fstack-protector-strong --param=ssp-buffer-size=4 -fPIC -mtune=generic -march=x86-64 -gdwarf-4 -fno-debug-types-section -fvar-tracking-assignments -g2  -MT tsk_db.lo -MD -MP -MF .deps/tsk_db.Tpo -c -o tsk_db.lo tsk_db.cpp
libtool: compile:  x86_64-pld-linux-gnux32-g++ -DHAVE_CONFIG_H -I. -I../../tsk -I../.. -I./../.. -pthread -I/usr/local/include -Wall -Wextra -Wno-unused-parameter -Wmultichar -Wsign-promo -Wno-overloaded-virtual -O2 -fwrapv -pipe -Wformat -Werror=format-security -gdwarf-4 -fno-debug-types-section -fvar-tracking-assignments -g2 -Wp,-D_FORTIFY_SOURCE=2 -fstack-protector-strong --param=ssp-buffer-size=4 -fPIC -mtune=generic -march=x86-64 -gdwarf-4 -fno-debug-types-section -fvar-tracking-assignments -g2 -MT tsk_db.lo -MD -MP -MF .deps/tsk_db.Tpo -c tsk_db.cpp  -fPIC -DPIC -o .libs/tsk_db.o
libtool: compile:  x86_64-pld-linux-gnux32-g++ -DHAVE_CONFIG_H -I. -I../../tsk -I../.. -I./../.. -pthread -I/usr/local/include -Wall -Wextra -Wno-unused-parameter -Wmultichar -Wsign-promo -Wno-overloaded-virtual -O2 -fwrapv -pipe -Wformat -Werror=format-security -gdwarf-4 -fno-debug-types-section -fvar-tracking-assignments -g2 -Wp,-D_FORTIFY_SOURCE=2 -fstack-protector-strong --param=ssp-buffer-size=4 -fPIC -mtune=generic -march=x86-64 -gdwarf-4 -fno-debug-types-section -fvar-tracking-assignments -g2 -MT tsk_db.lo -MD -MP -MF .deps/tsk_db.Tpo -c tsk_db.cpp -o tsk_db.o >/dev/null 2>&1
mv -f .deps/tsk_db.Tpo .deps/tsk_db.Plo
make[3]: Leaving directory '/tmp/B.JWIKG9/BUILD/sleuthkit-4.6.4/tsk/auto'
make[3]: Entering directory '/tmp/B.JWIKG9/BUILD/sleuthkit-4.6.4/tsk/auto'
/bin/sh ../../libtool  --tag=CXX   --mode=compile x86_64-pld-linux-gnux32-g++ -DHAVE_CONFIG_H -I. -I../../tsk  -I../.. -I./../.. -pthread -I/usr/local/include -Wall -Wextra -Wno-unused-parameter -Wmultichar -Wsign-promo -Wno-overloaded-virtual -O2 -fwrapv -pipe -Wformat -Werror=format-security -gdwarf-4 -fno-debug-types-section -fvar-tracking-assignments -g2 -Wp,-D_FORTIFY_SOURCE=2 -fstack-protector-strong --param=ssp-buffer-size=4 -fPIC -mtune=generic -march=x86-64 -gdwarf-4 -fno-debug-types-section -fvar-tracking-assignments -g2  -MT case_db.lo -MD -MP -MF .deps/case_db.Tpo -c -o case_db.lo case_db.cpp
libtool: compile:  x86_64-pld-linux-gnux32-g++ -DHAVE_CONFIG_H -I. -I../../tsk -I../.. -I./../.. -pthread -I/usr/local/include -Wall -Wextra -Wno-unused-parameter -Wmultichar -Wsign-promo -Wno-overloaded-virtual -O2 -fwrapv -pipe -Wformat -Werror=format-security -gdwarf-4 -fno-debug-types-section -fvar-tracking-assignments -g2 -Wp,-D_FORTIFY_SOURCE=2 -fstack-protector-strong --param=ssp-buffer-size=4 -fPIC -mtune=generic -march=x86-64 -gdwarf-4 -fno-debug-types-section -fvar-tracking-assignments -g2 -MT case_db.lo -MD -MP -MF .deps/case_db.Tpo -c case_db.cpp  -fPIC -DPIC -o .libs/case_db.o
libtool: compile:  x86_64-pld-linux-gnux32-g++ -DHAVE_CONFIG_H -I. -I../../tsk -I../.. -I./../.. -pthread -I/usr/local/include -Wall -Wextra -Wno-unused-parameter -Wmultichar -Wsign-promo -Wno-overloaded-virtual -O2 -fwrapv -pipe -Wformat -Werror=format-security -gdwarf-4 -fno-debug-types-section -fvar-tracking-assignments -g2 -Wp,-D_FORTIFY_SOURCE=2 -fstack-protector-strong --param=ssp-buffer-size=4 -fPIC -mtune=generic -march=x86-64 -gdwarf-4 -fno-debug-types-section -fvar-tracking-assignments -g2 -MT case_db.lo -MD -MP -MF .deps/case_db.Tpo -c case_db.cpp -o case_db.o >/dev/null 2>&1
mv -f .deps/case_db.Tpo .deps/case_db.Plo
make[3]: Leaving directory '/tmp/B.JWIKG9/BUILD/sleuthkit-4.6.4/tsk/auto'
make[3]: Entering directory '/tmp/B.JWIKG9/BUILD/sleuthkit-4.6.4/tsk/auto'
/bin/sh ../../libtool  --tag=CXX   --mode=compile x86_64-pld-linux-gnux32-g++ -DHAVE_CONFIG_H -I. -I../../tsk  -I../.. -I./../.. -pthread -I/usr/local/include -Wall -Wextra -Wno-unused-parameter -Wmultichar -Wsign-promo -Wno-overloaded-virtual -O2 -fwrapv -pipe -Wformat -Werror=format-security -gdwarf-4 -fno-debug-types-section -fvar-tracking-assignments -g2 -Wp,-D_FORTIFY_SOURCE=2 -fstack-protector-strong --param=ssp-buffer-size=4 -fPIC -mtune=generic -march=x86-64 -gdwarf-4 -fno-debug-types-section -fvar-tracking-assignments -g2  -MT guid.lo -MD -MP -MF .deps/guid.Tpo -c -o guid.lo guid.cpp
libtool: compile:  x86_64-pld-linux-gnux32-g++ -DHAVE_CONFIG_H -I. -I../../tsk -I../.. -I./../.. -pthread -I/usr/local/include -Wall -Wextra -Wno-unused-parameter -Wmultichar -Wsign-promo -Wno-overloaded-virtual -O2 -fwrapv -pipe -Wformat -Werror=format-security -gdwarf-4 -fno-debug-types-section -fvar-tracking-assignments -g2 -Wp,-D_FORTIFY_SOURCE=2 -fstack-protector-strong --param=ssp-buffer-size=4 -fPIC -mtune=generic -march=x86-64 -gdwarf-4 -fno-debug-types-section -fvar-tracking-assignments -g2 -MT guid.lo -MD -MP -MF .deps/guid.Tpo -c guid.cpp  -fPIC -DPIC -o .libs/guid.o
libtool: compile:  x86_64-pld-linux-gnux32-g++ -DHAVE_CONFIG_H -I. -I../../tsk -I../.. -I./../.. -pthread -I/usr/local/include -Wall -Wextra -Wno-unused-parameter -Wmultichar -Wsign-promo -Wno-overloaded-virtual -O2 -fwrapv -pipe -Wformat -Werror=format-security -gdwarf-4 -fno-debug-types-section -fvar-tracking-assignments -g2 -Wp,-D_FORTIFY_SOURCE=2 -fstack-protector-strong --param=ssp-buffer-size=4 -fPIC -mtune=generic -march=x86-64 -gdwarf-4 -fno-debug-types-section -fvar-tracking-assignments -g2 -MT guid.lo -MD -MP -MF .deps/guid.Tpo -c guid.cpp -o guid.o >/dev/null 2>&1
mv -f .deps/guid.Tpo .deps/guid.Plo
make[3]: Leaving directory '/tmp/B.JWIKG9/BUILD/sleuthkit-4.6.4/tsk/auto'
make[3]: Entering directory '/tmp/B.JWIKG9/BUILD/sleuthkit-4.6.4/tsk/auto'
/bin/sh ../../libtool  --tag=CXX   --mode=compile x86_64-pld-linux-gnux32-g++ -DHAVE_CONFIG_H -I. -I../../tsk  -I../.. -I./../.. -pthread -I/usr/local/include -Wall -Wextra -Wno-unused-parameter -Wmultichar -Wsign-promo -Wno-overloaded-virtual -O2 -fwrapv -pipe -Wformat -Werror=format-security -gdwarf-4 -fno-debug-types-section -fvar-tracking-assignments -g2 -Wp,-D_FORTIFY_SOURCE=2 -fstack-protector-strong --param=ssp-buffer-size=4 -fPIC -mtune=generic -march=x86-64 -gdwarf-4 -fno-debug-types-section -fvar-tracking-assignments -g2  -MT auto.lo -MD -MP -MF .deps/auto.Tpo -c -o auto.lo auto.cpp
libtool: compile:  x86_64-pld-linux-gnux32-g++ -DHAVE_CONFIG_H -I. -I../../tsk -I../.. -I./../.. -pthread -I/usr/local/include -Wall -Wextra -Wno-unused-parameter -Wmultichar -Wsign-promo -Wno-overloaded-virtual -O2 -fwrapv -pipe -Wformat -Werror=format-security -gdwarf-4 -fno-debug-types-section -fvar-tracking-assignments -g2 -Wp,-D_FORTIFY_SOURCE=2 -fstack-protector-strong --param=ssp-buffer-size=4 -fPIC -mtune=generic -march=x86-64 -gdwarf-4 -fno-debug-types-section -fvar-tracking-assignments -g2 -MT auto.lo -MD -MP -MF .deps/auto.Tpo -c auto.cpp  -fPIC -DPIC -o .libs/auto.o
libtool: compile:  x86_64-pld-linux-gnux32-g++ -DHAVE_CONFIG_H -I. -I../../tsk -I../.. -I./../.. -pthread -I/usr/local/include -Wall -Wextra -Wno-unused-parameter -Wmultichar -Wsign-promo -Wno-overloaded-virtual -O2 -fwrapv -pipe -Wformat -Werror=format-security -gdwarf-4 -fno-debug-types-section -fvar-tracking-assignments -g2 -Wp,-D_FORTIFY_SOURCE=2 -fstack-protector-strong --param=ssp-buffer-size=4 -fPIC -mtune=generic -march=x86-64 -gdwarf-4 -fno-debug-types-section -fvar-tracking-assignments -g2 -MT auto.lo -MD -MP -MF .deps/auto.Tpo -c auto.cpp -o auto.o >/dev/null 2>&1
mv -f .deps/auto.Tpo .deps/auto.Plo
make[3]: Leaving directory '/tmp/B.JWIKG9/BUILD/sleuthkit-4.6.4/tsk/auto'
make[3]: Entering directory '/tmp/B.JWIKG9/BUILD/sleuthkit-4.6.4/tsk/auto'
/bin/sh ../../libtool  --tag=CXX   --mode=compile x86_64-pld-linux-gnux32-g++ -DHAVE_CONFIG_H -I. -I../../tsk  -I../.. -I./../.. -pthread -I/usr/local/include -Wall -Wextra -Wno-unused-parameter -Wmultichar -Wsign-promo -Wno-overloaded-virtual -O2 -fwrapv -pipe -Wformat -Werror=format-security -gdwarf-4 -fno-debug-types-section -fvar-tracking-assignments -g2 -Wp,-D_FORTIFY_SOURCE=2 -fstack-protector-strong --param=ssp-buffer-size=4 -fPIC -mtune=generic -march=x86-64 -gdwarf-4 -fno-debug-types-section -fvar-tracking-assignments -g2  -MT auto_db.lo -MD -MP -MF .deps/auto_db.Tpo -c -o auto_db.lo auto_db.cpp
libtool: compile:  x86_64-pld-linux-gnux32-g++ -DHAVE_CONFIG_H -I. -I../../tsk -I../.. -I./../.. -pthread -I/usr/local/include -Wall -Wextra -Wno-unused-parameter -Wmultichar -Wsign-promo -Wno-overloaded-virtual -O2 -fwrapv -pipe -Wformat -Werror=format-security -gdwarf-4 -fno-debug-types-section -fvar-tracking-assignments -g2 -Wp,-D_FORTIFY_SOURCE=2 -fstack-protector-strong --param=ssp-buffer-size=4 -fPIC -mtune=generic -march=x86-64 -gdwarf-4 -fno-debug-types-section -fvar-tracking-assignments -g2 -MT auto_db.lo -MD -MP -MF .deps/auto_db.Tpo -c auto_db.cpp  -fPIC -DPIC -o .libs/auto_db.o
libtool: compile:  x86_64-pld-linux-gnux32-g++ -DHAVE_CONFIG_H -I. -I../../tsk -I../.. -I./../.. -pthread -I/usr/local/include -Wall -Wextra -Wno-unused-parameter -Wmultichar -Wsign-promo -Wno-overloaded-virtual -O2 -fwrapv -pipe -Wformat -Werror=format-security -gdwarf-4 -fno-debug-types-section -fvar-tracking-assignments -g2 -Wp,-D_FORTIFY_SOURCE=2 -fstack-protector-strong --param=ssp-buffer-size=4 -fPIC -mtune=generic -march=x86-64 -gdwarf-4 -fno-debug-types-section -fvar-tracking-assignments -g2 -MT auto_db.lo -MD -MP -MF .deps/auto_db.Tpo -c auto_db.cpp -o auto_db.o >/dev/null 2>&1
mv -f .deps/auto_db.Tpo .deps/auto_db.Plo
make[3]: Leaving directory '/tmp/B.JWIKG9/BUILD/sleuthkit-4.6.4/tsk/auto'
make[3]: Entering directory '/tmp/B.JWIKG9/BUILD/sleuthkit-4.6.4/tsk/auto'
/bin/sh ../../libtool  --tag=CXX   --mode=compile x86_64-pld-linux-gnux32-g++ -DHAVE_CONFIG_H -I. -I../../tsk  -I../.. -I./../.. -pthread -I/usr/local/include -Wall -Wextra -Wno-unused-parameter -Wmultichar -Wsign-promo -Wno-overloaded-virtual -O2 -fwrapv -pipe -Wformat -Werror=format-security -gdwarf-4 -fno-debug-types-section -fvar-tracking-assignments -g2 -Wp,-D_FORTIFY_SOURCE=2 -fstack-protector-strong --param=ssp-buffer-size=4 -fPIC -mtune=generic -march=x86-64 -gdwarf-4 -fno-debug-types-section -fvar-tracking-assignments -g2  -MT db_sqlite.lo -MD -MP -MF .deps/db_sqlite.Tpo -c -o db_sqlite.lo db_sqlite.cpp
libtool: compile:  x86_64-pld-linux-gnux32-g++ -DHAVE_CONFIG_H -I. -I../../tsk -I../.. -I./../.. -pthread -I/usr/local/include -Wall -Wextra -Wno-unused-parameter -Wmultichar -Wsign-promo -Wno-overloaded-virtual -O2 -fwrapv -pipe -Wformat -Werror=format-security -gdwarf-4 -fno-debug-types-section -fvar-tracking-assignments -g2 -Wp,-D_FORTIFY_SOURCE=2 -fstack-protector-strong --param=ssp-buffer-size=4 -fPIC -mtune=generic -march=x86-64 -gdwarf-4 -fno-debug-types-section -fvar-tracking-assignments -g2 -MT db_sqlite.lo -MD -MP -MF .deps/db_sqlite.Tpo -c db_sqlite.cpp  -fPIC -DPIC -o .libs/db_sqlite.o
libtool: compile:  x86_64-pld-linux-gnux32-g++ -DHAVE_CONFIG_H -I. -I../../tsk -I../.. -I./../.. -pthread -I/usr/local/include -Wall -Wextra -Wno-unused-parameter -Wmultichar -Wsign-promo -Wno-overloaded-virtual -O2 -fwrapv -pipe -Wformat -Werror=format-security -gdwarf-4 -fno-debug-types-section -fvar-tracking-assignments -g2 -Wp,-D_FORTIFY_SOURCE=2 -fstack-protector-strong --param=ssp-buffer-size=4 -fPIC -mtune=generic -march=x86-64 -gdwarf-4 -fno-debug-types-section -fvar-tracking-assignments -g2 -MT db_sqlite.lo -MD -MP -MF .deps/db_sqlite.Tpo -c db_sqlite.cpp -o db_sqlite.o >/dev/null 2>&1
mv -f .deps/db_sqlite.Tpo .deps/db_sqlite.Plo
make[3]: Leaving directory '/tmp/B.JWIKG9/BUILD/sleuthkit-4.6.4/tsk/auto'
make[3]: Entering directory '/tmp/B.JWIKG9/BUILD/sleuthkit-4.6.4/tsk/auto'
/bin/sh ../../libtool  --tag=CXX   --mode=compile x86_64-pld-linux-gnux32-g++ -DHAVE_CONFIG_H -I. -I../../tsk  -I../.. -I./../.. -pthread -I/usr/local/include -Wall -Wextra -Wno-unused-parameter -Wmultichar -Wsign-promo -Wno-overloaded-virtual -O2 -fwrapv -pipe -Wformat -Werror=format-security -gdwarf-4 -fno-debug-types-section -fvar-tracking-assignments -g2 -Wp,-D_FORTIFY_SOURCE=2 -fstack-protector-strong --param=ssp-buffer-size=4 -fPIC -mtune=generic -march=x86-64 -gdwarf-4 -fno-debug-types-section -fvar-tracking-assignments -g2  -MT db_postgresql.lo -MD -MP -MF .deps/db_postgresql.Tpo -c -o db_postgresql.lo db_postgresql.cpp
libtool: compile:  x86_64-pld-linux-gnux32-g++ -DHAVE_CONFIG_H -I. -I../../tsk -I../.. -I./../.. -pthread -I/usr/local/include -Wall -Wextra -Wno-unused-parameter -Wmultichar -Wsign-promo -Wno-overloaded-virtual -O2 -fwrapv -pipe -Wformat -Werror=format-security -gdwarf-4 -fno-debug-types-section -fvar-tracking-assignments -g2 -Wp,-D_FORTIFY_SOURCE=2 -fstack-protector-strong --param=ssp-buffer-size=4 -fPIC -mtune=generic -march=x86-64 -gdwarf-4 -fno-debug-types-section -fvar-tracking-assignments -g2 -MT db_postgresql.lo -MD -MP -MF .deps/db_postgresql.Tpo -c db_postgresql.cpp  -fPIC -DPIC -o .libs/db_postgresql.o
libtool: compile:  x86_64-pld-linux-gnux32-g++ -DHAVE_CONFIG_H -I. -I../../tsk -I../.. -I./../.. -pthread -I/usr/local/include -Wall -Wextra -Wno-unused-parameter -Wmultichar -Wsign-promo -Wno-overloaded-virtual -O2 -fwrapv -pipe -Wformat -Werror=format-security -gdwarf-4 -fno-debug-types-section -fvar-tracking-assignments -g2 -Wp,-D_FORTIFY_SOURCE=2 -fstack-protector-strong --param=ssp-buffer-size=4 -fPIC -mtune=generic -march=x86-64 -gdwarf-4 -fno-debug-types-section -fvar-tracking-assignments -g2 -MT db_postgresql.lo -MD -MP -MF .deps/db_postgresql.Tpo -c db_postgresql.cpp -o db_postgresql.o >/dev/null 2>&1
mv -f .deps/db_postgresql.Tpo .deps/db_postgresql.Plo
make[3]: Leaving directory '/tmp/B.JWIKG9/BUILD/sleuthkit-4.6.4/tsk/auto'
make[3]: Entering directory '/tmp/B.JWIKG9/BUILD/sleuthkit-4.6.4/tsk/auto'
/bin/sh ../../libtool  --tag=CXX   --mode=link x86_64-pld-linux-gnux32-g++ -Wall -Wextra -Wno-unused-parameter -Wmultichar -Wsign-promo -Wno-overloaded-virtual -O2 -fwrapv -pipe -Wformat -Werror=format-security -gdwarf-4 -fno-debug-types-section -fvar-tracking-assignments -g2 -Wp,-D_FORTIFY_SOURCE=2 -fstack-protector-strong --param=ssp-buffer-size=4 -fPIC -mtune=generic -march=x86-64 -gdwarf-4 -fno-debug-types-section -fvar-tracking-assignments -g2   -Wl,--as-needed -Wl,--no-copy-dt-needed-entries -Wl,-z,relro -Wl,-z,combreloc  -pthread -L/usr/local/lib -o libtskauto.la  auto.lo auto_db.lo db_sqlite.lo db_postgresql.lo case_db.lo guid.lo tsk_db.lo is_image_supported.lo   -lewf -ldl -lz -lafflib -lpq -lsqlite3 -ldl -lstdc++ 
libtool: link: ar cru .libs/libtskauto.a .libs/auto.o .libs/auto_db.o .libs/db_sqlite.o .libs/db_postgresql.o .libs/case_db.o .libs/guid.o .libs/tsk_db.o .libs/is_image_supported.o 
libtool: link: ranlib .libs/libtskauto.a
libtool: link: ( cd ".libs" && rm -f "libtskauto.la" && ln -s "../libtskauto.la" "libtskauto.la" )
make[3]: Leaving directory '/tmp/B.JWIKG9/BUILD/sleuthkit-4.6.4/tsk/auto'
make[3]: Entering directory '/tmp/B.JWIKG9/BUILD/sleuthkit-4.6.4/tsk'
/bin/sh ../libtool  --tag=CC   --mode=link x86_64-pld-linux-gnux32-gcc -Wall -Wextra -Wno-unused-parameter -O2 -fwrapv -pipe -Wformat -Werror=format-security -gdwarf-4 -fno-debug-types-section -fvar-tracking-assignments -g2 -Wp,-D_FORTIFY_SOURCE=2 -fstack-protector-strong --param=ssp-buffer-size=4 -fPIC -mtune=generic -march=x86-64 -gdwarf-4 -fno-debug-types-section -fvar-tracking-assignments -g2  -version-info 17:5:4  -Wl,--as-needed -Wl,--no-copy-dt-needed-entries -Wl,-z,relro -Wl,-z,combreloc  -pthread -L/usr/local/lib -o libtsk.la -rpath /usr/libx32  base/libtskbase.la img/libtskimg.la vs/libtskvs.la fs/libtskfs.la hashdb/libtskhashdb.la auto/libtskauto.la -lewf -ldl -lpthread -ldl -lz -lafflib -lpq -lsqlite3 -ldl -lstdc++ 
libtool: link: x86_64-pld-linux-gnux32-gcc -shared  -fPIC -DPIC  -Wl,--whole-archive base/.libs/libtskbase.a img/.libs/libtskimg.a vs/.libs/libtskvs.a fs/.libs/libtskfs.a hashdb/.libs/libtskhashdb.a auto/.libs/libtskauto.a -Wl,--no-whole-archive  -Wl,-rpath -Wl,/usr/libx32 -Wl,-rpath -Wl,/usr/libx32 -L/usr/local/lib -L/usr/libx32 -L/usr/lib64 -L/usr/lib -L/usr/local/libx32 -L/usr/local/lib64 -lewf /usr/libx32/libafflib.so -lmd /usr/libx32/libcurl.so /usr/libx32/libcares.so -lnghttp2 /usr/libx32/librtmp.so /usr/libx32/libgnutls.so -lp11-kit /usr/libx32/libidn2.so /usr/libx32/libunistring.so /usr/libx32/libtasn1.so -lhogweed -lnettle /usr/libx32/libgmp.so /usr/libx32/libssh2.so -lpsl /usr/libx32/libgssapi.so /usr/libx32/libheimntlm.so /usr/libx32/libkrb5.so /usr/libx32/libhx509.so /usr/libx32/libwind.so /usr/libx32/libhcrypto.so /usr/libx32/libasn1.so -lcom_err /usr/libx32/libheimbase.so /usr/libx32/libroken.so /usr/libx32/libldap.so /usr/libx32/libsasl2.so -lcrypt /usr/libx32/libpam.so /usr/libx32/libaudit.so /usr/libx32/libcap-ng.so -lssl -lcrypto /usr/libx32/liblber.so -lresolv /usr/libx32/libbrotlidec.so /usr/libx32/libbrotlicommon.so /usr/libx32/libexpat.so -lrt -lreadline -lpq /usr/libx32/libsqlite3.so -lz -lpthread -ldl /usr/libx32/libstdc++.so -lm  -O2 -gdwarf-4 -g2 -fstack-protector-strong -mtune=generic -march=x86-64 -gdwarf-4 -g2 -Wl,--as-needed -Wl,--no-copy-dt-needed-entries -Wl,-z -Wl,relro -Wl,-z -Wl,combreloc -pthread   -pthread -Wl,-soname -Wl,libtsk.so.13 -o .libs/libtsk.so.13.4.5
libtool: link: (cd ".libs" && rm -f "libtsk.so.13" && ln -s "libtsk.so.13.4.5" "libtsk.so.13")
libtool: link: (cd ".libs" && rm -f "libtsk.so" && ln -s "libtsk.so.13.4.5" "libtsk.so")
libtool: link: (cd .libs/libtsk.lax/libtskbase.a && ar x "/tmp/B.JWIKG9/BUILD/sleuthkit-4.6.4/tsk/base/.libs/libtskbase.a")
libtool: link: (cd .libs/libtsk.lax/libtskimg.a && ar x "/tmp/B.JWIKG9/BUILD/sleuthkit-4.6.4/tsk/img/.libs/libtskimg.a")
libtool: link: (cd .libs/libtsk.lax/libtskvs.a && ar x "/tmp/B.JWIKG9/BUILD/sleuthkit-4.6.4/tsk/vs/.libs/libtskvs.a")
libtool: link: (cd .libs/libtsk.lax/libtskfs.a && ar x "/tmp/B.JWIKG9/BUILD/sleuthkit-4.6.4/tsk/fs/.libs/libtskfs.a")
libtool: link: (cd .libs/libtsk.lax/libtskhashdb.a && ar x "/tmp/B.JWIKG9/BUILD/sleuthkit-4.6.4/tsk/hashdb/.libs/libtskhashdb.a")
libtool: link: (cd .libs/libtsk.lax/libtskauto.a && ar x "/tmp/B.JWIKG9/BUILD/sleuthkit-4.6.4/tsk/auto/.libs/libtskauto.a")
libtool: link: ar cru .libs/libtsk.a   .libs/libtsk.lax/libtskbase.a/XGetopt.o .libs/libtsk.lax/libtskbase.a/crc.o .libs/libtsk.lax/libtskbase.a/md5c.o .libs/libtsk.lax/libtskbase.a/mymalloc.o .libs/libtsk.lax/libtskbase.a/sha1c.o .libs/libtsk.lax/libtskbase.a/tsk_endian.o .libs/libtsk.lax/libtskbase.a/tsk_error.o .libs/libtsk.lax/libtskbase.a/tsk_error_win32.o .libs/libtsk.lax/libtskbase.a/tsk_list.o .libs/libtsk.lax/libtskbase.a/tsk_lock.o .libs/libtsk.lax/libtskbase.a/tsk_parse.o .libs/libtsk.lax/libtskbase.a/tsk_printf.o .libs/libtsk.lax/libtskbase.a/tsk_stack.o .libs/libtsk.lax/libtskbase.a/tsk_unicode.o .libs/libtsk.lax/libtskbase.a/tsk_version.o  .libs/libtsk.lax/libtskimg.a/aff.o .libs/libtsk.lax/libtskimg.a/ewf.o .libs/libtsk.lax/libtskimg.a/img_io.o .libs/libtsk.lax/libtskimg.a/img_open.o .libs/libtsk.lax/libtskimg.a/img_types.o .libs/libtsk.lax/libtskimg.a/img_writer.o .libs/libtsk.lax/libtskimg.a/mult_files.o .libs/libtsk.lax/libtskimg.a/raw.o .libs/libtsk.lax/libtskimg.a/vhd.o .libs/libtsk.lax/libtskimg.a/vmdk.o  .libs/libtsk.lax/libtskvs.a/bsd.o .libs/libtsk.lax/libtskvs.a/dos.o .libs/libtsk.lax/libtskvs.a/gpt.o .libs/libtsk.lax/libtskvs.a/mac.o .libs/libtsk.lax/libtskvs.a/mm_io.o .libs/libtsk.lax/libtskvs.a/mm_open.o .libs/libtsk.lax/libtskvs.a/mm_part.o .libs/libtsk.lax/libtskvs.a/mm_types.o .libs/libtsk.lax/libtskvs.a/sun.o  .libs/libtsk.lax/libtskfs.a/dcalc_lib.o .libs/libtsk.lax/libtskfs.a/dcat_lib.o .libs/libtsk.lax/libtskfs.a/dls_lib.o .libs/libtsk.lax/libtskfs.a/dstat_lib.o .libs/libtsk.lax/libtskfs.a/exfatfs.o .libs/libtsk.lax/libtskfs.a/exfatfs_dent.o .libs/libtsk.lax/libtskfs.a/exfatfs_meta.o .libs/libtsk.lax/libtskfs.a/ext2fs.o .libs/libtsk.lax/libtskfs.a/ext2fs_dent.o .libs/libtsk.lax/libtskfs.a/ext2fs_journal.o .libs/libtsk.lax/libtskfs.a/fatfs.o .libs/libtsk.lax/libtskfs.a/fatfs_dent.o .libs/libtsk.lax/libtskfs.a/fatfs_meta.o .libs/libtsk.lax/libtskfs.a/fatfs_utils.o .libs/libtsk.lax/libtskfs.a/fatxxfs.o .libs/libtsk.lax/libtskfs.a/fatxxfs_dent.o .libs/libtsk.lax/libtskfs.a/fatxxfs_meta.o .libs/libtsk.lax/libtskfs.a/ffind_lib.o .libs/libtsk.lax/libtskfs.a/ffs.o .libs/libtsk.lax/libtskfs.a/ffs_dent.o .libs/libtsk.lax/libtskfs.a/fls_lib.o .libs/libtsk.lax/libtskfs.a/fs_attr.o .libs/libtsk.lax/libtskfs.a/fs_attrlist.o .libs/libtsk.lax/libtskfs.a/fs_block.o .libs/libtsk.lax/libtskfs.a/fs_dir.o .libs/libtsk.lax/libtskfs.a/fs_file.o .libs/libtsk.lax/libtskfs.a/fs_inode.o .libs/libtsk.lax/libtskfs.a/fs_io.o .libs/libtsk.lax/libtskfs.a/fs_load.o .libs/libtsk.lax/libtskfs.a/fs_name.o .libs/libtsk.lax/libtskfs.a/fs_open.o .libs/libtsk.lax/libtskfs.a/fs_parse.o .libs/libtsk.lax/libtskfs.a/fs_types.o .libs/libtsk.lax/libtskfs.a/hfs.o .libs/libtsk.lax/libtskfs.a/hfs_dent.o .libs/libtsk.lax/libtskfs.a/hfs_journal.o .libs/libtsk.lax/libtskfs.a/hfs_unicompare.o .libs/libtsk.lax/libtskfs.a/icat_lib.o .libs/libtsk.lax/libtskfs.a/ifind_lib.o .libs/libtsk.lax/libtskfs.a/ils_lib.o .libs/libtsk.lax/libtskfs.a/iso9660.o .libs/libtsk.lax/libtskfs.a/iso9660_dent.o .libs/libtsk.lax/libtskfs.a/lzvn.o .libs/libtsk.lax/libtskfs.a/nofs_misc.o .libs/libtsk.lax/libtskfs.a/ntfs.o .libs/libtsk.lax/libtskfs.a/ntfs_dent.o .libs/libtsk.lax/libtskfs.a/rawfs.o .libs/libtsk.lax/libtskfs.a/swapfs.o .libs/libtsk.lax/libtskfs.a/unix_misc.o .libs/libtsk.lax/libtskfs.a/usn_journal.o .libs/libtsk.lax/libtskfs.a/usnjls_lib.o .libs/libtsk.lax/libtskfs.a/walk_cpp.o .libs/libtsk.lax/libtskfs.a/yaffs.o  .libs/libtsk.lax/libtskhashdb.a/binsrch_index.o .libs/libtsk.lax/libtskhashdb.a/encase.o .libs/libtsk.lax/libtskhashdb.a/hashkeeper.o .libs/libtsk.lax/libtskhashdb.a/hdb_base.o .libs/libtsk.lax/libtskhashdb.a/idxonly.o .libs/libtsk.lax/libtskhashdb.a/md5sum.o .libs/libtsk.lax/libtskhashdb.a/nsrl.o .libs/libtsk.lax/libtskhashdb.a/sqlite_hdb.o .libs/libtsk.lax/libtskhashdb.a/tsk_hashdb.o  .libs/libtsk.lax/libtskauto.a/auto.o .libs/libtsk.lax/libtskauto.a/auto_db.o .libs/libtsk.lax/libtskauto.a/case_db.o .libs/libtsk.lax/libtskauto.a/db_postgresql.o .libs/libtsk.lax/libtskauto.a/db_sqlite.o .libs/libtsk.lax/libtskauto.a/guid.o .libs/libtsk.lax/libtskauto.a/is_image_supported.o .libs/libtsk.lax/libtskauto.a/tsk_db.o 
libtool: link: ranlib .libs/libtsk.a
libtool: link: rm -fr .libs/libtsk.lax
libtool: link: ( cd ".libs" && rm -f "libtsk.la" && ln -s "../libtsk.la" "libtsk.la" )
make[3]: Leaving directory '/tmp/B.JWIKG9/BUILD/sleuthkit-4.6.4/tsk'
Making all in tools
Making all in imgtools
make[2]: Entering directory '/tmp/B.JWIKG9/BUILD/sleuthkit-4.6.4/tools/imgtools'
x86_64-pld-linux-gnux32-g++ -DHAVE_CONFIG_H -I. -I../../tsk  -I../.. -I./../.. -pthread -I/usr/local/include -Wall -Wextra -Wno-unused-parameter -Wno-unused-command-line-argument -O2 -fwrapv -pipe -Wformat -Werror=format-security -gdwarf-4 -fno-debug-types-section -fvar-tracking-assignments -g2 -Wp,-D_FORTIFY_SOURCE=2 -fstack-protector-strong --param=ssp-buffer-size=4 -fPIC -mtune=generic -march=x86-64 -gdwarf-4 -fno-debug-types-section -fvar-tracking-assignments -g2  -MT img_stat.o -MD -MP -MF .deps/img_stat.Tpo -c -o img_stat.o img_stat.cpp
img_stat.cpp: In function 'int main(int, char**)':
img_stat.cpp:64:18: warning: this statement may fall through [-Wimplicit-fallthrough=]
             usage();
             ~~~~~^~
img_stat.cpp:65:9: note: here
         case _TSK_T('b'):
         ^~~~
At global scope:
cc1plus: warning: unrecognized command line option '-Wno-unused-command-line-argument'
mv -f .deps/img_stat.Tpo .deps/img_stat.Po
make[2]: Leaving directory '/tmp/B.JWIKG9/BUILD/sleuthkit-4.6.4/tools/imgtools'
make[2]: Entering directory '/tmp/B.JWIKG9/BUILD/sleuthkit-4.6.4/tools/imgtools'
x86_64-pld-linux-gnux32-g++ -DHAVE_CONFIG_H -I. -I../../tsk  -I../.. -I./../.. -pthread -I/usr/local/include -Wall -Wextra -Wno-unused-parameter -Wno-unused-command-line-argument -O2 -fwrapv -pipe -Wformat -Werror=format-security -gdwarf-4 -fno-debug-types-section -fvar-tracking-assignments -g2 -Wp,-D_FORTIFY_SOURCE=2 -fstack-protector-strong --param=ssp-buffer-size=4 -fPIC -mtune=generic -march=x86-64 -gdwarf-4 -fno-debug-types-section -fvar-tracking-assignments -g2  -MT img_cat.o -MD -MP -MF .deps/img_cat.Tpo -c -o img_cat.o img_cat.cpp
img_cat.cpp: In function 'int main(int, char**)':
img_cat.cpp:73:18: warning: this statement may fall through [-Wimplicit-fallthrough=]
             usage();
             ~~~~~^~
img_cat.cpp:74:9: note: here
         case _TSK_T('b'):
         ^~~~
At global scope:
cc1plus: warning: unrecognized command line option '-Wno-unused-command-line-argument'
mv -f .deps/img_cat.Tpo .deps/img_cat.Po
make[2]: Leaving directory '/tmp/B.JWIKG9/BUILD/sleuthkit-4.6.4/tools/imgtools'
make[2]: Entering directory '/tmp/B.JWIKG9/BUILD/sleuthkit-4.6.4/tools/imgtools'
/bin/sh ../../libtool  --tag=CXX   --mode=link x86_64-pld-linux-gnux32-g++ -Wall -Wextra -Wno-unused-parameter -Wno-unused-command-line-argument -O2 -fwrapv -pipe -Wformat -Werror=format-security -gdwarf-4 -fno-debug-types-section -fvar-tracking-assignments -g2 -Wp,-D_FORTIFY_SOURCE=2 -fstack-protector-strong --param=ssp-buffer-size=4 -fPIC -mtune=generic -march=x86-64 -gdwarf-4 -fno-debug-types-section -fvar-tracking-assignments -g2   -Wl,--as-needed -Wl,--no-copy-dt-needed-entries -Wl,-z,relro -Wl,-z,combreloc  -pthread -L/usr/local/lib  -o img_stat img_stat.o ../../tsk/libtsk.la -lewf -ldl -lz -lafflib -lpq -lsqlite3 -ldl -lstdc++ 
libtool: link: x86_64-pld-linux-gnux32-g++ -Wall -Wextra -Wno-unused-parameter -Wno-unused-command-line-argument -O2 -fwrapv -pipe -Wformat -Werror=format-security -gdwarf-4 -fno-debug-types-section -fvar-tracking-assignments -g2 -Wp,-D_FORTIFY_SOURCE=2 -fstack-protector-strong --param=ssp-buffer-size=4 -fPIC -mtune=generic -march=x86-64 -gdwarf-4 -fno-debug-types-section -fvar-tracking-assignments -g2 -Wl,--as-needed -Wl,--no-copy-dt-needed-entries -Wl,-z -Wl,relro -Wl,-z -Wl,combreloc -pthread -o .libs/img_stat img_stat.o  -L/usr/local/lib ../../tsk/.libs/libtsk.so -L/usr/libx32 -L/usr/lib64 -L/usr/lib -L/usr/local/libx32 -L/usr/local/lib64 -lewf /usr/libx32/libafflib.so -lmd /usr/libx32/libcurl.so /usr/libx32/libcares.so -lnghttp2 /usr/libx32/librtmp.so /usr/libx32/libgnutls.so -lp11-kit /usr/libx32/libidn2.so /usr/libx32/libunistring.so /usr/libx32/libtasn1.so -lhogweed -lnettle /usr/libx32/libgmp.so /usr/libx32/libssh2.so -lpsl /usr/libx32/libgssapi.so /usr/libx32/libheimntlm.so /usr/libx32/libkrb5.so /usr/libx32/libhx509.so /usr/libx32/libwind.so /usr/libx32/libhcrypto.so /usr/libx32/libasn1.so -lcom_err /usr/libx32/libheimbase.so /usr/libx32/libroken.so /usr/libx32/libldap.so /usr/libx32/libsasl2.so -lcrypt /usr/libx32/libpam.so /usr/libx32/libaudit.so /usr/libx32/libcap-ng.so -lssl -lcrypto /usr/libx32/liblber.so -lresolv /usr/libx32/libbrotlidec.so /usr/libx32/libbrotlicommon.so /usr/libx32/libexpat.so -lrt -lreadline -lpq /usr/libx32/libsqlite3.so -lz -lpthread -ldl /usr/libx32/libstdc++.so -lm -pthread -Wl,-rpath -Wl,/usr/libx32
make[2]: Leaving directory '/tmp/B.JWIKG9/BUILD/sleuthkit-4.6.4/tools/imgtools'
make[2]: Entering directory '/tmp/B.JWIKG9/BUILD/sleuthkit-4.6.4/tools/imgtools'
/bin/sh ../../libtool  --tag=CXX   --mode=link x86_64-pld-linux-gnux32-g++ -Wall -Wextra -Wno-unused-parameter -Wno-unused-command-line-argument -O2 -fwrapv -pipe -Wformat -Werror=format-security -gdwarf-4 -fno-debug-types-section -fvar-tracking-assignments -g2 -Wp,-D_FORTIFY_SOURCE=2 -fstack-protector-strong --param=ssp-buffer-size=4 -fPIC -mtune=generic -march=x86-64 -gdwarf-4 -fno-debug-types-section -fvar-tracking-assignments -g2   -Wl,--as-needed -Wl,--no-copy-dt-needed-entries -Wl,-z,relro -Wl,-z,combreloc  -pthread -L/usr/local/lib  -o img_cat img_cat.o ../../tsk/libtsk.la -lewf -ldl -lz -lafflib -lpq -lsqlite3 -ldl -lstdc++ 
libtool: link: x86_64-pld-linux-gnux32-g++ -Wall -Wextra -Wno-unused-parameter -Wno-unused-command-line-argument -O2 -fwrapv -pipe -Wformat -Werror=format-security -gdwarf-4 -fno-debug-types-section -fvar-tracking-assignments -g2 -Wp,-D_FORTIFY_SOURCE=2 -fstack-protector-strong --param=ssp-buffer-size=4 -fPIC -mtune=generic -march=x86-64 -gdwarf-4 -fno-debug-types-section -fvar-tracking-assignments -g2 -Wl,--as-needed -Wl,--no-copy-dt-needed-entries -Wl,-z -Wl,relro -Wl,-z -Wl,combreloc -pthread -o .libs/img_cat img_cat.o  -L/usr/local/lib ../../tsk/.libs/libtsk.so -L/usr/libx32 -L/usr/lib64 -L/usr/lib -L/usr/local/libx32 -L/usr/local/lib64 -lewf /usr/libx32/libafflib.so -lmd /usr/libx32/libcurl.so /usr/libx32/libcares.so -lnghttp2 /usr/libx32/librtmp.so /usr/libx32/libgnutls.so -lp11-kit /usr/libx32/libidn2.so /usr/libx32/libunistring.so /usr/libx32/libtasn1.so -lhogweed -lnettle /usr/libx32/libgmp.so /usr/libx32/libssh2.so -lpsl /usr/libx32/libgssapi.so /usr/libx32/libheimntlm.so /usr/libx32/libkrb5.so /usr/libx32/libhx509.so /usr/libx32/libwind.so /usr/libx32/libhcrypto.so /usr/libx32/libasn1.so -lcom_err /usr/libx32/libheimbase.so /usr/libx32/libroken.so /usr/libx32/libldap.so /usr/libx32/libsasl2.so -lcrypt /usr/libx32/libpam.so /usr/libx32/libaudit.so /usr/libx32/libcap-ng.so -lssl -lcrypto /usr/libx32/liblber.so -lresolv /usr/libx32/libbrotlidec.so /usr/libx32/libbrotlicommon.so /usr/libx32/libexpat.so -lrt -lreadline -lpq /usr/libx32/libsqlite3.so -lz -lpthread -ldl /usr/libx32/libstdc++.so -lm -pthread -Wl,-rpath -Wl,/usr/libx32
make[2]: Leaving directory '/tmp/B.JWIKG9/BUILD/sleuthkit-4.6.4/tools/imgtools'
Making all in vstools
make[2]: Entering directory '/tmp/B.JWIKG9/BUILD/sleuthkit-4.6.4/tools/vstools'
x86_64-pld-linux-gnux32-g++ -DHAVE_CONFIG_H -I. -I../../tsk  -I../.. -I./../.. -pthread -I/usr/local/include -Wall -Wextra -Wno-unused-parameter -Wno-unused-command-line-argument -O2 -fwrapv -pipe -Wformat -Werror=format-security -gdwarf-4 -fno-debug-types-section -fvar-tracking-assignments -g2 -Wp,-D_FORTIFY_SOURCE=2 -fstack-protector-strong --param=ssp-buffer-size=4 -fPIC -mtune=generic -march=x86-64 -gdwarf-4 -fno-debug-types-section -fvar-tracking-assignments -g2  -MT mmstat.o -MD -MP -MF .deps/mmstat.Tpo -c -o mmstat.o mmstat.cpp
mv -f .deps/mmstat.Tpo .deps/mmstat.Po
make[2]: Leaving directory '/tmp/B.JWIKG9/BUILD/sleuthkit-4.6.4/tools/vstools'
make[2]: Entering directory '/tmp/B.JWIKG9/BUILD/sleuthkit-4.6.4/tools/vstools'
x86_64-pld-linux-gnux32-g++ -DHAVE_CONFIG_H -I. -I../../tsk  -I../.. -I./../.. -pthread -I/usr/local/include -Wall -Wextra -Wno-unused-parameter -Wno-unused-command-line-argument -O2 -fwrapv -pipe -Wformat -Werror=format-security -gdwarf-4 -fno-debug-types-section -fvar-tracking-assignments -g2 -Wp,-D_FORTIFY_SOURCE=2 -fstack-protector-strong --param=ssp-buffer-size=4 -fPIC -mtune=generic -march=x86-64 -gdwarf-4 -fno-debug-types-section -fvar-tracking-assignments -g2  -MT mmcat.o -MD -MP -MF .deps/mmcat.Tpo -c -o mmcat.o mmcat.cpp
mv -f .deps/mmcat.Tpo .deps/mmcat.Po
make[2]: Leaving directory '/tmp/B.JWIKG9/BUILD/sleuthkit-4.6.4/tools/vstools'
make[2]: Entering directory '/tmp/B.JWIKG9/BUILD/sleuthkit-4.6.4/tools/vstools'
x86_64-pld-linux-gnux32-g++ -DHAVE_CONFIG_H -I. -I../../tsk  -I../.. -I./../.. -pthread -I/usr/local/include -Wall -Wextra -Wno-unused-parameter -Wno-unused-command-line-argument -O2 -fwrapv -pipe -Wformat -Werror=format-security -gdwarf-4 -fno-debug-types-section -fvar-tracking-assignments -g2 -Wp,-D_FORTIFY_SOURCE=2 -fstack-protector-strong --param=ssp-buffer-size=4 -fPIC -mtune=generic -march=x86-64 -gdwarf-4 -fno-debug-types-section -fvar-tracking-assignments -g2  -MT mmls.o -MD -MP -MF .deps/mmls.Tpo -c -o mmls.o mmls.cpp
mv -f .deps/mmls.Tpo .deps/mmls.Po
make[2]: Leaving directory '/tmp/B.JWIKG9/BUILD/sleuthkit-4.6.4/tools/vstools'
make[2]: Entering directory '/tmp/B.JWIKG9/BUILD/sleuthkit-4.6.4/tools/vstools'
/bin/sh ../../libtool  --tag=CXX   --mode=link x86_64-pld-linux-gnux32-g++ -Wall -Wextra -Wno-unused-parameter -Wno-unused-command-line-argument -O2 -fwrapv -pipe -Wformat -Werror=format-security -gdwarf-4 -fno-debug-types-section -fvar-tracking-assignments -g2 -Wp,-D_FORTIFY_SOURCE=2 -fstack-protector-strong --param=ssp-buffer-size=4 -fPIC -mtune=generic -march=x86-64 -gdwarf-4 -fno-debug-types-section -fvar-tracking-assignments -g2   -Wl,--as-needed -Wl,--no-copy-dt-needed-entries -Wl,-z,relro -Wl,-z,combreloc  -pthread -L/usr/local/lib  -o mmstat mmstat.o ../../tsk/libtsk.la -lewf -ldl -lz -lafflib -lpq -lsqlite3 -ldl -lstdc++ 
libtool: link: x86_64-pld-linux-gnux32-g++ -Wall -Wextra -Wno-unused-parameter -Wno-unused-command-line-argument -O2 -fwrapv -pipe -Wformat -Werror=format-security -gdwarf-4 -fno-debug-types-section -fvar-tracking-assignments -g2 -Wp,-D_FORTIFY_SOURCE=2 -fstack-protector-strong --param=ssp-buffer-size=4 -fPIC -mtune=generic -march=x86-64 -gdwarf-4 -fno-debug-types-section -fvar-tracking-assignments -g2 -Wl,--as-needed -Wl,--no-copy-dt-needed-entries -Wl,-z -Wl,relro -Wl,-z -Wl,combreloc -pthread -o .libs/mmstat mmstat.o  -L/usr/local/lib ../../tsk/.libs/libtsk.so -L/usr/libx32 -L/usr/lib64 -L/usr/lib -L/usr/local/libx32 -L/usr/local/lib64 -lewf /usr/libx32/libafflib.so -lmd /usr/libx32/libcurl.so /usr/libx32/libcares.so -lnghttp2 /usr/libx32/librtmp.so /usr/libx32/libgnutls.so -lp11-kit /usr/libx32/libidn2.so /usr/libx32/libunistring.so /usr/libx32/libtasn1.so -lhogweed -lnettle /usr/libx32/libgmp.so /usr/libx32/libssh2.so -lpsl /usr/libx32/libgssapi.so /usr/libx32/libheimntlm.so /usr/libx32/libkrb5.so /usr/libx32/libhx509.so /usr/libx32/libwind.so /usr/libx32/libhcrypto.so /usr/libx32/libasn1.so -lcom_err /usr/libx32/libheimbase.so /usr/libx32/libroken.so /usr/libx32/libldap.so /usr/libx32/libsasl2.so -lcrypt /usr/libx32/libpam.so /usr/libx32/libaudit.so /usr/libx32/libcap-ng.so -lssl -lcrypto /usr/libx32/liblber.so -lresolv /usr/libx32/libbrotlidec.so /usr/libx32/libbrotlicommon.so /usr/libx32/libexpat.so -lrt -lreadline -lpq /usr/libx32/libsqlite3.so -lz -lpthread -ldl /usr/libx32/libstdc++.so -lm -pthread -Wl,-rpath -Wl,/usr/libx32
make[2]: Leaving directory '/tmp/B.JWIKG9/BUILD/sleuthkit-4.6.4/tools/vstools'
make[2]: Entering directory '/tmp/B.JWIKG9/BUILD/sleuthkit-4.6.4/tools/vstools'
/bin/sh ../../libtool  --tag=CXX   --mode=link x86_64-pld-linux-gnux32-g++ -Wall -Wextra -Wno-unused-parameter -Wno-unused-command-line-argument -O2 -fwrapv -pipe -Wformat -Werror=format-security -gdwarf-4 -fno-debug-types-section -fvar-tracking-assignments -g2 -Wp,-D_FORTIFY_SOURCE=2 -fstack-protector-strong --param=ssp-buffer-size=4 -fPIC -mtune=generic -march=x86-64 -gdwarf-4 -fno-debug-types-section -fvar-tracking-assignments -g2   -Wl,--as-needed -Wl,--no-copy-dt-needed-entries -Wl,-z,relro -Wl,-z,combreloc  -pthread -L/usr/local/lib  -o mmcat mmcat.o ../../tsk/libtsk.la -lewf -ldl -lz -lafflib -lpq -lsqlite3 -ldl -lstdc++ 
libtool: link: x86_64-pld-linux-gnux32-g++ -Wall -Wextra -Wno-unused-parameter -Wno-unused-command-line-argument -O2 -fwrapv -pipe -Wformat -Werror=format-security -gdwarf-4 -fno-debug-types-section -fvar-tracking-assignments -g2 -Wp,-D_FORTIFY_SOURCE=2 -fstack-protector-strong --param=ssp-buffer-size=4 -fPIC -mtune=generic -march=x86-64 -gdwarf-4 -fno-debug-types-section -fvar-tracking-assignments -g2 -Wl,--as-needed -Wl,--no-copy-dt-needed-entries -Wl,-z -Wl,relro -Wl,-z -Wl,combreloc -pthread -o .libs/mmcat mmcat.o  -L/usr/local/lib ../../tsk/.libs/libtsk.so -L/usr/libx32 -L/usr/lib64 -L/usr/lib -L/usr/local/libx32 -L/usr/local/lib64 -lewf /usr/libx32/libafflib.so -lmd /usr/libx32/libcurl.so /usr/libx32/libcares.so -lnghttp2 /usr/libx32/librtmp.so /usr/libx32/libgnutls.so -lp11-kit /usr/libx32/libidn2.so /usr/libx32/libunistring.so /usr/libx32/libtasn1.so -lhogweed -lnettle /usr/libx32/libgmp.so /usr/libx32/libssh2.so -lpsl /usr/libx32/libgssapi.so /usr/libx32/libheimntlm.so /usr/libx32/libkrb5.so /usr/libx32/libhx509.so /usr/libx32/libwind.so /usr/libx32/libhcrypto.so /usr/libx32/libasn1.so -lcom_err /usr/libx32/libheimbase.so /usr/libx32/libroken.so /usr/libx32/libldap.so /usr/libx32/libsasl2.so -lcrypt /usr/libx32/libpam.so /usr/libx32/libaudit.so /usr/libx32/libcap-ng.so -lssl -lcrypto /usr/libx32/liblber.so -lresolv /usr/libx32/libbrotlidec.so /usr/libx32/libbrotlicommon.so /usr/libx32/libexpat.so -lrt -lreadline -lpq /usr/libx32/libsqlite3.so -lz -lpthread -ldl /usr/libx32/libstdc++.so -lm -pthread -Wl,-rpath -Wl,/usr/libx32
make[2]: Leaving directory '/tmp/B.JWIKG9/BUILD/sleuthkit-4.6.4/tools/vstools'
make[2]: Entering directory '/tmp/B.JWIKG9/BUILD/sleuthkit-4.6.4/tools/vstools'
/bin/sh ../../libtool  --tag=CXX   --mode=link x86_64-pld-linux-gnux32-g++ -Wall -Wextra -Wno-unused-parameter -Wno-unused-command-line-argument -O2 -fwrapv -pipe -Wformat -Werror=format-security -gdwarf-4 -fno-debug-types-section -fvar-tracking-assignments -g2 -Wp,-D_FORTIFY_SOURCE=2 -fstack-protector-strong --param=ssp-buffer-size=4 -fPIC -mtune=generic -march=x86-64 -gdwarf-4 -fno-debug-types-section -fvar-tracking-assignments -g2   -Wl,--as-needed -Wl,--no-copy-dt-needed-entries -Wl,-z,relro -Wl,-z,combreloc  -pthread -L/usr/local/lib  -o mmls mmls.o ../../tsk/libtsk.la -lewf -ldl -lz -lafflib -lpq -lsqlite3 -ldl -lstdc++ 
libtool: link: x86_64-pld-linux-gnux32-g++ -Wall -Wextra -Wno-unused-parameter -Wno-unused-command-line-argument -O2 -fwrapv -pipe -Wformat -Werror=format-security -gdwarf-4 -fno-debug-types-section -fvar-tracking-assignments -g2 -Wp,-D_FORTIFY_SOURCE=2 -fstack-protector-strong --param=ssp-buffer-size=4 -fPIC -mtune=generic -march=x86-64 -gdwarf-4 -fno-debug-types-section -fvar-tracking-assignments -g2 -Wl,--as-needed -Wl,--no-copy-dt-needed-entries -Wl,-z -Wl,relro -Wl,-z -Wl,combreloc -pthread -o .libs/mmls mmls.o  -L/usr/local/lib ../../tsk/.libs/libtsk.so -L/usr/libx32 -L/usr/lib64 -L/usr/lib -L/usr/local/libx32 -L/usr/local/lib64 -lewf /usr/libx32/libafflib.so -lmd /usr/libx32/libcurl.so /usr/libx32/libcares.so -lnghttp2 /usr/libx32/librtmp.so /usr/libx32/libgnutls.so -lp11-kit /usr/libx32/libidn2.so /usr/libx32/libunistring.so /usr/libx32/libtasn1.so -lhogweed -lnettle /usr/libx32/libgmp.so /usr/libx32/libssh2.so -lpsl /usr/libx32/libgssapi.so /usr/libx32/libheimntlm.so /usr/libx32/libkrb5.so /usr/libx32/libhx509.so /usr/libx32/libwind.so /usr/libx32/libhcrypto.so /usr/libx32/libasn1.so -lcom_err /usr/libx32/libheimbase.so /usr/libx32/libroken.so /usr/libx32/libldap.so /usr/libx32/libsasl2.so -lcrypt /usr/libx32/libpam.so /usr/libx32/libaudit.so /usr/libx32/libcap-ng.so -lssl -lcrypto /usr/libx32/liblber.so -lresolv /usr/libx32/libbrotlidec.so /usr/libx32/libbrotlicommon.so /usr/libx32/libexpat.so -lrt -lreadline -lpq /usr/libx32/libsqlite3.so -lz -lpthread -ldl /usr/libx32/libstdc++.so -lm -pthread -Wl,-rpath -Wl,/usr/libx32
make[2]: Leaving directory '/tmp/B.JWIKG9/BUILD/sleuthkit-4.6.4/tools/vstools'
Making all in fstools
make[2]: Entering directory '/tmp/B.JWIKG9/BUILD/sleuthkit-4.6.4/tools/fstools'
x86_64-pld-linux-gnux32-g++ -DHAVE_CONFIG_H -I. -I../../tsk  -I../.. -I./../.. -pthread -I/usr/local/include -Wall -Wextra -Wno-unused-parameter -Wno-unused-command-line-argument -O2 -fwrapv -pipe -Wformat -Werror=format-security -gdwarf-4 -fno-debug-types-section -fvar-tracking-assignments -g2 -Wp,-D_FORTIFY_SOURCE=2 -fstack-protector-strong --param=ssp-buffer-size=4 -fPIC -mtune=generic -march=x86-64 -gdwarf-4 -fno-debug-types-section -fvar-tracking-assignments -g2  -MT ffind.o -MD -MP -MF .deps/ffind.Tpo -c -o ffind.o ffind.cpp
mv -f .deps/ffind.Tpo .deps/ffind.Po
make[2]: Leaving directory '/tmp/B.JWIKG9/BUILD/sleuthkit-4.6.4/tools/fstools'
make[2]: Entering directory '/tmp/B.JWIKG9/BUILD/sleuthkit-4.6.4/tools/fstools'
x86_64-pld-linux-gnux32-g++ -DHAVE_CONFIG_H -I. -I../../tsk  -I../.. -I./../.. -pthread -I/usr/local/include -Wall -Wextra -Wno-unused-parameter -Wno-unused-command-line-argument -O2 -fwrapv -pipe -Wformat -Werror=format-security -gdwarf-4 -fno-debug-types-section -fvar-tracking-assignments -g2 -Wp,-D_FORTIFY_SOURCE=2 -fstack-protector-strong --param=ssp-buffer-size=4 -fPIC -mtune=generic -march=x86-64 -gdwarf-4 -fno-debug-types-section -fvar-tracking-assignments -g2  -MT fcat.o -MD -MP -MF .deps/fcat.Tpo -c -o fcat.o fcat.cpp
fcat.cpp: In function 'int main(int, char**)':
fcat.cpp:84:18: warning: this statement may fall through [-Wimplicit-fallthrough=]
             usage();
             ~~~~~^~
fcat.cpp:85:9: note: here
         case _TSK_T('b'):
         ^~~~
At global scope:
cc1plus: warning: unrecognized command line option '-Wno-unused-command-line-argument'
mv -f .deps/fcat.Tpo .deps/fcat.Po
make[2]: Leaving directory '/tmp/B.JWIKG9/BUILD/sleuthkit-4.6.4/tools/fstools'
make[2]: Entering directory '/tmp/B.JWIKG9/BUILD/sleuthkit-4.6.4/tools/fstools'
x86_64-pld-linux-gnux32-g++ -DHAVE_CONFIG_H -I. -I../../tsk  -I../.. -I./../.. -pthread -I/usr/local/include -Wall -Wextra -Wno-unused-parameter -Wno-unused-command-line-argument -O2 -fwrapv -pipe -Wformat -Werror=format-security -gdwarf-4 -fno-debug-types-section -fvar-tracking-assignments -g2 -Wp,-D_FORTIFY_SOURCE=2 -fstack-protector-strong --param=ssp-buffer-size=4 -fPIC -mtune=generic -march=x86-64 -gdwarf-4 -fno-debug-types-section -fvar-tracking-assignments -g2  -MT icat.o -MD -MP -MF .deps/icat.Tpo -c -o icat.o icat.cpp
icat.cpp: In function 'int main(int, char**)':
icat.cpp:99:18: warning: this statement may fall through [-Wimplicit-fallthrough=]
             usage();
             ~~~~~^~
icat.cpp:100:9: note: here
         case _TSK_T('b'):
         ^~~~
At global scope:
cc1plus: warning: unrecognized command line option '-Wno-unused-command-line-argument'
mv -f .deps/icat.Tpo .deps/icat.Po
make[2]: Leaving directory '/tmp/B.JWIKG9/BUILD/sleuthkit-4.6.4/tools/fstools'
make[2]: Entering directory '/tmp/B.JWIKG9/BUILD/sleuthkit-4.6.4/tools/fstools'
x86_64-pld-linux-gnux32-g++ -DHAVE_CONFIG_H -I. -I../../tsk  -I../.. -I./../.. -pthread -I/usr/local/include -Wall -Wextra -Wno-unused-parameter -Wno-unused-command-line-argument -O2 -fwrapv -pipe -Wformat -Werror=format-security -gdwarf-4 -fno-debug-types-section -fvar-tracking-assignments -g2 -Wp,-D_FORTIFY_SOURCE=2 -fstack-protector-strong --param=ssp-buffer-size=4 -fPIC -mtune=generic -march=x86-64 -gdwarf-4 -fno-debug-types-section -fvar-tracking-assignments -g2  -MT fls.o -MD -MP -MF .deps/fls.Tpo -c -o fls.o fls.cpp
fls.cpp: In function 'int main(int, char**)':
fls.cpp:112:18: warning: this statement may fall through [-Wimplicit-fallthrough=]
             usage();
             ~~~~~^~
fls.cpp:113:9: note: here
         case _TSK_T('a'):
         ^~~~
At global scope:
cc1plus: warning: unrecognized command line option '-Wno-unused-command-line-argument'
mv -f .deps/fls.Tpo .deps/fls.Po
make[2]: Leaving directory '/tmp/B.JWIKG9/BUILD/sleuthkit-4.6.4/tools/fstools'
make[2]: Entering directory '/tmp/B.JWIKG9/BUILD/sleuthkit-4.6.4/tools/fstools'
x86_64-pld-linux-gnux32-g++ -DHAVE_CONFIG_H -I. -I../../tsk  -I../.. -I./../.. -pthread -I/usr/local/include -Wall -Wextra -Wno-unused-parameter -Wno-unused-command-line-argument -O2 -fwrapv -pipe -Wformat -Werror=format-security -gdwarf-4 -fno-debug-types-section -fvar-tracking-assignments -g2 -Wp,-D_FORTIFY_SOURCE=2 -fstack-protector-strong --param=ssp-buffer-size=4 -fPIC -mtune=generic -march=x86-64 -gdwarf-4 -fno-debug-types-section -fvar-tracking-assignments -g2  -MT blkcat.o -MD -MP -MF .deps/blkcat.Tpo -c -o blkcat.o blkcat.cpp
mv -f .deps/blkcat.Tpo .deps/blkcat.Po
make[2]: Leaving directory '/tmp/B.JWIKG9/BUILD/sleuthkit-4.6.4/tools/fstools'
make[2]: Entering directory '/tmp/B.JWIKG9/BUILD/sleuthkit-4.6.4/tools/fstools'
x86_64-pld-linux-gnux32-g++ -DHAVE_CONFIG_H -I. -I../../tsk  -I../.. -I./../.. -pthread -I/usr/local/include -Wall -Wextra -Wno-unused-parameter -Wno-unused-command-line-argument -O2 -fwrapv -pipe -Wformat -Werror=format-security -gdwarf-4 -fno-debug-types-section -fvar-tracking-assignments -g2 -Wp,-D_FORTIFY_SOURCE=2 -fstack-protector-strong --param=ssp-buffer-size=4 -fPIC -mtune=generic -march=x86-64 -gdwarf-4 -fno-debug-types-section -fvar-tracking-assignments -g2  -MT blkstat.o -MD -MP -MF .deps/blkstat.Tpo -c -o blkstat.o blkstat.cpp
mv -f .deps/blkstat.Tpo .deps/blkstat.Po
make[2]: Leaving directory '/tmp/B.JWIKG9/BUILD/sleuthkit-4.6.4/tools/fstools'
make[2]: Entering directory '/tmp/B.JWIKG9/BUILD/sleuthkit-4.6.4/tools/fstools'
x86_64-pld-linux-gnux32-g++ -DHAVE_CONFIG_H -I. -I../../tsk  -I../.. -I./../.. -pthread -I/usr/local/include -Wall -Wextra -Wno-unused-parameter -Wno-unused-command-line-argument -O2 -fwrapv -pipe -Wformat -Werror=format-security -gdwarf-4 -fno-debug-types-section -fvar-tracking-assignments -g2 -Wp,-D_FORTIFY_SOURCE=2 -fstack-protector-strong --param=ssp-buffer-size=4 -fPIC -mtune=generic -march=x86-64 -gdwarf-4 -fno-debug-types-section -fvar-tracking-assignments -g2  -MT blkcalc.o -MD -MP -MF .deps/blkcalc.Tpo -c -o blkcalc.o blkcalc.cpp
blkcalc.cpp: In function 'int main(int, char**)':
blkcalc.cpp:100:18: warning: this statement may fall through [-Wimplicit-fallthrough=]
             usage();
             ~~~~~^~
blkcalc.cpp:102:9: note: here
         case _TSK_T('b'):
         ^~~~
At global scope:
cc1plus: warning: unrecognized command line option '-Wno-unused-command-line-argument'
mv -f .deps/blkcalc.Tpo .deps/blkcalc.Po
make[2]: Leaving directory '/tmp/B.JWIKG9/BUILD/sleuthkit-4.6.4/tools/fstools'
make[2]: Entering directory '/tmp/B.JWIKG9/BUILD/sleuthkit-4.6.4/tools/fstools'
x86_64-pld-linux-gnux32-g++ -DHAVE_CONFIG_H -I. -I../../tsk  -I../.. -I./../.. -pthread -I/usr/local/include -Wall -Wextra -Wno-unused-parameter -Wno-unused-command-line-argument -O2 -fwrapv -pipe -Wformat -Werror=format-security -gdwarf-4 -fno-debug-types-section -fvar-tracking-assignments -g2 -Wp,-D_FORTIFY_SOURCE=2 -fstack-protector-strong --param=ssp-buffer-size=4 -fPIC -mtune=generic -march=x86-64 -gdwarf-4 -fno-debug-types-section -fvar-tracking-assignments -g2  -MT fsstat.o -MD -MP -MF .deps/fsstat.Tpo -c -o fsstat.o fsstat.cpp
fsstat.cpp: In function 'int main(int, char**)':
fsstat.cpp:79:18: warning: this statement may fall through [-Wimplicit-fallthrough=]
             usage();
             ~~~~~^~
fsstat.cpp:80:9: note: here
         case _TSK_T('b'):
         ^~~~
At global scope:
cc1plus: warning: unrecognized command line option '-Wno-unused-command-line-argument'
mv -f .deps/fsstat.Tpo .deps/fsstat.Po
make[2]: Leaving directory '/tmp/B.JWIKG9/BUILD/sleuthkit-4.6.4/tools/fstools'
make[2]: Entering directory '/tmp/B.JWIKG9/BUILD/sleuthkit-4.6.4/tools/fstools'
x86_64-pld-linux-gnux32-g++ -DHAVE_CONFIG_H -I. -I../../tsk  -I../.. -I./../.. -pthread -I/usr/local/include -Wall -Wextra -Wno-unused-parameter -Wno-unused-command-line-argument -O2 -fwrapv -pipe -Wformat -Werror=format-security -gdwarf-4 -fno-debug-types-section -fvar-tracking-assignments -g2 -Wp,-D_FORTIFY_SOURCE=2 -fstack-protector-strong --param=ssp-buffer-size=4 -fPIC -mtune=generic -march=x86-64 -gdwarf-4 -fno-debug-types-section -fvar-tracking-assignments -g2  -MT blkls.o -MD -MP -MF .deps/blkls.Tpo -c -o blkls.o blkls.cpp
blkls.cpp: In function 'int main(int, char**)':
blkls.cpp:109:18: warning: this statement may fall through [-Wimplicit-fallthrough=]
             usage();
             ~~~~~^~
blkls.cpp:110:9: note: here
         case _TSK_T('a'):
         ^~~~
At global scope:
cc1plus: warning: unrecognized command line option '-Wno-unused-command-line-argument'
mv -f .deps/blkls.Tpo .deps/blkls.Po
make[2]: Leaving directory '/tmp/B.JWIKG9/BUILD/sleuthkit-4.6.4/tools/fstools'
make[2]: Entering directory '/tmp/B.JWIKG9/BUILD/sleuthkit-4.6.4/tools/fstools'
x86_64-pld-linux-gnux32-g++ -DHAVE_CONFIG_H -I. -I../../tsk  -I../.. -I./../.. -pthread -I/usr/local/include -Wall -Wextra -Wno-unused-parameter -Wno-unused-command-line-argument -O2 -fwrapv -pipe -Wformat -Werror=format-security -gdwarf-4 -fno-debug-types-section -fvar-tracking-assignments -g2 -Wp,-D_FORTIFY_SOURCE=2 -fstack-protector-strong --param=ssp-buffer-size=4 -fPIC -mtune=generic -march=x86-64 -gdwarf-4 -fno-debug-types-section -fvar-tracking-assignments -g2  -MT usnjls.o -MD -MP -MF .deps/usnjls.Tpo -c -o usnjls.o usnjls.cpp
usnjls.cpp: In function 'int main(int, char**)':
usnjls.cpp:91:22: warning: this statement may fall through [-Wimplicit-fallthrough=]
                 usage();
                 ~~~~~^~
usnjls.cpp:93:9: note: here
         case _TSK_T('b'):
         ^~~~
At global scope:
cc1plus: warning: unrecognized command line option '-Wno-unused-command-line-argument'
mv -f .deps/usnjls.Tpo .deps/usnjls.Po
make[2]: Leaving directory '/tmp/B.JWIKG9/BUILD/sleuthkit-4.6.4/tools/fstools'
make[2]: Entering directory '/tmp/B.JWIKG9/BUILD/sleuthkit-4.6.4/tools/fstools'
x86_64-pld-linux-gnux32-g++ -DHAVE_CONFIG_H -I. -I../../tsk  -I../.. -I./../.. -pthread -I/usr/local/include -Wall -Wextra -Wno-unused-parameter -Wno-unused-command-line-argument -O2 -fwrapv -pipe -Wformat -Werror=format-security -gdwarf-4 -fno-debug-types-section -fvar-tracking-assignments -g2 -Wp,-D_FORTIFY_SOURCE=2 -fstack-protector-strong --param=ssp-buffer-size=4 -fPIC -mtune=generic -march=x86-64 -gdwarf-4 -fno-debug-types-section -fvar-tracking-assignments -g2  -MT ifind.o -MD -MP -MF .deps/ifind.Tpo -c -o ifind.o ifind.cpp
mv -f .deps/ifind.Tpo .deps/ifind.Po
make[2]: Leaving directory '/tmp/B.JWIKG9/BUILD/sleuthkit-4.6.4/tools/fstools'
make[2]: Entering directory '/tmp/B.JWIKG9/BUILD/sleuthkit-4.6.4/tools/fstools'
x86_64-pld-linux-gnux32-g++ -DHAVE_CONFIG_H -I. -I../../tsk  -I../.. -I./../.. -pthread -I/usr/local/include -Wall -Wextra -Wno-unused-parameter -Wno-unused-command-line-argument -O2 -fwrapv -pipe -Wformat -Werror=format-security -gdwarf-4 -fno-debug-types-section -fvar-tracking-assignments -g2 -Wp,-D_FORTIFY_SOURCE=2 -fstack-protector-strong --param=ssp-buffer-size=4 -fPIC -mtune=generic -march=x86-64 -gdwarf-4 -fno-debug-types-section -fvar-tracking-assignments -g2  -MT jcat.o -MD -MP -MF .deps/jcat.Tpo -c -o jcat.o jcat.cpp
jcat.cpp: In function 'int main(int, char**)':
jcat.cpp:83:18: warning: this statement may fall through [-Wimplicit-fallthrough=]
             usage();
             ~~~~~^~
jcat.cpp:84:9: note: here
         case _TSK_T('b'):
         ^~~~
At global scope:
cc1plus: warning: unrecognized command line option '-Wno-unused-command-line-argument'
mv -f .deps/jcat.Tpo .deps/jcat.Po
make[2]: Leaving directory '/tmp/B.JWIKG9/BUILD/sleuthkit-4.6.4/tools/fstools'
make[2]: Entering directory '/tmp/B.JWIKG9/BUILD/sleuthkit-4.6.4/tools/fstools'
x86_64-pld-linux-gnux32-g++ -DHAVE_CONFIG_H -I. -I../../tsk  -I../.. -I./../.. -pthread -I/usr/local/include -Wall -Wextra -Wno-unused-parameter -Wno-unused-command-line-argument -O2 -fwrapv -pipe -Wformat -Werror=format-security -gdwarf-4 -fno-debug-types-section -fvar-tracking-assignments -g2 -Wp,-D_FORTIFY_SOURCE=2 -fstack-protector-strong --param=ssp-buffer-size=4 -fPIC -mtune=generic -march=x86-64 -gdwarf-4 -fno-debug-types-section -fvar-tracking-assignments -g2  -MT istat.o -MD -MP -MF .deps/istat.Tpo -c -o istat.o istat.cpp
istat.cpp: In function 'int main(int, char**)':
istat.cpp:97:18: warning: this statement may fall through [-Wimplicit-fallthrough=]
             usage();
             ~~~~~^~
istat.cpp:98:9: note: here
         case _TSK_T('B'):
         ^~~~
At global scope:
cc1plus: warning: unrecognized command line option '-Wno-unused-command-line-argument'
mv -f .deps/istat.Tpo .deps/istat.Po
make[2]: Leaving directory '/tmp/B.JWIKG9/BUILD/sleuthkit-4.6.4/tools/fstools'
make[2]: Entering directory '/tmp/B.JWIKG9/BUILD/sleuthkit-4.6.4/tools/fstools'
x86_64-pld-linux-gnux32-g++ -DHAVE_CONFIG_H -I. -I../../tsk  -I../.. -I./../.. -pthread -I/usr/local/include -Wall -Wextra -Wno-unused-parameter -Wno-unused-command-line-argument -O2 -fwrapv -pipe -Wformat -Werror=format-security -gdwarf-4 -fno-debug-types-section -fvar-tracking-assignments -g2 -Wp,-D_FORTIFY_SOURCE=2 -fstack-protector-strong --param=ssp-buffer-size=4 -fPIC -mtune=generic -march=x86-64 -gdwarf-4 -fno-debug-types-section -fvar-tracking-assignments -g2  -MT ils.o -MD -MP -MF .deps/ils.Tpo -c -o ils.o ils.cpp
ils.cpp: In function 'int main(int, char**)':
ils.cpp:115:18: warning: this statement may fall through [-Wimplicit-fallthrough=]
             usage();
             ~~~~~^~
ils.cpp:116:9: note: here
         case _TSK_T('b'):
         ^~~~
At global scope:
cc1plus: warning: unrecognized command line option '-Wno-unused-command-line-argument'
mv -f .deps/ils.Tpo .deps/ils.Po
make[2]: Leaving directory '/tmp/B.JWIKG9/BUILD/sleuthkit-4.6.4/tools/fstools'
make[2]: Entering directory '/tmp/B.JWIKG9/BUILD/sleuthkit-4.6.4/tools/fstools'
x86_64-pld-linux-gnux32-g++ -DHAVE_CONFIG_H -I. -I../../tsk  -I../.. -I./../.. -pthread -I/usr/local/include -Wall -Wextra -Wno-unused-parameter -Wno-unused-command-line-argument -O2 -fwrapv -pipe -Wformat -Werror=format-security -gdwarf-4 -fno-debug-types-section -fvar-tracking-assignments -g2 -Wp,-D_FORTIFY_SOURCE=2 -fstack-protector-strong --param=ssp-buffer-size=4 -fPIC -mtune=generic -march=x86-64 -gdwarf-4 -fno-debug-types-section -fvar-tracking-assignments -g2  -MT jls.o -MD -MP -MF .deps/jls.Tpo -c -o jls.o jls.cpp
jls.cpp: In function 'int main(int, char**)':
jls.cpp:75:18: warning: this statement may fall through [-Wimplicit-fallthrough=]
             usage();
             ~~~~~^~
jls.cpp:76:9: note: here
         case _TSK_T('b'):
         ^~~~
At global scope:
cc1plus: warning: unrecognized command line option '-Wno-unused-command-line-argument'
mv -f .deps/jls.Tpo .deps/jls.Po
make[2]: Leaving directory '/tmp/B.JWIKG9/BUILD/sleuthkit-4.6.4/tools/fstools'
make[2]: Entering directory '/tmp/B.JWIKG9/BUILD/sleuthkit-4.6.4/tools/fstools'
/bin/sh ../../libtool  --tag=CXX   --mode=link x86_64-pld-linux-gnux32-g++ -Wall -Wextra -Wno-unused-parameter -Wno-unused-command-line-argument -O2 -fwrapv -pipe -Wformat -Werror=format-security -gdwarf-4 -fno-debug-types-section -fvar-tracking-assignments -g2 -Wp,-D_FORTIFY_SOURCE=2 -fstack-protector-strong --param=ssp-buffer-size=4 -fPIC -mtune=generic -march=x86-64 -gdwarf-4 -fno-debug-types-section -fvar-tracking-assignments -g2   -Wl,--as-needed -Wl,--no-copy-dt-needed-entries -Wl,-z,relro -Wl,-z,combreloc  -pthread -L/usr/local/lib  -o blkstat blkstat.o ../../tsk/libtsk.la -lewf -ldl -lz -lafflib -lpq -lsqlite3 -ldl -lstdc++ 
libtool: link: x86_64-pld-linux-gnux32-g++ -Wall -Wextra -Wno-unused-parameter -Wno-unused-command-line-argument -O2 -fwrapv -pipe -Wformat -Werror=format-security -gdwarf-4 -fno-debug-types-section -fvar-tracking-assignments -g2 -Wp,-D_FORTIFY_SOURCE=2 -fstack-protector-strong --param=ssp-buffer-size=4 -fPIC -mtune=generic -march=x86-64 -gdwarf-4 -fno-debug-types-section -fvar-tracking-assignments -g2 -Wl,--as-needed -Wl,--no-copy-dt-needed-entries -Wl,-z -Wl,relro -Wl,-z -Wl,combreloc -pthread -o .libs/blkstat blkstat.o  -L/usr/local/lib ../../tsk/.libs/libtsk.so -L/usr/libx32 -L/usr/lib64 -L/usr/lib -L/usr/local/libx32 -L/usr/local/lib64 -lewf /usr/libx32/libafflib.so -lmd /usr/libx32/libcurl.so /usr/libx32/libcares.so -lnghttp2 /usr/libx32/librtmp.so /usr/libx32/libgnutls.so -lp11-kit /usr/libx32/libidn2.so /usr/libx32/libunistring.so /usr/libx32/libtasn1.so -lhogweed -lnettle /usr/libx32/libgmp.so /usr/libx32/libssh2.so -lpsl /usr/libx32/libgssapi.so /usr/libx32/libheimntlm.so /usr/libx32/libkrb5.so /usr/libx32/libhx509.so /usr/libx32/libwind.so /usr/libx32/libhcrypto.so /usr/libx32/libasn1.so -lcom_err /usr/libx32/libheimbase.so /usr/libx32/libroken.so /usr/libx32/libldap.so /usr/libx32/libsasl2.so -lcrypt /usr/libx32/libpam.so /usr/libx32/libaudit.so /usr/libx32/libcap-ng.so -lssl -lcrypto /usr/libx32/liblber.so -lresolv /usr/libx32/libbrotlidec.so /usr/libx32/libbrotlicommon.so /usr/libx32/libexpat.so -lrt -lreadline -lpq /usr/libx32/libsqlite3.so -lz -lpthread -ldl /usr/libx32/libstdc++.so -lm -pthread -Wl,-rpath -Wl,/usr/libx32
make[2]: Leaving directory '/tmp/B.JWIKG9/BUILD/sleuthkit-4.6.4/tools/fstools'
make[2]: Entering directory '/tmp/B.JWIKG9/BUILD/sleuthkit-4.6.4/tools/fstools'
/bin/sh ../../libtool  --tag=CXX   --mode=link x86_64-pld-linux-gnux32-g++ -Wall -Wextra -Wno-unused-parameter -Wno-unused-command-line-argument -O2 -fwrapv -pipe -Wformat -Werror=format-security -gdwarf-4 -fno-debug-types-section -fvar-tracking-assignments -g2 -Wp,-D_FORTIFY_SOURCE=2 -fstack-protector-strong --param=ssp-buffer-size=4 -fPIC -mtune=generic -march=x86-64 -gdwarf-4 -fno-debug-types-section -fvar-tracking-assignments -g2   -Wl,--as-needed -Wl,--no-copy-dt-needed-entries -Wl,-z,relro -Wl,-z,combreloc  -pthread -L/usr/local/lib  -o blkcat blkcat.o ../../tsk/libtsk.la -lewf -ldl -lz -lafflib -lpq -lsqlite3 -ldl -lstdc++ 
libtool: link: x86_64-pld-linux-gnux32-g++ -Wall -Wextra -Wno-unused-parameter -Wno-unused-command-line-argument -O2 -fwrapv -pipe -Wformat -Werror=format-security -gdwarf-4 -fno-debug-types-section -fvar-tracking-assignments -g2 -Wp,-D_FORTIFY_SOURCE=2 -fstack-protector-strong --param=ssp-buffer-size=4 -fPIC -mtune=generic -march=x86-64 -gdwarf-4 -fno-debug-types-section -fvar-tracking-assignments -g2 -Wl,--as-needed -Wl,--no-copy-dt-needed-entries -Wl,-z -Wl,relro -Wl,-z -Wl,combreloc -pthread -o .libs/blkcat blkcat.o  -L/usr/local/lib ../../tsk/.libs/libtsk.so -L/usr/libx32 -L/usr/lib64 -L/usr/lib -L/usr/local/libx32 -L/usr/local/lib64 -lewf /usr/libx32/libafflib.so -lmd /usr/libx32/libcurl.so /usr/libx32/libcares.so -lnghttp2 /usr/libx32/librtmp.so /usr/libx32/libgnutls.so -lp11-kit /usr/libx32/libidn2.so /usr/libx32/libunistring.so /usr/libx32/libtasn1.so -lhogweed -lnettle /usr/libx32/libgmp.so /usr/libx32/libssh2.so -lpsl /usr/libx32/libgssapi.so /usr/libx32/libheimntlm.so /usr/libx32/libkrb5.so /usr/libx32/libhx509.so /usr/libx32/libwind.so /usr/libx32/libhcrypto.so /usr/libx32/libasn1.so -lcom_err /usr/libx32/libheimbase.so /usr/libx32/libroken.so /usr/libx32/libldap.so /usr/libx32/libsasl2.so -lcrypt /usr/libx32/libpam.so /usr/libx32/libaudit.so /usr/libx32/libcap-ng.so -lssl -lcrypto /usr/libx32/liblber.so -lresolv /usr/libx32/libbrotlidec.so /usr/libx32/libbrotlicommon.so /usr/libx32/libexpat.so -lrt -lreadline -lpq /usr/libx32/libsqlite3.so -lz -lpthread -ldl /usr/libx32/libstdc++.so -lm -pthread -Wl,-rpath -Wl,/usr/libx32
make[2]: Leaving directory '/tmp/B.JWIKG9/BUILD/sleuthkit-4.6.4/tools/fstools'
make[2]: Entering directory '/tmp/B.JWIKG9/BUILD/sleuthkit-4.6.4/tools/fstools'
/bin/sh ../../libtool  --tag=CXX   --mode=link x86_64-pld-linux-gnux32-g++ -Wall -Wextra -Wno-unused-parameter -Wno-unused-command-line-argument -O2 -fwrapv -pipe -Wformat -Werror=format-security -gdwarf-4 -fno-debug-types-section -fvar-tracking-assignments -g2 -Wp,-D_FORTIFY_SOURCE=2 -fstack-protector-strong --param=ssp-buffer-size=4 -fPIC -mtune=generic -march=x86-64 -gdwarf-4 -fno-debug-types-section -fvar-tracking-assignments -g2   -Wl,--as-needed -Wl,--no-copy-dt-needed-entries -Wl,-z,relro -Wl,-z,combreloc  -pthread -L/usr/local/lib  -o blkcalc blkcalc.o ../../tsk/libtsk.la -lewf -ldl -lz -lafflib -lpq -lsqlite3 -ldl -lstdc++ 
libtool: link: x86_64-pld-linux-gnux32-g++ -Wall -Wextra -Wno-unused-parameter -Wno-unused-command-line-argument -O2 -fwrapv -pipe -Wformat -Werror=format-security -gdwarf-4 -fno-debug-types-section -fvar-tracking-assignments -g2 -Wp,-D_FORTIFY_SOURCE=2 -fstack-protector-strong --param=ssp-buffer-size=4 -fPIC -mtune=generic -march=x86-64 -gdwarf-4 -fno-debug-types-section -fvar-tracking-assignments -g2 -Wl,--as-needed -Wl,--no-copy-dt-needed-entries -Wl,-z -Wl,relro -Wl,-z -Wl,combreloc -pthread -o .libs/blkcalc blkcalc.o  -L/usr/local/lib ../../tsk/.libs/libtsk.so -L/usr/libx32 -L/usr/lib64 -L/usr/lib -L/usr/local/libx32 -L/usr/local/lib64 -lewf /usr/libx32/libafflib.so -lmd /usr/libx32/libcurl.so /usr/libx32/libcares.so -lnghttp2 /usr/libx32/librtmp.so /usr/libx32/libgnutls.so -lp11-kit /usr/libx32/libidn2.so /usr/libx32/libunistring.so /usr/libx32/libtasn1.so -lhogweed -lnettle /usr/libx32/libgmp.so /usr/libx32/libssh2.so -lpsl /usr/libx32/libgssapi.so /usr/libx32/libheimntlm.so /usr/libx32/libkrb5.so /usr/libx32/libhx509.so /usr/libx32/libwind.so /usr/libx32/libhcrypto.so /usr/libx32/libasn1.so -lcom_err /usr/libx32/libheimbase.so /usr/libx32/libroken.so /usr/libx32/libldap.so /usr/libx32/libsasl2.so -lcrypt /usr/libx32/libpam.so /usr/libx32/libaudit.so /usr/libx32/libcap-ng.so -lssl -lcrypto /usr/libx32/liblber.so -lresolv /usr/libx32/libbrotlidec.so /usr/libx32/libbrotlicommon.so /usr/libx32/libexpat.so -lrt -lreadline -lpq /usr/libx32/libsqlite3.so -lz -lpthread -ldl /usr/libx32/libstdc++.so -lm -pthread -Wl,-rpath -Wl,/usr/libx32
make[2]: Leaving directory '/tmp/B.JWIKG9/BUILD/sleuthkit-4.6.4/tools/fstools'
make[2]: Entering directory '/tmp/B.JWIKG9/BUILD/sleuthkit-4.6.4/tools/fstools'
/bin/sh ../../libtool  --tag=CXX   --mode=link x86_64-pld-linux-gnux32-g++ -Wall -Wextra -Wno-unused-parameter -Wno-unused-command-line-argument -O2 -fwrapv -pipe -Wformat -Werror=format-security -gdwarf-4 -fno-debug-types-section -fvar-tracking-assignments -g2 -Wp,-D_FORTIFY_SOURCE=2 -fstack-protector-strong --param=ssp-buffer-size=4 -fPIC -mtune=generic -march=x86-64 -gdwarf-4 -fno-debug-types-section -fvar-tracking-assignments -g2   -Wl,--as-needed -Wl,--no-copy-dt-needed-entries -Wl,-z,relro -Wl,-z,combreloc  -pthread -L/usr/local/lib  -o ffind ffind.o ../../tsk/libtsk.la -lewf -ldl -lz -lafflib -lpq -lsqlite3 -ldl -lstdc++ 
libtool: link: x86_64-pld-linux-gnux32-g++ -Wall -Wextra -Wno-unused-parameter -Wno-unused-command-line-argument -O2 -fwrapv -pipe -Wformat -Werror=format-security -gdwarf-4 -fno-debug-types-section -fvar-tracking-assignments -g2 -Wp,-D_FORTIFY_SOURCE=2 -fstack-protector-strong --param=ssp-buffer-size=4 -fPIC -mtune=generic -march=x86-64 -gdwarf-4 -fno-debug-types-section -fvar-tracking-assignments -g2 -Wl,--as-needed -Wl,--no-copy-dt-needed-entries -Wl,-z -Wl,relro -Wl,-z -Wl,combreloc -pthread -o .libs/ffind ffind.o  -L/usr/local/lib ../../tsk/.libs/libtsk.so -L/usr/libx32 -L/usr/lib64 -L/usr/lib -L/usr/local/libx32 -L/usr/local/lib64 -lewf /usr/libx32/libafflib.so -lmd /usr/libx32/libcurl.so /usr/libx32/libcares.so -lnghttp2 /usr/libx32/librtmp.so /usr/libx32/libgnutls.so -lp11-kit /usr/libx32/libidn2.so /usr/libx32/libunistring.so /usr/libx32/libtasn1.so -lhogweed -lnettle /usr/libx32/libgmp.so /usr/libx32/libssh2.so -lpsl /usr/libx32/libgssapi.so /usr/libx32/libheimntlm.so /usr/libx32/libkrb5.so /usr/libx32/libhx509.so /usr/libx32/libwind.so /usr/libx32/libhcrypto.so /usr/libx32/libasn1.so -lcom_err /usr/libx32/libheimbase.so /usr/libx32/libroken.so /usr/libx32/libldap.so /usr/libx32/libsasl2.so -lcrypt /usr/libx32/libpam.so /usr/libx32/libaudit.so /usr/libx32/libcap-ng.so -lssl -lcrypto /usr/libx32/liblber.so -lresolv /usr/libx32/libbrotlidec.so /usr/libx32/libbrotlicommon.so /usr/libx32/libexpat.so -lrt -lreadline -lpq /usr/libx32/libsqlite3.so -lz -lpthread -ldl /usr/libx32/libstdc++.so -lm -pthread -Wl,-rpath -Wl,/usr/libx32
make[2]: Leaving directory '/tmp/B.JWIKG9/BUILD/sleuthkit-4.6.4/tools/fstools'
make[2]: Entering directory '/tmp/B.JWIKG9/BUILD/sleuthkit-4.6.4/tools/fstools'
/bin/sh ../../libtool  --tag=CXX   --mode=link x86_64-pld-linux-gnux32-g++ -Wall -Wextra -Wno-unused-parameter -Wno-unused-command-line-argument -O2 -fwrapv -pipe -Wformat -Werror=format-security -gdwarf-4 -fno-debug-types-section -fvar-tracking-assignments -g2 -Wp,-D_FORTIFY_SOURCE=2 -fstack-protector-strong --param=ssp-buffer-size=4 -fPIC -mtune=generic -march=x86-64 -gdwarf-4 -fno-debug-types-section -fvar-tracking-assignments -g2   -Wl,--as-needed -Wl,--no-copy-dt-needed-entries -Wl,-z,relro -Wl,-z,combreloc  -pthread -L/usr/local/lib  -o ifind ifind.o ../../tsk/libtsk.la -lewf -ldl -lz -lafflib -lpq -lsqlite3 -ldl -lstdc++ 
libtool: link: x86_64-pld-linux-gnux32-g++ -Wall -Wextra -Wno-unused-parameter -Wno-unused-command-line-argument -O2 -fwrapv -pipe -Wformat -Werror=format-security -gdwarf-4 -fno-debug-types-section -fvar-tracking-assignments -g2 -Wp,-D_FORTIFY_SOURCE=2 -fstack-protector-strong --param=ssp-buffer-size=4 -fPIC -mtune=generic -march=x86-64 -gdwarf-4 -fno-debug-types-section -fvar-tracking-assignments -g2 -Wl,--as-needed -Wl,--no-copy-dt-needed-entries -Wl,-z -Wl,relro -Wl,-z -Wl,combreloc -pthread -o .libs/ifind ifind.o  -L/usr/local/lib ../../tsk/.libs/libtsk.so -L/usr/libx32 -L/usr/lib64 -L/usr/lib -L/usr/local/libx32 -L/usr/local/lib64 -lewf /usr/libx32/libafflib.so -lmd /usr/libx32/libcurl.so /usr/libx32/libcares.so -lnghttp2 /usr/libx32/librtmp.so /usr/libx32/libgnutls.so -lp11-kit /usr/libx32/libidn2.so /usr/libx32/libunistring.so /usr/libx32/libtasn1.so -lhogweed -lnettle /usr/libx32/libgmp.so /usr/libx32/libssh2.so -lpsl /usr/libx32/libgssapi.so /usr/libx32/libheimntlm.so /usr/libx32/libkrb5.so /usr/libx32/libhx509.so /usr/libx32/libwind.so /usr/libx32/libhcrypto.so /usr/libx32/libasn1.so -lcom_err /usr/libx32/libheimbase.so /usr/libx32/libroken.so /usr/libx32/libldap.so /usr/libx32/libsasl2.so -lcrypt /usr/libx32/libpam.so /usr/libx32/libaudit.so /usr/libx32/libcap-ng.so -lssl -lcrypto /usr/libx32/liblber.so -lresolv /usr/libx32/libbrotlidec.so /usr/libx32/libbrotlicommon.so /usr/libx32/libexpat.so -lrt -lreadline -lpq /usr/libx32/libsqlite3.so -lz -lpthread -ldl /usr/libx32/libstdc++.so -lm -pthread -Wl,-rpath -Wl,/usr/libx32
make[2]: Leaving directory '/tmp/B.JWIKG9/BUILD/sleuthkit-4.6.4/tools/fstools'
make[2]: Entering directory '/tmp/B.JWIKG9/BUILD/sleuthkit-4.6.4/tools/fstools'
/bin/sh ../../libtool  --tag=CXX   --mode=link x86_64-pld-linux-gnux32-g++ -Wall -Wextra -Wno-unused-parameter -Wno-unused-command-line-argument -O2 -fwrapv -pipe -Wformat -Werror=format-security -gdwarf-4 -fno-debug-types-section -fvar-tracking-assignments -g2 -Wp,-D_FORTIFY_SOURCE=2 -fstack-protector-strong --param=ssp-buffer-size=4 -fPIC -mtune=generic -march=x86-64 -gdwarf-4 -fno-debug-types-section -fvar-tracking-assignments -g2   -Wl,--as-needed -Wl,--no-copy-dt-needed-entries -Wl,-z,relro -Wl,-z,combreloc  -pthread -L/usr/local/lib  -o fsstat fsstat.o ../../tsk/libtsk.la -lewf -ldl -lz -lafflib -lpq -lsqlite3 -ldl -lstdc++ 
libtool: link: x86_64-pld-linux-gnux32-g++ -Wall -Wextra -Wno-unused-parameter -Wno-unused-command-line-argument -O2 -fwrapv -pipe -Wformat -Werror=format-security -gdwarf-4 -fno-debug-types-section -fvar-tracking-assignments -g2 -Wp,-D_FORTIFY_SOURCE=2 -fstack-protector-strong --param=ssp-buffer-size=4 -fPIC -mtune=generic -march=x86-64 -gdwarf-4 -fno-debug-types-section -fvar-tracking-assignments -g2 -Wl,--as-needed -Wl,--no-copy-dt-needed-entries -Wl,-z -Wl,relro -Wl,-z -Wl,combreloc -pthread -o .libs/fsstat fsstat.o  -L/usr/local/lib ../../tsk/.libs/libtsk.so -L/usr/libx32 -L/usr/lib64 -L/usr/lib -L/usr/local/libx32 -L/usr/local/lib64 -lewf /usr/libx32/libafflib.so -lmd /usr/libx32/libcurl.so /usr/libx32/libcares.so -lnghttp2 /usr/libx32/librtmp.so /usr/libx32/libgnutls.so -lp11-kit /usr/libx32/libidn2.so /usr/libx32/libunistring.so /usr/libx32/libtasn1.so -lhogweed -lnettle /usr/libx32/libgmp.so /usr/libx32/libssh2.so -lpsl /usr/libx32/libgssapi.so /usr/libx32/libheimntlm.so /usr/libx32/libkrb5.so /usr/libx32/libhx509.so /usr/libx32/libwind.so /usr/libx32/libhcrypto.so /usr/libx32/libasn1.so -lcom_err /usr/libx32/libheimbase.so /usr/libx32/libroken.so /usr/libx32/libldap.so /usr/libx32/libsasl2.so -lcrypt /usr/libx32/libpam.so /usr/libx32/libaudit.so /usr/libx32/libcap-ng.so -lssl -lcrypto /usr/libx32/liblber.so -lresolv /usr/libx32/libbrotlidec.so /usr/libx32/libbrotlicommon.so /usr/libx32/libexpat.so -lrt -lreadline -lpq /usr/libx32/libsqlite3.so -lz -lpthread -ldl /usr/libx32/libstdc++.so -lm -pthread -Wl,-rpath -Wl,/usr/libx32
make[2]: Leaving directory '/tmp/B.JWIKG9/BUILD/sleuthkit-4.6.4/tools/fstools'
make[2]: Entering directory '/tmp/B.JWIKG9/BUILD/sleuthkit-4.6.4/tools/fstools'
/bin/sh ../../libtool  --tag=CXX   --mode=link x86_64-pld-linux-gnux32-g++ -Wall -Wextra -Wno-unused-parameter -Wno-unused-command-line-argument -O2 -fwrapv -pipe -Wformat -Werror=format-security -gdwarf-4 -fno-debug-types-section -fvar-tracking-assignments -g2 -Wp,-D_FORTIFY_SOURCE=2 -fstack-protector-strong --param=ssp-buffer-size=4 -fPIC -mtune=generic -march=x86-64 -gdwarf-4 -fno-debug-types-section -fvar-tracking-assignments -g2   -Wl,--as-needed -Wl,--no-copy-dt-needed-entries -Wl,-z,relro -Wl,-z,combreloc  -pthread -L/usr/local/lib  -o fcat fcat.o ../../tsk/libtsk.la -lewf -ldl -lz -lafflib -lpq -lsqlite3 -ldl -lstdc++ 
libtool: link: x86_64-pld-linux-gnux32-g++ -Wall -Wextra -Wno-unused-parameter -Wno-unused-command-line-argument -O2 -fwrapv -pipe -Wformat -Werror=format-security -gdwarf-4 -fno-debug-types-section -fvar-tracking-assignments -g2 -Wp,-D_FORTIFY_SOURCE=2 -fstack-protector-strong --param=ssp-buffer-size=4 -fPIC -mtune=generic -march=x86-64 -gdwarf-4 -fno-debug-types-section -fvar-tracking-assignments -g2 -Wl,--as-needed -Wl,--no-copy-dt-needed-entries -Wl,-z -Wl,relro -Wl,-z -Wl,combreloc -pthread -o .libs/fcat fcat.o  -L/usr/local/lib ../../tsk/.libs/libtsk.so -L/usr/libx32 -L/usr/lib64 -L/usr/lib -L/usr/local/libx32 -L/usr/local/lib64 -lewf /usr/libx32/libafflib.so -lmd /usr/libx32/libcurl.so /usr/libx32/libcares.so -lnghttp2 /usr/libx32/librtmp.so /usr/libx32/libgnutls.so -lp11-kit /usr/libx32/libidn2.so /usr/libx32/libunistring.so /usr/libx32/libtasn1.so -lhogweed -lnettle /usr/libx32/libgmp.so /usr/libx32/libssh2.so -lpsl /usr/libx32/libgssapi.so /usr/libx32/libheimntlm.so /usr/libx32/libkrb5.so /usr/libx32/libhx509.so /usr/libx32/libwind.so /usr/libx32/libhcrypto.so /usr/libx32/libasn1.so -lcom_err /usr/libx32/libheimbase.so /usr/libx32/libroken.so /usr/libx32/libldap.so /usr/libx32/libsasl2.so -lcrypt /usr/libx32/libpam.so /usr/libx32/libaudit.so /usr/libx32/libcap-ng.so -lssl -lcrypto /usr/libx32/liblber.so -lresolv /usr/libx32/libbrotlidec.so /usr/libx32/libbrotlicommon.so /usr/libx32/libexpat.so -lrt -lreadline -lpq /usr/libx32/libsqlite3.so -lz -lpthread -ldl /usr/libx32/libstdc++.so -lm -pthread -Wl,-rpath -Wl,/usr/libx32
make[2]: Leaving directory '/tmp/B.JWIKG9/BUILD/sleuthkit-4.6.4/tools/fstools'
make[2]: Entering directory '/tmp/B.JWIKG9/BUILD/sleuthkit-4.6.4/tools/fstools'
/bin/sh ../../libtool  --tag=CXX   --mode=link x86_64-pld-linux-gnux32-g++ -Wall -Wextra -Wno-unused-parameter -Wno-unused-command-line-argument -O2 -fwrapv -pipe -Wformat -Werror=format-security -gdwarf-4 -fno-debug-types-section -fvar-tracking-assignments -g2 -Wp,-D_FORTIFY_SOURCE=2 -fstack-protector-strong --param=ssp-buffer-size=4 -fPIC -mtune=generic -march=x86-64 -gdwarf-4 -fno-debug-types-section -fvar-tracking-assignments -g2   -Wl,--as-needed -Wl,--no-copy-dt-needed-entries -Wl,-z,relro -Wl,-z,combreloc  -pthread -L/usr/local/lib  -o icat icat.o ../../tsk/libtsk.la -lewf -ldl -lz -lafflib -lpq -lsqlite3 -ldl -lstdc++ 
libtool: link: x86_64-pld-linux-gnux32-g++ -Wall -Wextra -Wno-unused-parameter -Wno-unused-command-line-argument -O2 -fwrapv -pipe -Wformat -Werror=format-security -gdwarf-4 -fno-debug-types-section -fvar-tracking-assignments -g2 -Wp,-D_FORTIFY_SOURCE=2 -fstack-protector-strong --param=ssp-buffer-size=4 -fPIC -mtune=generic -march=x86-64 -gdwarf-4 -fno-debug-types-section -fvar-tracking-assignments -g2 -Wl,--as-needed -Wl,--no-copy-dt-needed-entries -Wl,-z -Wl,relro -Wl,-z -Wl,combreloc -pthread -o .libs/icat icat.o  -L/usr/local/lib ../../tsk/.libs/libtsk.so -L/usr/libx32 -L/usr/lib64 -L/usr/lib -L/usr/local/libx32 -L/usr/local/lib64 -lewf /usr/libx32/libafflib.so -lmd /usr/libx32/libcurl.so /usr/libx32/libcares.so -lnghttp2 /usr/libx32/librtmp.so /usr/libx32/libgnutls.so -lp11-kit /usr/libx32/libidn2.so /usr/libx32/libunistring.so /usr/libx32/libtasn1.so -lhogweed -lnettle /usr/libx32/libgmp.so /usr/libx32/libssh2.so -lpsl /usr/libx32/libgssapi.so /usr/libx32/libheimntlm.so /usr/libx32/libkrb5.so /usr/libx32/libhx509.so /usr/libx32/libwind.so /usr/libx32/libhcrypto.so /usr/libx32/libasn1.so -lcom_err /usr/libx32/libheimbase.so /usr/libx32/libroken.so /usr/libx32/libldap.so /usr/libx32/libsasl2.so -lcrypt /usr/libx32/libpam.so /usr/libx32/libaudit.so /usr/libx32/libcap-ng.so -lssl -lcrypto /usr/libx32/liblber.so -lresolv /usr/libx32/libbrotlidec.so /usr/libx32/libbrotlicommon.so /usr/libx32/libexpat.so -lrt -lreadline -lpq /usr/libx32/libsqlite3.so -lz -lpthread -ldl /usr/libx32/libstdc++.so -lm -pthread -Wl,-rpath -Wl,/usr/libx32
make[2]: Leaving directory '/tmp/B.JWIKG9/BUILD/sleuthkit-4.6.4/tools/fstools'
make[2]: Entering directory '/tmp/B.JWIKG9/BUILD/sleuthkit-4.6.4/tools/fstools'
/bin/sh ../../libtool  --tag=CXX   --mode=link x86_64-pld-linux-gnux32-g++ -Wall -Wextra -Wno-unused-parameter -Wno-unused-command-line-argument -O2 -fwrapv -pipe -Wformat -Werror=format-security -gdwarf-4 -fno-debug-types-section -fvar-tracking-assignments -g2 -Wp,-D_FORTIFY_SOURCE=2 -fstack-protector-strong --param=ssp-buffer-size=4 -fPIC -mtune=generic -march=x86-64 -gdwarf-4 -fno-debug-types-section -fvar-tracking-assignments -g2   -Wl,--as-needed -Wl,--no-copy-dt-needed-entries -Wl,-z,relro -Wl,-z,combreloc  -pthread -L/usr/local/lib  -o fls fls.o ../../tsk/libtsk.la -lewf -ldl -lz -lafflib -lpq -lsqlite3 -ldl -lstdc++ 
libtool: link: x86_64-pld-linux-gnux32-g++ -Wall -Wextra -Wno-unused-parameter -Wno-unused-command-line-argument -O2 -fwrapv -pipe -Wformat -Werror=format-security -gdwarf-4 -fno-debug-types-section -fvar-tracking-assignments -g2 -Wp,-D_FORTIFY_SOURCE=2 -fstack-protector-strong --param=ssp-buffer-size=4 -fPIC -mtune=generic -march=x86-64 -gdwarf-4 -fno-debug-types-section -fvar-tracking-assignments -g2 -Wl,--as-needed -Wl,--no-copy-dt-needed-entries -Wl,-z -Wl,relro -Wl,-z -Wl,combreloc -pthread -o .libs/fls fls.o  -L/usr/local/lib ../../tsk/.libs/libtsk.so -L/usr/libx32 -L/usr/lib64 -L/usr/lib -L/usr/local/libx32 -L/usr/local/lib64 -lewf /usr/libx32/libafflib.so -lmd /usr/libx32/libcurl.so /usr/libx32/libcares.so -lnghttp2 /usr/libx32/librtmp.so /usr/libx32/libgnutls.so -lp11-kit /usr/libx32/libidn2.so /usr/libx32/libunistring.so /usr/libx32/libtasn1.so -lhogweed -lnettle /usr/libx32/libgmp.so /usr/libx32/libssh2.so -lpsl /usr/libx32/libgssapi.so /usr/libx32/libheimntlm.so /usr/libx32/libkrb5.so /usr/libx32/libhx509.so /usr/libx32/libwind.so /usr/libx32/libhcrypto.so /usr/libx32/libasn1.so -lcom_err /usr/libx32/libheimbase.so /usr/libx32/libroken.so /usr/libx32/libldap.so /usr/libx32/libsasl2.so -lcrypt /usr/libx32/libpam.so /usr/libx32/libaudit.so /usr/libx32/libcap-ng.so -lssl -lcrypto /usr/libx32/liblber.so -lresolv /usr/libx32/libbrotlidec.so /usr/libx32/libbrotlicommon.so /usr/libx32/libexpat.so -lrt -lreadline -lpq /usr/libx32/libsqlite3.so -lz -lpthread -ldl /usr/libx32/libstdc++.so -lm -pthread -Wl,-rpath -Wl,/usr/libx32
make[2]: Leaving directory '/tmp/B.JWIKG9/BUILD/sleuthkit-4.6.4/tools/fstools'
make[2]: Entering directory '/tmp/B.JWIKG9/BUILD/sleuthkit-4.6.4/tools/fstools'
/bin/sh ../../libtool  --tag=CXX   --mode=link x86_64-pld-linux-gnux32-g++ -Wall -Wextra -Wno-unused-parameter -Wno-unused-command-line-argument -O2 -fwrapv -pipe -Wformat -Werror=format-security -gdwarf-4 -fno-debug-types-section -fvar-tracking-assignments -g2 -Wp,-D_FORTIFY_SOURCE=2 -fstack-protector-strong --param=ssp-buffer-size=4 -fPIC -mtune=generic -march=x86-64 -gdwarf-4 -fno-debug-types-section -fvar-tracking-assignments -g2   -Wl,--as-needed -Wl,--no-copy-dt-needed-entries -Wl,-z,relro -Wl,-z,combreloc  -pthread -L/usr/local/lib  -o ils ils.o ../../tsk/libtsk.la -lewf -ldl -lz -lafflib -lpq -lsqlite3 -ldl -lstdc++ 
libtool: link: x86_64-pld-linux-gnux32-g++ -Wall -Wextra -Wno-unused-parameter -Wno-unused-command-line-argument -O2 -fwrapv -pipe -Wformat -Werror=format-security -gdwarf-4 -fno-debug-types-section -fvar-tracking-assignments -g2 -Wp,-D_FORTIFY_SOURCE=2 -fstack-protector-strong --param=ssp-buffer-size=4 -fPIC -mtune=generic -march=x86-64 -gdwarf-4 -fno-debug-types-section -fvar-tracking-assignments -g2 -Wl,--as-needed -Wl,--no-copy-dt-needed-entries -Wl,-z -Wl,relro -Wl,-z -Wl,combreloc -pthread -o .libs/ils ils.o  -L/usr/local/lib ../../tsk/.libs/libtsk.so -L/usr/libx32 -L/usr/lib64 -L/usr/lib -L/usr/local/libx32 -L/usr/local/lib64 -lewf /usr/libx32/libafflib.so -lmd /usr/libx32/libcurl.so /usr/libx32/libcares.so -lnghttp2 /usr/libx32/librtmp.so /usr/libx32/libgnutls.so -lp11-kit /usr/libx32/libidn2.so /usr/libx32/libunistring.so /usr/libx32/libtasn1.so -lhogweed -lnettle /usr/libx32/libgmp.so /usr/libx32/libssh2.so -lpsl /usr/libx32/libgssapi.so /usr/libx32/libheimntlm.so /usr/libx32/libkrb5.so /usr/libx32/libhx509.so /usr/libx32/libwind.so /usr/libx32/libhcrypto.so /usr/libx32/libasn1.so -lcom_err /usr/libx32/libheimbase.so /usr/libx32/libroken.so /usr/libx32/libldap.so /usr/libx32/libsasl2.so -lcrypt /usr/libx32/libpam.so /usr/libx32/libaudit.so /usr/libx32/libcap-ng.so -lssl -lcrypto /usr/libx32/liblber.so -lresolv /usr/libx32/libbrotlidec.so /usr/libx32/libbrotlicommon.so /usr/libx32/libexpat.so -lrt -lreadline -lpq /usr/libx32/libsqlite3.so -lz -lpthread -ldl /usr/libx32/libstdc++.so -lm -pthread -Wl,-rpath -Wl,/usr/libx32
make[2]: Leaving directory '/tmp/B.JWIKG9/BUILD/sleuthkit-4.6.4/tools/fstools'
make[2]: Entering directory '/tmp/B.JWIKG9/BUILD/sleuthkit-4.6.4/tools/fstools'
/bin/sh ../../libtool  --tag=CXX   --mode=link x86_64-pld-linux-gnux32-g++ -Wall -Wextra -Wno-unused-parameter -Wno-unused-command-line-argument -O2 -fwrapv -pipe -Wformat -Werror=format-security -gdwarf-4 -fno-debug-types-section -fvar-tracking-assignments -g2 -Wp,-D_FORTIFY_SOURCE=2 -fstack-protector-strong --param=ssp-buffer-size=4 -fPIC -mtune=generic -march=x86-64 -gdwarf-4 -fno-debug-types-section -fvar-tracking-assignments -g2   -Wl,--as-needed -Wl,--no-copy-dt-needed-entries -Wl,-z,relro -Wl,-z,combreloc  -pthread -L/usr/local/lib  -o istat istat.o ../../tsk/libtsk.la -lewf -ldl -lz -lafflib -lpq -lsqlite3 -ldl -lstdc++ 
libtool: link: x86_64-pld-linux-gnux32-g++ -Wall -Wextra -Wno-unused-parameter -Wno-unused-command-line-argument -O2 -fwrapv -pipe -Wformat -Werror=format-security -gdwarf-4 -fno-debug-types-section -fvar-tracking-assignments -g2 -Wp,-D_FORTIFY_SOURCE=2 -fstack-protector-strong --param=ssp-buffer-size=4 -fPIC -mtune=generic -march=x86-64 -gdwarf-4 -fno-debug-types-section -fvar-tracking-assignments -g2 -Wl,--as-needed -Wl,--no-copy-dt-needed-entries -Wl,-z -Wl,relro -Wl,-z -Wl,combreloc -pthread -o .libs/istat istat.o  -L/usr/local/lib ../../tsk/.libs/libtsk.so -L/usr/libx32 -L/usr/lib64 -L/usr/lib -L/usr/local/libx32 -L/usr/local/lib64 -lewf /usr/libx32/libafflib.so -lmd /usr/libx32/libcurl.so /usr/libx32/libcares.so -lnghttp2 /usr/libx32/librtmp.so /usr/libx32/libgnutls.so -lp11-kit /usr/libx32/libidn2.so /usr/libx32/libunistring.so /usr/libx32/libtasn1.so -lhogweed -lnettle /usr/libx32/libgmp.so /usr/libx32/libssh2.so -lpsl /usr/libx32/libgssapi.so /usr/libx32/libheimntlm.so /usr/libx32/libkrb5.so /usr/libx32/libhx509.so /usr/libx32/libwind.so /usr/libx32/libhcrypto.so /usr/libx32/libasn1.so -lcom_err /usr/libx32/libheimbase.so /usr/libx32/libroken.so /usr/libx32/libldap.so /usr/libx32/libsasl2.so -lcrypt /usr/libx32/libpam.so /usr/libx32/libaudit.so /usr/libx32/libcap-ng.so -lssl -lcrypto /usr/libx32/liblber.so -lresolv /usr/libx32/libbrotlidec.so /usr/libx32/libbrotlicommon.so /usr/libx32/libexpat.so -lrt -lreadline -lpq /usr/libx32/libsqlite3.so -lz -lpthread -ldl /usr/libx32/libstdc++.so -lm -pthread -Wl,-rpath -Wl,/usr/libx32
make[2]: Leaving directory '/tmp/B.JWIKG9/BUILD/sleuthkit-4.6.4/tools/fstools'
make[2]: Entering directory '/tmp/B.JWIKG9/BUILD/sleuthkit-4.6.4/tools/fstools'
/bin/sh ../../libtool  --tag=CXX   --mode=link x86_64-pld-linux-gnux32-g++ -Wall -Wextra -Wno-unused-parameter -Wno-unused-command-line-argument -O2 -fwrapv -pipe -Wformat -Werror=format-security -gdwarf-4 -fno-debug-types-section -fvar-tracking-assignments -g2 -Wp,-D_FORTIFY_SOURCE=2 -fstack-protector-strong --param=ssp-buffer-size=4 -fPIC -mtune=generic -march=x86-64 -gdwarf-4 -fno-debug-types-section -fvar-tracking-assignments -g2   -Wl,--as-needed -Wl,--no-copy-dt-needed-entries -Wl,-z,relro -Wl,-z,combreloc  -pthread -L/usr/local/lib  -o jcat jcat.o ../../tsk/libtsk.la -lewf -ldl -lz -lafflib -lpq -lsqlite3 -ldl -lstdc++ 
libtool: link: x86_64-pld-linux-gnux32-g++ -Wall -Wextra -Wno-unused-parameter -Wno-unused-command-line-argument -O2 -fwrapv -pipe -Wformat -Werror=format-security -gdwarf-4 -fno-debug-types-section -fvar-tracking-assignments -g2 -Wp,-D_FORTIFY_SOURCE=2 -fstack-protector-strong --param=ssp-buffer-size=4 -fPIC -mtune=generic -march=x86-64 -gdwarf-4 -fno-debug-types-section -fvar-tracking-assignments -g2 -Wl,--as-needed -Wl,--no-copy-dt-needed-entries -Wl,-z -Wl,relro -Wl,-z -Wl,combreloc -pthread -o .libs/jcat jcat.o  -L/usr/local/lib ../../tsk/.libs/libtsk.so -L/usr/libx32 -L/usr/lib64 -L/usr/lib -L/usr/local/libx32 -L/usr/local/lib64 -lewf /usr/libx32/libafflib.so -lmd /usr/libx32/libcurl.so /usr/libx32/libcares.so -lnghttp2 /usr/libx32/librtmp.so /usr/libx32/libgnutls.so -lp11-kit /usr/libx32/libidn2.so /usr/libx32/libunistring.so /usr/libx32/libtasn1.so -lhogweed -lnettle /usr/libx32/libgmp.so /usr/libx32/libssh2.so -lpsl /usr/libx32/libgssapi.so /usr/libx32/libheimntlm.so /usr/libx32/libkrb5.so /usr/libx32/libhx509.so /usr/libx32/libwind.so /usr/libx32/libhcrypto.so /usr/libx32/libasn1.so -lcom_err /usr/libx32/libheimbase.so /usr/libx32/libroken.so /usr/libx32/libldap.so /usr/libx32/libsasl2.so -lcrypt /usr/libx32/libpam.so /usr/libx32/libaudit.so /usr/libx32/libcap-ng.so -lssl -lcrypto /usr/libx32/liblber.so -lresolv /usr/libx32/libbrotlidec.so /usr/libx32/libbrotlicommon.so /usr/libx32/libexpat.so -lrt -lreadline -lpq /usr/libx32/libsqlite3.so -lz -lpthread -ldl /usr/libx32/libstdc++.so -lm -pthread -Wl,-rpath -Wl,/usr/libx32
make[2]: Leaving directory '/tmp/B.JWIKG9/BUILD/sleuthkit-4.6.4/tools/fstools'
make[2]: Entering directory '/tmp/B.JWIKG9/BUILD/sleuthkit-4.6.4/tools/fstools'
/bin/sh ../../libtool  --tag=CXX   --mode=link x86_64-pld-linux-gnux32-g++ -Wall -Wextra -Wno-unused-parameter -Wno-unused-command-line-argument -O2 -fwrapv -pipe -Wformat -Werror=format-security -gdwarf-4 -fno-debug-types-section -fvar-tracking-assignments -g2 -Wp,-D_FORTIFY_SOURCE=2 -fstack-protector-strong --param=ssp-buffer-size=4 -fPIC -mtune=generic -march=x86-64 -gdwarf-4 -fno-debug-types-section -fvar-tracking-assignments -g2   -Wl,--as-needed -Wl,--no-copy-dt-needed-entries -Wl,-z,relro -Wl,-z,combreloc  -pthread -L/usr/local/lib  -o jls jls.o ../../tsk/libtsk.la -lewf -ldl -lz -lafflib -lpq -lsqlite3 -ldl -lstdc++ 
libtool: link: x86_64-pld-linux-gnux32-g++ -Wall -Wextra -Wno-unused-parameter -Wno-unused-command-line-argument -O2 -fwrapv -pipe -Wformat -Werror=format-security -gdwarf-4 -fno-debug-types-section -fvar-tracking-assignments -g2 -Wp,-D_FORTIFY_SOURCE=2 -fstack-protector-strong --param=ssp-buffer-size=4 -fPIC -mtune=generic -march=x86-64 -gdwarf-4 -fno-debug-types-section -fvar-tracking-assignments -g2 -Wl,--as-needed -Wl,--no-copy-dt-needed-entries -Wl,-z -Wl,relro -Wl,-z -Wl,combreloc -pthread -o .libs/jls jls.o  -L/usr/local/lib ../../tsk/.libs/libtsk.so -L/usr/libx32 -L/usr/lib64 -L/usr/lib -L/usr/local/libx32 -L/usr/local/lib64 -lewf /usr/libx32/libafflib.so -lmd /usr/libx32/libcurl.so /usr/libx32/libcares.so -lnghttp2 /usr/libx32/librtmp.so /usr/libx32/libgnutls.so -lp11-kit /usr/libx32/libidn2.so /usr/libx32/libunistring.so /usr/libx32/libtasn1.so -lhogweed -lnettle /usr/libx32/libgmp.so /usr/libx32/libssh2.so -lpsl /usr/libx32/libgssapi.so /usr/libx32/libheimntlm.so /usr/libx32/libkrb5.so /usr/libx32/libhx509.so /usr/libx32/libwind.so /usr/libx32/libhcrypto.so /usr/libx32/libasn1.so -lcom_err /usr/libx32/libheimbase.so /usr/libx32/libroken.so /usr/libx32/libldap.so /usr/libx32/libsasl2.so -lcrypt /usr/libx32/libpam.so /usr/libx32/libaudit.so /usr/libx32/libcap-ng.so -lssl -lcrypto /usr/libx32/liblber.so -lresolv /usr/libx32/libbrotlidec.so /usr/libx32/libbrotlicommon.so /usr/libx32/libexpat.so -lrt -lreadline -lpq /usr/libx32/libsqlite3.so -lz -lpthread -ldl /usr/libx32/libstdc++.so -lm -pthread -Wl,-rpath -Wl,/usr/libx32
make[2]: Leaving directory '/tmp/B.JWIKG9/BUILD/sleuthkit-4.6.4/tools/fstools'
make[2]: Entering directory '/tmp/B.JWIKG9/BUILD/sleuthkit-4.6.4/tools/fstools'
/bin/sh ../../libtool  --tag=CXX   --mode=link x86_64-pld-linux-gnux32-g++ -Wall -Wextra -Wno-unused-parameter -Wno-unused-command-line-argument -O2 -fwrapv -pipe -Wformat -Werror=format-security -gdwarf-4 -fno-debug-types-section -fvar-tracking-assignments -g2 -Wp,-D_FORTIFY_SOURCE=2 -fstack-protector-strong --param=ssp-buffer-size=4 -fPIC -mtune=generic -march=x86-64 -gdwarf-4 -fno-debug-types-section -fvar-tracking-assignments -g2   -Wl,--as-needed -Wl,--no-copy-dt-needed-entries -Wl,-z,relro -Wl,-z,combreloc  -pthread -L/usr/local/lib  -o usnjls usnjls.o ../../tsk/libtsk.la -lewf -ldl -lz -lafflib -lpq -lsqlite3 -ldl -lstdc++ 
libtool: link: x86_64-pld-linux-gnux32-g++ -Wall -Wextra -Wno-unused-parameter -Wno-unused-command-line-argument -O2 -fwrapv -pipe -Wformat -Werror=format-security -gdwarf-4 -fno-debug-types-section -fvar-tracking-assignments -g2 -Wp,-D_FORTIFY_SOURCE=2 -fstack-protector-strong --param=ssp-buffer-size=4 -fPIC -mtune=generic -march=x86-64 -gdwarf-4 -fno-debug-types-section -fvar-tracking-assignments -g2 -Wl,--as-needed -Wl,--no-copy-dt-needed-entries -Wl,-z -Wl,relro -Wl,-z -Wl,combreloc -pthread -o .libs/usnjls usnjls.o  -L/usr/local/lib ../../tsk/.libs/libtsk.so -L/usr/libx32 -L/usr/lib64 -L/usr/lib -L/usr/local/libx32 -L/usr/local/lib64 -lewf /usr/libx32/libafflib.so -lmd /usr/libx32/libcurl.so /usr/libx32/libcares.so -lnghttp2 /usr/libx32/librtmp.so /usr/libx32/libgnutls.so -lp11-kit /usr/libx32/libidn2.so /usr/libx32/libunistring.so /usr/libx32/libtasn1.so -lhogweed -lnettle /usr/libx32/libgmp.so /usr/libx32/libssh2.so -lpsl /usr/libx32/libgssapi.so /usr/libx32/libheimntlm.so /usr/libx32/libkrb5.so /usr/libx32/libhx509.so /usr/libx32/libwind.so /usr/libx32/libhcrypto.so /usr/libx32/libasn1.so -lcom_err /usr/libx32/libheimbase.so /usr/libx32/libroken.so /usr/libx32/libldap.so /usr/libx32/libsasl2.so -lcrypt /usr/libx32/libpam.so /usr/libx32/libaudit.so /usr/libx32/libcap-ng.so -lssl -lcrypto /usr/libx32/liblber.so -lresolv /usr/libx32/libbrotlidec.so /usr/libx32/libbrotlicommon.so /usr/libx32/libexpat.so -lrt -lreadline -lpq /usr/libx32/libsqlite3.so -lz -lpthread -ldl /usr/libx32/libstdc++.so -lm -pthread -Wl,-rpath -Wl,/usr/libx32
make[2]: Leaving directory '/tmp/B.JWIKG9/BUILD/sleuthkit-4.6.4/tools/fstools'
make[2]: Entering directory '/tmp/B.JWIKG9/BUILD/sleuthkit-4.6.4/tools/fstools'
/bin/sh ../../libtool  --tag=CXX   --mode=link x86_64-pld-linux-gnux32-g++ -Wall -Wextra -Wno-unused-parameter -Wno-unused-command-line-argument -O2 -fwrapv -pipe -Wformat -Werror=format-security -gdwarf-4 -fno-debug-types-section -fvar-tracking-assignments -g2 -Wp,-D_FORTIFY_SOURCE=2 -fstack-protector-strong --param=ssp-buffer-size=4 -fPIC -mtune=generic -march=x86-64 -gdwarf-4 -fno-debug-types-section -fvar-tracking-assignments -g2   -Wl,--as-needed -Wl,--no-copy-dt-needed-entries -Wl,-z,relro -Wl,-z,combreloc  -pthread -L/usr/local/lib  -o blkls blkls.o ../../tsk/libtsk.la -lewf -ldl -lz -lafflib -lpq -lsqlite3 -ldl -lstdc++ 
libtool: link: x86_64-pld-linux-gnux32-g++ -Wall -Wextra -Wno-unused-parameter -Wno-unused-command-line-argument -O2 -fwrapv -pipe -Wformat -Werror=format-security -gdwarf-4 -fno-debug-types-section -fvar-tracking-assignments -g2 -Wp,-D_FORTIFY_SOURCE=2 -fstack-protector-strong --param=ssp-buffer-size=4 -fPIC -mtune=generic -march=x86-64 -gdwarf-4 -fno-debug-types-section -fvar-tracking-assignments -g2 -Wl,--as-needed -Wl,--no-copy-dt-needed-entries -Wl,-z -Wl,relro -Wl,-z -Wl,combreloc -pthread -o .libs/blkls blkls.o  -L/usr/local/lib ../../tsk/.libs/libtsk.so -L/usr/libx32 -L/usr/lib64 -L/usr/lib -L/usr/local/libx32 -L/usr/local/lib64 -lewf /usr/libx32/libafflib.so -lmd /usr/libx32/libcurl.so /usr/libx32/libcares.so -lnghttp2 /usr/libx32/librtmp.so /usr/libx32/libgnutls.so -lp11-kit /usr/libx32/libidn2.so /usr/libx32/libunistring.so /usr/libx32/libtasn1.so -lhogweed -lnettle /usr/libx32/libgmp.so /usr/libx32/libssh2.so -lpsl /usr/libx32/libgssapi.so /usr/libx32/libheimntlm.so /usr/libx32/libkrb5.so /usr/libx32/libhx509.so /usr/libx32/libwind.so /usr/libx32/libhcrypto.so /usr/libx32/libasn1.so -lcom_err /usr/libx32/libheimbase.so /usr/libx32/libroken.so /usr/libx32/libldap.so /usr/libx32/libsasl2.so -lcrypt /usr/libx32/libpam.so /usr/libx32/libaudit.so /usr/libx32/libcap-ng.so -lssl -lcrypto /usr/libx32/liblber.so -lresolv /usr/libx32/libbrotlidec.so /usr/libx32/libbrotlicommon.so /usr/libx32/libexpat.so -lrt -lreadline -lpq /usr/libx32/libsqlite3.so -lz -lpthread -ldl /usr/libx32/libstdc++.so -lm -pthread -Wl,-rpath -Wl,/usr/libx32
make[2]: Leaving directory '/tmp/B.JWIKG9/BUILD/sleuthkit-4.6.4/tools/fstools'
Making all in hashtools
make[2]: Entering directory '/tmp/B.JWIKG9/BUILD/sleuthkit-4.6.4/tools/hashtools'
x86_64-pld-linux-gnux32-g++ -DHAVE_CONFIG_H -I. -I../../tsk  -I../.. -I./../.. -pthread -I/usr/local/include -Wall -Wextra -Wno-unused-parameter -Wno-unused-command-line-argument -O2 -fwrapv -pipe -Wformat -Werror=format-security -gdwarf-4 -fno-debug-types-section -fvar-tracking-assignments -g2 -Wp,-D_FORTIFY_SOURCE=2 -fstack-protector-strong --param=ssp-buffer-size=4 -fPIC -mtune=generic -march=x86-64 -gdwarf-4 -fno-debug-types-section -fvar-tracking-assignments -g2  -MT hfind.o -MD -MP -MF .deps/hfind.Tpo -c -o hfind.o hfind.cpp
mv -f .deps/hfind.Tpo .deps/hfind.Po
make[2]: Leaving directory '/tmp/B.JWIKG9/BUILD/sleuthkit-4.6.4/tools/hashtools'
make[2]: Entering directory '/tmp/B.JWIKG9/BUILD/sleuthkit-4.6.4/tools/hashtools'
/bin/sh ../../libtool  --tag=CXX   --mode=link x86_64-pld-linux-gnux32-g++ -Wall -Wextra -Wno-unused-parameter -Wno-unused-command-line-argument -O2 -fwrapv -pipe -Wformat -Werror=format-security -gdwarf-4 -fno-debug-types-section -fvar-tracking-assignments -g2 -Wp,-D_FORTIFY_SOURCE=2 -fstack-protector-strong --param=ssp-buffer-size=4 -fPIC -mtune=generic -march=x86-64 -gdwarf-4 -fno-debug-types-section -fvar-tracking-assignments -g2   -Wl,--as-needed -Wl,--no-copy-dt-needed-entries -Wl,-z,relro -Wl,-z,combreloc  -pthread -L/usr/local/lib  -o hfind hfind.o ../../tsk/libtsk.la -lewf -ldl -lz -lafflib -lpq -lsqlite3 -ldl -lstdc++ 
libtool: link: x86_64-pld-linux-gnux32-g++ -Wall -Wextra -Wno-unused-parameter -Wno-unused-command-line-argument -O2 -fwrapv -pipe -Wformat -Werror=format-security -gdwarf-4 -fno-debug-types-section -fvar-tracking-assignments -g2 -Wp,-D_FORTIFY_SOURCE=2 -fstack-protector-strong --param=ssp-buffer-size=4 -fPIC -mtune=generic -march=x86-64 -gdwarf-4 -fno-debug-types-section -fvar-tracking-assignments -g2 -Wl,--as-needed -Wl,--no-copy-dt-needed-entries -Wl,-z -Wl,relro -Wl,-z -Wl,combreloc -pthread -o .libs/hfind hfind.o  -L/usr/local/lib ../../tsk/.libs/libtsk.so -L/usr/libx32 -L/usr/lib64 -L/usr/lib -L/usr/local/libx32 -L/usr/local/lib64 -lewf /usr/libx32/libafflib.so -lmd /usr/libx32/libcurl.so /usr/libx32/libcares.so -lnghttp2 /usr/libx32/librtmp.so /usr/libx32/libgnutls.so -lp11-kit /usr/libx32/libidn2.so /usr/libx32/libunistring.so /usr/libx32/libtasn1.so -lhogweed -lnettle /usr/libx32/libgmp.so /usr/libx32/libssh2.so -lpsl /usr/libx32/libgssapi.so /usr/libx32/libheimntlm.so /usr/libx32/libkrb5.so /usr/libx32/libhx509.so /usr/libx32/libwind.so /usr/libx32/libhcrypto.so /usr/libx32/libasn1.so -lcom_err /usr/libx32/libheimbase.so /usr/libx32/libroken.so /usr/libx32/libldap.so /usr/libx32/libsasl2.so -lcrypt /usr/libx32/libpam.so /usr/libx32/libaudit.so /usr/libx32/libcap-ng.so -lssl -lcrypto /usr/libx32/liblber.so -lresolv /usr/libx32/libbrotlidec.so /usr/libx32/libbrotlicommon.so /usr/libx32/libexpat.so -lrt -lreadline -lpq /usr/libx32/libsqlite3.so -lz -lpthread -ldl /usr/libx32/libstdc++.so -lm -pthread -Wl,-rpath -Wl,/usr/libx32
make[2]: Leaving directory '/tmp/B.JWIKG9/BUILD/sleuthkit-4.6.4/tools/hashtools'
Making all in srchtools
make[2]: Entering directory '/tmp/B.JWIKG9/BUILD/sleuthkit-4.6.4/tools/srchtools'
x86_64-pld-linux-gnux32-gcc -DHAVE_CONFIG_H -I. -I../../tsk  -I../.. -I./../.. -pthread -I/usr/local/include -Wall -Wextra -Wno-unused-parameter -Wno-unused-command-line-argument -O2 -fwrapv -pipe -Wformat -Werror=format-security -gdwarf-4 -fno-debug-types-section -fvar-tracking-assignments -g2 -Wp,-D_FORTIFY_SOURCE=2 -fstack-protector-strong --param=ssp-buffer-size=4 -fPIC -mtune=generic -march=x86-64 -gdwarf-4 -fno-debug-types-section -fvar-tracking-assignments -g2  -MT srch_strings.o -MD -MP -MF .deps/srch_strings.Tpo -c -o srch_strings.o srch_strings.c
srch_strings.c: In function 'main':
srch_strings.c:281:4: warning: this statement may fall through [-Wimplicit-fallthrough=]
    usage (stdout, 0);
    ^~~~~~~~~~~~~~~~~
srch_strings.c:283:2: note: here
  case 'n':
  ^~~~
srch_strings.c:336:4: warning: this statement may fall through [-Wimplicit-fallthrough=]
    usage (stderr, 1);
    ^~~~~~~~~~~~~~~~~
srch_strings.c:338:2: note: here
  default:
  ^~~~~~~
srch_strings.c: At top level:
cc1: warning: unrecognized command line option '-Wno-unused-command-line-argument'
mv -f .deps/srch_strings.Tpo .deps/srch_strings.Po
make[2]: Leaving directory '/tmp/B.JWIKG9/BUILD/sleuthkit-4.6.4/tools/srchtools'
make[2]: Entering directory '/tmp/B.JWIKG9/BUILD/sleuthkit-4.6.4/tools/srchtools'
x86_64-pld-linux-gnux32-g++ -DHAVE_CONFIG_H -I. -I../../tsk  -I../.. -I./../.. -pthread -I/usr/local/include -Wall -Wextra -Wno-unused-parameter -Wno-unused-command-line-argument -O2 -fwrapv -pipe -Wformat -Werror=format-security -gdwarf-4 -fno-debug-types-section -fvar-tracking-assignments -g2 -Wp,-D_FORTIFY_SOURCE=2 -fstack-protector-strong --param=ssp-buffer-size=4 -fPIC -mtune=generic -march=x86-64 -gdwarf-4 -fno-debug-types-section -fvar-tracking-assignments -g2  -MT sigfind.o -MD -MP -MF .deps/sigfind.Tpo -c -o sigfind.o sigfind.cpp
mv -f .deps/sigfind.Tpo .deps/sigfind.Po
make[2]: Leaving directory '/tmp/B.JWIKG9/BUILD/sleuthkit-4.6.4/tools/srchtools'
make[2]: Entering directory '/tmp/B.JWIKG9/BUILD/sleuthkit-4.6.4/tools/srchtools'
/bin/sh ../../libtool  --tag=CC   --mode=link x86_64-pld-linux-gnux32-gcc -Wall -Wextra -Wno-unused-parameter -Wno-unused-command-line-argument -O2 -fwrapv -pipe -Wformat -Werror=format-security -gdwarf-4 -fno-debug-types-section -fvar-tracking-assignments -g2 -Wp,-D_FORTIFY_SOURCE=2 -fstack-protector-strong --param=ssp-buffer-size=4 -fPIC -mtune=generic -march=x86-64 -gdwarf-4 -fno-debug-types-section -fvar-tracking-assignments -g2   -Wl,--as-needed -Wl,--no-copy-dt-needed-entries -Wl,-z,relro -Wl,-z,combreloc  -pthread -L/usr/local/lib -o srch_strings srch_strings.o  -lewf -ldl -lz -lafflib -lpq -lsqlite3 -ldl -lstdc++ 
libtool: link: x86_64-pld-linux-gnux32-gcc -Wall -Wextra -Wno-unused-parameter -Wno-unused-command-line-argument -O2 -fwrapv -pipe -Wformat -Werror=format-security -gdwarf-4 -fno-debug-types-section -fvar-tracking-assignments -g2 -Wp,-D_FORTIFY_SOURCE=2 -fstack-protector-strong --param=ssp-buffer-size=4 -fPIC -mtune=generic -march=x86-64 -gdwarf-4 -fno-debug-types-section -fvar-tracking-assignments -g2 -Wl,--as-needed -Wl,--no-copy-dt-needed-entries -Wl,-z -Wl,relro -Wl,-z -Wl,combreloc -pthread -o srch_strings srch_strings.o  -L/usr/local/lib -lewf /usr/libx32/libafflib.so -L/usr/libx32 -L/usr/lib64 -L/usr/lib -L/usr/local/libx32 -L/usr/local/lib64 -lmd /usr/libx32/libcurl.so /usr/libx32/libcares.so -lnghttp2 /usr/libx32/librtmp.so /usr/libx32/libgnutls.so -lp11-kit /usr/libx32/libidn2.so /usr/libx32/libunistring.so /usr/libx32/libtasn1.so -lhogweed -lnettle /usr/libx32/libgmp.so /usr/libx32/libssh2.so -lpsl /usr/libx32/libgssapi.so /usr/libx32/libheimntlm.so /usr/libx32/libkrb5.so /usr/libx32/libhx509.so /usr/libx32/libwind.so /usr/libx32/libhcrypto.so /usr/libx32/libasn1.so -lcom_err /usr/libx32/libheimbase.so /usr/libx32/libroken.so /usr/libx32/libldap.so /usr/libx32/libsasl2.so -lcrypt /usr/libx32/libpam.so /usr/libx32/libaudit.so /usr/libx32/libcap-ng.so -lssl -lcrypto /usr/libx32/liblber.so -lresolv /usr/libx32/libbrotlidec.so /usr/libx32/libbrotlicommon.so /usr/libx32/libexpat.so -lrt -lreadline -lpq /usr/libx32/libsqlite3.so -lz -lpthread -ldl /usr/libx32/libstdc++.so -lm -pthread -Wl,-rpath -Wl,/usr/libx32 -Wl,-rpath -Wl,/usr/libx32
make[2]: Leaving directory '/tmp/B.JWIKG9/BUILD/sleuthkit-4.6.4/tools/srchtools'
make[2]: Entering directory '/tmp/B.JWIKG9/BUILD/sleuthkit-4.6.4/tools/srchtools'
/bin/sh ../../libtool  --tag=CXX   --mode=link x86_64-pld-linux-gnux32-g++ -Wall -Wextra -Wno-unused-parameter -Wno-unused-command-line-argument -O2 -fwrapv -pipe -Wformat -Werror=format-security -gdwarf-4 -fno-debug-types-section -fvar-tracking-assignments -g2 -Wp,-D_FORTIFY_SOURCE=2 -fstack-protector-strong --param=ssp-buffer-size=4 -fPIC -mtune=generic -march=x86-64 -gdwarf-4 -fno-debug-types-section -fvar-tracking-assignments -g2   -Wl,--as-needed -Wl,--no-copy-dt-needed-entries -Wl,-z,relro -Wl,-z,combreloc  -pthread -L/usr/local/lib -o sigfind sigfind.o ../../tsk/libtsk.la -lewf -ldl -lz -lafflib -lpq -lsqlite3 -ldl -lstdc++ 
libtool: link: x86_64-pld-linux-gnux32-g++ -Wall -Wextra -Wno-unused-parameter -Wno-unused-command-line-argument -O2 -fwrapv -pipe -Wformat -Werror=format-security -gdwarf-4 -fno-debug-types-section -fvar-tracking-assignments -g2 -Wp,-D_FORTIFY_SOURCE=2 -fstack-protector-strong --param=ssp-buffer-size=4 -fPIC -mtune=generic -march=x86-64 -gdwarf-4 -fno-debug-types-section -fvar-tracking-assignments -g2 -Wl,--as-needed -Wl,--no-copy-dt-needed-entries -Wl,-z -Wl,relro -Wl,-z -Wl,combreloc -pthread -o .libs/sigfind sigfind.o  -L/usr/local/lib ../../tsk/.libs/libtsk.so -L/usr/libx32 -L/usr/lib64 -L/usr/lib -L/usr/local/libx32 -L/usr/local/lib64 -lewf /usr/libx32/libafflib.so -lmd /usr/libx32/libcurl.so /usr/libx32/libcares.so -lnghttp2 /usr/libx32/librtmp.so /usr/libx32/libgnutls.so -lp11-kit /usr/libx32/libidn2.so /usr/libx32/libunistring.so /usr/libx32/libtasn1.so -lhogweed -lnettle /usr/libx32/libgmp.so /usr/libx32/libssh2.so -lpsl /usr/libx32/libgssapi.so /usr/libx32/libheimntlm.so /usr/libx32/libkrb5.so /usr/libx32/libhx509.so /usr/libx32/libwind.so /usr/libx32/libhcrypto.so /usr/libx32/libasn1.so -lcom_err /usr/libx32/libheimbase.so /usr/libx32/libroken.so /usr/libx32/libldap.so /usr/libx32/libsasl2.so -lcrypt /usr/libx32/libpam.so /usr/libx32/libaudit.so /usr/libx32/libcap-ng.so -lssl -lcrypto /usr/libx32/liblber.so -lresolv /usr/libx32/libbrotlidec.so /usr/libx32/libbrotlicommon.so /usr/libx32/libexpat.so -lrt -lreadline -lpq /usr/libx32/libsqlite3.so -lz -lpthread -ldl /usr/libx32/libstdc++.so -lm -pthread -Wl,-rpath -Wl,/usr/libx32
make[2]: Leaving directory '/tmp/B.JWIKG9/BUILD/sleuthkit-4.6.4/tools/srchtools'
Making all in sorter
Making all in timeline
Making all in autotools
make[2]: Entering directory '/tmp/B.JWIKG9/BUILD/sleuthkit-4.6.4/tools/autotools'
x86_64-pld-linux-gnux32-g++ -DHAVE_CONFIG_H -I. -I../../tsk  -I../.. -I./../..  -pthread -I/usr/local/include -Wall -Wextra -Wno-unused-parameter -Wno-overloaded-virtual -Wno-unused-command-line-argument -O2 -fwrapv -pipe -Wformat -Werror=format-security -gdwarf-4 -fno-debug-types-section -fvar-tracking-assignments -g2 -Wp,-D_FORTIFY_SOURCE=2 -fstack-protector-strong --param=ssp-buffer-size=4 -fPIC -mtune=generic -march=x86-64 -gdwarf-4 -fno-debug-types-section -fvar-tracking-assignments -g2  -MT tsk_gettimes.o -MD -MP -MF .deps/tsk_gettimes.Tpo -c -o tsk_gettimes.o tsk_gettimes.cpp
tsk_gettimes.cpp: In function 'int main(int, char**)':
tsk_gettimes.cpp:149:18: warning: this statement may fall through [-Wimplicit-fallthrough=]
             usage();
             ~~~~~^~
tsk_gettimes.cpp:152:9: note: here
         case _TSK_T('b'):
         ^~~~
At global scope:
cc1plus: warning: unrecognized command line option '-Wno-unused-command-line-argument'
mv -f .deps/tsk_gettimes.Tpo .deps/tsk_gettimes.Po
make[2]: Leaving directory '/tmp/B.JWIKG9/BUILD/sleuthkit-4.6.4/tools/autotools'
make[2]: Entering directory '/tmp/B.JWIKG9/BUILD/sleuthkit-4.6.4/tools/autotools'
x86_64-pld-linux-gnux32-g++ -DHAVE_CONFIG_H -I. -I../../tsk  -I../.. -I./../..  -pthread -I/usr/local/include -Wall -Wextra -Wno-unused-parameter -Wno-overloaded-virtual -Wno-unused-command-line-argument -O2 -fwrapv -pipe -Wformat -Werror=format-security -gdwarf-4 -fno-debug-types-section -fvar-tracking-assignments -g2 -Wp,-D_FORTIFY_SOURCE=2 -fstack-protector-strong --param=ssp-buffer-size=4 -fPIC -mtune=generic -march=x86-64 -gdwarf-4 -fno-debug-types-section -fvar-tracking-assignments -g2  -MT tsk_recover.o -MD -MP -MF .deps/tsk_recover.Tpo -c -o tsk_recover.o tsk_recover.cpp
tsk_recover.cpp: In function 'int main(int, char**)':
tsk_recover.cpp:407:18: warning: this statement may fall through [-Wimplicit-fallthrough=]
             usage();
             ~~~~~^~
tsk_recover.cpp:409:9: note: here
         case _TSK_T('a'):
         ^~~~
tsk_recover.cpp: In member function 'uint8_t TskRecover::writeFile(TSK_FS_FILE*, const char*)':
tsk_recover.cpp:247:30: warning: '/' directive output may be truncated writing 1 byte into a region of size between 0 and 4095 [-Wformat-truncation=]
     snprintf(fbuf, PATH_MAX, "%s/%s/%s", (char *) m_base_dir, m_vsName,
                              ^~~~~~~~~~
In file included from /usr/include/stdio.h:873,
                 from ../../tsk/base/tsk_base.h:27,
                 from ../../tsk/base/tsk_base_i.h:26,
                 from ../../tsk/tsk_tools_i.h:8,
                 from tsk_recover.cpp:12:
/usr/include/bits/stdio2.h:67:35: note: '__builtin___snprintf_chk' output 3 or more bytes (assuming 4098) into a destination of size 4096
   return __builtin___snprintf_chk (__s, __n, __USE_FORTIFY_LEVEL - 1,
          ~~~~~~~~~~~~~~~~~~~~~~~~~^~~~~~~~~~~~~~~~~~~~~~~~~~~~~~~~~~~
        __bos (__s), __fmt, __va_arg_pack ());
        ~~~~~~~~~~~~~~~~~~~~~~~~~~~~~~~~~~~~~
At global scope:
cc1plus: warning: unrecognized command line option '-Wno-unused-command-line-argument'
mv -f .deps/tsk_recover.Tpo .deps/tsk_recover.Po
make[2]: Leaving directory '/tmp/B.JWIKG9/BUILD/sleuthkit-4.6.4/tools/autotools'
make[2]: Entering directory '/tmp/B.JWIKG9/BUILD/sleuthkit-4.6.4/tools/autotools'
x86_64-pld-linux-gnux32-g++ -DHAVE_CONFIG_H -I. -I../../tsk  -I../.. -I./../..  -pthread -I/usr/local/include -Wall -Wextra -Wno-unused-parameter -Wno-overloaded-virtual -Wno-unused-command-line-argument -O2 -fwrapv -pipe -Wformat -Werror=format-security -gdwarf-4 -fno-debug-types-section -fvar-tracking-assignments -g2 -Wp,-D_FORTIFY_SOURCE=2 -fstack-protector-strong --param=ssp-buffer-size=4 -fPIC -mtune=generic -march=x86-64 -gdwarf-4 -fno-debug-types-section -fvar-tracking-assignments -g2  -MT tsk_comparedir.o -MD -MP -MF .deps/tsk_comparedir.Tpo -c -o tsk_comparedir.o tsk_comparedir.cpp
tsk_comparedir.cpp: In function 'int main(int, char**)':
tsk_comparedir.cpp:336:18: warning: this statement may fall through [-Wimplicit-fallthrough=]
             usage();
             ~~~~~^~
tsk_comparedir.cpp:338:9: note: here
         case _TSK_T('b'):
         ^~~~
At global scope:
cc1plus: warning: unrecognized command line option '-Wno-unused-command-line-argument'
mv -f .deps/tsk_comparedir.Tpo .deps/tsk_comparedir.Po
make[2]: Leaving directory '/tmp/B.JWIKG9/BUILD/sleuthkit-4.6.4/tools/autotools'
make[2]: Entering directory '/tmp/B.JWIKG9/BUILD/sleuthkit-4.6.4/tools/autotools'
x86_64-pld-linux-gnux32-g++ -DHAVE_CONFIG_H -I. -I../../tsk  -I../.. -I./../..  -pthread -I/usr/local/include -Wall -Wextra -Wno-unused-parameter -Wno-overloaded-virtual -Wno-unused-command-line-argument -O2 -fwrapv -pipe -Wformat -Werror=format-security -gdwarf-4 -fno-debug-types-section -fvar-tracking-assignments -g2 -Wp,-D_FORTIFY_SOURCE=2 -fstack-protector-strong --param=ssp-buffer-size=4 -fPIC -mtune=generic -march=x86-64 -gdwarf-4 -fno-debug-types-section -fvar-tracking-assignments -g2  -MT tsk_loaddb.o -MD -MP -MF .deps/tsk_loaddb.Tpo -c -o tsk_loaddb.o tsk_loaddb.cpp
tsk_loaddb.cpp: In function 'int main(int, char**)':
tsk_loaddb.cpp:77:18: warning: this statement may fall through [-Wimplicit-fallthrough=]
             usage();
             ~~~~~^~
tsk_loaddb.cpp:79:9: note: here
         case _TSK_T('a'):
         ^~~~
At global scope:
cc1plus: warning: unrecognized command line option '-Wno-unused-command-line-argument'
mv -f .deps/tsk_loaddb.Tpo .deps/tsk_loaddb.Po
make[2]: Leaving directory '/tmp/B.JWIKG9/BUILD/sleuthkit-4.6.4/tools/autotools'
make[2]: Entering directory '/tmp/B.JWIKG9/BUILD/sleuthkit-4.6.4/tools/autotools'
/bin/sh ../../libtool  --tag=CXX   --mode=link x86_64-pld-linux-gnux32-g++ -Wall -Wextra -Wno-unused-parameter -Wno-overloaded-virtual -Wno-unused-command-line-argument -O2 -fwrapv -pipe -Wformat -Werror=format-security -gdwarf-4 -fno-debug-types-section -fvar-tracking-assignments -g2 -Wp,-D_FORTIFY_SOURCE=2 -fstack-protector-strong --param=ssp-buffer-size=4 -fPIC -mtune=generic -march=x86-64 -gdwarf-4 -fno-debug-types-section -fvar-tracking-assignments -g2   -Wl,--as-needed -Wl,--no-copy-dt-needed-entries -Wl,-z,relro -Wl,-z,combreloc  -pthread -L/usr/local/lib  -o tsk_gettimes tsk_gettimes.o ../../tsk/libtsk.la -lewf -ldl -lpthread -ldl -lz -lafflib -lpq -lsqlite3 -ldl -lstdc++ 
libtool: link: x86_64-pld-linux-gnux32-g++ -Wall -Wextra -Wno-unused-parameter -Wno-overloaded-virtual -Wno-unused-command-line-argument -O2 -fwrapv -pipe -Wformat -Werror=format-security -gdwarf-4 -fno-debug-types-section -fvar-tracking-assignments -g2 -Wp,-D_FORTIFY_SOURCE=2 -fstack-protector-strong --param=ssp-buffer-size=4 -fPIC -mtune=generic -march=x86-64 -gdwarf-4 -fno-debug-types-section -fvar-tracking-assignments -g2 -Wl,--as-needed -Wl,--no-copy-dt-needed-entries -Wl,-z -Wl,relro -Wl,-z -Wl,combreloc -pthread -o .libs/tsk_gettimes tsk_gettimes.o  -L/usr/local/lib ../../tsk/.libs/libtsk.so -L/usr/libx32 -L/usr/lib64 -L/usr/lib -L/usr/local/libx32 -L/usr/local/lib64 -lewf /usr/libx32/libafflib.so -lmd /usr/libx32/libcurl.so /usr/libx32/libcares.so -lnghttp2 /usr/libx32/librtmp.so /usr/libx32/libgnutls.so -lp11-kit /usr/libx32/libidn2.so /usr/libx32/libunistring.so /usr/libx32/libtasn1.so -lhogweed -lnettle /usr/libx32/libgmp.so /usr/libx32/libssh2.so -lpsl /usr/libx32/libgssapi.so /usr/libx32/libheimntlm.so /usr/libx32/libkrb5.so /usr/libx32/libhx509.so /usr/libx32/libwind.so /usr/libx32/libhcrypto.so /usr/libx32/libasn1.so -lcom_err /usr/libx32/libheimbase.so /usr/libx32/libroken.so /usr/libx32/libldap.so /usr/libx32/libsasl2.so -lcrypt /usr/libx32/libpam.so /usr/libx32/libaudit.so /usr/libx32/libcap-ng.so -lssl -lcrypto /usr/libx32/liblber.so -lresolv /usr/libx32/libbrotlidec.so /usr/libx32/libbrotlicommon.so /usr/libx32/libexpat.so -lrt -lreadline -lpq /usr/libx32/libsqlite3.so -lz -lpthread -ldl /usr/libx32/libstdc++.so -lm -pthread -Wl,-rpath -Wl,/usr/libx32
make[2]: Leaving directory '/tmp/B.JWIKG9/BUILD/sleuthkit-4.6.4/tools/autotools'
make[2]: Entering directory '/tmp/B.JWIKG9/BUILD/sleuthkit-4.6.4/tools/autotools'
/bin/sh ../../libtool  --tag=CXX   --mode=link x86_64-pld-linux-gnux32-g++ -Wall -Wextra -Wno-unused-parameter -Wno-overloaded-virtual -Wno-unused-command-line-argument -O2 -fwrapv -pipe -Wformat -Werror=format-security -gdwarf-4 -fno-debug-types-section -fvar-tracking-assignments -g2 -Wp,-D_FORTIFY_SOURCE=2 -fstack-protector-strong --param=ssp-buffer-size=4 -fPIC -mtune=generic -march=x86-64 -gdwarf-4 -fno-debug-types-section -fvar-tracking-assignments -g2   -Wl,--as-needed -Wl,--no-copy-dt-needed-entries -Wl,-z,relro -Wl,-z,combreloc  -pthread -L/usr/local/lib  -o tsk_recover tsk_recover.o ../../tsk/libtsk.la -lewf -ldl -lpthread -ldl -lz -lafflib -lpq -lsqlite3 -ldl -lstdc++ 
libtool: link: x86_64-pld-linux-gnux32-g++ -Wall -Wextra -Wno-unused-parameter -Wno-overloaded-virtual -Wno-unused-command-line-argument -O2 -fwrapv -pipe -Wformat -Werror=format-security -gdwarf-4 -fno-debug-types-section -fvar-tracking-assignments -g2 -Wp,-D_FORTIFY_SOURCE=2 -fstack-protector-strong --param=ssp-buffer-size=4 -fPIC -mtune=generic -march=x86-64 -gdwarf-4 -fno-debug-types-section -fvar-tracking-assignments -g2 -Wl,--as-needed -Wl,--no-copy-dt-needed-entries -Wl,-z -Wl,relro -Wl,-z -Wl,combreloc -pthread -o .libs/tsk_recover tsk_recover.o  -L/usr/local/lib ../../tsk/.libs/libtsk.so -L/usr/libx32 -L/usr/lib64 -L/usr/lib -L/usr/local/libx32 -L/usr/local/lib64 -lewf /usr/libx32/libafflib.so -lmd /usr/libx32/libcurl.so /usr/libx32/libcares.so -lnghttp2 /usr/libx32/librtmp.so /usr/libx32/libgnutls.so -lp11-kit /usr/libx32/libidn2.so /usr/libx32/libunistring.so /usr/libx32/libtasn1.so -lhogweed -lnettle /usr/libx32/libgmp.so /usr/libx32/libssh2.so -lpsl /usr/libx32/libgssapi.so /usr/libx32/libheimntlm.so /usr/libx32/libkrb5.so /usr/libx32/libhx509.so /usr/libx32/libwind.so /usr/libx32/libhcrypto.so /usr/libx32/libasn1.so -lcom_err /usr/libx32/libheimbase.so /usr/libx32/libroken.so /usr/libx32/libldap.so /usr/libx32/libsasl2.so -lcrypt /usr/libx32/libpam.so /usr/libx32/libaudit.so /usr/libx32/libcap-ng.so -lssl -lcrypto /usr/libx32/liblber.so -lresolv /usr/libx32/libbrotlidec.so /usr/libx32/libbrotlicommon.so /usr/libx32/libexpat.so -lrt -lreadline -lpq /usr/libx32/libsqlite3.so -lz -lpthread -ldl /usr/libx32/libstdc++.so -lm -pthread -Wl,-rpath -Wl,/usr/libx32
make[2]: Leaving directory '/tmp/B.JWIKG9/BUILD/sleuthkit-4.6.4/tools/autotools'
make[2]: Entering directory '/tmp/B.JWIKG9/BUILD/sleuthkit-4.6.4/tools/autotools'
/bin/sh ../../libtool  --tag=CXX   --mode=link x86_64-pld-linux-gnux32-g++ -Wall -Wextra -Wno-unused-parameter -Wno-overloaded-virtual -Wno-unused-command-line-argument -O2 -fwrapv -pipe -Wformat -Werror=format-security -gdwarf-4 -fno-debug-types-section -fvar-tracking-assignments -g2 -Wp,-D_FORTIFY_SOURCE=2 -fstack-protector-strong --param=ssp-buffer-size=4 -fPIC -mtune=generic -march=x86-64 -gdwarf-4 -fno-debug-types-section -fvar-tracking-assignments -g2   -Wl,--as-needed -Wl,--no-copy-dt-needed-entries -Wl,-z,relro -Wl,-z,combreloc  -pthread -L/usr/local/lib  -o tsk_comparedir tsk_comparedir.o ../../tsk/libtsk.la -lewf -ldl -lpthread -ldl -lz -lafflib -lpq -lsqlite3 -ldl -lstdc++ 
libtool: link: x86_64-pld-linux-gnux32-g++ -Wall -Wextra -Wno-unused-parameter -Wno-overloaded-virtual -Wno-unused-command-line-argument -O2 -fwrapv -pipe -Wformat -Werror=format-security -gdwarf-4 -fno-debug-types-section -fvar-tracking-assignments -g2 -Wp,-D_FORTIFY_SOURCE=2 -fstack-protector-strong --param=ssp-buffer-size=4 -fPIC -mtune=generic -march=x86-64 -gdwarf-4 -fno-debug-types-section -fvar-tracking-assignments -g2 -Wl,--as-needed -Wl,--no-copy-dt-needed-entries -Wl,-z -Wl,relro -Wl,-z -Wl,combreloc -pthread -o .libs/tsk_comparedir tsk_comparedir.o  -L/usr/local/lib ../../tsk/.libs/libtsk.so -L/usr/libx32 -L/usr/lib64 -L/usr/lib -L/usr/local/libx32 -L/usr/local/lib64 -lewf /usr/libx32/libafflib.so -lmd /usr/libx32/libcurl.so /usr/libx32/libcares.so -lnghttp2 /usr/libx32/librtmp.so /usr/libx32/libgnutls.so -lp11-kit /usr/libx32/libidn2.so /usr/libx32/libunistring.so /usr/libx32/libtasn1.so -lhogweed -lnettle /usr/libx32/libgmp.so /usr/libx32/libssh2.so -lpsl /usr/libx32/libgssapi.so /usr/libx32/libheimntlm.so /usr/libx32/libkrb5.so /usr/libx32/libhx509.so /usr/libx32/libwind.so /usr/libx32/libhcrypto.so /usr/libx32/libasn1.so -lcom_err /usr/libx32/libheimbase.so /usr/libx32/libroken.so /usr/libx32/libldap.so /usr/libx32/libsasl2.so -lcrypt /usr/libx32/libpam.so /usr/libx32/libaudit.so /usr/libx32/libcap-ng.so -lssl -lcrypto /usr/libx32/liblber.so -lresolv /usr/libx32/libbrotlidec.so /usr/libx32/libbrotlicommon.so /usr/libx32/libexpat.so -lrt -lreadline -lpq /usr/libx32/libsqlite3.so -lz -lpthread -ldl /usr/libx32/libstdc++.so -lm -pthread -Wl,-rpath -Wl,/usr/libx32
make[2]: Leaving directory '/tmp/B.JWIKG9/BUILD/sleuthkit-4.6.4/tools/autotools'
make[2]: Entering directory '/tmp/B.JWIKG9/BUILD/sleuthkit-4.6.4/tools/autotools'
/bin/sh ../../libtool  --tag=CXX   --mode=link x86_64-pld-linux-gnux32-g++ -Wall -Wextra -Wno-unused-parameter -Wno-overloaded-virtual -Wno-unused-command-line-argument -O2 -fwrapv -pipe -Wformat -Werror=format-security -gdwarf-4 -fno-debug-types-section -fvar-tracking-assignments -g2 -Wp,-D_FORTIFY_SOURCE=2 -fstack-protector-strong --param=ssp-buffer-size=4 -fPIC -mtune=generic -march=x86-64 -gdwarf-4 -fno-debug-types-section -fvar-tracking-assignments -g2   -Wl,--as-needed -Wl,--no-copy-dt-needed-entries -Wl,-z,relro -Wl,-z,combreloc  -pthread -L/usr/local/lib  -o tsk_loaddb tsk_loaddb.o ../../tsk/libtsk.la -lewf -ldl -lpthread -ldl -lz -lafflib -lpq -lsqlite3 -ldl -lstdc++ 
libtool: link: x86_64-pld-linux-gnux32-g++ -Wall -Wextra -Wno-unused-parameter -Wno-overloaded-virtual -Wno-unused-command-line-argument -O2 -fwrapv -pipe -Wformat -Werror=format-security -gdwarf-4 -fno-debug-types-section -fvar-tracking-assignments -g2 -Wp,-D_FORTIFY_SOURCE=2 -fstack-protector-strong --param=ssp-buffer-size=4 -fPIC -mtune=generic -march=x86-64 -gdwarf-4 -fno-debug-types-section -fvar-tracking-assignments -g2 -Wl,--as-needed -Wl,--no-copy-dt-needed-entries -Wl,-z -Wl,relro -Wl,-z -Wl,combreloc -pthread -o .libs/tsk_loaddb tsk_loaddb.o  -L/usr/local/lib ../../tsk/.libs/libtsk.so -L/usr/libx32 -L/usr/lib64 -L/usr/lib -L/usr/local/libx32 -L/usr/local/lib64 -lewf /usr/libx32/libafflib.so -lmd /usr/libx32/libcurl.so /usr/libx32/libcares.so -lnghttp2 /usr/libx32/librtmp.so /usr/libx32/libgnutls.so -lp11-kit /usr/libx32/libidn2.so /usr/libx32/libunistring.so /usr/libx32/libtasn1.so -lhogweed -lnettle /usr/libx32/libgmp.so /usr/libx32/libssh2.so -lpsl /usr/libx32/libgssapi.so /usr/libx32/libheimntlm.so /usr/libx32/libkrb5.so /usr/libx32/libhx509.so /usr/libx32/libwind.so /usr/libx32/libhcrypto.so /usr/libx32/libasn1.so -lcom_err /usr/libx32/libheimbase.so /usr/libx32/libroken.so /usr/libx32/libldap.so /usr/libx32/libsasl2.so -lcrypt /usr/libx32/libpam.so /usr/libx32/libaudit.so /usr/libx32/libcap-ng.so -lssl -lcrypto /usr/libx32/liblber.so -lresolv /usr/libx32/libbrotlidec.so /usr/libx32/libbrotlicommon.so /usr/libx32/libexpat.so -lrt -lreadline -lpq /usr/libx32/libsqlite3.so -lz -lpthread -ldl /usr/libx32/libstdc++.so -lm -pthread -Wl,-rpath -Wl,/usr/libx32
make[2]: Leaving directory '/tmp/B.JWIKG9/BUILD/sleuthkit-4.6.4/tools/autotools'
Making all in fiwalk
Making all in src
make[3]: Entering directory '/tmp/B.JWIKG9/BUILD/sleuthkit-4.6.4/tools/fiwalk/src'
x86_64-pld-linux-gnux32-gcc -DHAVE_CONFIG_H -I. -I../../../tsk  -I../../.. -pthread -I/usr/local/include -Wall -Wextra -Wno-unused-parameter -O2 -fwrapv -pipe -Wformat -Werror=format-security -gdwarf-4 -fno-debug-types-section -fvar-tracking-assignments -g2 -Wp,-D_FORTIFY_SOURCE=2 -fstack-protector-strong --param=ssp-buffer-size=4 -fPIC -mtune=generic -march=x86-64 -gdwarf-4 -fno-debug-types-section -fvar-tracking-assignments -g2  -MT utils.o -MD -MP -MF .deps/utils.Tpo -c -o utils.o utils.c
mv -f .deps/utils.Tpo .deps/utils.Po
make[3]: Leaving directory '/tmp/B.JWIKG9/BUILD/sleuthkit-4.6.4/tools/fiwalk/src'
make[3]: Entering directory '/tmp/B.JWIKG9/BUILD/sleuthkit-4.6.4/tools/fiwalk/src'
x86_64-pld-linux-gnux32-gcc -DHAVE_CONFIG_H -I. -I../../../tsk  -I../../.. -pthread -I/usr/local/include -Wall -Wextra -Wno-unused-parameter -O2 -fwrapv -pipe -Wformat -Werror=format-security -gdwarf-4 -fno-debug-types-section -fvar-tracking-assignments -g2 -Wp,-D_FORTIFY_SOURCE=2 -fstack-protector-strong --param=ssp-buffer-size=4 -fPIC -mtune=generic -march=x86-64 -gdwarf-4 -fno-debug-types-section -fvar-tracking-assignments -g2  -MT hexbuf.o -MD -MP -MF .deps/hexbuf.Tpo -c -o hexbuf.o hexbuf.c
mv -f .deps/hexbuf.Tpo .deps/hexbuf.Po
make[3]: Leaving directory '/tmp/B.JWIKG9/BUILD/sleuthkit-4.6.4/tools/fiwalk/src'
make[3]: Entering directory '/tmp/B.JWIKG9/BUILD/sleuthkit-4.6.4/tools/fiwalk/src'
x86_64-pld-linux-gnux32-g++ -DHAVE_CONFIG_H -I. -I../../../tsk  -I../../.. -pthread -I/usr/local/include -Wall -Wextra -Wno-unused-parameter -Wno-unused-command-line-argument -O2 -fwrapv -pipe -Wformat -Werror=format-security -gdwarf-4 -fno-debug-types-section -fvar-tracking-assignments -g2 -Wp,-D_FORTIFY_SOURCE=2 -fstack-protector-strong --param=ssp-buffer-size=4 -fPIC -mtune=generic -march=x86-64 -gdwarf-4 -fno-debug-types-section -fvar-tracking-assignments -g2  -MT base64.o -MD -MP -MF .deps/base64.Tpo -c -o base64.o base64.cpp
mv -f .deps/base64.Tpo .deps/base64.Po
make[3]: Leaving directory '/tmp/B.JWIKG9/BUILD/sleuthkit-4.6.4/tools/fiwalk/src'
make[3]: Entering directory '/tmp/B.JWIKG9/BUILD/sleuthkit-4.6.4/tools/fiwalk/src'
x86_64-pld-linux-gnux32-gcc -DHAVE_CONFIG_H -I. -I../../../tsk  -I../../.. -pthread -I/usr/local/include -Wall -Wextra -Wno-unused-parameter -O2 -fwrapv -pipe -Wformat -Werror=format-security -gdwarf-4 -fno-debug-types-section -fvar-tracking-assignments -g2 -Wp,-D_FORTIFY_SOURCE=2 -fstack-protector-strong --param=ssp-buffer-size=4 -fPIC -mtune=generic -march=x86-64 -gdwarf-4 -fno-debug-types-section -fvar-tracking-assignments -g2  -MT sha2.o -MD -MP -MF .deps/sha2.Tpo -c -o sha2.o sha2.c
mv -f .deps/sha2.Tpo .deps/sha2.Po
make[3]: Leaving directory '/tmp/B.JWIKG9/BUILD/sleuthkit-4.6.4/tools/fiwalk/src'
make[3]: Entering directory '/tmp/B.JWIKG9/BUILD/sleuthkit-4.6.4/tools/fiwalk/src'
x86_64-pld-linux-gnux32-g++ -DHAVE_CONFIG_H -I. -I../../../tsk  -I../../.. -pthread -I/usr/local/include -Wall -Wextra -Wno-unused-parameter -Wno-unused-command-line-argument -O2 -fwrapv -pipe -Wformat -Werror=format-security -gdwarf-4 -fno-debug-types-section -fvar-tracking-assignments -g2 -Wp,-D_FORTIFY_SOURCE=2 -fstack-protector-strong --param=ssp-buffer-size=4 -fPIC -mtune=generic -march=x86-64 -gdwarf-4 -fno-debug-types-section -fvar-tracking-assignments -g2  -MT unicode_escape.o -MD -MP -MF .deps/unicode_escape.Tpo -c -o unicode_escape.o unicode_escape.cpp
mv -f .deps/unicode_escape.Tpo .deps/unicode_escape.Po
make[3]: Leaving directory '/tmp/B.JWIKG9/BUILD/sleuthkit-4.6.4/tools/fiwalk/src'
make[3]: Entering directory '/tmp/B.JWIKG9/BUILD/sleuthkit-4.6.4/tools/fiwalk/src'
x86_64-pld-linux-gnux32-g++ -DHAVE_CONFIG_H -I. -I../../../tsk  -I../../.. -pthread -I/usr/local/include -Wall -Wextra -Wno-unused-parameter -Wno-unused-command-line-argument -O2 -fwrapv -pipe -Wformat -Werror=format-security -gdwarf-4 -fno-debug-types-section -fvar-tracking-assignments -g2 -Wp,-D_FORTIFY_SOURCE=2 -fstack-protector-strong --param=ssp-buffer-size=4 -fPIC -mtune=generic -march=x86-64 -gdwarf-4 -fno-debug-types-section -fvar-tracking-assignments -g2  -MT plugin.o -MD -MP -MF .deps/plugin.Tpo -c -o plugin.o plugin.cpp
In file included from fiwalk.h:97,
                 from plugin.cpp:49:
hash_t.h: In instantiation of 'hash_generator__<T>::hash_generator__() [with T = md5_]':
content.h:71:15:   required from here
hash_t.h:196:15: warning: cast between incompatible function types from 'void (*)(TSK_MD5_CTX*)' to 'int (*)(void*)' [-Wcast-function-type]
   md_init   = (int(*)(void *))&TSK_MD5_Init;
               ^~~~~~~~~~~~~~~~~~~~~~~~~~~~~
hash_t.h:197:18: warning: cast between incompatible function types from 'void (*)(TSK_MD5_CTX*, unsigned char*, unsigned int)' to 'int (*)(void*, const void*, uint32_t)' {aka 'int (*)(void*, const void*, unsigned int)'} [-Wcast-function-type]
      md_update = (int (*)(void *, const void *, uint32_t))&TSK_MD5_Update;
                  ^~~~~~~~~~~~~~~~~~~~~~~~~~~~~~~~~~~~~~~~~~~~~~~~~~~~~~~~
hash_t.h:198:14: warning: cast between incompatible function types from 'void (*)(unsigned char*, TSK_MD5_CTX*)' to 'int (*)(unsigned char*, void*)' [-Wcast-function-type]
   md_final = (int (*)(unsigned char*, void *))&TSK_MD5_Final;
              ^~~~~~~~~~~~~~~~~~~~~~~~~~~~~~~~~~~~~~~~~~~~~~~
hash_t.h:205:14: warning: cast between incompatible function types from 'void (*)(TSK_SHA_CTX*)' to 'int (*)(void*)' [-Wcast-function-type]
   md_init  = (int(*)(void *))&TSK_SHA_Init;
              ^~~~~~~~~~~~~~~~~~~~~~~~~~~~~
hash_t.h:207:14: warning: cast between incompatible function types from 'void (*)(BYTE*, TSK_SHA_CTX*)' {aka 'void (*)(unsigned char*, TSK_SHA_CTX*)'} to 'int (*)(unsigned char*, void*)' [-Wcast-function-type]
   md_final = (int (*)(unsigned char*, void*))&TSK_SHA_Final;
              ^~~~~~~~~~~~~~~~~~~~~~~~~~~~~~~~~~~~~~~~~~~~~~
hash_t.h:212:14: warning: cast between incompatible function types from 'void (*)(SHA256_CTX*)' to 'int (*)(void*)' [-Wcast-function-type]
   md_init  = (int(*)(void *))&SHA256_Init;
              ^~~~~~~~~~~~~~~~~~~~~~~~~~~~
hash_t.h:214:14: warning: cast between incompatible function types from 'void (*)(SHA256_CTX*, unsigned char*)' to 'int (*)(unsigned char*, void*)' [-Wcast-function-type]
   md_final = (int (*)(unsigned char*, void*))&SHA256_Final;
              ^~~~~~~~~~~~~~~~~~~~~~~~~~~~~~~~~~~~~~~~~~~~~
hash_t.h:219:14: warning: cast between incompatible function types from 'void (*)(SHA512_CTX*)' to 'int (*)(void*)' [-Wcast-function-type]
   md_init  = (int(*)(void *))&SHA512_Init;
              ^~~~~~~~~~~~~~~~~~~~~~~~~~~~
hash_t.h:221:14: warning: cast between incompatible function types from 'void (*)(SHA512_CTX*, unsigned char*)' to 'int (*)(unsigned char*, void*)' [-Wcast-function-type]
   md_final = (int (*)(unsigned char*, void*))&SHA512_Final;
              ^~~~~~~~~~~~~~~~~~~~~~~~~~~~~~~~~~~~~~~~~~~~~
hash_t.h: In instantiation of 'hash_generator__<T>::hash_generator__() [with T = sha1_]':
content.h:71:15:   required from here
hash_t.h:196:15: warning: cast between incompatible function types from 'void (*)(TSK_MD5_CTX*)' to 'int (*)(void*)' [-Wcast-function-type]
   md_init   = (int(*)(void *))&TSK_MD5_Init;
               ^~~~~~~~~~~~~~~~~~~~~~~~~~~~~
hash_t.h:197:18: warning: cast between incompatible function types from 'void (*)(TSK_MD5_CTX*, unsigned char*, unsigned int)' to 'int (*)(void*, const void*, uint32_t)' {aka 'int (*)(void*, const void*, unsigned int)'} [-Wcast-function-type]
      md_update = (int (*)(void *, const void *, uint32_t))&TSK_MD5_Update;
                  ^~~~~~~~~~~~~~~~~~~~~~~~~~~~~~~~~~~~~~~~~~~~~~~~~~~~~~~~
hash_t.h:198:14: warning: cast between incompatible function types from 'void (*)(unsigned char*, TSK_MD5_CTX*)' to 'int (*)(unsigned char*, void*)' [-Wcast-function-type]
   md_final = (int (*)(unsigned char*, void *))&TSK_MD5_Final;
              ^~~~~~~~~~~~~~~~~~~~~~~~~~~~~~~~~~~~~~~~~~~~~~~
hash_t.h:205:14: warning: cast between incompatible function types from 'void (*)(TSK_SHA_CTX*)' to 'int (*)(void*)' [-Wcast-function-type]
   md_init  = (int(*)(void *))&TSK_SHA_Init;
              ^~~~~~~~~~~~~~~~~~~~~~~~~~~~~
hash_t.h:207:14: warning: cast between incompatible function types from 'void (*)(BYTE*, TSK_SHA_CTX*)' {aka 'void (*)(unsigned char*, TSK_SHA_CTX*)'} to 'int (*)(unsigned char*, void*)' [-Wcast-function-type]
   md_final = (int (*)(unsigned char*, void*))&TSK_SHA_Final;
              ^~~~~~~~~~~~~~~~~~~~~~~~~~~~~~~~~~~~~~~~~~~~~~
hash_t.h:212:14: warning: cast between incompatible function types from 'void (*)(SHA256_CTX*)' to 'int (*)(void*)' [-Wcast-function-type]
   md_init  = (int(*)(void *))&SHA256_Init;
              ^~~~~~~~~~~~~~~~~~~~~~~~~~~~
hash_t.h:214:14: warning: cast between incompatible function types from 'void (*)(SHA256_CTX*, unsigned char*)' to 'int (*)(unsigned char*, void*)' [-Wcast-function-type]
   md_final = (int (*)(unsigned char*, void*))&SHA256_Final;
              ^~~~~~~~~~~~~~~~~~~~~~~~~~~~~~~~~~~~~~~~~~~~~
hash_t.h:219:14: warning: cast between incompatible function types from 'void (*)(SHA512_CTX*)' to 'int (*)(void*)' [-Wcast-function-type]
   md_init  = (int(*)(void *))&SHA512_Init;
              ^~~~~~~~~~~~~~~~~~~~~~~~~~~~
hash_t.h:221:14: warning: cast between incompatible function types from 'void (*)(SHA512_CTX*, unsigned char*)' to 'int (*)(unsigned char*, void*)' [-Wcast-function-type]
   md_final = (int (*)(unsigned char*, void*))&SHA512_Final;
              ^~~~~~~~~~~~~~~~~~~~~~~~~~~~~~~~~~~~~~~~~~~~~
cc1plus: warning: unrecognized command line option '-Wno-unused-command-line-argument'
mv -f .deps/plugin.Tpo .deps/plugin.Po
make[3]: Leaving directory '/tmp/B.JWIKG9/BUILD/sleuthkit-4.6.4/tools/fiwalk/src'
make[3]: Entering directory '/tmp/B.JWIKG9/BUILD/sleuthkit-4.6.4/tools/fiwalk/src'
x86_64-pld-linux-gnux32-g++ -DHAVE_CONFIG_H -I. -I../../../tsk  -I../../.. -pthread -I/usr/local/include -Wall -Wextra -Wno-unused-parameter -Wno-unused-command-line-argument -O2 -fwrapv -pipe -Wformat -Werror=format-security -gdwarf-4 -fno-debug-types-section -fvar-tracking-assignments -g2 -Wp,-D_FORTIFY_SOURCE=2 -fstack-protector-strong --param=ssp-buffer-size=4 -fPIC -mtune=generic -march=x86-64 -gdwarf-4 -fno-debug-types-section -fvar-tracking-assignments -g2  -MT content.o -MD -MP -MF .deps/content.Tpo -c -o content.o content.cpp
In file included from fiwalk.h:97,
                 from content.cpp:39:
hash_t.h: In instantiation of 'hash_generator__<T>::hash_generator__() [with T = md5_]':
content.h:71:15:   required from here
hash_t.h:196:15: warning: cast between incompatible function types from 'void (*)(TSK_MD5_CTX*)' to 'int (*)(void*)' [-Wcast-function-type]
   md_init   = (int(*)(void *))&TSK_MD5_Init;
               ^~~~~~~~~~~~~~~~~~~~~~~~~~~~~
hash_t.h:197:18: warning: cast between incompatible function types from 'void (*)(TSK_MD5_CTX*, unsigned char*, unsigned int)' to 'int (*)(void*, const void*, uint32_t)' {aka 'int (*)(void*, const void*, unsigned int)'} [-Wcast-function-type]
      md_update = (int (*)(void *, const void *, uint32_t))&TSK_MD5_Update;
                  ^~~~~~~~~~~~~~~~~~~~~~~~~~~~~~~~~~~~~~~~~~~~~~~~~~~~~~~~
hash_t.h:198:14: warning: cast between incompatible function types from 'void (*)(unsigned char*, TSK_MD5_CTX*)' to 'int (*)(unsigned char*, void*)' [-Wcast-function-type]
   md_final = (int (*)(unsigned char*, void *))&TSK_MD5_Final;
              ^~~~~~~~~~~~~~~~~~~~~~~~~~~~~~~~~~~~~~~~~~~~~~~
hash_t.h:205:14: warning: cast between incompatible function types from 'void (*)(TSK_SHA_CTX*)' to 'int (*)(void*)' [-Wcast-function-type]
   md_init  = (int(*)(void *))&TSK_SHA_Init;
              ^~~~~~~~~~~~~~~~~~~~~~~~~~~~~
hash_t.h:207:14: warning: cast between incompatible function types from 'void (*)(BYTE*, TSK_SHA_CTX*)' {aka 'void (*)(unsigned char*, TSK_SHA_CTX*)'} to 'int (*)(unsigned char*, void*)' [-Wcast-function-type]
   md_final = (int (*)(unsigned char*, void*))&TSK_SHA_Final;
              ^~~~~~~~~~~~~~~~~~~~~~~~~~~~~~~~~~~~~~~~~~~~~~
hash_t.h:212:14: warning: cast between incompatible function types from 'void (*)(SHA256_CTX*)' to 'int (*)(void*)' [-Wcast-function-type]
   md_init  = (int(*)(void *))&SHA256_Init;
              ^~~~~~~~~~~~~~~~~~~~~~~~~~~~
hash_t.h:214:14: warning: cast between incompatible function types from 'void (*)(SHA256_CTX*, unsigned char*)' to 'int (*)(unsigned char*, void*)' [-Wcast-function-type]
   md_final = (int (*)(unsigned char*, void*))&SHA256_Final;
              ^~~~~~~~~~~~~~~~~~~~~~~~~~~~~~~~~~~~~~~~~~~~~
hash_t.h:219:14: warning: cast between incompatible function types from 'void (*)(SHA512_CTX*)' to 'int (*)(void*)' [-Wcast-function-type]
   md_init  = (int(*)(void *))&SHA512_Init;
              ^~~~~~~~~~~~~~~~~~~~~~~~~~~~
hash_t.h:221:14: warning: cast between incompatible function types from 'void (*)(SHA512_CTX*, unsigned char*)' to 'int (*)(unsigned char*, void*)' [-Wcast-function-type]
   md_final = (int (*)(unsigned char*, void*))&SHA512_Final;
              ^~~~~~~~~~~~~~~~~~~~~~~~~~~~~~~~~~~~~~~~~~~~~
hash_t.h: In instantiation of 'hash_generator__<T>::hash_generator__() [with T = sha1_]':
content.h:71:15:   required from here
hash_t.h:196:15: warning: cast between incompatible function types from 'void (*)(TSK_MD5_CTX*)' to 'int (*)(void*)' [-Wcast-function-type]
   md_init   = (int(*)(void *))&TSK_MD5_Init;
               ^~~~~~~~~~~~~~~~~~~~~~~~~~~~~
hash_t.h:197:18: warning: cast between incompatible function types from 'void (*)(TSK_MD5_CTX*, unsigned char*, unsigned int)' to 'int (*)(void*, const void*, uint32_t)' {aka 'int (*)(void*, const void*, unsigned int)'} [-Wcast-function-type]
      md_update = (int (*)(void *, const void *, uint32_t))&TSK_MD5_Update;
                  ^~~~~~~~~~~~~~~~~~~~~~~~~~~~~~~~~~~~~~~~~~~~~~~~~~~~~~~~
hash_t.h:198:14: warning: cast between incompatible function types from 'void (*)(unsigned char*, TSK_MD5_CTX*)' to 'int (*)(unsigned char*, void*)' [-Wcast-function-type]
   md_final = (int (*)(unsigned char*, void *))&TSK_MD5_Final;
              ^~~~~~~~~~~~~~~~~~~~~~~~~~~~~~~~~~~~~~~~~~~~~~~
hash_t.h:205:14: warning: cast between incompatible function types from 'void (*)(TSK_SHA_CTX*)' to 'int (*)(void*)' [-Wcast-function-type]
   md_init  = (int(*)(void *))&TSK_SHA_Init;
              ^~~~~~~~~~~~~~~~~~~~~~~~~~~~~
hash_t.h:207:14: warning: cast between incompatible function types from 'void (*)(BYTE*, TSK_SHA_CTX*)' {aka 'void (*)(unsigned char*, TSK_SHA_CTX*)'} to 'int (*)(unsigned char*, void*)' [-Wcast-function-type]
   md_final = (int (*)(unsigned char*, void*))&TSK_SHA_Final;
              ^~~~~~~~~~~~~~~~~~~~~~~~~~~~~~~~~~~~~~~~~~~~~~
hash_t.h:212:14: warning: cast between incompatible function types from 'void (*)(SHA256_CTX*)' to 'int (*)(void*)' [-Wcast-function-type]
   md_init  = (int(*)(void *))&SHA256_Init;
              ^~~~~~~~~~~~~~~~~~~~~~~~~~~~
hash_t.h:214:14: warning: cast between incompatible function types from 'void (*)(SHA256_CTX*, unsigned char*)' to 'int (*)(unsigned char*, void*)' [-Wcast-function-type]
   md_final = (int (*)(unsigned char*, void*))&SHA256_Final;
              ^~~~~~~~~~~~~~~~~~~~~~~~~~~~~~~~~~~~~~~~~~~~~
hash_t.h:219:14: warning: cast between incompatible function types from 'void (*)(SHA512_CTX*)' to 'int (*)(void*)' [-Wcast-function-type]
   md_init  = (int(*)(void *))&SHA512_Init;
              ^~~~~~~~~~~~~~~~~~~~~~~~~~~~
hash_t.h:221:14: warning: cast between incompatible function types from 'void (*)(SHA512_CTX*, unsigned char*)' to 'int (*)(unsigned char*, void*)' [-Wcast-function-type]
   md_final = (int (*)(unsigned char*, void*))&SHA512_Final;
              ^~~~~~~~~~~~~~~~~~~~~~~~~~~~~~~~~~~~~~~~~~~~~
cc1plus: warning: unrecognized command line option '-Wno-unused-command-line-argument'
mv -f .deps/content.Tpo .deps/content.Po
make[3]: Leaving directory '/tmp/B.JWIKG9/BUILD/sleuthkit-4.6.4/tools/fiwalk/src'
make[3]: Entering directory '/tmp/B.JWIKG9/BUILD/sleuthkit-4.6.4/tools/fiwalk/src'
x86_64-pld-linux-gnux32-g++ -DHAVE_CONFIG_H -I. -I../../../tsk  -I../../.. -pthread -I/usr/local/include -Wall -Wextra -Wno-unused-parameter -Wno-unused-command-line-argument -O2 -fwrapv -pipe -Wformat -Werror=format-security -gdwarf-4 -fno-debug-types-section -fvar-tracking-assignments -g2 -Wp,-D_FORTIFY_SOURCE=2 -fstack-protector-strong --param=ssp-buffer-size=4 -fPIC -mtune=generic -march=x86-64 -gdwarf-4 -fno-debug-types-section -fvar-tracking-assignments -g2  -MT fiwalk_tsk.o -MD -MP -MF .deps/fiwalk_tsk.Tpo -c -o fiwalk_tsk.o fiwalk_tsk.cpp
In file included from fiwalk.h:97,
                 from fiwalk_tsk.cpp:22:
hash_t.h: In instantiation of 'hash_generator__<T>::hash_generator__() [with T = md5_]':
content.h:71:15:   required from here
hash_t.h:196:15: warning: cast between incompatible function types from 'void (*)(TSK_MD5_CTX*)' to 'int (*)(void*)' [-Wcast-function-type]
   md_init   = (int(*)(void *))&TSK_MD5_Init;
               ^~~~~~~~~~~~~~~~~~~~~~~~~~~~~
hash_t.h:197:18: warning: cast between incompatible function types from 'void (*)(TSK_MD5_CTX*, unsigned char*, unsigned int)' to 'int (*)(void*, const void*, uint32_t)' {aka 'int (*)(void*, const void*, unsigned int)'} [-Wcast-function-type]
      md_update = (int (*)(void *, const void *, uint32_t))&TSK_MD5_Update;
                  ^~~~~~~~~~~~~~~~~~~~~~~~~~~~~~~~~~~~~~~~~~~~~~~~~~~~~~~~
hash_t.h:198:14: warning: cast between incompatible function types from 'void (*)(unsigned char*, TSK_MD5_CTX*)' to 'int (*)(unsigned char*, void*)' [-Wcast-function-type]
   md_final = (int (*)(unsigned char*, void *))&TSK_MD5_Final;
              ^~~~~~~~~~~~~~~~~~~~~~~~~~~~~~~~~~~~~~~~~~~~~~~
hash_t.h:205:14: warning: cast between incompatible function types from 'void (*)(TSK_SHA_CTX*)' to 'int (*)(void*)' [-Wcast-function-type]
   md_init  = (int(*)(void *))&TSK_SHA_Init;
              ^~~~~~~~~~~~~~~~~~~~~~~~~~~~~
hash_t.h:207:14: warning: cast between incompatible function types from 'void (*)(BYTE*, TSK_SHA_CTX*)' {aka 'void (*)(unsigned char*, TSK_SHA_CTX*)'} to 'int (*)(unsigned char*, void*)' [-Wcast-function-type]
   md_final = (int (*)(unsigned char*, void*))&TSK_SHA_Final;
              ^~~~~~~~~~~~~~~~~~~~~~~~~~~~~~~~~~~~~~~~~~~~~~
hash_t.h:212:14: warning: cast between incompatible function types from 'void (*)(SHA256_CTX*)' to 'int (*)(void*)' [-Wcast-function-type]
   md_init  = (int(*)(void *))&SHA256_Init;
              ^~~~~~~~~~~~~~~~~~~~~~~~~~~~
hash_t.h:214:14: warning: cast between incompatible function types from 'void (*)(SHA256_CTX*, unsigned char*)' to 'int (*)(unsigned char*, void*)' [-Wcast-function-type]
   md_final = (int (*)(unsigned char*, void*))&SHA256_Final;
              ^~~~~~~~~~~~~~~~~~~~~~~~~~~~~~~~~~~~~~~~~~~~~
hash_t.h:219:14: warning: cast between incompatible function types from 'void (*)(SHA512_CTX*)' to 'int (*)(void*)' [-Wcast-function-type]
   md_init  = (int(*)(void *))&SHA512_Init;
              ^~~~~~~~~~~~~~~~~~~~~~~~~~~~
hash_t.h:221:14: warning: cast between incompatible function types from 'void (*)(SHA512_CTX*, unsigned char*)' to 'int (*)(unsigned char*, void*)' [-Wcast-function-type]
   md_final = (int (*)(unsigned char*, void*))&SHA512_Final;
              ^~~~~~~~~~~~~~~~~~~~~~~~~~~~~~~~~~~~~~~~~~~~~
hash_t.h: In instantiation of 'hash_generator__<T>::hash_generator__() [with T = sha1_]':
content.h:71:15:   required from here
hash_t.h:196:15: warning: cast between incompatible function types from 'void (*)(TSK_MD5_CTX*)' to 'int (*)(void*)' [-Wcast-function-type]
   md_init   = (int(*)(void *))&TSK_MD5_Init;
               ^~~~~~~~~~~~~~~~~~~~~~~~~~~~~
hash_t.h:197:18: warning: cast between incompatible function types from 'void (*)(TSK_MD5_CTX*, unsigned char*, unsigned int)' to 'int (*)(void*, const void*, uint32_t)' {aka 'int (*)(void*, const void*, unsigned int)'} [-Wcast-function-type]
      md_update = (int (*)(void *, const void *, uint32_t))&TSK_MD5_Update;
                  ^~~~~~~~~~~~~~~~~~~~~~~~~~~~~~~~~~~~~~~~~~~~~~~~~~~~~~~~
hash_t.h:198:14: warning: cast between incompatible function types from 'void (*)(unsigned char*, TSK_MD5_CTX*)' to 'int (*)(unsigned char*, void*)' [-Wcast-function-type]
   md_final = (int (*)(unsigned char*, void *))&TSK_MD5_Final;
              ^~~~~~~~~~~~~~~~~~~~~~~~~~~~~~~~~~~~~~~~~~~~~~~
hash_t.h:205:14: warning: cast between incompatible function types from 'void (*)(TSK_SHA_CTX*)' to 'int (*)(void*)' [-Wcast-function-type]
   md_init  = (int(*)(void *))&TSK_SHA_Init;
              ^~~~~~~~~~~~~~~~~~~~~~~~~~~~~
hash_t.h:207:14: warning: cast between incompatible function types from 'void (*)(BYTE*, TSK_SHA_CTX*)' {aka 'void (*)(unsigned char*, TSK_SHA_CTX*)'} to 'int (*)(unsigned char*, void*)' [-Wcast-function-type]
   md_final = (int (*)(unsigned char*, void*))&TSK_SHA_Final;
              ^~~~~~~~~~~~~~~~~~~~~~~~~~~~~~~~~~~~~~~~~~~~~~
hash_t.h:212:14: warning: cast between incompatible function types from 'void (*)(SHA256_CTX*)' to 'int (*)(void*)' [-Wcast-function-type]
   md_init  = (int(*)(void *))&SHA256_Init;
              ^~~~~~~~~~~~~~~~~~~~~~~~~~~~
hash_t.h:214:14: warning: cast between incompatible function types from 'void (*)(SHA256_CTX*, unsigned char*)' to 'int (*)(unsigned char*, void*)' [-Wcast-function-type]
   md_final = (int (*)(unsigned char*, void*))&SHA256_Final;
              ^~~~~~~~~~~~~~~~~~~~~~~~~~~~~~~~~~~~~~~~~~~~~
hash_t.h:219:14: warning: cast between incompatible function types from 'void (*)(SHA512_CTX*)' to 'int (*)(void*)' [-Wcast-function-type]
   md_init  = (int(*)(void *))&SHA512_Init;
              ^~~~~~~~~~~~~~~~~~~~~~~~~~~~
hash_t.h:221:14: warning: cast between incompatible function types from 'void (*)(SHA512_CTX*, unsigned char*)' to 'int (*)(unsigned char*, void*)' [-Wcast-function-type]
   md_final = (int (*)(unsigned char*, void*))&SHA512_Final;
              ^~~~~~~~~~~~~~~~~~~~~~~~~~~~~~~~~~~~~~~~~~~~~
cc1plus: warning: unrecognized command line option '-Wno-unused-command-line-argument'
mv -f .deps/fiwalk_tsk.Tpo .deps/fiwalk_tsk.Po
make[3]: Leaving directory '/tmp/B.JWIKG9/BUILD/sleuthkit-4.6.4/tools/fiwalk/src'
make[3]: Entering directory '/tmp/B.JWIKG9/BUILD/sleuthkit-4.6.4/tools/fiwalk/src'
x86_64-pld-linux-gnux32-g++ -DHAVE_CONFIG_H -I. -I../../../tsk  -I../../.. -pthread -I/usr/local/include -Wall -Wextra -Wno-unused-parameter -Wno-unused-command-line-argument -O2 -fwrapv -pipe -Wformat -Werror=format-security -gdwarf-4 -fno-debug-types-section -fvar-tracking-assignments -g2 -Wp,-D_FORTIFY_SOURCE=2 -fstack-protector-strong --param=ssp-buffer-size=4 -fPIC -mtune=generic -march=x86-64 -gdwarf-4 -fno-debug-types-section -fvar-tracking-assignments -g2  -MT arff.o -MD -MP -MF .deps/arff.Tpo -c -o arff.o arff.cpp
In file included from fiwalk.h:97,
                 from arff.cpp:21:
hash_t.h: In instantiation of 'hash_generator__<T>::hash_generator__() [with T = md5_]':
content.h:71:15:   required from here
hash_t.h:196:15: warning: cast between incompatible function types from 'void (*)(TSK_MD5_CTX*)' to 'int (*)(void*)' [-Wcast-function-type]
   md_init   = (int(*)(void *))&TSK_MD5_Init;
               ^~~~~~~~~~~~~~~~~~~~~~~~~~~~~
hash_t.h:197:18: warning: cast between incompatible function types from 'void (*)(TSK_MD5_CTX*, unsigned char*, unsigned int)' to 'int (*)(void*, const void*, uint32_t)' {aka 'int (*)(void*, const void*, unsigned int)'} [-Wcast-function-type]
      md_update = (int (*)(void *, const void *, uint32_t))&TSK_MD5_Update;
                  ^~~~~~~~~~~~~~~~~~~~~~~~~~~~~~~~~~~~~~~~~~~~~~~~~~~~~~~~
hash_t.h:198:14: warning: cast between incompatible function types from 'void (*)(unsigned char*, TSK_MD5_CTX*)' to 'int (*)(unsigned char*, void*)' [-Wcast-function-type]
   md_final = (int (*)(unsigned char*, void *))&TSK_MD5_Final;
              ^~~~~~~~~~~~~~~~~~~~~~~~~~~~~~~~~~~~~~~~~~~~~~~
hash_t.h:205:14: warning: cast between incompatible function types from 'void (*)(TSK_SHA_CTX*)' to 'int (*)(void*)' [-Wcast-function-type]
   md_init  = (int(*)(void *))&TSK_SHA_Init;
              ^~~~~~~~~~~~~~~~~~~~~~~~~~~~~
hash_t.h:207:14: warning: cast between incompatible function types from 'void (*)(BYTE*, TSK_SHA_CTX*)' {aka 'void (*)(unsigned char*, TSK_SHA_CTX*)'} to 'int (*)(unsigned char*, void*)' [-Wcast-function-type]
   md_final = (int (*)(unsigned char*, void*))&TSK_SHA_Final;
              ^~~~~~~~~~~~~~~~~~~~~~~~~~~~~~~~~~~~~~~~~~~~~~
hash_t.h:212:14: warning: cast between incompatible function types from 'void (*)(SHA256_CTX*)' to 'int (*)(void*)' [-Wcast-function-type]
   md_init  = (int(*)(void *))&SHA256_Init;
              ^~~~~~~~~~~~~~~~~~~~~~~~~~~~
hash_t.h:214:14: warning: cast between incompatible function types from 'void (*)(SHA256_CTX*, unsigned char*)' to 'int (*)(unsigned char*, void*)' [-Wcast-function-type]
   md_final = (int (*)(unsigned char*, void*))&SHA256_Final;
              ^~~~~~~~~~~~~~~~~~~~~~~~~~~~~~~~~~~~~~~~~~~~~
hash_t.h:219:14: warning: cast between incompatible function types from 'void (*)(SHA512_CTX*)' to 'int (*)(void*)' [-Wcast-function-type]
   md_init  = (int(*)(void *))&SHA512_Init;
              ^~~~~~~~~~~~~~~~~~~~~~~~~~~~
hash_t.h:221:14: warning: cast between incompatible function types from 'void (*)(SHA512_CTX*, unsigned char*)' to 'int (*)(unsigned char*, void*)' [-Wcast-function-type]
   md_final = (int (*)(unsigned char*, void*))&SHA512_Final;
              ^~~~~~~~~~~~~~~~~~~~~~~~~~~~~~~~~~~~~~~~~~~~~
hash_t.h: In instantiation of 'hash_generator__<T>::hash_generator__() [with T = sha1_]':
content.h:71:15:   required from here
hash_t.h:196:15: warning: cast between incompatible function types from 'void (*)(TSK_MD5_CTX*)' to 'int (*)(void*)' [-Wcast-function-type]
   md_init   = (int(*)(void *))&TSK_MD5_Init;
               ^~~~~~~~~~~~~~~~~~~~~~~~~~~~~
hash_t.h:197:18: warning: cast between incompatible function types from 'void (*)(TSK_MD5_CTX*, unsigned char*, unsigned int)' to 'int (*)(void*, const void*, uint32_t)' {aka 'int (*)(void*, const void*, unsigned int)'} [-Wcast-function-type]
      md_update = (int (*)(void *, const void *, uint32_t))&TSK_MD5_Update;
                  ^~~~~~~~~~~~~~~~~~~~~~~~~~~~~~~~~~~~~~~~~~~~~~~~~~~~~~~~
hash_t.h:198:14: warning: cast between incompatible function types from 'void (*)(unsigned char*, TSK_MD5_CTX*)' to 'int (*)(unsigned char*, void*)' [-Wcast-function-type]
   md_final = (int (*)(unsigned char*, void *))&TSK_MD5_Final;
              ^~~~~~~~~~~~~~~~~~~~~~~~~~~~~~~~~~~~~~~~~~~~~~~
hash_t.h:205:14: warning: cast between incompatible function types from 'void (*)(TSK_SHA_CTX*)' to 'int (*)(void*)' [-Wcast-function-type]
   md_init  = (int(*)(void *))&TSK_SHA_Init;
              ^~~~~~~~~~~~~~~~~~~~~~~~~~~~~
hash_t.h:207:14: warning: cast between incompatible function types from 'void (*)(BYTE*, TSK_SHA_CTX*)' {aka 'void (*)(unsigned char*, TSK_SHA_CTX*)'} to 'int (*)(unsigned char*, void*)' [-Wcast-function-type]
   md_final = (int (*)(unsigned char*, void*))&TSK_SHA_Final;
              ^~~~~~~~~~~~~~~~~~~~~~~~~~~~~~~~~~~~~~~~~~~~~~
hash_t.h:212:14: warning: cast between incompatible function types from 'void (*)(SHA256_CTX*)' to 'int (*)(void*)' [-Wcast-function-type]
   md_init  = (int(*)(void *))&SHA256_Init;
              ^~~~~~~~~~~~~~~~~~~~~~~~~~~~
hash_t.h:214:14: warning: cast between incompatible function types from 'void (*)(SHA256_CTX*, unsigned char*)' to 'int (*)(unsigned char*, void*)' [-Wcast-function-type]
   md_final = (int (*)(unsigned char*, void*))&SHA256_Final;
              ^~~~~~~~~~~~~~~~~~~~~~~~~~~~~~~~~~~~~~~~~~~~~
hash_t.h:219:14: warning: cast between incompatible function types from 'void (*)(SHA512_CTX*)' to 'int (*)(void*)' [-Wcast-function-type]
   md_init  = (int(*)(void *))&SHA512_Init;
              ^~~~~~~~~~~~~~~~~~~~~~~~~~~~
hash_t.h:221:14: warning: cast between incompatible function types from 'void (*)(SHA512_CTX*, unsigned char*)' to 'int (*)(unsigned char*, void*)' [-Wcast-function-type]
   md_final = (int (*)(unsigned char*, void*))&SHA512_Final;
              ^~~~~~~~~~~~~~~~~~~~~~~~~~~~~~~~~~~~~~~~~~~~~
cc1plus: warning: unrecognized command line option '-Wno-unused-command-line-argument'
mv -f .deps/arff.Tpo .deps/arff.Po
make[3]: Leaving directory '/tmp/B.JWIKG9/BUILD/sleuthkit-4.6.4/tools/fiwalk/src'
make[3]: Entering directory '/tmp/B.JWIKG9/BUILD/sleuthkit-4.6.4/tools/fiwalk/src'
x86_64-pld-linux-gnux32-g++ -DHAVE_CONFIG_H -I. -I../../../tsk  -I../../.. -pthread -I/usr/local/include -Wall -Wextra -Wno-unused-parameter -Wno-unused-command-line-argument -O2 -fwrapv -pipe -Wformat -Werror=format-security -gdwarf-4 -fno-debug-types-section -fvar-tracking-assignments -g2 -Wp,-D_FORTIFY_SOURCE=2 -fstack-protector-strong --param=ssp-buffer-size=4 -fPIC -mtune=generic -march=x86-64 -gdwarf-4 -fno-debug-types-section -fvar-tracking-assignments -g2  -MT dfxml.o -MD -MP -MF .deps/dfxml.Tpo -c -o dfxml.o dfxml.cpp
mv -f .deps/dfxml.Tpo .deps/dfxml.Po
make[3]: Leaving directory '/tmp/B.JWIKG9/BUILD/sleuthkit-4.6.4/tools/fiwalk/src'
make[3]: Entering directory '/tmp/B.JWIKG9/BUILD/sleuthkit-4.6.4/tools/fiwalk/src'
x86_64-pld-linux-gnux32-g++ -DHAVE_CONFIG_H -I. -I../../../tsk  -I../../.. -pthread -I/usr/local/include -Wall -Wextra -Wno-unused-parameter -Wno-unused-command-line-argument -O2 -fwrapv -pipe -Wformat -Werror=format-security -gdwarf-4 -fno-debug-types-section -fvar-tracking-assignments -g2 -Wp,-D_FORTIFY_SOURCE=2 -fstack-protector-strong --param=ssp-buffer-size=4 -fPIC -mtune=generic -march=x86-64 -gdwarf-4 -fno-debug-types-section -fvar-tracking-assignments -g2  -MT fiwalk.o -MD -MP -MF .deps/fiwalk.Tpo -c -o fiwalk.o fiwalk.cpp
In file included from fiwalk.h:97,
                 from fiwalk.cpp:39:
hash_t.h: In instantiation of 'hash_generator__<T>::hash_generator__() [with T = md5_]':
content.h:71:15:   required from here
hash_t.h:196:15: warning: cast between incompatible function types from 'void (*)(TSK_MD5_CTX*)' to 'int (*)(void*)' [-Wcast-function-type]
   md_init   = (int(*)(void *))&TSK_MD5_Init;
               ^~~~~~~~~~~~~~~~~~~~~~~~~~~~~
hash_t.h:197:18: warning: cast between incompatible function types from 'void (*)(TSK_MD5_CTX*, unsigned char*, unsigned int)' to 'int (*)(void*, const void*, uint32_t)' {aka 'int (*)(void*, const void*, unsigned int)'} [-Wcast-function-type]
      md_update = (int (*)(void *, const void *, uint32_t))&TSK_MD5_Update;
                  ^~~~~~~~~~~~~~~~~~~~~~~~~~~~~~~~~~~~~~~~~~~~~~~~~~~~~~~~
hash_t.h:198:14: warning: cast between incompatible function types from 'void (*)(unsigned char*, TSK_MD5_CTX*)' to 'int (*)(unsigned char*, void*)' [-Wcast-function-type]
   md_final = (int (*)(unsigned char*, void *))&TSK_MD5_Final;
              ^~~~~~~~~~~~~~~~~~~~~~~~~~~~~~~~~~~~~~~~~~~~~~~
hash_t.h:205:14: warning: cast between incompatible function types from 'void (*)(TSK_SHA_CTX*)' to 'int (*)(void*)' [-Wcast-function-type]
   md_init  = (int(*)(void *))&TSK_SHA_Init;
              ^~~~~~~~~~~~~~~~~~~~~~~~~~~~~
hash_t.h:207:14: warning: cast between incompatible function types from 'void (*)(BYTE*, TSK_SHA_CTX*)' {aka 'void (*)(unsigned char*, TSK_SHA_CTX*)'} to 'int (*)(unsigned char*, void*)' [-Wcast-function-type]
   md_final = (int (*)(unsigned char*, void*))&TSK_SHA_Final;
              ^~~~~~~~~~~~~~~~~~~~~~~~~~~~~~~~~~~~~~~~~~~~~~
hash_t.h:212:14: warning: cast between incompatible function types from 'void (*)(SHA256_CTX*)' to 'int (*)(void*)' [-Wcast-function-type]
   md_init  = (int(*)(void *))&SHA256_Init;
              ^~~~~~~~~~~~~~~~~~~~~~~~~~~~
hash_t.h:214:14: warning: cast between incompatible function types from 'void (*)(SHA256_CTX*, unsigned char*)' to 'int (*)(unsigned char*, void*)' [-Wcast-function-type]
   md_final = (int (*)(unsigned char*, void*))&SHA256_Final;
              ^~~~~~~~~~~~~~~~~~~~~~~~~~~~~~~~~~~~~~~~~~~~~
hash_t.h:219:14: warning: cast between incompatible function types from 'void (*)(SHA512_CTX*)' to 'int (*)(void*)' [-Wcast-function-type]
   md_init  = (int(*)(void *))&SHA512_Init;
              ^~~~~~~~~~~~~~~~~~~~~~~~~~~~
hash_t.h:221:14: warning: cast between incompatible function types from 'void (*)(SHA512_CTX*, unsigned char*)' to 'int (*)(unsigned char*, void*)' [-Wcast-function-type]
   md_final = (int (*)(unsigned char*, void*))&SHA512_Final;
              ^~~~~~~~~~~~~~~~~~~~~~~~~~~~~~~~~~~~~~~~~~~~~
hash_t.h: In instantiation of 'hash_generator__<T>::hash_generator__() [with T = sha1_]':
content.h:71:15:   required from here
hash_t.h:196:15: warning: cast between incompatible function types from 'void (*)(TSK_MD5_CTX*)' to 'int (*)(void*)' [-Wcast-function-type]
   md_init   = (int(*)(void *))&TSK_MD5_Init;
               ^~~~~~~~~~~~~~~~~~~~~~~~~~~~~
hash_t.h:197:18: warning: cast between incompatible function types from 'void (*)(TSK_MD5_CTX*, unsigned char*, unsigned int)' to 'int (*)(void*, const void*, uint32_t)' {aka 'int (*)(void*, const void*, unsigned int)'} [-Wcast-function-type]
      md_update = (int (*)(void *, const void *, uint32_t))&TSK_MD5_Update;
                  ^~~~~~~~~~~~~~~~~~~~~~~~~~~~~~~~~~~~~~~~~~~~~~~~~~~~~~~~
hash_t.h:198:14: warning: cast between incompatible function types from 'void (*)(unsigned char*, TSK_MD5_CTX*)' to 'int (*)(unsigned char*, void*)' [-Wcast-function-type]
   md_final = (int (*)(unsigned char*, void *))&TSK_MD5_Final;
              ^~~~~~~~~~~~~~~~~~~~~~~~~~~~~~~~~~~~~~~~~~~~~~~
hash_t.h:205:14: warning: cast between incompatible function types from 'void (*)(TSK_SHA_CTX*)' to 'int (*)(void*)' [-Wcast-function-type]
   md_init  = (int(*)(void *))&TSK_SHA_Init;
              ^~~~~~~~~~~~~~~~~~~~~~~~~~~~~
hash_t.h:207:14: warning: cast between incompatible function types from 'void (*)(BYTE*, TSK_SHA_CTX*)' {aka 'void (*)(unsigned char*, TSK_SHA_CTX*)'} to 'int (*)(unsigned char*, void*)' [-Wcast-function-type]
   md_final = (int (*)(unsigned char*, void*))&TSK_SHA_Final;
              ^~~~~~~~~~~~~~~~~~~~~~~~~~~~~~~~~~~~~~~~~~~~~~
hash_t.h:212:14: warning: cast between incompatible function types from 'void (*)(SHA256_CTX*)' to 'int (*)(void*)' [-Wcast-function-type]
   md_init  = (int(*)(void *))&SHA256_Init;
              ^~~~~~~~~~~~~~~~~~~~~~~~~~~~
hash_t.h:214:14: warning: cast between incompatible function types from 'void (*)(SHA256_CTX*, unsigned char*)' to 'int (*)(unsigned char*, void*)' [-Wcast-function-type]
   md_final = (int (*)(unsigned char*, void*))&SHA256_Final;
              ^~~~~~~~~~~~~~~~~~~~~~~~~~~~~~~~~~~~~~~~~~~~~
hash_t.h:219:14: warning: cast between incompatible function types from 'void (*)(SHA512_CTX*)' to 'int (*)(void*)' [-Wcast-function-type]
   md_init  = (int(*)(void *))&SHA512_Init;
              ^~~~~~~~~~~~~~~~~~~~~~~~~~~~
hash_t.h:221:14: warning: cast between incompatible function types from 'void (*)(SHA512_CTX*, unsigned char*)' to 'int (*)(unsigned char*, void*)' [-Wcast-function-type]
   md_final = (int (*)(unsigned char*, void*))&SHA512_Final;
              ^~~~~~~~~~~~~~~~~~~~~~~~~~~~~~~~~~~~~~~~~~~~~
fiwalk.cpp: In function 'int main(int, char* const*)':
fiwalk.cpp:525:28: warning: this statement may fall through [-Wimplicit-fallthrough=]
  case _TSK_T('M'): opt_md5 = true;
                    ~~~~~~~~^~~~~~
fiwalk.cpp:526:2: note: here
  case _TSK_T('O'): opt_allocated_only=true; break;
  ^~~~
At global scope:
cc1plus: warning: unrecognized command line option '-Wno-unused-command-line-argument'
mv -f .deps/fiwalk.Tpo .deps/fiwalk.Po
make[3]: Leaving directory '/tmp/B.JWIKG9/BUILD/sleuthkit-4.6.4/tools/fiwalk/src'
make[3]: Entering directory '/tmp/B.JWIKG9/BUILD/sleuthkit-4.6.4/tools/fiwalk/src'
/bin/sh ../../../libtool  --tag=CXX   --mode=link x86_64-pld-linux-gnux32-g++ -Wall -Wextra -Wno-unused-parameter -Wno-unused-command-line-argument -O2 -fwrapv -pipe -Wformat -Werror=format-security -gdwarf-4 -fno-debug-types-section -fvar-tracking-assignments -g2 -Wp,-D_FORTIFY_SOURCE=2 -fstack-protector-strong --param=ssp-buffer-size=4 -fPIC -mtune=generic -march=x86-64 -gdwarf-4 -fno-debug-types-section -fvar-tracking-assignments -g2   -Wl,--as-needed -Wl,--no-copy-dt-needed-entries -Wl,-z,relro -Wl,-z,combreloc  -pthread -L/usr/local/lib -o fiwalk fiwalk.o fiwalk_tsk.o content.o arff.o plugin.o utils.o dfxml.o hexbuf.o unicode_escape.o base64.o sha2.o ../../../tsk/libtsk.la -lewf -ldl -lz -lafflib -lpq -lsqlite3 -ldl -lstdc++ 
libtool: link: x86_64-pld-linux-gnux32-g++ -Wall -Wextra -Wno-unused-parameter -Wno-unused-command-line-argument -O2 -fwrapv -pipe -Wformat -Werror=format-security -gdwarf-4 -fno-debug-types-section -fvar-tracking-assignments -g2 -Wp,-D_FORTIFY_SOURCE=2 -fstack-protector-strong --param=ssp-buffer-size=4 -fPIC -mtune=generic -march=x86-64 -gdwarf-4 -fno-debug-types-section -fvar-tracking-assignments -g2 -Wl,--as-needed -Wl,--no-copy-dt-needed-entries -Wl,-z -Wl,relro -Wl,-z -Wl,combreloc -pthread -o .libs/fiwalk fiwalk.o fiwalk_tsk.o content.o arff.o plugin.o utils.o dfxml.o hexbuf.o unicode_escape.o base64.o sha2.o  -L/usr/local/lib ../../../tsk/.libs/libtsk.so -L/usr/libx32 -L/usr/lib64 -L/usr/lib -L/usr/local/libx32 -L/usr/local/lib64 -lewf /usr/libx32/libafflib.so -lmd /usr/libx32/libcurl.so /usr/libx32/libcares.so -lnghttp2 /usr/libx32/librtmp.so /usr/libx32/libgnutls.so -lp11-kit /usr/libx32/libidn2.so /usr/libx32/libunistring.so /usr/libx32/libtasn1.so -lhogweed -lnettle /usr/libx32/libgmp.so /usr/libx32/libssh2.so -lpsl /usr/libx32/libgssapi.so /usr/libx32/libheimntlm.so /usr/libx32/libkrb5.so /usr/libx32/libhx509.so /usr/libx32/libwind.so /usr/libx32/libhcrypto.so /usr/libx32/libasn1.so -lcom_err /usr/libx32/libheimbase.so /usr/libx32/libroken.so /usr/libx32/libldap.so /usr/libx32/libsasl2.so -lcrypt /usr/libx32/libpam.so /usr/libx32/libaudit.so /usr/libx32/libcap-ng.so -lssl -lcrypto /usr/libx32/liblber.so -lresolv /usr/libx32/libbrotlidec.so /usr/libx32/libbrotlicommon.so /usr/libx32/libexpat.so -lrt -lreadline -lpq /usr/libx32/libsqlite3.so -lz -lpthread -ldl /usr/libx32/libstdc++.so -lm -pthread -Wl,-rpath -Wl,/usr/libx32
make[3]: Leaving directory '/tmp/B.JWIKG9/BUILD/sleuthkit-4.6.4/tools/fiwalk/src'
Making all in plugins
make[3]: Entering directory '/tmp/B.JWIKG9/BUILD/sleuthkit-4.6.4/tools/fiwalk/plugins'
x86_64-pld-linux-gnux32-g++ -DHAVE_CONFIG_H -I. -I../../../tsk   -pthread -I/usr/local/include -Wall -Wextra -Wno-unused-parameter -Wno-unused-command-line-argument -O2 -fwrapv -pipe -Wformat -Werror=format-security -gdwarf-4 -fno-debug-types-section -fvar-tracking-assignments -g2 -Wp,-D_FORTIFY_SOURCE=2 -fstack-protector-strong --param=ssp-buffer-size=4 -fPIC -mtune=generic -march=x86-64 -gdwarf-4 -fno-debug-types-section -fvar-tracking-assignments -g2  -MT jpeg_extract.o -MD -MP -MF .deps/jpeg_extract.Tpo -c -o jpeg_extract.o jpeg_extract.cpp
mv -f .deps/jpeg_extract.Tpo .deps/jpeg_extract.Po
make[3]: Leaving directory '/tmp/B.JWIKG9/BUILD/sleuthkit-4.6.4/tools/fiwalk/plugins'
make[3]: Entering directory '/tmp/B.JWIKG9/BUILD/sleuthkit-4.6.4/tools/fiwalk/plugins'
/bin/sh ../../../libtool  --tag=CXX   --mode=link x86_64-pld-linux-gnux32-g++ -Wall -Wextra -Wno-unused-parameter -Wno-unused-command-line-argument -O2 -fwrapv -pipe -Wformat -Werror=format-security -gdwarf-4 -fno-debug-types-section -fvar-tracking-assignments -g2 -Wp,-D_FORTIFY_SOURCE=2 -fstack-protector-strong --param=ssp-buffer-size=4 -fPIC -mtune=generic -march=x86-64 -gdwarf-4 -fno-debug-types-section -fvar-tracking-assignments -g2   -Wl,--as-needed -Wl,--no-copy-dt-needed-entries -Wl,-z,relro -Wl,-z,combreloc  -pthread -L/usr/local/lib -o jpeg_extract jpeg_extract.o  -lewf -ldl -lz -lafflib -lpq -lsqlite3 -ldl -lstdc++ 
libtool: link: x86_64-pld-linux-gnux32-g++ -Wall -Wextra -Wno-unused-parameter -Wno-unused-command-line-argument -O2 -fwrapv -pipe -Wformat -Werror=format-security -gdwarf-4 -fno-debug-types-section -fvar-tracking-assignments -g2 -Wp,-D_FORTIFY_SOURCE=2 -fstack-protector-strong --param=ssp-buffer-size=4 -fPIC -mtune=generic -march=x86-64 -gdwarf-4 -fno-debug-types-section -fvar-tracking-assignments -g2 -Wl,--as-needed -Wl,--no-copy-dt-needed-entries -Wl,-z -Wl,relro -Wl,-z -Wl,combreloc -pthread -o jpeg_extract jpeg_extract.o  -L/usr/local/lib -lewf /usr/libx32/libafflib.so -L/usr/libx32 -L/usr/lib64 -L/usr/lib -L/usr/local/libx32 -L/usr/local/lib64 -lmd /usr/libx32/libcurl.so /usr/libx32/libcares.so -lnghttp2 /usr/libx32/librtmp.so /usr/libx32/libgnutls.so -lp11-kit /usr/libx32/libidn2.so /usr/libx32/libunistring.so /usr/libx32/libtasn1.so -lhogweed -lnettle /usr/libx32/libgmp.so /usr/libx32/libssh2.so -lpsl /usr/libx32/libgssapi.so /usr/libx32/libheimntlm.so /usr/libx32/libkrb5.so /usr/libx32/libhx509.so /usr/libx32/libwind.so /usr/libx32/libhcrypto.so /usr/libx32/libasn1.so -lcom_err /usr/libx32/libheimbase.so /usr/libx32/libroken.so /usr/libx32/libldap.so /usr/libx32/libsasl2.so -lcrypt /usr/libx32/libpam.so /usr/libx32/libaudit.so /usr/libx32/libcap-ng.so -lssl -lcrypto /usr/libx32/liblber.so -lresolv /usr/libx32/libbrotlidec.so /usr/libx32/libbrotlicommon.so /usr/libx32/libexpat.so -lrt -lreadline -lpq /usr/libx32/libsqlite3.so -lz -lpthread -ldl /usr/libx32/libstdc++.so -lm -pthread -Wl,-rpath -Wl,/usr/libx32 -Wl,-rpath -Wl,/usr/libx32
make[3]: Leaving directory '/tmp/B.JWIKG9/BUILD/sleuthkit-4.6.4/tools/fiwalk/plugins'
make[3]: Nothing to be done for 'all-am'.
make[2]: Nothing to be done for 'all-am'.
Making all in tests
make[1]: Nothing to be done for 'all'.
Making all in samples
make[1]: Entering directory '/tmp/B.JWIKG9/BUILD/sleuthkit-4.6.4/samples'
x86_64-pld-linux-gnux32-g++ -DHAVE_CONFIG_H -I. -I../tsk  -I.. -I./.. -pthread -I/usr/local/include -Wall -Wextra -Wno-unused-parameter -Wno-unused-command-line-argument -O2 -fwrapv -pipe -Wformat -Werror=format-security -gdwarf-4 -fno-debug-types-section -fvar-tracking-assignments -g2 -Wp,-D_FORTIFY_SOURCE=2 -fstack-protector-strong --param=ssp-buffer-size=4 -fPIC -mtune=generic -march=x86-64 -gdwarf-4 -fno-debug-types-section -fvar-tracking-assignments -g2  -MT callback-style.o -MD -MP -MF .deps/callback-style.Tpo -c -o callback-style.o callback-style.cpp
mv -f .deps/callback-style.Tpo .deps/callback-style.Po
make[1]: Leaving directory '/tmp/B.JWIKG9/BUILD/sleuthkit-4.6.4/samples'
make[1]: Entering directory '/tmp/B.JWIKG9/BUILD/sleuthkit-4.6.4/samples'
x86_64-pld-linux-gnux32-g++ -DHAVE_CONFIG_H -I. -I../tsk  -I.. -I./.. -pthread -I/usr/local/include -Wall -Wextra -Wno-unused-parameter -Wno-unused-command-line-argument -O2 -fwrapv -pipe -Wformat -Werror=format-security -gdwarf-4 -fno-debug-types-section -fvar-tracking-assignments -g2 -Wp,-D_FORTIFY_SOURCE=2 -fstack-protector-strong --param=ssp-buffer-size=4 -fPIC -mtune=generic -march=x86-64 -gdwarf-4 -fno-debug-types-section -fvar-tracking-assignments -g2  -MT posix-style.o -MD -MP -MF .deps/posix-style.Tpo -c -o posix-style.o posix-style.cpp
mv -f .deps/posix-style.Tpo .deps/posix-style.Po
make[1]: Leaving directory '/tmp/B.JWIKG9/BUILD/sleuthkit-4.6.4/samples'
make[1]: Entering directory '/tmp/B.JWIKG9/BUILD/sleuthkit-4.6.4/samples'
x86_64-pld-linux-gnux32-g++ -DHAVE_CONFIG_H -I. -I../tsk  -I.. -I./.. -pthread -I/usr/local/include -Wall -Wextra -Wno-unused-parameter -Wno-unused-command-line-argument -O2 -fwrapv -pipe -Wformat -Werror=format-security -gdwarf-4 -fno-debug-types-section -fvar-tracking-assignments -g2 -Wp,-D_FORTIFY_SOURCE=2 -fstack-protector-strong --param=ssp-buffer-size=4 -fPIC -mtune=generic -march=x86-64 -gdwarf-4 -fno-debug-types-section -fvar-tracking-assignments -g2  -MT callback-cpp-style.o -MD -MP -MF .deps/callback-cpp-style.Tpo -c -o callback-cpp-style.o callback-cpp-style.cpp
mv -f .deps/callback-cpp-style.Tpo .deps/callback-cpp-style.Po
make[1]: Leaving directory '/tmp/B.JWIKG9/BUILD/sleuthkit-4.6.4/samples'
make[1]: Entering directory '/tmp/B.JWIKG9/BUILD/sleuthkit-4.6.4/samples'
x86_64-pld-linux-gnux32-g++ -DHAVE_CONFIG_H -I. -I../tsk  -I.. -I./.. -pthread -I/usr/local/include -Wall -Wextra -Wno-unused-parameter -Wno-unused-command-line-argument -O2 -fwrapv -pipe -Wformat -Werror=format-security -gdwarf-4 -fno-debug-types-section -fvar-tracking-assignments -g2 -Wp,-D_FORTIFY_SOURCE=2 -fstack-protector-strong --param=ssp-buffer-size=4 -fPIC -mtune=generic -march=x86-64 -gdwarf-4 -fno-debug-types-section -fvar-tracking-assignments -g2  -MT posix-cpp-style.o -MD -MP -MF .deps/posix-cpp-style.Tpo -c -o posix-cpp-style.o posix-cpp-style.cpp
mv -f .deps/posix-cpp-style.Tpo .deps/posix-cpp-style.Po
make[1]: Leaving directory '/tmp/B.JWIKG9/BUILD/sleuthkit-4.6.4/samples'
make[1]: Entering directory '/tmp/B.JWIKG9/BUILD/sleuthkit-4.6.4/samples'
/bin/sh ../libtool  --tag=CXX   --mode=link x86_64-pld-linux-gnux32-g++ -Wall -Wextra -Wno-unused-parameter -Wno-unused-command-line-argument -O2 -fwrapv -pipe -Wformat -Werror=format-security -gdwarf-4 -fno-debug-types-section -fvar-tracking-assignments -g2 -Wp,-D_FORTIFY_SOURCE=2 -fstack-protector-strong --param=ssp-buffer-size=4 -fPIC -mtune=generic -march=x86-64 -gdwarf-4 -fno-debug-types-section -fvar-tracking-assignments -g2   -Wl,--as-needed -Wl,--no-copy-dt-needed-entries -Wl,-z,relro -Wl,-z,combreloc  -pthread -L/usr/local/lib -o callback_style callback-style.o ../tsk/libtsk.la -lewf -ldl -lz -lafflib -lpq -lsqlite3 -ldl -lstdc++ 
libtool: link: x86_64-pld-linux-gnux32-g++ -Wall -Wextra -Wno-unused-parameter -Wno-unused-command-line-argument -O2 -fwrapv -pipe -Wformat -Werror=format-security -gdwarf-4 -fno-debug-types-section -fvar-tracking-assignments -g2 -Wp,-D_FORTIFY_SOURCE=2 -fstack-protector-strong --param=ssp-buffer-size=4 -fPIC -mtune=generic -march=x86-64 -gdwarf-4 -fno-debug-types-section -fvar-tracking-assignments -g2 -Wl,--as-needed -Wl,--no-copy-dt-needed-entries -Wl,-z -Wl,relro -Wl,-z -Wl,combreloc -pthread -o .libs/callback_style callback-style.o  -L/usr/local/lib ../tsk/.libs/libtsk.so -L/usr/libx32 -L/usr/lib64 -L/usr/lib -L/usr/local/libx32 -L/usr/local/lib64 -lewf /usr/libx32/libafflib.so -lmd /usr/libx32/libcurl.so /usr/libx32/libcares.so -lnghttp2 /usr/libx32/librtmp.so /usr/libx32/libgnutls.so -lp11-kit /usr/libx32/libidn2.so /usr/libx32/libunistring.so /usr/libx32/libtasn1.so -lhogweed -lnettle /usr/libx32/libgmp.so /usr/libx32/libssh2.so -lpsl /usr/libx32/libgssapi.so /usr/libx32/libheimntlm.so /usr/libx32/libkrb5.so /usr/libx32/libhx509.so /usr/libx32/libwind.so /usr/libx32/libhcrypto.so /usr/libx32/libasn1.so -lcom_err /usr/libx32/libheimbase.so /usr/libx32/libroken.so /usr/libx32/libldap.so /usr/libx32/libsasl2.so -lcrypt /usr/libx32/libpam.so /usr/libx32/libaudit.so /usr/libx32/libcap-ng.so -lssl -lcrypto /usr/libx32/liblber.so -lresolv /usr/libx32/libbrotlidec.so /usr/libx32/libbrotlicommon.so /usr/libx32/libexpat.so -lrt -lreadline -lpq /usr/libx32/libsqlite3.so -lz -lpthread -ldl /usr/libx32/libstdc++.so -lm -pthread -Wl,-rpath -Wl,/usr/libx32
make[1]: Leaving directory '/tmp/B.JWIKG9/BUILD/sleuthkit-4.6.4/samples'
make[1]: Entering directory '/tmp/B.JWIKG9/BUILD/sleuthkit-4.6.4/samples'
/bin/sh ../libtool  --tag=CXX   --mode=link x86_64-pld-linux-gnux32-g++ -Wall -Wextra -Wno-unused-parameter -Wno-unused-command-line-argument -O2 -fwrapv -pipe -Wformat -Werror=format-security -gdwarf-4 -fno-debug-types-section -fvar-tracking-assignments -g2 -Wp,-D_FORTIFY_SOURCE=2 -fstack-protector-strong --param=ssp-buffer-size=4 -fPIC -mtune=generic -march=x86-64 -gdwarf-4 -fno-debug-types-section -fvar-tracking-assignments -g2   -Wl,--as-needed -Wl,--no-copy-dt-needed-entries -Wl,-z,relro -Wl,-z,combreloc  -pthread -L/usr/local/lib -o posix_style posix-style.o ../tsk/libtsk.la -lewf -ldl -lz -lafflib -lpq -lsqlite3 -ldl -lstdc++ 
libtool: link: x86_64-pld-linux-gnux32-g++ -Wall -Wextra -Wno-unused-parameter -Wno-unused-command-line-argument -O2 -fwrapv -pipe -Wformat -Werror=format-security -gdwarf-4 -fno-debug-types-section -fvar-tracking-assignments -g2 -Wp,-D_FORTIFY_SOURCE=2 -fstack-protector-strong --param=ssp-buffer-size=4 -fPIC -mtune=generic -march=x86-64 -gdwarf-4 -fno-debug-types-section -fvar-tracking-assignments -g2 -Wl,--as-needed -Wl,--no-copy-dt-needed-entries -Wl,-z -Wl,relro -Wl,-z -Wl,combreloc -pthread -o .libs/posix_style posix-style.o  -L/usr/local/lib ../tsk/.libs/libtsk.so -L/usr/libx32 -L/usr/lib64 -L/usr/lib -L/usr/local/libx32 -L/usr/local/lib64 -lewf /usr/libx32/libafflib.so -lmd /usr/libx32/libcurl.so /usr/libx32/libcares.so -lnghttp2 /usr/libx32/librtmp.so /usr/libx32/libgnutls.so -lp11-kit /usr/libx32/libidn2.so /usr/libx32/libunistring.so /usr/libx32/libtasn1.so -lhogweed -lnettle /usr/libx32/libgmp.so /usr/libx32/libssh2.so -lpsl /usr/libx32/libgssapi.so /usr/libx32/libheimntlm.so /usr/libx32/libkrb5.so /usr/libx32/libhx509.so /usr/libx32/libwind.so /usr/libx32/libhcrypto.so /usr/libx32/libasn1.so -lcom_err /usr/libx32/libheimbase.so /usr/libx32/libroken.so /usr/libx32/libldap.so /usr/libx32/libsasl2.so -lcrypt /usr/libx32/libpam.so /usr/libx32/libaudit.so /usr/libx32/libcap-ng.so -lssl -lcrypto /usr/libx32/liblber.so -lresolv /usr/libx32/libbrotlidec.so /usr/libx32/libbrotlicommon.so /usr/libx32/libexpat.so -lrt -lreadline -lpq /usr/libx32/libsqlite3.so -lz -lpthread -ldl /usr/libx32/libstdc++.so -lm -pthread -Wl,-rpath -Wl,/usr/libx32
make[1]: Leaving directory '/tmp/B.JWIKG9/BUILD/sleuthkit-4.6.4/samples'
make[1]: Entering directory '/tmp/B.JWIKG9/BUILD/sleuthkit-4.6.4/samples'
/bin/sh ../libtool  --tag=CXX   --mode=link x86_64-pld-linux-gnux32-g++ -Wall -Wextra -Wno-unused-parameter -Wno-unused-command-line-argument -O2 -fwrapv -pipe -Wformat -Werror=format-security -gdwarf-4 -fno-debug-types-section -fvar-tracking-assignments -g2 -Wp,-D_FORTIFY_SOURCE=2 -fstack-protector-strong --param=ssp-buffer-size=4 -fPIC -mtune=generic -march=x86-64 -gdwarf-4 -fno-debug-types-section -fvar-tracking-assignments -g2   -Wl,--as-needed -Wl,--no-copy-dt-needed-entries -Wl,-z,relro -Wl,-z,combreloc  -pthread -L/usr/local/lib -o callback_cpp_style callback-cpp-style.o ../tsk/libtsk.la -lewf -ldl -lz -lafflib -lpq -lsqlite3 -ldl -lstdc++ 
libtool: link: x86_64-pld-linux-gnux32-g++ -Wall -Wextra -Wno-unused-parameter -Wno-unused-command-line-argument -O2 -fwrapv -pipe -Wformat -Werror=format-security -gdwarf-4 -fno-debug-types-section -fvar-tracking-assignments -g2 -Wp,-D_FORTIFY_SOURCE=2 -fstack-protector-strong --param=ssp-buffer-size=4 -fPIC -mtune=generic -march=x86-64 -gdwarf-4 -fno-debug-types-section -fvar-tracking-assignments -g2 -Wl,--as-needed -Wl,--no-copy-dt-needed-entries -Wl,-z -Wl,relro -Wl,-z -Wl,combreloc -pthread -o .libs/callback_cpp_style callback-cpp-style.o  -L/usr/local/lib ../tsk/.libs/libtsk.so -L/usr/libx32 -L/usr/lib64 -L/usr/lib -L/usr/local/libx32 -L/usr/local/lib64 -lewf /usr/libx32/libafflib.so -lmd /usr/libx32/libcurl.so /usr/libx32/libcares.so -lnghttp2 /usr/libx32/librtmp.so /usr/libx32/libgnutls.so -lp11-kit /usr/libx32/libidn2.so /usr/libx32/libunistring.so /usr/libx32/libtasn1.so -lhogweed -lnettle /usr/libx32/libgmp.so /usr/libx32/libssh2.so -lpsl /usr/libx32/libgssapi.so /usr/libx32/libheimntlm.so /usr/libx32/libkrb5.so /usr/libx32/libhx509.so /usr/libx32/libwind.so /usr/libx32/libhcrypto.so /usr/libx32/libasn1.so -lcom_err /usr/libx32/libheimbase.so /usr/libx32/libroken.so /usr/libx32/libldap.so /usr/libx32/libsasl2.so -lcrypt /usr/libx32/libpam.so /usr/libx32/libaudit.so /usr/libx32/libcap-ng.so -lssl -lcrypto /usr/libx32/liblber.so -lresolv /usr/libx32/libbrotlidec.so /usr/libx32/libbrotlicommon.so /usr/libx32/libexpat.so -lrt -lreadline -lpq /usr/libx32/libsqlite3.so -lz -lpthread -ldl /usr/libx32/libstdc++.so -lm -pthread -Wl,-rpath -Wl,/usr/libx32
make[1]: Leaving directory '/tmp/B.JWIKG9/BUILD/sleuthkit-4.6.4/samples'
make[1]: Entering directory '/tmp/B.JWIKG9/BUILD/sleuthkit-4.6.4/samples'
/bin/sh ../libtool  --tag=CXX   --mode=link x86_64-pld-linux-gnux32-g++ -Wall -Wextra -Wno-unused-parameter -Wno-unused-command-line-argument -O2 -fwrapv -pipe -Wformat -Werror=format-security -gdwarf-4 -fno-debug-types-section -fvar-tracking-assignments -g2 -Wp,-D_FORTIFY_SOURCE=2 -fstack-protector-strong --param=ssp-buffer-size=4 -fPIC -mtune=generic -march=x86-64 -gdwarf-4 -fno-debug-types-section -fvar-tracking-assignments -g2   -Wl,--as-needed -Wl,--no-copy-dt-needed-entries -Wl,-z,relro -Wl,-z,combreloc  -pthread -L/usr/local/lib -o posix_cpp_style posix-cpp-style.o ../tsk/libtsk.la -lewf -ldl -lz -lafflib -lpq -lsqlite3 -ldl -lstdc++ 
libtool: link: x86_64-pld-linux-gnux32-g++ -Wall -Wextra -Wno-unused-parameter -Wno-unused-command-line-argument -O2 -fwrapv -pipe -Wformat -Werror=format-security -gdwarf-4 -fno-debug-types-section -fvar-tracking-assignments -g2 -Wp,-D_FORTIFY_SOURCE=2 -fstack-protector-strong --param=ssp-buffer-size=4 -fPIC -mtune=generic -march=x86-64 -gdwarf-4 -fno-debug-types-section -fvar-tracking-assignments -g2 -Wl,--as-needed -Wl,--no-copy-dt-needed-entries -Wl,-z -Wl,relro -Wl,-z -Wl,combreloc -pthread -o .libs/posix_cpp_style posix-cpp-style.o  -L/usr/local/lib ../tsk/.libs/libtsk.so -L/usr/libx32 -L/usr/lib64 -L/usr/lib -L/usr/local/libx32 -L/usr/local/lib64 -lewf /usr/libx32/libafflib.so -lmd /usr/libx32/libcurl.so /usr/libx32/libcares.so -lnghttp2 /usr/libx32/librtmp.so /usr/libx32/libgnutls.so -lp11-kit /usr/libx32/libidn2.so /usr/libx32/libunistring.so /usr/libx32/libtasn1.so -lhogweed -lnettle /usr/libx32/libgmp.so /usr/libx32/libssh2.so -lpsl /usr/libx32/libgssapi.so /usr/libx32/libheimntlm.so /usr/libx32/libkrb5.so /usr/libx32/libhx509.so /usr/libx32/libwind.so /usr/libx32/libhcrypto.so /usr/libx32/libasn1.so -lcom_err /usr/libx32/libheimbase.so /usr/libx32/libroken.so /usr/libx32/libldap.so /usr/libx32/libsasl2.so -lcrypt /usr/libx32/libpam.so /usr/libx32/libaudit.so /usr/libx32/libcap-ng.so -lssl -lcrypto /usr/libx32/liblber.so -lresolv /usr/libx32/libbrotlidec.so /usr/libx32/libbrotlicommon.so /usr/libx32/libexpat.so -lrt -lreadline -lpq /usr/libx32/libsqlite3.so -lz -lpthread -ldl /usr/libx32/libstdc++.so -lm -pthread -Wl,-rpath -Wl,/usr/libx32
make[1]: Leaving directory '/tmp/B.JWIKG9/BUILD/sleuthkit-4.6.4/samples'
Making all in man
make[1]: Nothing to be done for 'all'.
Making all in bindings/java
Making all in jni
make[2]: Entering directory '/tmp/B.JWIKG9/BUILD/sleuthkit-4.6.4/bindings/java/jni'
/bin/sh ../../../libtool  --tag=CXX   --mode=compile x86_64-pld-linux-gnux32-g++ -DHAVE_CONFIG_H -I. -I../../../tsk  -I../../.. -I./../../.. -I/usr/libx32/jvm/java/include -I/usr/libx32/jvm/java/include/linux  -pthread -I/usr/local/include -Wall -Wextra -Wno-unused-parameter -Wno-unused-command-line-argument -Wno-overloaded-virtual -O2 -fwrapv -pipe -Wformat -Werror=format-security -gdwarf-4 -fno-debug-types-section -fvar-tracking-assignments -g2 -Wp,-D_FORTIFY_SOURCE=2 -fstack-protector-strong --param=ssp-buffer-size=4 -fPIC -mtune=generic -march=x86-64 -gdwarf-4 -fno-debug-types-section -fvar-tracking-assignments -g2  -MT dataModel_SleuthkitJNI.lo -MD -MP -MF .deps/dataModel_SleuthkitJNI.Tpo -c -o dataModel_SleuthkitJNI.lo dataModel_SleuthkitJNI.cpp
libtool: compile:  x86_64-pld-linux-gnux32-g++ -DHAVE_CONFIG_H -I. -I../../../tsk -I../../.. -I./../../.. -I/usr/libx32/jvm/java/include -I/usr/libx32/jvm/java/include/linux -pthread -I/usr/local/include -Wall -Wextra -Wno-unused-parameter -Wno-unused-command-line-argument -Wno-overloaded-virtual -O2 -fwrapv -pipe -Wformat -Werror=format-security -gdwarf-4 -fno-debug-types-section -fvar-tracking-assignments -g2 -Wp,-D_FORTIFY_SOURCE=2 -fstack-protector-strong --param=ssp-buffer-size=4 -fPIC -mtune=generic -march=x86-64 -gdwarf-4 -fno-debug-types-section -fvar-tracking-assignments -g2 -MT dataModel_SleuthkitJNI.lo -MD -MP -MF .deps/dataModel_SleuthkitJNI.Tpo -c dataModel_SleuthkitJNI.cpp  -fPIC -DPIC -o .libs/dataModel_SleuthkitJNI.o
libtool: compile:  x86_64-pld-linux-gnux32-g++ -DHAVE_CONFIG_H -I. -I../../../tsk -I../../.. -I./../../.. -I/usr/libx32/jvm/java/include -I/usr/libx32/jvm/java/include/linux -pthread -I/usr/local/include -Wall -Wextra -Wno-unused-parameter -Wno-unused-command-line-argument -Wno-overloaded-virtual -O2 -fwrapv -pipe -Wformat -Werror=format-security -gdwarf-4 -fno-debug-types-section -fvar-tracking-assignments -g2 -Wp,-D_FORTIFY_SOURCE=2 -fstack-protector-strong --param=ssp-buffer-size=4 -fPIC -mtune=generic -march=x86-64 -gdwarf-4 -fno-debug-types-section -fvar-tracking-assignments -g2 -MT dataModel_SleuthkitJNI.lo -MD -MP -MF .deps/dataModel_SleuthkitJNI.Tpo -c dataModel_SleuthkitJNI.cpp -o dataModel_SleuthkitJNI.o >/dev/null 2>&1
mv -f .deps/dataModel_SleuthkitJNI.Tpo .deps/dataModel_SleuthkitJNI.Plo
make[2]: Leaving directory '/tmp/B.JWIKG9/BUILD/sleuthkit-4.6.4/bindings/java/jni'
make[2]: Entering directory '/tmp/B.JWIKG9/BUILD/sleuthkit-4.6.4/bindings/java/jni'
/bin/sh ../../../libtool  --tag=CXX   --mode=link x86_64-pld-linux-gnux32-g++ -Wall -Wextra -Wno-unused-parameter -Wno-unused-command-line-argument -Wno-overloaded-virtual -O2 -fwrapv -pipe -Wformat -Werror=format-security -gdwarf-4 -fno-debug-types-section -fvar-tracking-assignments -g2 -Wp,-D_FORTIFY_SOURCE=2 -fstack-protector-strong --param=ssp-buffer-size=4 -fPIC -mtune=generic -march=x86-64 -gdwarf-4 -fno-debug-types-section -fvar-tracking-assignments -g2   -Wl,--as-needed -Wl,--no-copy-dt-needed-entries -Wl,-z,relro -Wl,-z,combreloc  -pthread -L/usr/local/lib -o libtsk_jni.la -rpath /usr/libx32 dataModel_SleuthkitJNI.lo ../../../tsk/libtsk.la -lewf -ldl -lz -lafflib -lpq -lsqlite3 -ldl -lstdc++ 
libtool: warning: '/usr/libx32/gcc/x86_64-pld-linux-gnux32/8.2.0/../../../../libx32/libafflib.la' seems to be moved
libtool: warning: '/usr/libx32/gcc/x86_64-pld-linux-gnux32/8.2.0/../../../../libx32/libsqlite3.la' seems to be moved
libtool: warning: '/usr/libx32/gcc/x86_64-pld-linux-gnux32/8.2.0/../../../../libx32/libstdc++.la' seems to be moved
libtool: link: x86_64-pld-linux-gnux32-g++  -fPIC -DPIC -shared -nostdlib /usr/libx32/gcc/x86_64-pld-linux-gnux32/8.2.0/../../../../libx32/crti.o /usr/libx32/gcc/x86_64-pld-linux-gnux32/8.2.0/crtbeginS.o  .libs/dataModel_SleuthkitJNI.o   -Wl,-rpath -Wl,/tmp/B.JWIKG9/BUILD/sleuthkit-4.6.4/tsk/.libs -Wl,-rpath -Wl,/usr/libx32 -Wl,-rpath -Wl,/usr/libx32 -L/usr/local/lib ../../../tsk/.libs/libtsk.so -L/usr/libx32 -L/usr/lib64 -L/usr/lib -L/usr/local/libx32 -L/usr/local/lib64 -L/usr/libx32/gcc/x86_64-pld-linux-gnux32/8.2.0/../../../../libx32 -lewf /usr/libx32/libafflib.so -lmd /usr/libx32/libcurl.so /usr/libx32/libcares.so -lnghttp2 /usr/libx32/librtmp.so /usr/libx32/libgnutls.so -lp11-kit /usr/libx32/libidn2.so /usr/libx32/libunistring.so /usr/libx32/libtasn1.so -lhogweed -lnettle /usr/libx32/libgmp.so /usr/libx32/libssh2.so -lpsl /usr/libx32/libgssapi.so /usr/libx32/libheimntlm.so /usr/libx32/libkrb5.so /usr/libx32/libhx509.so /usr/libx32/libwind.so /usr/libx32/libhcrypto.so /usr/libx32/libasn1.so -lcom_err /usr/libx32/libheimbase.so /usr/libx32/libroken.so /usr/libx32/libldap.so /usr/libx32/libsasl2.so -lcrypt /usr/libx32/libpam.so /usr/libx32/libaudit.so /usr/libx32/libcap-ng.so -lssl -lcrypto /usr/libx32/liblber.so -lresolv /usr/libx32/libbrotlidec.so /usr/libx32/libbrotlicommon.so /usr/libx32/libexpat.so -lrt -lreadline -lpq /usr/libx32/libsqlite3.so -lz -lpthread -ldl -L/usr/libx32/gcc/x86_64-pld-linux-gnux32/8.2.0 -L/lib/../libx32 -L/usr/lib/../libx32 -L/usr/libx32/gcc/x86_64-pld-linux-gnux32/8.2.0/../../.. /usr/libx32/libstdc++.so -lm -lc -lgcc_s /usr/libx32/gcc/x86_64-pld-linux-gnux32/8.2.0/crtendS.o /usr/libx32/gcc/x86_64-pld-linux-gnux32/8.2.0/../../../../libx32/crtn.o  -O2 -gdwarf-4 -g2 -fstack-protector-strong -mtune=generic -march=x86-64 -gdwarf-4 -g2 -Wl,--as-needed -Wl,--no-copy-dt-needed-entries -Wl,-z -Wl,relro -Wl,-z -Wl,combreloc -pthread   -pthread -Wl,-soname -Wl,libtsk_jni.so.0 -o .libs/libtsk_jni.so.0.0.0
libtool: link: (cd ".libs" && rm -f "libtsk_jni.so.0" && ln -s "libtsk_jni.so.0.0.0" "libtsk_jni.so.0")
libtool: link: (cd ".libs" && rm -f "libtsk_jni.so" && ln -s "libtsk_jni.so.0.0.0" "libtsk_jni.so")
libtool: link: ar cru .libs/libtsk_jni.a  dataModel_SleuthkitJNI.o
libtool: link: ranlib .libs/libtsk_jni.a
libtool: link: ( cd ".libs" && rm -f "libtsk_jni.la" && ln -s "../libtsk_jni.la" "libtsk_jni.la" )
make[2]: Leaving directory '/tmp/B.JWIKG9/BUILD/sleuthkit-4.6.4/bindings/java/jni'
make[2]: Entering directory '/tmp/B.JWIKG9/BUILD/sleuthkit-4.6.4/bindings/java'
ant dist 
Buildfile: /tmp/B.JWIKG9/BUILD/sleuthkit-4.6.4/bindings/java/build.xml

testTSKLibs:

check-native-build-mac:

check-native-build-unix:

check-native-build:

check-build:

dist:

testTSKLibs:

check-native-build-mac:

check-native-build-unix:

check-native-build:

check-build:

download-ivy:

-download-ivy:
      [get] Getting: http://repo2.maven.org/maven2/org/apache/ivy/ivy/2.3.0-rc2/ivy-2.3.0-rc2.jar
      [get] To: /home/users/builder/.ant/lib/ivy.jar
      [get] Error getting http://repo2.maven.org/maven2/org/apache/ivy/ivy/2.3.0-rc2/ivy-2.3.0-rc2.jar to /home/users/builder/.ant/lib/ivy.jar

BUILD FAILED
/tmp/B.JWIKG9/BUILD/sleuthkit-4.6.4/bindings/java/build.xml:181: The following error occurred while executing this line:
/tmp/B.JWIKG9/BUILD/sleuthkit-4.6.4/bindings/java/build.xml:103: The following error occurred while executing this line:
/tmp/B.JWIKG9/BUILD/sleuthkit-4.6.4/bindings/java/build.xml:108: java.net.UnknownHostException: repo2.maven.org
	at java.net.AbstractPlainSocketImpl.connect(AbstractPlainSocketImpl.java:184)
	at java.net.SocksSocketImpl.connect(SocksSocketImpl.java:392)
	at java.net.Socket.connect(Socket.java:589)
	at java.net.Socket.connect(Socket.java:538)
	at sun.net.NetworkClient.doConnect(NetworkClient.java:180)
	at sun.net.www.http.HttpClient.openServer(HttpClient.java:463)
	at sun.net.www.http.HttpClient.openServer(HttpClient.java:558)
	at sun.net.www.http.HttpClient.<init>(HttpClient.java:242)
	at sun.net.www.http.HttpClient.New(HttpClient.java:339)
	at sun.net.www.http.HttpClient.New(HttpClient.java:357)
	at sun.net.www.protocol.http.HttpURLConnection.getNewHttpClient(HttpURLConnection.java:1220)
	at sun.net.www.protocol.http.HttpURLConnection.plainConnect0(HttpURLConnection.java:1156)
	at sun.net.www.protocol.http.HttpURLConnection.plainConnect(HttpURLConnection.java:1050)
	at sun.net.www.protocol.http.HttpURLConnection.connect(HttpURLConnection.java:984)
	at org.apache.tools.ant.taskdefs.Get$GetThread.openConnection(Get.java:766)
	at org.apache.tools.ant.taskdefs.Get$GetThread.get(Get.java:676)
	at org.apache.tools.ant.taskdefs.Get$GetThread.run(Get.java:666)

Total time: 1 second
make[2]: *** [Makefile:707: all-local] Error 1
make[2]: Leaving directory '/tmp/B.JWIKG9/BUILD/sleuthkit-4.6.4/bindings/java'
make[1]: *** [Makefile:433: all-recursive] Error 1
make: *** [Makefile:572: all-recursive] Error 1
error: Bad exit status from /tmp/B.JWIKG9/BUILD/tmp/rpm-tmp.24799 (%build)


RPM build errors:
    Bad exit status from /tmp/B.JWIKG9/BUILD/tmp/rpm-tmp.24799 (%build)
ended at: Mon Nov 26 00:26:15 2018, done in 0:01:15.797902
error: No files produced.
+ chmod -R u+rwX /tmp/B.JWIKG9/BUILD
+ rm -rf /tmp/B.JWIKG9/tmp /tmp/B.JWIKG9/BUILD
+ rm -rf /tmp/B.JWIKG9
Begin-PLD-Builder-Info
Build-Time: user:150.15s sys:34.18s real:79.57s (faults io:55 non-io:12200681)

End-PLD-Builder-Info
[Back to list of logs] [View rpm -qa of builder]